##TITLE=1H_PR184_K
 D2O,64 sc, 
 3.9.2021
##JCAMPDX= 6.0         $$ Bruker NMR JCAMP-DX V2.0
##DATA TYPE= NMR FID
##DATA CLASS= NTUPLES
##ORIGIN= UXNMR, Bruker Analytische Messtechnik GmbH
##OWNER= root
$$ XWIN-NMR		Version 3.5
$$ Fri Sep  3 12:48:28 2021 Russian Standard Time (UT+4h)  she@DPX200
##.OBSERVE FREQUENCY= 200.1314
##.OBSERVE NUCLEUS= ^1H
##.DELAY= (6, 6)
##.ACQUISITION MODE= SIMULTANEOUS
##.ACQUISITION SCHEME= undefined
##.AVERAGES= 64
##.DIGITISER RES= 18
##SPECTROMETER/DATA SYSTEM= spect
##.PULSE SEQUENCE= zg30
##.SOLVENT NAME= D2O
##.SHIFT REFERENCE= (INTERNAL, D2O, 0, 15.7039)
##AUDIT TRAIL= $$ (NUMBER, WHEN, WHO, WHERE, WHAT)
$$ ##TITLE= Audit trail, XWIN-NMR		Version 3.5
$$ ##JCAMPDX= 5.01
$$ ##ORIGIN= Bruker BioSpin GmbH
$$ ##OWNER= she
$$ F:/spectra/data/she/nmr/H-F/1/audita.txt
$$ ##AUDIT TRAIL=  $$ (NUMBER, WHEN, WHO, WHERE, WHAT)
(   1,<2021-09-03 12:47:04.32 +0400>,<she>,<DPX200>,
      <continue with go, POWCHK disabled, PULCHK disabled
       configuration hash MD5:
       00 E9 B6 7A A2 85 ED C7 34 08 36 98 17 FE 4E 26
       data hash MD5: 16K
       17 7B 5C E8 DC A8 01 B4 F0 4F C6 46 41 6B 78 9C>)
$$ ##END=
$$ 
$$ hash MD5
$$ 6C 60 F4 D0 25 28 5D FA F8 49 64 D1 DC 79 DE EA
##$RELAX= 
##$RELAX= 
##$RELAX= 
##$RELAX= 
##$RELAX= 
##$RELAX= 
$$ Bruker specific parameters
$$ --------------------------
##$DU= <F:/spectra>
##$EXPNO= 1
##$NAME= <H-F>
##$PROCNO= 1
##$TYPE= <nmr>
##$USER= <she>
##$AMP= (0..31)
100 100 100 100 100 100 100 100 100 100 100 100 100 100 100 100 100 100 
100 100 100 100 100 100 100 100 100 100 100 100 100 100 
##$AQSEQ= 0
##$AQ_mod= 1
##$AUNM= <au_zg>
##$AUTOPOS= <>
##$BF1= 200.13
##$BF2= 200.13
##$BF3= 200.13
##$BF4= 200.13
##$BF5= 200.13
##$BF6= 200.13
##$BF7= 200.13
##$BF8= 200.13
##$BYTORDA= 1
##$CFDGTYP= 0
##$CFRGTYP= 5
##$CHEMSTR= <none>
##$CNST= (0..31)
1 1 145 1 1 1 1 1 1 1 1 1 1 1 1 1 1 1 1 1 1 1 1 1 1 1 1 1 1 1 1 1 
##$CPDPRG= <>
##$CPDPRG1= <>
##$CPDPRG2= <>
##$CPDPRG3= <>
##$CPDPRG4= <mlev>
##$CPDPRG5= <mlev>
##$CPDPRG6= <mlev>
##$CPDPRG7= <mlev>
##$CPDPRG8= <mlev>
##$CPDPRGB= <>
##$CPDPRGT= <>
##$D= (0..31)
0 1.2 0 0 0 0 0 0 0 0.06 0 0.03 0 0 0 0 0.0002 0 0 0 0 0 0 0 0 0 0 0 0 
0 0 0 
##$DATE= 1630658597
##$DBL= (0..7)
120 120 120 120 120 120 120 120 
##$DBP= (0..7)
150 150 150 150 150 150 150 150 
##$DBP07= 0
##$DBPNAM0= <>
##$DBPNAM1= <>
##$DBPNAM2= <>
##$DBPNAM3= <>
##$DBPNAM4= <>
##$DBPNAM5= <>
##$DBPNAM6= <>
##$DBPNAM7= <>
##$DBPOAL= (0..7)
0.5 0.5 0.5 0.5 0.5 0.5 0.5 0.5 
##$DBPOFFS= (0..7)
0 0 0 0 0 0 0 0 
##$DE= 6
##$DECBNUC= <off>
##$DECIM= 32
##$DECNUC= <off>
##$DECSTAT= 4
##$DIGMOD= 1
##$DIGTYP= 9
##$DL= (0..7)
0 120 120 120 120 120 120 120 
##$DP= (0..7)
150 150 150 150 150 150 150 150 
##$DP07= 0
##$DPNAME0= <>
##$DPNAME1= <>
##$DPNAME2= <>
##$DPNAME3= <>
##$DPNAME4= <>
##$DPNAME5= <>
##$DPNAME6= <>
##$DPNAME7= <>
##$DPOAL= (0..7)
0.5 0.5 0.5 0.5 0.5 0.5 0.5 0.5 
##$DPOFFS= (0..7)
0 0 0 0 0 0 0 0 
##$DQDMODE= 0
##$DR= 18
##$DS= 0
##$DSLIST= <SSSSSSSSSSSSSSS>
##$DSPFIRM= 0
$$ [...]
##$SUBNAM2= <"">
##$SUBNAM3= <"">
##$SUBNAM4= <"">
##$SUBNAM5= <"">
##$SUBNAM6= <"">
##$SUBNAM7= <"">
##$SUBNAM8= <"">
##$SUBNAM9= <"">
##$SW= 20.0188988654967
##$SWIBOX= (0..15)
0 0 2 0 0 0 0 0 0 0 0 0 0 0 0 0 
##$SW_h= 4006.41025641026
##$TD= 16384
##$TD0= 1
##$TE= 0
##$TE2= 300
##$TE3= 300
##$TEG= 300
##$TL= (0..7)
0 120 120 120 120 120 120 120 
##$TP= (0..7)
150 150 150 150 150 150 150 150 
##$TP07= 0
##$TPNAME0= <>
##$TPNAME1= <>
##$TPNAME2= <>
##$TPNAME3= <>
##$TPNAME4= <>
##$TPNAME5= <>
##$TPNAME6= <>
##$TPNAME7= <>
##$TPOAL= (0..7)
0.5 0.5 0.5 0.5 0.5 0.5 0.5 0.5 
##$TPOFFS= (0..7)
0 0 0 0 0 0 0 0 
##$TUNHIN= 0
##$TUNHOUT= 0
##$TUNXOUT= 0
##$USERA1= <user>
##$USERA2= <user>
##$USERA3= <user>
##$USERA4= <user>
##$USERA5= <user>
##$V9= 5
##$VALIST= <valist>
##$VCLIST= <CCCCCCCCCCCCCCC>
##$VD= 0
##$VDLIST= <DDDDDDDDDDDDDDD>
##$VPLIST= <PPPPPPPPPPPPPPP>
##$VTLIST= <TTTTTTTTTTTTTTT>
##$WBST= 1024
##$WBSW= 4
##$XGAIN= (0..3)
0 0 0 0 
##$XL= 0
##$YL= 0
##$YMAX_a= 844985
##$YMIN_a= -874136
##$ZGOPTNS= <>
##$ZL1= 120
##$ZL2= 120
##$ZL3= 120
##$ZL4= 120
##$ABSF1= 10
##$ABSF2= 0
##$ABSG= 5
##$ABSL= 3
##$ALPHA= 0
##$AQORDER= 0
##$ASSFAC= 0
##$ASSFACI= 0
##$ASSFACX= 0
##$ASSWID= 0
##$AUNMP= <proc_1d>
##$AZFE= 0.1
##$AZFW= 0.1
##$BCFW= 1
##$BC_mod= 2
##$BYTORDP= 1
##$COROFFS= 0
##$CY= 11.3945322036743
##$DATMOD= 1
##$DC= 2
##$DFILT= <>
##$DTYPP= 0
##$F1P= 2.36226072786647
##$F2P= -0.459571619588291
##$FCOR= 0.5
##$FTSIZE= 0
##$FT_mod= 4
##$GAMMA= 1
##$GB= 0.15
##$INTBC= 1
##$INTSCL= 1
##$ISEN= 128
##$LB= 0.24
##$LEV0= 0
##$LPBIN= 0
##$MAXI= 10000
##$MC2= 0
##$MEAN= 0
##$ME_mod= 0
##$MI= 1.114404
##$NCOEF= 0
##$NC_proc= 0
##$NLEV= 6
##$NOISF1= 3.799351
##$NOISF2= 2.8
##$NSP= 1
##$NTH_PI= 0
##$NZP= 0
##$OFFSET= 15.70392
##$PC= 1
##$PHC0= -13716.75
##$PHC1= 8.600906
##$PH_mod= 1
##$PKNL= yes
##$PPARMOD= 0
##$PSCAL= 0
##$PSIGN= 0
##$REVERSE= no
##$SF= 200.130013532006
##$SI= 16384
##$SIGF1= 3
##$SIGF2= 2
##$SINO= 400
##$SIOLD= 16384
##$SREGLST= <1H.CDCl3>
##$SSB= 0
##$STSI= 0
##$STSR= 0
##$SW_p= 3612.71676300578
##$SYMM= 0
##$S_DEV= 0
##$TDeff= 0
##$TDoff= 0
##$TI= <>
##$TILT= no
##$TM1= 0
##$TM2= 0
##$TOPLEV= 0
##$USERP1= <user>
##$USERP2= <user>
##$USERP3= <user>
##$USERP4= <user>
##$USERP5= <user>
##$WDW= 1
##$XDIM= 8192
##$YMAX_p= 0
##$YMIN_p= 0
$$ End of Bruker specific parameters
$$ ---------------------------------
##NTUPLES= NMR FID
##VAR_NAME=  TIME,          FID/REAL,        FID/IMAG
##SYMBOL=    X,             R,               I
##VAR_TYPE=  INDEPENDENT,   DEPENDENT,       DEPENDENT
##VAR_FORM=  AFFN,          ASDF,            ASDF
##VAR_DIM=   8192,          8192,            8192
##UNITS=     SECONDS,       ARBITRARY UNITS, ARBITRARY UNITS
##FACTOR=    0.0002496,     1,               1
##FIRST=     0,             0,               0
##LAST=      2.0444736,     0,               0
##MIN=       0,             -874136,         0
##MAX=       2.0444736,     844985,          0
$$ Real data points
##PAGE= N=1
##DATA TABLE= (X++(R..R)), XYDATA
$$ [...]
3655a1278J516O438Q900N492m33n167p632p229k150K707P654P761M341m89o541
$$ -11278 -9762 -3324 5576 11068 10635 5468 -2164 -9393 -11543 -8836 -1182 6579 10920 10431 3890
3670C890p358n852j570L758Q230P285L339k666o482q033n712J350M336Q001P170
$$ 3890 -3468 -9320 -10890 -7132 1098 8383 11722 9056 2574 -5459 -11171 -9821 -5485 2516 9686
3685I686J535k595q564p831l243J031O418P764O195R77n098p274p053l629K913
$$ 9686 11221 8626 62 -7769 -11012 -9981 -3563 4201 10396 11373 6275 -999 -8052 -11681 -8768
3700h768P032O731O303o26n008q543o909j428L342P724P375M191j255o607p696
$$ -8768 -1736 4995 11298 10672 5664 -2879 -9788 -11216 -7874 -150 7225 11416 10161 3554 -4142
3715d142n825q12M599Q130P459J760j747o715q474n853J800M851P712O822J665
$$ -4142 -9967 -10779 -6180 1950 9409 11169 9422 2707 -5767 -11620 -9820 -4969 2743 9565 11230
3730A1230l429q244o900l709J732P087O887N694M43m180q344p146k240K690P514
$$ 11230 7801 -443 -7343 -11052 -9320 -2233 4654 10348 10791 6611 -1733 -8879 -11119 -8429 -915
3745i15P031N016n60o078q613m678k307L942P615P868K911k483o627p782n266
$$ -915 6116 11132 10572 4494 -4119 -8797 -11104 -7162 453 8321 11232 8749 2122 -5660 -10926
3760a0926J69N152P550O364K756k669q169p115m225J219N990P676O794Q5l373
$$ -10926 -10757 -5605 1945 8309 11065 8396 227 -6888 -11113 -9894 -3904 3772 10566 10651 7278
3775G278q325p068l825L237O924P532M706J13m999q865n414k691L447P278P779
$$ 7278 -1047 -8115 -11940 -8703 -1779 5753 10459 10572 5573 -3292 -8706 -11397 -7950 -672 7107
3790G107L841j290o345p167o438l87N088P548O511J903j933o553p266n186M94
$$ 7107 10948 9658 3313 -3854 -10292 -10679 -5591 1957 8468 10371 8438 1885 -5381 -10567 -10073
3805a0073N638P018P735P73m209o251p352l896Q94P253O873N510M91n433o782
$$ -10073 -4435 2583 10318 11091 6882 631 -6721 -10617 -9723 -2470 4403 9913 10404 4971 -1811
3820a811p367j506J906P181R126K829j447l827q587n211j461L242O747Q241K810
$$ -1811 -9178 -10684 -8778 -1597 7529 10358 8911 5084 -3503 -8714 -10175 -6933 -186 8055 10865
3835A0865k390n301p957n618n12O025P066O957J525k763p179o560m645J491O275
$$ 10865 8475 3174 -4783 -10401 -10913 -4888 2178 9135 10660 7897 718 -5842 -10487 -8996 -2721
3850b721N950O192J121m164p500o723k051O32O977Q012L794M39n142p283o039
$$ -2721 3229 9421 10542 6378 -1122 -7845 -9896 -9264 -2287 5725 9519 9958 4816 -2467 -8506
3865h506k122L059P899O857M243k524m967q104n759q34M899O700O803L670l410
$$ -8506 -10628 -7569 330 7187 11430 8906 3939 -4165 -9924 -10758 -5859 841 7644 11314 7904
3880G904o934o606n014R07N216P489O166J103l780n995p175m025J863N332P805
$$ 7904 970 -5636 -10650 -9743 -4527 2962 9128 10231 6451 456 -6719 -10744 -8881 -3549 4256
3895D256N383J114n502o171p143k709K942N864O816M734P9n319p482o599k96K773
$$ 4256 9639 10753 5251 -920 -8063 -10772 -7830 -1966 4850 9584 9663 4344 -3138 -9737 -10033 -7260
3911g260P124P654L003j948n974p061n486J58M684O832P055K235l670o504o620
$$ -7260 -136 7518 10521 8573 2599 -4462 -9948 -9790 -5106 1726 8781 11016 7346 842 -5778
3926e778m341J266N527O795O318O97m358o153p560k662K036O247P372L965N47
$$ -5778 -10119 -8853 -3326 3469 9787 10484 6126 -27 -7587 -10249 -8213 -1966 5406 9371 9918
3941I918n641o862o052j139K709O663P483L203k047n203o836n552r06L268Q489
$$ 9918 4277 -2585 -8637 -9776 -7067 -404 7079 10282 8235 3032 -3804 -9356 -10262 -6994 1495
3956A495O686K610k796o255q168l483j69N781P401N862J813l898o968p045k599
$$ 1495 8181 10791 7995 1740 -6428 -9911 -10080 -4299 3102 8964 10777 6879 -89 -7134 -9733
3971i733Q05O306P613M005Q12l579p269o441k483K415N776P087M505q39n766p214
$$ -9733 -8928 -2622 4991 8996 9808 6229 -1040 -7481 -9964 -7549 -1773 5314 9819 8980 3214 -4000
3987d000m564r90L688O395O373L332k002n198p736m960M78N009O906N957J440
$$ -4000 -8564 -9554 -5866 529 6902 10234 8232 3034 -4702 -9662 -9184 -4175 2731 8688 10128
4002A0128k486o577o951n003K035N129P333M854J399l475p255o485k447K195N445
$$ 10128 7642 1065 -5886 -10889 -8854 -3725 3608 8462 9861 6386 -869 -7354 -9801 -7606 -2161
4017b161P446N010o61m747o998o011k539L679P015O542K811j113n082p362m686
$$ -2161 5285 10295 9634 4887 -2111 -8122 -10661 -6982 33 6575 9386 8273 3191 -4171 -8857
4032h857j326M599O914N726K553j448o117p439l819J85M551P734M787J809l165
$$ -8857 -10183 -5584 1330 7056 9609 8161 2044 -5395 -9214 -9029 -4478 3256 8043 9852 6687
4047F687n821o938m084J026O394O956M926K42m133p299m951k468K115N699O824
$$ 6687 866 -6072 -10156 -9130 -2736 4220 9146 9388 5255 -2044 -6995 -9463 -7348 -1649 5175
4062E175M052o45m970p000n349j163K815P513P070K008j553n820o461m806n88
$$ 5175 9227 8582 3612 -3388 -8737 -9900 -7085 428 7498 9506 7953 2133 -4328 -9134 -9722
4077i722M753P297N151K025k959n656o487l669L98M745O755O073J506m564o518
$$ -9722 -4969 2328 7479 9504 6545 889 -5598 -9267 -8869 -4124 2631 8704 10210 5646 -872
4092h72n968l423J834O298O501M771M14n396o795n623j448K014P990N304M110
$$ -872 -6840 -10263 -8429 -2131 4370 9141 9555 4159 -2636 -8259 -9707 -7693 297 5601 9711
4107I711p72n879p119l876j063L533O507O236K983k241o165p435k563m17M494
$$ 9711 8939 3060 -4059 -7935 -8998 -5465 1042 7278 10261 8020 1855 -5580 -8143 -8560 -4066
4122d066P398M627J087k046o762o399k458Q51M501P107M754Q37m118o457o429
$$ -4066 3332 7959 9046 7000 238 -6161 -8619 -7768 -3267 3840 8594 9431 5313 -1144 -7573
4137g573j630K137N716P074L246q14m392o704m918j263L345N936O503L462j517
$$ -7573 -9203 -7066 -1350 5724 8970 8156 3764 -2940 -7858 -9121 -5776 160 6663 10125 8608
4152H608o039p170l665r89M778O041N728K650k913o122o509k951j79N423O293
$$ 8608 2569 -4601 -8266 -9255 -4477 1564 7292 9942 7029 907 -5602 -8553 -8732 -3309 2984
4167B984N042Q26l041o231o607k358K135N100O130N334m24m604o656o150o51L543
$$ 2984 8026 8852 5811 -420 -7027 -9385 -7250 -2150 3980 9314 8890 4286 -2370 -8520 -9171 -5628
4183e628N127O525K833l57n289o548m876j208M821N689N271K568j491n941o102
$$ -5628 -501 6024 8857 8500 3211 -3337 -8213 -9421 -4600 1089 6360 8928 7437 1496 -4606
4198d606m508R08M389O265O524N21l237o369o096l356J406M883P097M946J20l389
$$ -4606 -9114 -8206 -3817 2448 8972 9493 6256 -113 -6209 -9565 -8159 -3276 3821 8767 8887 5498
4214E498o431o224j774K625M841P193K758l89l861o111o840j25K286O501O534
$$ 5498 -933 -7157 -8931 -6306 -1465 5728 8486 8097 4236 -1875 -8715 -8840 -6554 -53 6481
4229F481L003j725n393o696m470j00M265O641N453J864k266o538n291m529J304
$$ 6481 9484 7759 2366 -4330 -8800 -8900 -4635 2006 7459 9323 7057 519 -4772 -9301 -7997
4244g997M557O689M467J249l420p089m697k789J240N702P235L964J52n158n764
$$ -7997 -3440 3249 7716 8965 5545 -1544 -6241 -9030 -7790 -2088 5147 9111 9263 4105 -1659
4259a659n102k149K386O255O123L551k425m578n992m676l27L446O333N495K685
$$ -1659 -6761 -8910 -6524 -269 5854 9405 6980 2402 -3590 -8266 -8593 -5147 1186 6681 9366
4274I366j848o130o150m842J068L842O535N530J761k944o224n998l262K065M014
$$ 9366 7518 1388 -4762 -9604 -8536 -4694 1841 7371 9132 6188 -36 -6034 -9296 -7231 -3217
4289c217P876L522J105m706o169o053j872K574N976N775L994m38m587o627m934
$$ -3217 4659 8181 9286 4580 -1589 -7642 -9514 -6940 -964 4811 8805 8367 3780 -2847 -7781
4304g781j219L812M511P094K011n33n632n831m498JL979N934N445J822k881n131
$$ -7781 -9000 -5188 -677 6417 8428 7895 2263 -3568 -8066 -8065 -4086 1848 7293 9115 6234 1103
4320A103o641l134O59M584N654N424R18l097o163n593k909K430M741O343M409
$$ 1103 -5538 -8672 -8013 -3429 2225 7649 8567 5470 -693 -6286 -9195 -6765 -2024 4319 8728
4335H728N8m537o637m618j756K750N498O115L374j017n662n218n185r16M065O364
$$ 8728 8786 4249 -2388 -7006 -8762 -6012 -514 5601 8975 7958 2296 -2922 -8107 -9023 -4958 1406
4351A406M790L352k947n421n330n016J085M819O602M017J681l274n456n412l359
$$ 1406 6196 9548 6601 1180 -4150 -9166 -8081 -3262 3340 7357 9038 5764 308 -5104 -8463
4366h463J352M128O579M467k05k926o105n776k229K541N301O106L734m33n065
$$ -8463 -7111 -2983 3596 8063 7858 4932 -1173 -6949 -9178 -6637 -1336 4770 8504 8071 3006
4381C006n366n381j361L416O032N899J886j044n098o093l766n55M977N308M532
$$ 3006 -2360 -7741 -9102 -5686 346 6245 8131 7087 1989 -4104 -7870 -8425 -3448 1860 6392
4396F392K255k078n927n316m037J175M310O819M506Q56l003o739n143l643K386
$$ 6392 8647 6569 642 -4674 -8711 -7536 -3226 3593 8099 8955 5952 -787 -5930 -9573 -7187
4411g187N699N434M567k20m278n599n771j812K732N958N351L577o94m693o093
$$ -7187 -1488 3946 8513 8293 4015 -1584 -7355 -9167 -6435 -477 4874 8451 7757 3064 -3029
4426c029m721o58L404M982P246J459j677n758n261m494O29M342N801N199J055
$$ -3029 -7750 -8408 -5004 -22 7224 8683 7006 1248 -4013 -8507 -7878 -3536 2265 7464 8519
4441H519k948o341m735l034J153M917N464N238K32l578o213m874k538K521N220
$$ 8519 5571 -770 -5505 -8539 -7386 -2469 2995 8233 8465 4887 -1326 -6200 -8738 -6217 -997
4456i97N817L031j36m039o153m032k231L625N514N620K756j400n504n603m506
$$ -997 4820 7851 7715 3676 -2477 -6509 -8740 -5115 399 6019 8775 7375 1871 -3732 -8238
4471h238k16L383O005N502K643k054o018n772k518j43M684N100M798J541l578
$$ -8238 -8454 -5071 934 6436 9079 7025 1007 -4765 -7283 -7426 -2742 2358 7156 8697 5119
4486E119n995m806l174J480M748O101M266J41l349n802m938j333K065M847N306
$$ 5119 -876 -5682 -8856 -7376 -2628 3473 7739 7880 4531 -1271 -6209 -7542 -5477 -630 4676
4501D676L537m57n204n321m768m81K895N645O320J234j609n221n515l378q52N250
$$ 4676 8213 7756 2552 -2769 -7537 -8018 -5123 522 6842 8076 6467 1246 -4269 -7647 -8499 -3249
4517c249M742N450J335k051o568m928k771Q08M619N731M429R2k617p170l431l117
$$ -3249 1493 6943 8278 6227 -341 -5269 -8040 -7232 -2613 3118 7547 7639 5022 -2148 -5579 -8696
4533h696K171M643O622L142K17n380m621n052j926L115N560N367K910j376m806
$$ -8696 -6525 -1882 4740 7882 8099 2719 -1902 -6954 -8880 -5765 -205 5162 8072 6696 1890
4548A890n639l970l93L653N965M804J758k419m497n706l220R15L680O014M196
$$ 1890 -3749 -7719 -8112 -4459 1506 6310 8068 5649 1152 -4554 -7774 -6859 -3179 2835 7031
4563G031J098k797n805o057n27Q18L812N950L680L96m095n197m595j153J726L988
$$ 7031 8129 5332 -473 -6530 -7057 -6239 -2427 3523 7203 7599 3504 -1693 -6288 -7441 -5715 -1727
4579a727O083K888j35l854n539m052j909L756M858N229K666j859n332m819m120
$$ -1727 4356 7244 7109 3255 -2284 -6336 -8245 -4489 369 5598 8264 6405 1073 -3746 -7866
4594g866R24K677O730M816O28k123n413o009l250J865M707N840L876O11k526o721
$$ -7866 -6942 -4265 2465 7281 7909 5786 373 -5636 -8886 -7021 -2314 3526 7402 8013 5487 -1234
4610a234m884k073J315N837N740K373k76k954o213m746q70K036O198M236L518
$$ -1234 -6118 -8191 -6876 -1039 4701 7074 6798 3844 -2369 -7115 -7985 -5949 249 4485 8003
4625H003j509m600n217m386L96L586N210M336J922j161n599n594k682J91L539
$$ 8003 6494 1894 -3323 -7709 -7313 -3727 1483 5819 7741 6580 981 -4613 -7295 -7104 -3565
4640c565N750M748N58k649n202m969l596J967N675M753L402M49l171n818m970
$$ -3565 2185 6933 7491 4842 -360 -5329 -8925 -6958 -1283 3470 6872 7321 4150 -1668 -6638
4655f638r58J856N461M611K981l86l832n717m201p70K227N842M598L052k085m634
$$ -6638 -7596 -5740 -279 4332 7313 6927 3095 -2622 -6823 -7593 -5366 476 5074 8126 6041 1407
4671A407n326l509k3M017M793N034J254k465n058m910l306J720M294M558M220
$$ 1407 -3919 -7428 -7451 -3434 1359 6393 7647 5182 124 -4786 -8092 -6372 -2078 2480 6700
4686F700Q38l477n018n247j938J857M425N912L714j148l764m295m744j697K568
$$ 6700 7538 4061 -957 -6204 -8142 -6285 -1860 4052 7766 6618 2854 -1441 -6185 -7882 -5314
4701e314N293N028K251k75m849m878m617k88L593N289M092K699k329n160m233
$$ -5314 -21 5007 7258 6983 2134 -2744 -7361 -7649 -4056 1233 5325 8024 5695 535 -3698
4716c698l118o42M717M620N154R23k841o478l764k880J663M270N494L089R63l177
$$ -3698 -6816 -7458 -2741 1879 7033 7956 5115 -1363 -5127 -8007 -6344 -2074 3420 6509 7472 4295
4732D295n201n640j375K596M427M903L508l17m397n148m741o88L263N888L976
$$ 4295 -906 -6546 -7921 -5325 -898 4005 7513 7196 2799 -2349 -7090 -7778 -4515 1373 5349
4747E349K280j526m706m530m024J029K597N651M212J167k444n034m226k716L35
$$ 5349 7629 6103 1397 -3133 -7157 -6128 -3531 2120 6332 7499 5055 21 -4205 -6921 -6586
4762f586M181M904L216P69k468n173m275k449K045L951O024K739j0l484n089n152
$$ -6586 -2405 2499 5715 6484 4016 -1157 -5432 -7881 -5836 -1885 4139 6878 6868 3384 -1705 -6857
4778f857r27K825N176M495K264q85m715l985m267j45L043M564N109J946j930m660
$$ -6857 -7784 -4959 217 4712 6976 6091 1376 -2609 -6876 -7021 -3978 586 5695 7641 5711 1051
4794A051n455l052M62M017N625L581N54k638m625m838j525Q53M804M854L065L42
$$ 1051 -4404 -7456 -6994 -2977 2648 6229 6783 4145 -480 -5318 -6843 -5990 -1186 3668 6733 7075
4810G075l633n239m383o96J881M687M461L517j636l151n739l857j77K314N108
$$ 7075 3442 -1797 -6180 -6876 -4995 -308 4153 7670 6034 2883 -2856 -6713 -6890 -4576 532
4825E32M756K407j987l486n874l681P96K986N131M677N21j464m301n777k933J466
$$ 532 5288 7695 5708 2222 -3652 -7333 -6537 -3551 1580 6257 6778 5314 1013 -4764 -7697 -6231
4841f231L492N180M227N18k887m481m800k370J928M034M509M014p91l802m241
$$ -6231 -2739 2441 6668 7186 4299 -182 -4982 -7352 -5424 -1390 3119 7133 6342 2540 -1701
4856a701m123o40R00N456M312K547l15m860m291l581o17L953L707M805J906j426
$$ -1701 -5824 -6464 -5564 -108 4204 6751 6436 1576 -2715 -6296 -6913 -2960 747 5552 7458 6032
4872F032n762l876k764J00L470M887L867K041l313m751m643k792J417L891N416
$$ 6032 270 -3606 -6370 -6270 -2800 2087 5954 7995 4682 -69 -4712 -7504 -6087 -2196 3220
4887C220K977O16l682m456l545j382J251L988N465J711J07m212m051l693q24K548
$$ 3220 6197 6813 3131 -1325 -4870 -6252 -5001 -1013 4452 6163 6270 2058 -1993 -5686 -6510 -3962
4903c962M400N246J349j629m074m323k830o77K883M392N228L15k353l898m199
$$ -3962 438 5684 7033 5404 1330 -2993 -5823 -6500 -3617 775 6003 6318 3965 67 -4132
4918d132k083j271N277N031K309J974l170m410m110k298J339M258N079L588o37
$$ -4132 -6215 -7486 -2209 2822 5131 7105 3935 -475 -4585 -6883 -5544 -1286 3793 7381 6744
4933F744l480n012l644j804J577N297M807K544j508k820n002l688k45K159N332
$$ 6744 3264 -1748 -5392 -7196 -5619 -322 4485 7029 5521 2701 -2301 -5989 -6234 -4075 1257
4948A257L579K525k228m129m437l048O8K995M866L911K181k907n582m117j030
$$ 1257 4836 7361 5133 1004 -3433 -6481 -6413 -3418 1448 5359 7540 4633 -949 -5066 -6096
4963f096O17L431N352K687O78l227m853l619k244K261M346L839K865L76m392l948
$$ -6096 -5479 -2048 3304 5991 6669 3442 -1411 -5030 -7274 -5013 -667 3172 6037 6413 2021 -1927
4979a927l697j415L236L902L696L131j869m086m065l675K67L205M697M155L89
$$ -1927 -5624 -7039 -3803 99 3795 6926 5057 971 -3094 -6769 -6502 -3297 1400 5555 5944
4994E944q71m911m057k202K9L161M511M622l08k111l717n340q58Q19L783M606
$$ 5944 5073 162 -3895 -6097 -6068 -2907 1604 6226 5918 3807 90 -5250 -6108 -5289 -1506 3100
5010C100K975P08m366m234l830j117K399L937M460K141L56m040m784m266M28K023
$$ 3100 6075 6783 2417 -1817 -5647 -6764 -4365 -428 4032 6173 6529 2489 -2295 -6561 -6133 -4110
5026d110M177M551J679j234l479m879l121l87L550N261L670J260k474l791m278
$$ -4110 67 4618 6297 5063 1584 -3295 -6416 -6803 -3253 2008 5678 6938 4464 673 -3605
5041c605l286J374L892L639M080K96k748m431m141j951J715L899M606K662k15
$$ -3605 -6891 -5517 -1625 2014 6094 6390 3642 -789 -4930 -6881 -5166 -1267 3339 6001 5786
5056E786k886m945l417q25J173N252L791K602r72m181l843l208N5K004M664L544
$$ 5786 2900 -2045 -5462 -6287 -5114 138 3929 6531 5559 1378 -2465 -5673 -5618 -3614 1050 4594
5072D594J279j302m008m608k157R87L107M671L061J088k517m720m035j694R53
$$ 4594 5873 4571 563 -4045 -6202 -5215 -2108 2563 5624 6712 4195 -525 -4560 -6254 -5301
5087e301L928L896L979p60l001m196l680p91J749L120M175K909o70k921m151m872
$$ -5301 -1373 2523 6502 5742 2741 -1455 -5135 -5926 -4177 -1057 3118 6027 5357 2436 -1715 -6587
5103f587L08K494M025M610J038r07m158m329k335N63K345M467L565J114k015l403
$$ -6587 -6279 -3785 240 4850 5888 4981 823 -3506 -5841 -5278 -2933 1534 5099 6213 4198 795
5119G95m289k852J056L081N235K699N80k683m539l379j599P99L354M690K136K64
$$ 795 -3494 -6346 -5290 -2209 3026 5725 6305 3622 -917 -4296 -5895 -5096 -1742 2948 5084 5348
5135E348k955l653m408m47K115M024L981J860o97l496m162l568K29K419L204M713
$$ 5348 2393 -1260 -5668 -6115 -4000 24 4005 5865 5168 1672 -2490 -6058 -5829 -3410 -206 4507
5151D507J332j093m205m092j327m93L122M366L441L12j550l944m839j537J614
$$ 4507 5839 4746 541 -3551 -4878 -5371 -2249 2117 5558 5870 4320 376 -4463 -6000 -4386
5166d386K049M821L714k45k934l526m377j778K170L427M443K245n8l843l811k950
$$ -4386 -2337 2484 6198 5953 3019 -507 -4884 -6662 -4492 -1065 3378 5623 5565 1722 -2089 -5039
5182e039p10J753M228M160J700q69m007m290k414k97K343N170L021J717j413l757
$$ -5039 -5749 -3996 232 4392 6092 5223 1216 -3074 -5488 -5785 -3442 1728 4749 6466 5053 1296
5198A296m974k008L60L375M064L518Q0k316l528l824j863J603L005M171L396p30
$$ 1296 -3678 -5686 -5326 -1951 2113 5631 5711 3395 -133 -3957 -5820 -4217 -1212 2959 6355 5625
5214E625k640m079l258j772J811L863L893K213p12l700l738k365p34J751M872
$$ 5625 2985 -1094 -4352 -6124 -4313 -450 3443 5656 4944 1244 -2494 -4859 -5593 -3842 1030
5229A030L801J734k291l880l988j497M01J126N148L179J186j166m494l682k922
$$ 1030 4831 6565 4274 394 -3594 -5091 -4690 -3564 1584 4763 5949 4783 289 -3393 -6315
5244f315J982K663L863L018K61l382k581l314q11L27L205M598J737L1k814m077
$$ -6315 -4333 -1670 2193 5211 5472 2090 -491 -3805 -4616 -4289 -1084 3514 5251 5282 2468 -1609
5260a609l548N1J580L041L250K695r00l726l339k489J89J868L801L437K385k826
$$ -1609 -5157 -5106 -3526 -485 2765 5460 4560 834 -2505 -4994 -4805 -2937 864 4301 6686 3860
5276C860l196l478k339J00L216L394K813J481k153m256l318k176J784K796M741
$$ 3860 664 -2814 -5153 -5053 -1837 1557 4370 5851 3698 -558 -3876 -6052 -4268 -1472 3269
5291C269K330n31k522l560m005j104K537L251L133L054j018k621m198k398j043
$$ 3269 5599 5068 2546 -1014 -5019 -6123 -3586 -335 2798 5852 4834 2213 -1985 -4383 -5426
5306e426K650L210L120K797k021k917n134j210m19K788L863L400J454k658k206
$$ -5426 -2776 434 3554 6351 4330 1413 -3721 -4931 -5350 -2562 1301 4701 6155 3497 1291
5321A291m676j800j78L760L443L317o6k282l407l931j148J376L430M147K109m12
$$ 1291 -3385 -5185 -5363 -1603 1840 5157 5091 2809 -598 -4529 -5677 -4301 -871 3276 5385 4973
5337D973k462l878k989q85J626L379L435L191j895l062m105k503Q0J612M313K880
$$ 4973 2511 -1367 -4356 -5241 -3615 -236 3199 6390 4495 1433 -2672 -5175 -5095 -3483 830 3710
5353C710J939j553l129n049j596P42K636L830L157Q77k059m031l334j816R97L130
$$ 3710 5649 4096 967 -4082 -5678 -4936 -2300 1530 4687 5564 3505 -526 -3860 -5676 -4679 -1549
5369a549L407L233m19k160m117l018o27P01L973L249K394m35k939k993k860q64
$$ -1549 1858 5091 4672 2512 -1605 -4623 -5250 -4549 -576 2673 5067 4632 1693 -1300 -4160 -5024
5385e024J401L244L730K061n65m377k865k663o92L372L459K997J400j753l727
$$ -5024 -3623 -379 3351 5412 4847 470 -2395 -5058 -5750 -2378 1081 4078 5478 3725 -2
5400bl010l048O14L240M121K450K88j478l701k720k500J241L053K992L477m85
$$ -2 -3012 -6060 -5446 -2206 1915 4365 4653 3175 -526 -3246 -5746 -4505 -1452 1540 5017 4532
5416D532k375m129k716o37J342L256M027J931m94k432m029l007j49K065K753L528
$$ 4532 2157 -1972 -4688 -5325 -3983 -727 3300 5231 4737 2305 -1724 -4731 -4880 -2815 -62 3466
5432C466K306j942k965l501k304n3L622L579J855J397j691l536l756j304K30K694
$$ 3466 5772 3830 865 -2636 -4940 -4993 -1371 2208 4063 5460 3769 233 -3523 -4827 -4597 -1903
5448a903M484K176K19j923l435l665q53J580K373L295L297o67l021l037l675l50
$$ -1903 2581 4757 4976 3053 -382 -4047 -4900 -3320 -947 2348 5645 4978 1957 -1080 -4755 -5105
5464e105J416L115M142J202k24l080l333l012j05J791L508K907K061n97l992l755
$$ -5105 -3689 -574 3568 4770 4546 1466 -1867 -4879 -4984 -3193 315 3222 5283 4686 694 -3061
5480c061j445J08J871L572L591J187k653l275l339k119J616L191L168K546m5j829
$$ -3061 -4506 -4398 -2527 1045 4636 5823 3170 -105 -3444 -5563 -3947 -756 2412 4958 4913 3084
5496C084l833l342j415J924L207L785J491j102k098l080k791k20J310L734K770
$$ 3084 -749 -4091 -5506 -3582 -375 3410 4901 3799 1701 -1379 -4170 -4390 -3080 654 3424
5511C424J927j405l154k950k996J31L002K676L083J995k895k674l569k081N38
$$ 3424 5351 3946 792 -2158 -5154 -5023 -2021 655 3738 5733 2838 164 -3405 -5486 -4948
5526d948K829M418K716K00k313l631k610j995J584K607L251L034m78k731l237
$$ -4948 -2119 2299 5015 5215 2902 -729 -3339 -5334 -3750 -1143 2108 5142 4664 1933 -1304
5541a304k640j960K697K970L632J613k96l145k800l287o96K462L848K692J282
$$ -1304 -3944 -5904 -3207 -237 3395 5008 4712 1567 -1233 -4520 -5216 -2754 1094 3786 5068
5556E068j703k428l781j409j270L375L287K249J127j266l507l413j672Q25L570
$$ 5068 3365 937 -2844 -4253 -5523 -2148 1139 3388 4515 3249 -258 -3671 -5343 -4518 -948
5571i48L368K904o82j712l584l612j102K338K234L957J494k24k139l476l304n71
$$ -948 2420 5324 4642 2930 -654 -4266 -5368 -3030 -796 3161 4655 4431 2292 -1184 -4488 -5059
5587e059R49M380L312J361q10l035l040j929p40K265L300K495J699j415l753l225
$$ -5059 -4110 270 3582 4943 4133 1098 -1942 -3871 -4611 -2346 954 3449 5148 3733 -20 -3245
5603c245j090j368L604L692K764P00k174l205k818j803J452K465M084J631j92
$$ -3245 -4335 -5703 -2099 1593 4357 5057 2883 -322 -3140 -4943 -3491 -1026 3058 4689 4497
5618D497j837m423k294o47J396L697K835K381j284k972l498k075o54K377K913
$$ 4497 2660 -1763 -4057 -4704 -3308 389 3224 5605 4321 1349 -2149 -4224 -4878 -2501 412
5633D12K711J852j051l848k917j477p98L077K958L264J053k333k844l331j949
$$ 412 3123 4975 3924 76 -2841 -4318 -5116 -2039 919 4183 5236 2903 59 -3272 -5221
5648e221J805J956L851K606o59k113k433l185q78j60L615K990K616L5k781l715
$$ -5221 -3416 -1460 2391 4997 4338 2225 -208 -3393 -4271 -4431 -816 2174 4790 4825 2044 -1671
5664a671k388n26J368K950L167J436n83k028l789k947J24K722L155K558J558j340
$$ -1671 -4059 -4585 -3217 -267 2900 4336 3753 1725 -2064 -5011 -4887 -2165 990 3548 5106 3766
5680C766l230l455j238n16K637L080K673J171k424k861l223j181L29K641M157
$$ 3766 536 -2919 -4157 -4673 -2036 1044 3717 4888 2464 -397 -3620 -4801 -4472 -1831 2326
5695B326K012j45k161k471l474j288J575K946L901J397r06k348k970j663r29J218
$$ 2326 4338 4193 2032 -439 -3913 -5201 -3626 -680 3221 4618 3712 1364 -1606 -3269 -4198 -2980
5711b980L531K478J627m48l394k832k028n98K136L253L652l46j288k960k417k057
$$ -2980 551 3029 4656 4208 814 -2018 -4046 -4644 -2508 745 4397 4051 2763 -197 -2614 -4671
5727d671N48K181L701K472k55j262l271l393l27J482K352K644J934r9k187l134
$$ -4671 -4123 -1942 1759 4231 3976 2714 -557 -3950 -4277 -2795 -443 2201 4135 4036 1849 -1285
5743a285l423J51J824L118L021P41O4k681l630k577M51J989K517L100J211p71
$$ -1285 -4708 -4557 -2733 385 3406 4147 4211 1530 -2100 -4677 -4226 -2237 280 3380 4591 3820
5759C820k870l087j874o68L276L020K130r6j1l957k907q73R71K051L015K605K30
$$ 3820 950 -2137 -4011 -4679 -1403 1617 3747 3651 3640 -317 -3224 -4097 -3126 -1075 1940 4545 4775
5776D775k882l493k085j328J568K858L112J940k26k967l187j531J06M25L049K862
$$ 4775 1893 -1600 -3685 -5013 -3445 -587 2525 4465 4239 1272 -1915 -3446 -3340 -2915 134 2996
5792B996J588k04l567k733k281J71K828J383L624Q98j325l479l129j303J240K075
$$ 2996 4584 4380 813 -1920 -4201 -4030 -1202 181 3805 4703 3378 -101 -3230 -4533 -3293 -1218
5808a218L282K126l92j861j899l197j138J408K046L215K253k41k526k637k744
$$ -1218 2064 4190 3798 1937 38 -3159 -4297 -2889 -843 2372 4625 4384 1858 -779 -3523
5823c523p44J428K844K636J816j358j576k956k143K57J258L607J357J505k503
$$ -3523 -4267 -2839 5 2641 4457 3099 1523 -1433 -3576 -3319 -2061 1546 2903 4408 1905
5838A905j050l277j944M51K526K857K083J155j599k998k935j245L96K339K932
$$ 1905 855 -2422 -4366 -3915 -1389 1468 3551 4706 3107 109 -2826 -4071 -3675 -1336 1596
5853A596K667o5j878l489k298n16N8L781J983K994q24k157k815k597n58J502K403
$$ 1596 4263 4198 2320 -1169 -3467 -3983 -3925 -144 1839 4833 4009 1852 -963 -3560 -4118 -2616 -213
5870b13K601J922p72k587l281k303M74J902K683K629J288j363k622k631j548m6
$$ -213 2388 4310 3538 951 -2330 -4633 -4159 -2257 426 3055 4343 2980 358 -2273 -3821 -3867
5886c867K235K618L508l32k155k568k778q37J215J947K953J704J75j319l506l136
$$ -3867 -1632 986 4494 4162 2007 -561 -3339 -4176 -2961 -1014 1939 3643 3818 2499 -1007 -4143
5902d143j077K968K745K113J523p32j418l361k695j85K333J782L134Q27p27k425
$$ -4143 -5220 -2252 493 2606 4129 3397 1979 -1382 -4077 -4262 -1929 -147 2987 3814 3087 662
5918F62k927j929K85K181L160J823K82j014k111l263j185M78K029L539K483n87
$$ 662 -2265 -4194 -3909 -1728 1432 3255 3537 2523 412 -2851 -4036 -3558 -1529 2010 4493 3906
5934C906j534l268k660j165J020L232L605O50j00k398k493k362l40J354K253L227
$$ 3906 2372 -896 -3556 -4721 -3701 -469 3136 3786 3686 1288 -1205 -3567 -3907 -2553 -300 2927
5950B927J932j835k119k954k251L64J924L179K136Q55j229k795k229j732P92J658
$$ 2927 4859 3024 905 -2049 -4300 -3936 -2012 1167 3303 4158 2929 134 -2095 -3827 -3035 -1377
5966a377K837K469j69o62l198k763j479J070K220K644K091k60j363k569k448j519
$$ -1377 1460 3929 3760 3098 -100 -2863 -4342 -3272 -1052 1592 3683 3423 2060 -509 -2957 -4476
5982d476J659K652K945J148n91j826l429j980K06J358K857L008P63j186k675k302
$$ -4476 -2817 -165 2780 3928 3337 1511 -1918 -3898 -3692 -2334 523 3531 4294 3108 433 -1869
5998a869k090J92J711L562J585Q97j279k692k891p16K40K162K467J896N10j447
$$ -1869 -3959 -3767 -2056 1506 3091 3988 2709 17 -2874 -3590 -3350 -1188 1279 3175 3685 2238
6014B238k861k170j570J179K722K357K638r51k069k541j286j360J293K267K907
$$ 2238 -623 -2793 -4363 -3184 -462 1895 4533 3582 1513 -1028 -2314 -3674 -2381 -114 2793
6029B793J170m27k726k486k125n14K508K514K353J105j145k498k852j324O23J674
$$ 2793 3963 3536 810 -1676 -3801 -4315 -1807 707 3060 4165 3020 522 -2330 -3654 -3031 -1357
6045a357K775J559O54j192k507k831j250P37K359K540K704j446p52k723l013p1
$$ -1357 1418 2977 3631 2439 -68 -2899 -4149 -3412 -1053 1487 4191 2745 1993 -730 -3743 -3814
6061c814J452K127K857J360n76k047l071q57j089J234K222L296P75p56k114l340
$$ -3814 -2362 -235 2622 3982 3406 1359 -1712 -2569 -3658 -2424 -202 3094 3869 3113 999 -2341
6077b341j440N25J531K537K964N89j197l204k636j167J61K257L677Q69R45j692
$$ -2341 -3781 -3256 -1725 812 3776 4365 3168 -36 -2672 -3839 -3678 -1421 2256 3125 4070 2378
6093B378k723k071j954J084K420L327J378q62j468k020k140r47J123K325K298
$$ 2378 -345 -2416 -4370 -3286 -866 2461 3839 2977 1509 -511 -2651 -3598 -2475 -150 2148
6108B148J644j294q37l473k134N58O48L143K005J516q22k216k567j898N75R23
$$ 2148 3792 2498 1661 -1812 -3946 -3388 -2740 403 2408 3924 3102 886 -1681 -3579 -3004 -2081
6124b081L730K213%j900j952k763l11L94J968J559K333L32j588l250j864n12J813
$$ -2081 1649 3862 3862 1962 10 -2753 -3064 -2670 -702 857 3190 3522 1934 -1316 -3180 -3692 -1879
6141a879J931J858J983p43k347j510k272p27J775J715K952L07m78j533k505j674
$$ -1879 52 1910 3893 3150 803 -707 -2979 -3706 -1931 -216 2736 3043 2565 1032 -1473 -3147
6157c147q26J619K884K537J340j593j785l191k190J448K091K793J167O35j827
$$ -3147 -3973 -2354 530 3067 4407 2814 1029 -2162 -4352 -2904 -813 1980 3147 3782 1955
6172A955j868l123j029J026K019K437J334L58j550j828k873p15J727K233K485
$$ 1955 87 -3036 -4065 -3039 -1020 1417 2751 3109 1559 -269 -3142 -3857 -2130 103 2588
6187B588Q63n03j358l117j366j182K247K833J490J046r76j683k739j643o4K247
$$ 2588 3451 2948 1590 -1527 -2893 -4075 -1828 1005 2495 3541 2565 882 -1857 -3500 -3564 -1317
6203a317K818J066J43J70l204k239j815J376J999K723J475K10j853k164k140l48
$$ -1317 1501 2567 2710 2880 -324 -2563 -4378 -3002 -1003 1720 3195 3405 1552 -612 -2752 -3100
6219c100L16J436L400J768L3k306k444j907q95J464K127L069O89o75j594k601
$$ -3100 -2784 -1348 2052 3820 3853 1547 -897 -2804 -3699 -2235 -108 2961 3650 2975 1381 -1220
6235a220k618P82J357J794K425J365j598k100j885j769P32J677K343J925M60k127
$$ -1220 -3838 -3056 -1699 95 2520 3885 2287 187 -1698 -3467 -2735 -1058 1285 3210 3670 1543
6251A543j865k357o69J102K182J525K706k63k689j917k646M35J008J646K302J398
$$ 1543 -322 -2679 -3348 -2246 -64 1461 4167 3904 1215 -702 -3348 -2913 -1905 -259 2043 3441
6267C441j4j908k643k076J24P87K577K366M18o1k298k184j783J97J542L034N82
$$ 3441 3427 1519 -1124 -3200 -3076 -2289 288 2654 3072 3011 713 -1471 -3254 -3057 -1515 1519 2101
6284B101J696j072l044j509p54o73J912K380J829M04j684k109k012q19R36K022
$$ 2101 3797 2725 -319 -1828 -2582 -3255 -1343 1037 2866 3270 1586 -523 -2535 -3354 -2418 -396
6300c96K414P09P54j798k699j730j23J445K656J047P71l37k248j828j342n61J337
$$ -396 2018 2727 3481 1683 -1016 -2746 -2869 -1424 1232 2279 3050 2713 465 -1363 -2705 -3266 -1929
6317a929L328R61J064j404k151j853j233K63J423L028J709J75j577j961j965j399
$$ -1929 1399 2360 3424 2020 -131 -1984 -3217 -2954 -1531 1497 3206 3381 1804 -157 -2122 -3521
6333c521L84K137L217P40K42j299k524k775L56J144J622J607J367K6j537k032
$$ -3521 -3137 -1000 2217 2957 3199 1900 -624 -3399 -3043 -1899 -277 1330 2697 2723 1186 -846
6349h46j608o28J190K127J792N13M78k551j876j171n53J695K008J028J613r07
$$ -846 -2454 -3082 -1892 235 2027 2540 3018 467 -1409 -2580 -3133 -1438 570 1598 3211 2304
6365B304k681j922j583J257J764K557J185J7j465j448k386p15J257J827J595J815
$$ 2304 -377 -2299 -3882 -2625 -861 1696 2881 2898 1433 -15 -2401 -3116 -1859 -32 1563 3378
6381C378r2k011j650k318m72J089J684K537J002j120j432j417j813j32J790J176
$$ 3378 3286 1275 -375 -2693 -3165 -2076 -392 2145 3147 2027 595 -822 -2635 -2767 -977 199
6397A99K213P5J26k815j738n67Q9Q75K279K059O61j644j465k367j501L61J767
$$ 199 2412 2487 2613 -202 -1940 -2507 -2418 -1543 736 2795 3456 1812 347 -2020 -3521 -3160 -1393
6414a393K681J980J33j826k294j031j423R93J811R96K934j185p94k775j721m2
$$ -1393 1288 3268 3401 1575 -719 -1750 -3173 -2180 -369 627 3561 2376 1582 -1193 -2914 -2956
6430b956J193K209J336J546n18k341j561j692N09J53K403J911M53j66k324k685
$$ -2956 -1763 446 1782 3328 2810 469 -1092 -2784 -2275 -2122 281 2192 2645 2479 155 -2530
6446b530O2J22J307K382J481J86q93l276j475j29m66K525J276K177L96j535j389
$$ -2530 -2468 -2346 -1039 1343 2824 3010 2117 -1159 -2634 -2763 -3229 -704 572 2749 3145 1610 221
6463B21k087j941J560K007K085J736j527j149j777j395m27J247J710J236J400
$$ 221 -1866 -3807 -2247 -240 1845 3581 2054 905 -872 -2267 -2694 -1447 263 1499 2899
6478B899m70j731j738j837p4J682J577K751l25q26j204k160j547Q57J419J532
$$ 2899 2429 698 -1040 -2877 -2951 -1269 308 3059 2734 1908 704 -1456 -3003 -2146 -727 805
6494H05J939p75k18k222k078p57J206J170K480J046qj349k041j382j508K471J665
$$ 805 2744 1969 1751 -471 -2549 -3306 -2100 -930 1550 2596 2588 1239 -802 -2184 -3692 -1221 444
6511D44R66J540q13j111k791p02p30J396J866J622P64O8k821o79j997L70J290
$$ 444 1410 2950 2137 1026 -1765 -2467 -3197 -1801 65 1687 2451 2519 -302 -981 -2978 -2608 -1318
6528a318K109K110M78k535j278j086j368K12J985J741J493N25j352j834j665j361
$$ -1318 791 2901 3379 844 -434 -1520 -2888 -2676 -691 1050 2543 3068 1716 -118 -1783 -3144
6544c144Q22K738J505Q69J14k097j766k039K00J126J523K063J207j060j691j978
$$ -3144 -2322 416 1921 2790 2904 807 -959 -2998 -2798 -1672 -149 1914 3121 2061 370 -1608
6560a608j135j14J177K221J022J318q15j675j758j264N04J008J787J035J266j057
$$ -1608 -2743 -2857 -1680 541 1563 2881 2066 391 -1367 -2631 -2127 -1119 668 1703 2969 1912
6576A912k155j577j058M53J254K660J280Mj373j913j134j139L96K611J163J587
$$ 1912 -243 -1820 -2878 -2425 -1171 1489 2769 2773 1400 -513 -1647 -2786 -2390 221 1384 2971
6592B971m85j798j594j453l17K45K236K036R49m33k007j532j103n8J682J773M58
$$ 2971 2486 688 -906 -2359 -2676 -2431 -195 1841 2790 2357 350 -1182 -2285 -2343 -661 1112 1570
6609A570J117r51q43k354j419M10Q55K185J724O2m89k185j569o50J90K115J810
$$ 1570 2687 1736 893 -1461 -2880 -2470 -1615 570 2294 2356 1867 -318 -1887 -2537 -2347 -232 1578
6626A578Q99j68j172k296j118l89Q40K024J929O21j332r07j236j926m64J436J879
$$ 1578 2477 2309 1137 -1159 -2277 -2666 -1826 198 2127 2748 1416 509 -727 -2653 -3117 -1681 198
6643A98J455J510j694j227j915K2l87J065K639K14J016j310j117k225j375J516
$$ 198 1653 3163 1469 242 -1673 -1651 -2038 -973 1666 1880 2896 1586 469 -1756 -3131 -1615
6659a615J446J445R78Q85j521j831j415j269P84K264J298M10M51j029k217j429
$$ -1615 -169 1276 2254 3139 1618 -213 -1628 -2897 -2113 151 1449 1859 2310 1281 -936 -2365
6675b365m87J580J342J967N35l16j778j237j847j37J250J959K387l31l94j996
$$ -2365 -2852 -1272 70 2037 2572 2256 478 -759 -2606 -2743 -1493 466 2853 2522 2128 132
6691A32j529r08j27R72K093J236P92j156k208r37o22J04J513K207R23l56q59j782
$$ 132 -1397 -2305 -2432 -1460 633 1869 2661 1505 -703 -1640 -2262 -2158 -645 1562 2485 2129 1270 -512
6709e12k503M18O89R40K714J160q67j382j565j148p77K139L34K483P67j113j467
$$ -512 -3015 -2597 -1908 -968 1746 2906 2039 657 -908 -2056 -2833 -694 -360 2123 2890 1777 310
6726C10j546j305M52J068J920J873n06k40j388k267q55R94j92K492K225k08j268
$$ 310 -1236 -2541 -2089 -1021 899 2772 2266 2026 638 -1629 -2484 -1490 -1682 810 3035 2827 1559
6743A559j551k071m26p6J940K360L93J41j039j715k503K39N53K881R90J362p04
$$ 1559 8 -2063 -2489 -2565 -625 1735 2128 2269 1230 -485 -2988 -2749 -2196 685 1675 3037 2333
6760B333j081k479j170R6R07K161J210j73k35j255j558p74O34K60K263J515O46
$$ 2333 1252 -1227 -2397 -2301 -1394 767 1977 1804 1569 314 -1244 -2018 -1384 -1124 1139 2654 3300
6777C300k278j064j655j371L89K348K175J096q07m11k242q00j405N90J578J470
$$ 3300 1022 -42 -1697 -3068 -2679 -331 1844 2940 2133 1722 -520 -1320 -2725 -2135 -557 913
6793I13K152m67j571j717j543n63O18K270J736K68J83k394j080r33l70J000J412
$$ 913 3065 2598 1027 -690 -2233 -2796 -2178 92 1828 2096 2279 -115 -1195 -2128 -2498 -1498 -86
6810h6K061P87q94j923j159r47j67J235J740R11Q19j245o70k781n15J135R32K160
$$ -86 1975 2762 1868 -55 -1214 -2161 -2328 -1093 647 1558 2377 1132 462 -2319 -2834 -1699 -767 1393
6828A393J518r72j21k203j609l38m1J633K873O37J2j598j878j565k51J032J734
$$ 1393 2911 1939 1818 -385 -1994 -2332 -2373 -740 2133 2770 2782 1184 -694 -2259 -2510 -1478 256
6845B56J626O16k43k097j811K6o73Q17J542J894M95r7k751j032n51q72L210l00
$$ 256 1882 2498 2255 158 -1653 -1627 -2300 -1483 59 1953 2448 2351 -400 -1432 -1983 -2855 355 55
6863E5K078O0n14j460j898j173J556N43J926J974n81j884j882q82r35J570J058
$$ 55 2133 2193 1679 219 -1679 -2852 -1296 -753 1173 3147 2566 682 -1200 -2082 -3017 -1447 -389
6880c89J976Q18m07j384k025j614Q88m03K316K313j49L11k244j615q24N12J131
$$ -389 1587 2405 1998 614 -1411 -3025 -2137 -2540 -224 2089 1940 2251 7 -1608 -2432 -1920 -789
6897g89J024J180J120q98j546k213l80O47J645J305J407r1j126j421j641q57R52
$$ -789 235 1415 2535 1637 91 -2122 -2502 -1855 -210 1095 2502 2411 1285 -136 -1777 -2634 -1682
6914a682J989J607M56l00j712j696p81o86J297J441J183K192j072k298j211p41
$$ -1682 307 1914 2370 2070 358 -1338 -2119 -2805 -1508 -67 1116 3308 2236 -62 -1273 -2014
6930b014k85J359J944J093R74j288j185j800k177J665KK578J459O4r72j377k043
$$ -2014 -2299 -940 1004 2097 3071 1783 598 -1202 -3379 -1714 -1712 866 2325 2389 1417 40 -2003
6947b003J31m79J685K077J535r2j662j324o45k520J448J754J733J439j108q83
$$ -2003 -1872 -2351 -666 1411 2946 2854 1192 -132 -777 -3297 -1849 -95 1638 3077 1969 1086
6963A086j526k130J43Q21J716K113N77q56j368r19k441J440J99J333J916L95n74
$$ 1086 -440 -2570 -2427 -1606 110 2223 2800 1944 576 -343 -2784 -1344 -1145 188 2104 2499 1925
6980A925k091j452r94O30J838M53K203k80j692j385q83n77O94J386J938L10J55
$$ 1925 -166 -1618 -2612 -1982 -144 309 2512 2232 540 -845 -1728 -2305 -1611 -225 1713 2023 2178
6997B178j556j027j868p03J187K147J080Q46K05k248j300q01k28M30K558Q97L50
$$ 2178 622 -405 -2273 -2976 -1789 358 1438 2284 2489 241 -1059 -1860 -2088 -1658 900 1797 2147
7014B147j077j174j260j265n6K012J418K272k95n71k519j832L82k08J380J740
$$ 2147 1070 -104 -1364 -2629 -2685 -673 745 3017 2722 2151 -368 -2200 -1818 -2026 -646 1094
7030A094J334j228q7j698j037n92L30J404J765J380q89r05j756j325m28J552K017
$$ 1094 2428 1200 1113 -585 -1622 -2214 -1884 -480 1285 2665 1776 871 -885 -2210 -2638 -1086 931
7047I31Q45O01j144j166j420j208R8J100K251R62N86j141j144k355o74Q52M87
$$ 931 1776 2377 1233 67 -1353 -2561 -2463 -1363 888 1850 2436 1295 151 -2204 -2878 -2026 -1539
7064a539K098J356m20O71k063k075j32J29J456J316J894j37j047k506n41r02J376
$$ -1539 559 1915 1495 2166 103 -1972 -2104 -1975 -519 797 2691 2554 1507 -999 -1540 -2442 -1066
7081a066J248Q01K067j837p75j287j439n6Q97J992K414k41j416k088j15m72j219
$$ -1066 182 983 3050 1213 438 -849 -2288 -2344 -1447 545 2959 2718 1302 -786 -901 -1373 -2592
7098b592J723J258J857k15J21k319k193p41J109J748J586J372n75q12j154j904
$$ -2592 -869 389 2246 2031 2152 -167 -2360 -3101 -1992 -244 1342 2714 2139 1327 173 -1731
7114a731n80J180J464J241R01p70j325j448o58p33J178J415J194R52l09j321k618
$$ -1731 -2311 -1131 333 1574 2475 1705 380 -1068 -1726 -2459 -1281 134 1328 2280 1971 650 -1968
7131a968m87L52M73K250J669p0j142r37j368j942J034O80K088K034P4j429j491
$$ -1968 -2455 -2103 -1630 620 2289 2219 1077 140 -1228 -3170 -2136 -1456 632 2666 2740 1311 -180
7148a80j950r9O69O28K825K93k41p15j691j641k88J610K67K116J382l31j984j941
$$ -180 -2130 -2229 -1560 -932 1893 2186 1945 1230 -461 -2102 -2390 -780 -513 1603 2985 2654 670 -1271
7166a271p25o75K035Q16J784j13l17j735j723l20J82J139J686J536L54j403j338
$$ -1271 -1996 -2671 -636 180 1964 1851 1534 -201 -1924 -2244 -2062 -923 763 2299 2653 1250 -88
7183h8j216m74l20K036R59J340L46j426j161j893n96J426O81J900J091k88j260
$$ -88 -1304 -1778 -2098 -62 897 2237 2583 1157 -4 -1897 -2493 -1067 -386 1514 2605 2317 1057
7200A057j933j269l73Q57J773J376N15n79j184j423j279N81K17J854J504O35j43
$$ 1057 -876 -2145 -2518 -1661 112 1488 2003 1424 240 -1183 -2462 -1881 -1664 190 1694 2329 2186
7217B186k240j462p79O58j29K631J855j95j627j668o52j225N27J360J883J050
$$ 2186 -54 -1516 -2295 -1637 -1766 865 2720 2525 898 -770 -1422 -2647 -2120 -760 1123 2173
7233B173m62j100j101j728r84J310J206J799J003J42j514j069j646p05Q70J462
$$ 2173 1711 611 -490 -2218 -3202 -1892 -686 1113 2116 2258 744 -325 -1971 -2676 -1806 -344
7249c44K091Q70j176j386p63j639J73R85J723J654M10n75k072j703o69J19K156
$$ -344 1747 2617 1441 55 -708 -2347 -2174 -1189 534 2188 2598 2023 -49 -1752 -2421 -2302 -146
7266a46J282M23J059j075k058j549n94Q15J148J783J033L5j630j086j555j149
$$ -146 1136 1559 2618 1543 -515 -2064 -2658 -1843 -695 1088 2121 2156 526 -560 -2115 -3264
7282c264K372J349Q57R89n55j533q6l174O39J163J317J401R94n49j250j592r63
$$ -3264 -892 457 1314 2303 1748 215 129 -3045 -2406 -1243 74 1475 2469 1920 670 -922 -1885
7299a885K29O69J854R15R04j810n93j268j499O30P99J881J718j98j233j423k058
$$ -1885 -1656 -987 867 1782 2686 876 283 -985 -2484 -1854 -1055 826 2544 2346 1113 -310 -2368
7316b368j02O09R51K144P35J051k598j471j575J83O93K074J508N80l32j647r91
$$ -2368 -2470 -1861 -910 1234 1969 3020 422 -1049 -2624 -2441 -1748 326 1834 2414 2082 435 -556
7333e56j486L42J9K202J451N88k38k068j421q10K94J005K735K52J77p04j644j879
$$ -556 -2042 -1700 -1681 521 1972 2560 2322 254 -1167 -1977 -1683 -678 2057 2309 2486 1782 138 -1741
7351a741o62K26J633J871R74J1j333j284j503o71Q62K212P76J170r49K31k618
$$ -1741 -2403 -2177 -544 1327 2301 2312 979 -305 -1808 -2479 -1617 595 1371 2541 1592 1823 -795
7368g95j836nJ625J517Q57Q20k22j595j659n99n00J717J431J275J19j244j33j876
$$ -795 -2631 -2636 -1011 506 1363 2183 1961 366 -1293 -1892 -2392 -675 756 2031 2150 906 773 -1103
7386a103j311m6J822J646J115K57o9k619j797j04R57R93J352J472j110r47j112
$$ -1103 -2414 -2460 -638 1008 2123 2380 2311 -308 -2105 -2209 -1252 -259 1093 2565 1455 508 -604
7403f04j807r69J760J053J336J495o6j863j107j260n63J619J041J598J097q93
$$ -604 -2411 -3380 -1620 -567 769 2264 2198 335 -772 -2032 -2595 -976 65 1663 2760 1867
7419A867j447k154Q1q87J215K056J494L14j82k158j914m41l66K165R91J595lj140
$$ 1867 420 -1734 -1653 -2540 -1325 731 2225 2539 2357 199 -1715 -2156 -2522 -357 634 2229 2226 1086
7437A086k428j528O2J224J452J501Q11k20r73k347q91K18N57J424J810J033r01
$$ 1086 -1342 -2870 -2808 -1584 -132 1369 2180 1960 987 -1360 -2251 -2033 -1476 -52 1758 2791 1890
7454A890k016p81o99q82M51K366J503Q42q69j746k082j14k49J327J831J361R1
$$ 1890 -126 -907 -1606 -2488 -2037 329 1832 2674 1805 59 -2023 -2137 -2386 -1059 772 2133 2224
7471B224n31j534k025j022N80J378K567J097j175n55j788j005p22QK766J209O29
$$ 2224 1693 159 -1866 -2888 -2308 -930 1637 2734 1559 1004 -784 -1789 -2511 -2503 263 1472 2101
7488B101n94l62k135j378r30J503J904J181J576j116j031k949nJ43J312J653J096
$$ 2101 1507 1145 -990 -2368 -3298 -1795 109 1290 2866 1750 719 -2230 -2235 -2092 -780 873 1969
7505A969l32P7k174j385j96O5J537J890J048l06r52j186j427r79Q82P69K309J388
$$ 1969 1637 1714 -460 -1845 -2041 -1976 -439 1451 2499 2193 1241 55 -1372 -2351 -1469 -700 1609 2997
7523B997q14j472j479j644J97M50J341K142Q37m37j634k178j27k5M97J465K534
$$ 2997 2183 711 -768 -2412 -2215 -1765 -424 1718 2555 2118 484 -1694 -1821 -1846 -1349 116 2650
7540B650m64j57k288q10r48L86J165R55J708O82r02k259j251j63o67J728K111
$$ 2650 2186 2029 -259 -1069 -2017 -1631 -466 489 2197 2879 1977 -282 -1533 -1696 -2363 -635 1476
7557A476Q57k01j289r29k138R0L59J054K395M07j86L51l346p36p90J568J835J263
$$ 1476 2333 2132 843 -86 -2224 -2134 -1775 -721 1674 2081 1895 2246 -1100 -1836 -2626 -1058 777 2040
7575B040J012j340j035j999j292K10J459J534J593j2J07k434j799l57n12K425
$$ 2040 3052 1712 677 -1322 -2614 -2404 -945 589 2182 2170 2277 -157 -1956 -2313 -2825 -400
7591d00J132J432K49j028j503k281n6J87K211J517P51j46j254j918p70n21J173
$$ -400 732 2164 2413 1385 -118 -2399 -2455 -2268 -57 1460 2211 2065 811 -1107 -1877 -2398 -1225
7608a225Q67J856Q32l68n37k912o21O20L91J535P06K117j049j832j202j553L33
$$ -1225 -358 1498 2330 1962 1425 -1487 -2108 -1488 -1097 438 1144 3261 2212 380 -822 -2375 -2042
7625b042Q98K272K39P27j105j013j707j98r56J745K856K96Rp40j828j646o76J319
$$ -2042 -1144 1128 1367 2094 989 -24 -1731 -1929 -2885 -1140 1716 2012 2021 1281 -547 -2193 -2869 -1550
7643a550J408J135J623j60j431k027j313L50K27K322J335M17o69j644r10j654
$$ -1550 -142 993 2616 2456 1025 -1002 -2315 -1965 -1738 584 1919 2336 1667 23 -887 -2541
7659b541M35J169M57K656L26l7j989j700j451O83R67K349J063j14l13k304j112
$$ -2541 -2106 -937 -480 2176 2502 2465 476 -1224 -2675 -1992 -1025 1324 2387 2273 1960 -344 -1456
7676a456q85j09J393K043J946n70j501j255k209R06K29J363J883M55n61q63k109
$$ -1456 -2341 -2450 -1057 986 2932 2362 861 -394 -2603 -1697 -1468 -105 1778 2233 1672 809 -1300
7693a300j078P95M77J141P22J138o6j499j468j672L99J136J601K383r29N09j950
$$ -1300 -2378 -1583 -1106 35 757 1895 1829 330 -1138 -2810 -2411 -1275 326 2709 1780 2289 339
7710C39k194p94m28K797P16K552o76r8k397j839O7j015K311J937O02R57k176j803
$$ 339 -1855 -2649 -3077 -280 436 2988 2312 2214 -183 -2022 -1955 -2970 -659 1278 1880 2837 661 -1142
7728a142o97k18L46J465K082m0P83j422j707k076L1J758J002J271J170n94k453
$$ -1142 -1839 -2057 -1711 -246 1836 1796 2579 1157 -550 -2626 -2595 -837 165 1436 2606 2012 -441
7745d41q93j785Q48J886J340J405l37n18j904j017j251Q41P80K280J456j193K05
$$ -441 -1334 -3119 -2271 -385 955 2360 2023 1505 -399 -1416 -2667 -1826 -1046 1234 2690 1497 1702
7762A702j810j458p47jJ782J953J256r35j098j545j125K02N81J907J392L44j05
$$ 1702 -108 -1566 -2313 -2314 -532 1421 2677 1742 644 -901 -2026 -1824 -1243 664 2056 2400 2295
7779B295j589k154j510J818q9J261J473J753k351Q6k145j405K04J688J298K106
$$ 2295 706 -1448 -2958 -1140 -1229 32 1505 3258 907 993 -1152 -2557 -2353 -665 633 2739
7795B739m02j761j525j219j5K15J438J360J449m65p16j642j257o06J843m13K936
$$ 2739 2337 576 -949 -2168 -2183 -1968 -530 830 2279 1814 1098 -544 -1801 -2407 -564 -977 1959
7812A959Q60n7j540l252j054J99J582R77J989P31j004r45j863p52J78R99J254
$$ 1959 2819 2762 1222 -2030 -3084 -2885 -1303 -326 1663 2394 1390 445 -1418 -2170 -1992 -993 261
7829B61K617l50M2k990r55m80L89O51K033J46J71J47k118j253k55k2K073J713
$$ 261 2878 2528 2570 -420 -1375 -1855 -1466 -815 1218 1364 1535 1682 -436 -1689 -1944 -1966 107 1820
7847A820J357r31j084q01j971r93Q61K571J320l33N59j443j993q08n52J335J853
$$ 1820 3177 2246 1162 361 -1610 -2603 -1742 829 2149 1816 2375 932 -1061 -1869 -2421 -1086 767
7864G67J641j07p79j507j729j062N33J544J481J243R01p05k359j391n58L62M57
$$ 767 2408 2301 1522 15 -1714 -2776 -2243 -699 782 2025 2926 2221 -138 -1529 -2087 -1725 -1268
7881a268K321N60N79j296j327j561m32J224J254J939Q61q34o24k552j563P10P9
$$ -1268 1053 1613 2192 896 -431 -1992 -2424 -1200 54 1993 2854 2020 1396 -1156 -2719 -2009 -1930
7898a930K146J777J073o81j813k013r47L38J409J589N98O96J17j761k090p39M75
$$ -1930 216 1993 3066 2385 572 -1441 -2388 -2050 -641 948 1546 2242 2359 598 -1492 -2231 -1756
7915a756O8K715P06Q81j406k436n48m76J163J307J177P14k16j142j582j287J65
$$ -1756 -1688 1027 1733 2614 1208 -1228 -1776 -2252 -1089 218 1395 2109 1893 751 -831 -2118 -1953
7932a953P61J421J900K9q84r28j120j669O7J353K156L69L79J26j617r83j528J18
$$ -1953 -1192 229 2129 2158 1274 346 -774 -2443 -2376 -1023 1133 1502 1881 2007 390 -593 -2121 -2003
7950b003P82K092J230K19o50j490k323l32P01J041J595K095q50j141r20j671o07
$$ -2003 -1221 871 2101 2320 1670 180 -2143 -2475 -1774 -733 862 2957 2107 966 46 -1625 -2232
7967b232J30J920J978L33q4k028j143m70m94J076J030J762L00n51o84k011q24
$$ -2232 -2102 -182 1796 2129 2045 17 -1126 -1596 -2090 -1014 16 1778 2078 1527 843 -1168 -1992
7984a992o48J524J607J330L98k10k405j439q82Q65K122M17J289%j142j002j782
$$ -1992 -2640 -1116 491 1821 2219 2009 -396 -1835 -2717 -1852 270 687 1976 1976 834 -168 -1950
8001a950n04M02J925J100J465J41j451k529m71N0P60J402J148Q49j1j296k358
$$ -1950 -2454 -2052 -127 973 2438 2579 1128 -1401 -1872 -1822 -1062 340 1488 2337 2326 1030 -1328
8018a328j263j87J338J656J376j69Q91k099r14j433M20M82J793J374P13j657j025
$$ -1328 -2591 -2778 -1440 216 1592 1423 2314 215 -699 -2132 -1712 -1230 563 1937 2650 993 -32
8035c2q87k056J039J221J777J466k32j308j536j391m0N86J470O26J352N00j617
$$ -32 -919 -2975 -1936 -715 1062 2528 2296 988 -548 -1939 -1979 -1393 77 703 2055 2555 938
8052I38j800r30k98R35N02K303M54K61j945j196j566j42Q00J971J310L65n49r62
$$ 938 -862 -1792 -2090 -1155 -653 1650 2104 2365 420 -776 -2342 -2484 -1684 287 1597 1962 1413 451
8070D51j538p85n0P15K012J294J07n7j800k332k18k00J474J751J463K9q73k223
$$ 451 -1087 -1872 -1922 -1207 805 2099 2206 2149 349 -1983 -2201 -2401 -927 824 2287 2316 1443 -780
8088g80j289M27q6J180K557O38r89j640j705m37l66P91K420J176L74p55r49j719
$$ -780 -2069 -1642 -1728 -548 2009 2647 1658 18 -1687 -2124 -2490 -1699 721 1897 2271 1516 567 -1152
8106a152j570P9J677J913J417o67o17j185j442l96P4J938J282K31P05p16j661
$$ -1152 -2722 -2643 -966 947 2364 1697 1080 -105 -1547 -1943 -1869 69 1351 1582 2287 1571 -90
8123i0j392j365O48J228K033J416J26j754j029j654q87J245J608J862L66o54j141
$$ -90 -1482 -2847 -2199 -971 1062 2478 2604 850 -179 -1833 -2720 -1475 133 1995 2361 1707 566
8140E66j586j060M06M94N93J972J035o38k235p82j044J21J268J468J243Mn04j612
$$ 566 -1020 -2080 -1674 -1180 -587 1385 2420 1782 -453 -1235 -2279 -2158 -890 578 1821 1825 1321 -291
8158b91j569jo65K483L92J793l60m52j399j785p89N68J610K154Q11r32n43j687
$$ -291 -1860 -1861 -2526 -43 349 2142 1782 1330 -69 -1854 -2643 -2075 -465 1689 2500 1568 1025 -662
8176f62j815M24J059P68J741J76K13j094k192n89k89J403R40J598P53
$$ -662 -2477 -2053 -994 -226 1515 1691 1904 810 -1382 -1971 -2260 -857 83 1681 2434
8191B434
$$ 2434
$$ Imaginary data points
##PAGE= N=2
##DATA TABLE= (X++(I..I)), XYDATA
0@%%%%%%%%%%%%%%%%%kJ4p6J28j28J28j30J38j97K54k61K83l45L94m56N23n86
$$ 0 0 0 0 0 0 0 0 0 0 0 0 0 0 0 0 0 0 -2 12 -64 64 -64 64 -66 72 -125 129 -132 151 -194 200 -256 267 -319
34c19O66p41Q44r48J046j162J300j449J615j789J975k182K405k655K926l221L556
$$ -319 347 -394 450 -498 548 -614 686 -763 852 -937 1038 -1144 1261 -1394 1532 -1689 1867
51A867l921M317m766N265n825O465p194Q043r043J0238j1702J3539j5929J9171
$$ 1867 -2054 2263 -2503 2762 -3063 3402 -3792 4251 -4792 5446 -6256 7283 -8646 10525
65A0525k3861L1296m4972P8603l24980o00747R6165L66500O02779M68733J84944
$$ 10525 -13336 17960 -27012 51591 -273389 -874136 -777971 -411471 191308 660041 844985
76H44985k67293n27989n64823k94379Q4479M59647N76436M23358M5459l21062
$$ 844985 577692 49703 -515120 -809499 -725020 -265373 311063 734421 779880 458818
86D58818n49624m98861k12480J90226M82851N47074L31577l7586l86673n33321
$$ 458818 -90806 -589667 -802147 -611921 -129070 418004 749581 711995 325322 -207999
96b07999m32774j17574K55055N05355M94378K43916j19576m20931n16479l54107
$$ -207999 -640773 -758347 -503292 2063 496441 740357 620781 199850 -316629 -670736
106f70736k3333L16181M95034M36860J59660j93193m44838m74021k77173N3686
$$ -670736 -694069 -377888 117146 554006 713666 520473 75635 -398386 -675559 -621873
116f21873L56690M84681L73982P6487k52395m52036m29523j98727J26688L86409
$$ -621873 -265183 219498 593480 669967 417572 -34464 -463987 -662714 -536026 -149617
126a49617M57314L05197N873l02502m54729l79815j17615J90601M03408M26243
$$ -149617 307697 612894 618767 316265 -138464 -518279 -635894 -445293 -41885 384358
136C84358K35925o9730l35389m36770l24901n1726K46815M13435L78479J63942
$$ 384358 620283 550553 215164 -221606 -546507 -598233 -351418 62017 440496 604438
146F04438j26565l61564m17014k62441J7615K83768M10779L37469R7157j87645
$$ 604438 477873 116309 -300705 -563146 -545531 -261763 149016 486485 583642 395997
156C95997l75098l82603k05088P5485L21433L98846K82144L3189k32436l83816
$$ 395997 20899 -361704 -566792 -491307 -169874 228972 511116 544305 311869 -71947
166g1947l44369j37954J33071L39655L78985K29911l1955k71519l76860l01613
$$ -71947 -416316 -554270 -421199 -81544 297441 527352 495397 223878 -152982 -454595
176d54595p9689J83498L53700L48315J74923q4911l02354l66217k51231j8852
$$ -454595 -534284 -350786 2914 351229 526152 441241 138887 -227330 -478561 -497413
186d97413K24570L56759L15394J16226j37770l21879l45948k02828L9370K60900
$$ -497413 -272843 83916 399310 515536 377766 55887 -290061 -492889 -453519 -192619
196a92619L51416K74601O1244j83303l34273l18932j49570R1793K86555L40028
$$ -192619 158797 433398 494642 311339 -22934 -341866 -491436 -399643 -113088 226940
206B26940K27875M561k19943l36891k86729r6695J40622L05437L19827J80394
$$ 226940 454815 459376 239433 -97458 -384187 -480882 -340260 -34823 285004 465398
216D65398m7633k51987l32761k48308m3009J81929L16674K93771J29003r6767
$$ 465398 417765 165778 -166983 -415291 -458300 -276371 40303 334074 463077 366310
226C66310k76039l20763k05013R058K18385L18822K62601P8197j43403k92667
$$ 366310 90271 -230492 -435505 -426447 -208062 110760 373361 451558 308155 15488
236A5488k98781j59370N6970K47207L14261K25178K7408j82013l01165k74205
$$ 15488 -283293 -442663 -385693 -138486 175775 400953 428361 246348 -54817 -329022
246c29022j12168J04735K69387L00936J84937k0983k16380l03365k41303o3557
$$ -329022 -441190 -336455 -67068 233868 418805 397822 181442 -121923 -363226 -426783
256d26783J46032K83329K82002J41014p0348k41246k96296k05907j5443J84018
$$ -426783 -280751 2578 284580 425594 355246 114000 -182296 -388203 -403646 -219628
266b19628K90637K53357R6769j11572k63110k84551j63883L1304K12421K89700
$$ -219628 71009 324366 421135 309563 46453 -238098 -401981 -370677 -158256 131444
276A31444K25954M7299j51099k73583k63386j24730P6968K39552K80899J86890
$$ 131444 357398 404697 253598 -19985 -283371 -408101 -331133 -91581 189318 376208
286C76208K457j83120k79988k37794p8724J16300K54409K68718J49490m2547k11080
$$ 376208 378665 195545 -84443 -322237 -400961 -284661 -30252 238466 387956 345409 134329
297A34329k76638k07537l5781J54139K65336K45913J08778q1786k34490k68887
$$ 134329 -142309 -349846 -385627 -231488 33848 279761 388539 306753 72263 -196624
307a96624j71295R075J82379K68212K23429O6268j22452k47834k50286j36211
$$ -196624 -367919 -358844 -176465 91747 315176 381444 258992 11158 -239128 -375339
317c75339M8835K10552K65654J89065K4058j53232k55825k33071r4551Q9511K27267
$$ -375339 -326504 -115952 149702 338767 362825 209593 -46232 -279303 -373854 -284343 -57076
328e7076K54367J58967j8495j83243k57343k05302n5120J22924K42187K38259
$$ -57076 197291 356258 337763 154520 -102823 -308125 -363245 -240321 1866 240125
338B40125J19755n6661k03603k54150j75861j1924J53834K45546K17746Q4250
$$ 240125 359880 303219 99616 -154534 -330395 -342319 -188485 57061 274807 359057
348C59057r4702k23908k39078j42998K3696J80896K46786J90793M4353j25942
$$ 359057 264355 40447 -198631 -341629 -317933 -137037 109749 300542 344895 218953
358B18953k31035k26391j07892O3709K00601K38988J63855N249j55530k37262
$$ 218953 -12082 -238473 -346365 -282656 -82055 156933 320788 326037 170507 -66755
368f6755k02853p2706R6442K16963K30011J29200l2012j76306k35819j80824l3582
$$ -66755 -269608 -342314 -245872 -28909 201102 330302 298290 121984 -113835 -294659 -328241
379c28241J27291K24977K11322R8139o7244j97640k28933j49594J315J53039K30029
$$ -328241 -200950 24027 235349 333488 266244 68604 -160329 -309923 -308608 -155569 74460
390G4460J92038O0131r9355k08791k18037j19159L8133J75944K25239J66273K6316
$$ 74460 266498 326629 227274 18483 -199554 -318713 -280580 -104636 120603 286876 313192
401C13192j28247k19660j99345q4626P0691J91999K19675J38259j1241j52476
$$ 313192 184945 -34715 -234060 -318686 -247995 -55996 163679 301938 290697 138221
411A38221k19723j79668n1807J03881K04191K04902J07612m3469j72937k18783
$$ 138221 -81502 -261170 -312977 -209096 -4905 199997 307609 264140 91203 -127580
421a27580j53056j5718J28637K10951J89376P3746p6340j88368k08488j26733
$$ -127580 -280636 -296354 -167717 43234 232610 306356 230016 41648 -166840 -293573
431b93573J8589J52936K11658J68145L9740j04611j99249j95421r6095N0926J71166
$$ -293573 -274984 -122048 89610 257755 297495 192884 -6365 -201786 -297881 -246955 -75789
442g5789K08650J42781O104j31456k03874j76433o4708Q1210J86482J97682J14362
$$ -75789 132861 275642 281746 150290 -53584 -230017 -294725 -213515 -27033 170649 285011
453B85011k5245j53123k04213j55837l0135J08859J93704J84429Q4617n7960j70432
$$ 285011 259766 106643 -97570 -253407 -283542 -174683 19021 203450 288067 230107 59675
464E9675j98120j30433J800J32903J98868J64256N3901q6585j81655j88646j03072
$$ 59675 -138445 -268878 -267078 -134175 64693 228949 282850 196265 14610 -174036 -277108
475b77108L4322J51818J97475J43884J9877j11596j89114j73657p3371O3174J68086
$$ -277108 -242786 -90968 106507 250391 270268 158672 -30442 -204099 -277470 -214296 -46210
486d6210J89998J18233r707j34415j91397j54330m2830R0767J78021J78857R0592
$$ -46210 143788 262021 252314 117899 -73498 -227828 -270658 -179891 -1870 176987 267579
497B67579m0063j50870j89145j33723j1500J14249J83983J63679O2702o8630j65727
$$ 267579 227516 76646 -112499 -246222 -257722 -143473 40510 204189 266891 198261 32534
508C2534j80730j07572J8304J34613J83960J44525L2027r3383j73852j68449q1408
$$ 32534 -148196 -255768 -237464 -102851 81109 225634 257661 164278 -9574 -178023 -259431
519b59431M6614J50451J80192J22469L629j16825j78423j51329n4008P2611J62640
$$ -259431 -212817 -62366 117826 240295 243924 127099 -51324 -202653 -256661 -184050 -21410
530b1410J72182R7977k5594j34221j77823j33510k4313R7972J69155J58418P1419
$$ -21410 150772 248749 223155 88934 -88889 -222399 -246712 -148740 20415 178833 250252
541B50252n2235j49580j72534j11747N313J16759J72556J43235M3149p5967j59917
$$ 250252 198017 48437 -124097 -235844 -230531 -113772 58784 202019 245168 169201 9284
552I284j62811q7453L1001J34023J70753J23080J8084r9937j65733j48954o2538
$$ 9284 -153527 -240980 -209979 -75956 94797 217877 235961 136024 -29709 -178663 -241201
563b41201N6142J47037J66250J01434j0990j17730j66158j34553l5848P9991J56278
$$ -241201 -185059 -38022 128228 229662 218672 100942 -65216 -199769 -235617 -155626 652
574F52J54375P8566l5810j33134j64245j14875r191J00147J60888J41616N3970
$$ 652 155027 233593 197783 64649 -99596 -214471 -223662 -123515 37373 178989 232959
585B32959o1887j43918j55708r4278J6081J17375J61510J25394K6817q1733j51242
$$ 232959 171072 27154 -128554 -222832 -206751 -89376 72134 197528 224345 142612 -8630
596h630j47775o9988M1089J31499J57771J07539J566j02401j55076j32842m6815
$$ -8630 -156405 -226393 -185304 -53805 103966 211505 213071 110670 -44406 -177248 -224063
607b24063O4079J42234J49982Q4908k1642j17281j56323j16096k0527Q4800J46806
$$ -224063 -159984 -17750 132232 217140 195498 78217 -78106 -194202 -214729 -129929 16877
618A6877J39272O3863m6369j31990j50143r6185K963J01722J52091J24847L8081
$$ 16877 156149 220012 173643 41653 -108490 -204675 -201712 -99990 52101 176948 215029
629B15029o6944j40149j43135p6201K8343J17281J48444J09078J4058q7743j44185
$$ 215029 148085 7936 -135199 -211400 -183057 -65776 82668 191746 205804 118061 -26124
640b6124j31333n5177N1017J29305J45081Q8024r411j03173j46197j18234k9954
$$ -26124 -157457 -212634 -161617 -32312 112769 200793 191382 88209 -57988 -176222 -206176
651b06176P0129J36760J35445O9415l1777j19272j43437r9320p449Q7271J42718
$$ -206176 -136047 713 136158 205573 173796 54524 -88913 -188233 -195682 -108411 34307
662C4307J23201M6082n3663j26533j38356q2502J5191J05953J40504J10141K4153
$$ 34307 157508 203590 149927 23394 -114962 -197464 -182273 -76320 64184 174325 198478
673A98478p4595j33099j29506n9838L6428J16010J38764R2592R02q9899j35818
$$ 198478 123883 -9216 -138722 -198560 -162132 -46122 92642 185234 186136 96237 -39581
684c9581j17804m0181N8010J25326J31981P4305k0559j04766j38112j00137j7675
$$ -39581 -157385 -197566 -139556 -14230 117751 192056 171497 66731 -71381 -171518 -189193
695a89193P5738J30379J23120N3324m1973j14420j33284q6278N161R1575J33194
$$ -189193 -113455 16924 140044 193368 151395 36975 -96309 -182587 -177426 -85851 47343
706D7343J08600L2801o0046j23153j26300o5684K5343J04180J32347R4144J0115
$$ 47343 155943 188744 128698 5545 -120755 -186439 -161096 -56916 75431 169575 179690
717A79690p6459j26445j16427m7185M5709J14477J26412P7477q705r2980j29020
$$ 179690 103231 -23214 -139641 -186826 -141117 -26640 99772 177249 168544 75564 -53456
728e3456j02419k6214O3832J21211J18862N9491k9995j04363j25876q7974n980
$$ -53456 -155875 -182089 -118257 2954 121816 181307 151312 46949 -78927 -166901 -172881
739a72881P9779J23999J08684M0317m8577j12660j21244p1154J5114R2279J23864
$$ -172881 -93102 30897 139581 179898 131321 18661 -102583 -173737 -158623 -66344 57520
750E7520R6225K1275o5914j19522j12526n2433L2528J03171J22787Q1270R77q0877
$$ 57520 153745 175020 109106 -10416 -122942 -175375 -142847 -39676 83111 164381 165358 84481
762H4481j21281j02593l3758N1222J10588J16152O5006j8667r3440j20803q9182
$$ 84481 -36800 -139393 -173151 -121929 -11341 104811 169817 151150 57710 -63093 -152275
773a52275j4988O6784J17123J06856M7086l7210j02678j17170p5002N153Q0848
$$ -152275 -167263 -100479 16644 123500 170586 133376 30698 -86472 -161474 -156321 -75473
784g5473J18144R7454K8114n5025j09972j10864n8355K3358R3569J15614Q4574
$$ -75473 42671 140125 168239 113214 3242 -107622 -165977 -142619 -49050 66564 151138
795A51138R496p0071j12561j03117m0878M1184J01964J12967O8905j0410q3015
$$ 151138 160634 90563 -21998 -125115 -165993 -124809 -22845 90122 159027 148617 65602
806F5602j13726r1951k1312N6593J08385J06225N1949k7078r4334j12178p7643
$$ 65602 -48124 -140075 -161387 -104794 3591 109816 161765 134687 40353 -71825 -149468
817a49468l832P0990J11919R6895L4027m4417j01422j08572o2450J4840Q3216
$$ -149468 -153300 -82310 29609 126504 160531 116114 14692 -93880 -156330 -141490 -58274
828e8274J11184Q5456J7412o0428j06531j00602m5739L1619R3014J08740P1771
$$ -58274 52910 138366 155778 95350 -11181 -111783 -157522 -125903 -32889 75851 147622
839A47622j459p3102j08839r0599k9296M7729J01197J03417N5961j8610q4430
$$ 147622 146163 73061 -35778 -126377 -155673 -107944 -6747 96670 152631 134021 49591
850D9591j09555p8162j0931O1581J04766R5302M0593l5254r2801j04647o5809
$$ 49591 -59964 -138126 -149057 -87476 17290 112592 153185 117931 25130 -79517 -145326
861a45326M859P5863J05789Q6067K2887n0555r9171r9385n0311K3163Q4640J04784
$$ -145326 -140467 -64604 41185 127252 150139 99584 413 -98972 -149283 -126120 -41480 63304
873F3304P3831O447o5540j01776r0461l4800L9252R2481J00306N9711j0219p6554
$$ 63304 137135 143582 78042 -23734 -114195 -148995 -109743 -17262 83044 142755 132536 55982
885E5982j02886q0306j6529N1905R8362R4137M5179k7898q4554j01040o7037j727
$$ 55982 -46904 -127210 -143739 -91834 6528 100665 145844 117946 33392 -67648 -134685 -136412
897a36412O5375J00609Q6688K7650m2148r1595r7859n2633J5677P5932J00081
$$ -136412 -71037 29572 116260 143910 101762 10167 -87692 -140325 -124648 -48716 51365
908E1365P4902J2880n6679r5845q8699l9973L0647Q5313R7532O2648m007o7923
$$ 51365 126267 139147 82468 -13377 -102076 -142049 -111402 -26089 71443 134091 130084 62161
920F2161r7238q0836k3478M5931R0415R2323M8095j9247p7493r6730o9182q193
$$ 62161 -35077 -115913 -139391 -93460 -3045 89278 137373 118126 40633 -56097 -125279 -133472
932a33472N8753R4049Q4943L3645l4598q4806r3350n7468P955P0045R5408P4424
$$ -133472 -74719 19330 104273 137918 103320 18514 -74836 -132304 -124349 -54304 41104 115528
944A15528J8911m7669r0539q7578m2745K2635P7792R4735O3563L051o0442r2521
$$ 115528 134439 86770 -3769 -91347 -134092 -111457 -33665 61070 124633 127684 67242 -25279
956b5279p9759k9517L8162Q4845Q9787N1949j2557p0298r3178p0214j3091M9644
$$ -25279 -105038 -134555 -96393 -11548 78239 130188 117631 47333 -45845 -116059 -129150 -79506
968g9506Q9046Q3567L7966k6461p8323r0591n9205J311O1512R1225P5573K3897
$$ -79506 9540 93107 131073 104612 26289 -64302 -123507 -122196 -60684 30541 106114 130011
980A30011m0712q3948q6984m6206J7634O9608R0832O5240R056n2502q6957q0398
$$ 130011 89299 5351 -81633 -127839 -110205 -40597 50235 115475 124531 72029 -14928 -95326
992i5326l3200L0510P7378Q7804N3965m938o1937q8936p1769j9070M2539Q2965
$$ -95326 -128526 -98016 -20638 67166 121131 116193 54256 -34680 -106449 -125519 -82980 -15
1004a5Q2736M1769j9119p1122q8215o1318m751N4754Q6405P4431K8523l2770p7170
$$ -15 82721 124490 105371 34249 -53966 -115284 -120035 -65281 21124 95555 124078 91308 14138
1017A4138q4581m9888R509O3324Q6453O6777J5709m4328q2813p8653l8355K3293
$$ 14138 -70443 -120331 -110822 -47498 38955 105732 121441 77113 -5700 -84353 -122708 -99415
1029i9415P2433Q4050N7195Q71n7450q2566p1714k4514L5614P7226Q1352M4940
$$ -99415 -26982 57068 114263 115134 57684 -24882 -96596 -121110 -85496 -8270 73082 118022
1041A18022j2669o5241q4375o1314j0828M5986Q1468P5235L2998k5791p1872q1714
$$ 118022 105353 40112 -44263 -105577 -116405 -70419 11049 86284 119282 93491 21619 -60095
1053f0095n2810L658N6477Q2839O7627J9916l7551p7426p7820m1085J6092O5803
$$ -60095 -112905 -109247 -52770 30069 97696 117612 80061 2635 -75185 -116270 -100178 -34375
1065c4375Q1993N7918P162m9562p9533p2073k8033K9159P1304P9721M7782o917
$$ -34375 47618 105536 112698 63136 -16397 -88470 -116503 -87344 -16040 63681 111463 104546
1077A04546n8199q0388o4188j4657M0110P5671P4266L6308j9016o5916p9622n3861
$$ 104546 46347 -34041 -98229 -112886 -72776 2895 77161 113469 94453 28537 -51085 -104946
1089a04946k893N0488P9177O7152K4358l2059p1085p6273m4253J0941O0255P7556
$$ -104946 -107839 -57351 21826 88978 113336 81277 10192 -66081 -110334 -99393 -39138 38418
1101C8418O0135J0338m1527p5798p1288l1450K2631O5809P6768N0042r62n1612
$$ 38418 98553 108891 67364 -8434 -79722 -111172 -88541 -22732 54036 104078 103116 51504
1113E1504p7018o3807k0846L4608P0581P3734L8945j3224o0428p6545n5674p015
$$ 51504 -25514 -89321 -110167 -75559 -4978 68756 107701 94477 34049 -42496 -98170 -105185
1125a05185M3187P5165O7276K8453k6277o6158p3628m6425O260N1742P5405N9884
$$ -105185 -61998 13167 80443 108896 82619 16461 -57167 -103592 -97332 -45590 29815 89699
1137H9699J6193l6777o9311p0587l4610J6031O1383P3345N2159L676m5883p3095
$$ 89699 105892 69115 -196 -70783 -105393 -89362 -27979 45366 97525 101201 55318 -17777
1149a7777o4599k3080K8281O6242P1504M1062p894n4154p2846n7655j1933L8459
$$ -17777 -82376 -105456 -77175 -10933 60571 101633 93739 39585 -33261 -90916 -102849 -64390
1161f4390O9220O7734L1925j9643o1103p2554m7196j231M7116P1930O0072K1514
$$ -64390 4830 72564 104489 84846 23743 -48811 -96007 -97238 -50122 21808 81880 103394
1173A03394l0908o5625o8254l8924J1170N4685P2331N2830Q892m0106o8667o4874
$$ 103394 72486 6861 -61393 -100317 -89147 -34462 37869 90699 99591 59485 -9182 -74056
1185g4056k7325K1710O2020O9219M4437k428m8805p1439n7346j5860L2975O5115
$$ -74056 -101381 -79671 -17651 51568 96005 93577 44772 -26667 -84013 -99873 -66898 -1783
1197a783O6494L4360j3472n6957o9725m9639n165M2083O8243O1457K3933k6137
$$ -1783 64711 99071 85599 28642 -41083 -90722 -95887 -53804 14439 75896 99829 73692
1209G3692o0811o8161l9884O083M9051O9420N4743J2905l4363o5459o3997l0922
$$ 73692 12881 -55280 -95164 -89081 -40030 29390 84133 97038 62675 -2784 -66781 -97703
1221i7703J5725N8019O7410M6895J551m3360o7298n7538k0836K7355O0882O6368
$$ -97703 -81978 -23959 43451 90346 91897 48537 -18761 -76299 -97135 -69780 -8898 57470
1233E7470L6738r214n0799o6806n2359r732L7983O4626O0503K7085j9274n6882
$$ 57470 94208 84994 34195 -32611 -84970 -94702 -56719 7907 68410 95495 76221 19339
1245A9339o6328m2894R20M5244O6056N5323J7355l0088o1345o2251l4659J2235
$$ 19339 -46989 -89883 -88963 -43719 22337 77660 95015 64927 3582 -58669 -93328 -81093
1257h1093N1905O6072M7364P246l8405o4396n8587k3804K2061N7025O4698L9545
$$ -81093 -29188 36884 84248 91494 53089 -11307 -69894 -93698 -71637 -14612 50086 89631
1269H9631l952m7053o5034n2101j3743L2014O0773O0422L0619j4092n2249o4888
$$ 89631 85679 38626 -26408 -78509 -92252 -60238 535 60957 91576 77484 25235 -39653
1281c9653m4629l105M0002O3105N4902K0122k3145n8459o1585l6134P453M6193
$$ -39653 -84282 -87387 -47385 15720 70622 90744 67599 9140 -52445 -88579 -81126 -34933
1293c4933O4892M8416J0149l1935o1369n7884k7646J7840N2429O2039M2188N3
$$ -34933 29959 78375 88524 56589 -4780 -62664 -90310 -72470 -20041 41998 84186 84239
1305H4239m1594o1790n2901j7303K6662N7573N9181L3509j0774m7261o1896m6190
$$ 84239 42645 -19145 -72046 -89349 -62687 -5114 54067 87576 76802 29541 -32355 -78545
1317g8545p725L5465N9859N4448K3911j8661n3261o0746l7751K416M2692N9897
$$ -78545 -86270 -50805 9054 63502 87413 68752 15491 -45255 -83006 -80590 -37898 21999
1329B1999N0024J4906k8481n6841n8064k9910J2508M8721O0559M3069L940l5948
$$ 21999 72023 86929 58448 1607 -56457 -86367 -73859 -25138 35421 78490 82430 46482
1341D6482n9289n2618k0729K2425N2576N9221L4360n213m3091o0131m7086j0349
$$ 46482 -12807 -65425 -86154 -63729 -11153 48068 82428 77215 34124 -26007 -73093 -83442
1353h3442K9824N6143N5282K6474j4489m9294n8597l9715k259L8800N8084M9377
$$ -83442 -53618 2525 57807 84281 69792 20498 -38099 -77814 -80073 -41273 16811 66188
1365F6188J7208k3922n2210n6190l3047R065M3523N8413M4150Q315l2422n5505
$$ 66188 83396 59474 7264 -48926 -81973 -72908 -29385 29028 73178 81493 49071 -6434
1377f434n2551k3025J7187M9210N5784L7772j485l9507n5744m8145j4429K5546
$$ -6434 -58985 -82010 -64823 -15613 40171 77943 76458 36951 -18793 -66938 -81367 -55821
1389e5821N3178N4191K9072j0154m5687n7286m0812m863L3610N4491N0645K0968
$$ -55821 -2643 51548 80620 70466 24779 -32507 -73319 -78182 -44572 9919 60564 81532
1401H1532j9499n1021n4190l4522N089L9796N6940M3360J1775k6857n3094n2796
$$ 81532 62033 11012 -43178 -77700 -72611 -32815 24125 67485 79260 52403 -691 -53487
1413e3487k5990J3052M4903N6586L7465L353l5077n3710m9426j7353K2430M9116
$$ -53487 -79477 -66425 -21522 35064 72529 75882 40805 -12905 -62331 -79684 -57254 -8138
1425h138N3469L0247n113m1646n4219m2387r197K8986N2885M9562K3026j4568
$$ -8138 45331 75578 70465 28819 -25400 -67787 -76984 -47998 4887 54449 77475 62907
1437F2907m6090n3774l5819L82L5891N3466M4688J5663k3497m9295n1641k8142
$$ 62907 16817 -36957 -72776 -72394 -36503 16963 61651 77314 53817 4522 -47119 -75261
1449g5261Q380M1508N4000M0876M790k9850n2408m7414k0906J7112M7282N1243
$$ -75261 -66881 -25373 28627 69503 74293 44443 -7965 -55379 -76285 -59173 -11891 39352
1461C9352L3581l272l6972n2889m2850j1539K4118M9848M9610K5555j1149m1921
$$ 39352 72933 69661 32689 -20200 -63050 -74589 -50471 -623 48987 74542 63393 21472
1473B1472n2890l7071k822L1220N0889M6601J7453j9516m5752n1324k9532M895
$$ 21472 -31418 -68489 -71311 -40091 10798 57399 74852 55336 9584 -41740 -71272 -66377
1485f6377L7938N1046M0918R780k7584m8448m7862k2631J4407M1106N0994L4328
$$ -66377 -28439 22607 63525 73305 45721 -2727 -50589 -73220 -58813 -17707 33287 67615
1497F7615J324l2637n0018m4264j4525K1103M5457M9220K7660p463l8094n0677
$$ 67615 68939 36302 -13716 -57980 -72505 -51402 -5945 43275 70935 63472 25378 -25299
1509b5299l7807o707K7596M8558M4400J9912j4550m1949m9906l1767J776L2928
$$ -25299 -63106 -69813 -42217 6341 50741 70653 56103 14154 -35752 -67519 -65743 -32815
1521c2815M9606M2231J0930k1388m6038m7356k4767Q982L8470M9815L5796M113
$$ -32815 16791 59022 69952 48564 2526 -44830 -69597 -60615 -22145 27670 63466 67579
1533F7579k8462m8637m2937j7329J6371M2936M7356L0066l056l5016m8599l9073
$$ 67579 39117 -9520 -52457 -69786 -53415 -10479 36877 66943 63887 28871 -19728 -58801
1545e8801r453K3433M5688M5344K1842j0734l9642m7803l2651k235K9995M6149
$$ -58801 -68254 -44821 867 46211 68053 57319 17677 -30126 -62777 -65012 -35017 11132
1557A1132M0854J6452j8153m3724m6217k7150O732L4854M7871L6753P392k5448
$$ 11132 51986 68438 50285 6561 -39656 -66806 -60074 -25220 22651 59404 66796 41348
1569D1348m4825m4284j9687J4085L8613M6412L0987K43l0853m6318l9123j2951
$$ 41348 -3477 -47761 -67448 -53363 -14750 31662 62649 62892 32039 -14279 -53402 -66353
1581f6353J9938M2955M5527K3427p844l5344m7357l4566n366K6536M5923M2014
$$ -66353 -46415 -3460 42067 65494 57650 22306 -25051 -59617 -64983 -38447 7476 49490
1593D9490J6442j4536l9246m5753k8469J589L1921M6429L6727J0518k1308m2800
$$ 49490 65932 51396 12150 -33603 -62072 -60483 -28562 17867 54594 65112 43804 1004
1605A004m2587k3026J0093L4719M6606L2342K600k6602m4614l9657j5051J6259
$$ 1004 -41583 -64609 -54516 -19797 26809 59151 61751 35149 -9465 -49122 -64173 -47914
1617d7914L9868M4178K6105m136l2187m6193l4038r039K3234M1792M1591K0591
$$ -47914 -8046 36132 62237 58101 25914 -20279 -54317 -63356 -40122 1670 43261 63852
1629F3852j0941l7636m5190k8776j827K8840M3849L7834J2629j6571m0519m3665
$$ 63852 52911 15275 -29915 -58691 -60518 -31678 12171 50005 62634 46063 5544 -38121
1641c8121k3308N896L3124M3359L4180O334k4744m1311m0346j7765J3340L7038
$$ -38121 -61429 -55533 -22409 20950 55130 61464 36720 -4591 -44937 -62702 -49362 -12324
1653a2324M3630K8253k021k8912m3284l5934j1206J9175M0958M0542K1871p512
$$ -12324 31306 59559 57538 28626 -14658 -50592 -61798 -42623 -1665 38877 60748 53236
1665E3236l3966m3681l0517m363K5228M1412L8552J5231j3993l7731m1717k6289
$$ 53236 19270 -24411 -54928 -59291 -34063 7349 45901 61132 47139 9408 -32309 -58598
1677e8598L257K9612M3179L3502Q779j9946m0415l9566k0121J0142L4359M2157
$$ -58598 -55341 -25729 17450 50952 59731 39785 -630 -40196 -60317 -50175 -15816 26341
1689B6341K8558K796k6880m1321l6516j2810J5624L7960M0025K4582n072l0499
$$ 26341 54899 57695 30815 -10506 -47022 -59832 -44208 -6248 33777 58359 53287 22788
1701B2788m1758l2783o846K2059L9714L8026J8277j1870l4132m1220k7222l38
$$ 22788 -18970 -51753 -58599 -36540 3174 41200 59477 47607 13475 -27745 -54967 -55305
1713e5305K6685M0815L4637J1630j6785l7871l9517k1319O073L1266M0756L0190
$$ -55305 -28620 12195 46832 58462 41677 3806 -35711 -57030 -50957 -19691 21065 51255
1725E1255N232k2762l9384l5634j6557J2479L5110L9874K5369j797k7808l9671
$$ 51255 56487 33725 -5659 -41293 -57850 -45371 -10261 29613 54982 53185 25377 -14294
1737a4294l2775r772J8332L7504L7398J9940q152l1504m0063k7672l539K3627
$$ -14294 -47069 -56841 -38509 -1005 36393 56333 48181 16677 -23386 -51058 -54597 -30970
1749c0970L9207L4708J3509j4145l4219l8795k2926K839K8021L9409L0972P683
$$ -30970 8237 42945 56454 42309 8090 -30705 -53631 -50792 -22771 16638 47610 55293
1761E5293j9446l7027l5871j8532J0149L1524L9262K6251R05k3612l9013l3172
$$ 55293 35847 -1180 -37051 -55583 -45434 -13910 25352 51603 52508 28896 -10117 -43289
1773d3289j1606J5055L4595L7463K1046n244k8131l8817k8755o743K1312L7540
$$ -43289 -54895 -39840 -5245 32218 53264 48020 19889 -18928 -47683 -54426 -33114 4426
1785D426L4323J5535j0457l2125l8149k4232J18K4865L7543L2135R247j6419l3568
$$ 4426 38749 54284 43827 11702 -26447 -50679 -50561 -25696 11847 43982 53229 36810 3242
1798C242l6884j8512O276K8614L7875K7415L680k1089l6369l3259j4370J2489
$$ 3242 -33642 -52154 -45878 -17264 20611 48026 51706 30617 -5752 -39011 -53381 -40892
1810d0892L1793L6195K3002j013k6026l7783k8716q298J7076L4356L4681J6840
$$ -40892 -9099 27096 50098 49085 23059 -14724 -43440 -51738 -34662 -306 34375 51215
1822E1215p725k9575l5662k6495j692K2159L5108L2404J1946j2994l2816l5151
$$ 51215 43490 13915 -21747 -48242 -49934 -27775 7333 39737 51683 38689 5873 -29278
1834b9278k0818L476K6585L5919K7972P051j8144l4774l2900j6663R755K9073
$$ -29278 -50096 -46620 -20035 15884 43856 50907 32763 -2011 -34911 -51574 -41819 -12746
1846a2746L6448K3908O67k2897l4887l0982j0370J4102L2095L5179J9513n665
$$ -12746 23702 47610 48277 25380 -9507 -40489 -50859 -36757 -4662 30517 50030 44365
1858D4365k5893l6435k6289m403J8579L3804L2172J3983j0740k9146l5134k1631
$$ 44365 18472 -17963 -44252 -48655 -30076 3728 35900 49883 39143 9997 -25137 -46768
1870d6768N95K3888L4847K8112Q812j5160l2443l2762j8452P424K6653L4411K5010
$$ -46768 -46173 -22285 12562 40674 49486 34326 1883 -30879 -49331 -41907 -15254 19157 44167
1883D4167M060k0807l3277l0537j2826J1943K8922L4422K1599k724k3518l4519
$$ 44167 48227 27420 -5857 -36394 -49220 -37277 -8355 26067 47666 44942 21424 -13095
1895a3095k7622p358J5671L2415L2049J6770q376k7028l3812k4855j094K0978
$$ -13095 -40717 -48075 -32404 11 32060 48830 40454 13426 -20386 -45241 -46335 -25357
1907b5357L3634K9153J0068j2823k9297l2390j9329M006K4058L3052K6411N287
$$ -25357 8277 37430 47498 34675 5378 -27012 -46341 -42335 -18277 14775 41186 46473
1919D6473j6676l1236l1332j4596Q472K7476L3255K1526Q61k1249l2032k7881
$$ 46473 29797 -1439 -32771 -47367 -38895 -11419 21836 43362 44223 22974 -9058 -36939
1931c6939r979J2656L0901L0904J7210l451k4845l3271k4099m153J7560L0622
$$ -36939 -46918 -34262 -3361 27543 44753 41302 16457 -16814 -40913 -45066 -27506 3116
1943C116K9856J3386r515k7599l2206k0666O41K1468L2775K6197Q513j4461k9808
$$ 3116 32972 46358 36843 9244 -22962 -43628 -42987 -21519 11256 37453 45966 31505 1697
1956A697l0480j6373O445K4921L1802K2879K242j7538l1216k7214j2705J0722
$$ 1697 -28783 -45156 -38711 -13790 18012 40891 43133 25595 -5621 -32835 -45540 -34818
1968c4818K8089L0514J9606k046k1351l2238k3815q311J5067K9007K9897J5395
$$ -34818 -6729 23785 43391 41345 19994 -12244 -36059 -44370 -29303 -296 29601 44996
1980D4996p376k5749l0317k2265j769J9004L0577K6820J0334j0772k8135l0060
$$ 44996 37620 11871 -18446 -40711 -42480 -23476 7101 33921 44255 33483 5348 -24712
1992b4712j8073K458K2525L1579K3464O331j5212l0183k8397j3397P632K5114
$$ -24712 -42785 -40327 -17802 13777 37241 43572 28360 -1823 -30220 -43617 -35985 -10871
2004a0871L1229K0837q6j9000l0124k5651j0241J2507K7744K8408J7852m558k3636
$$ -10871 20358 41195 41109 22109 -8015 -33666 -43907 -31400 -3656 24752 42604 38046 14410
2017A4410k9866k1971m749J7028K7846K8399J1759q765k5765k9421j9095L90K0362
$$ 14410 -15456 -37427 -42176 -25148 2698 31097 42856 34091 8326 -21095 -40190 -39800 -19438
2030a9438K9313K4960P172j2254k7369k9608j4919N852K3186K8974K2256K722
$$ -19438 9875 34835 42007 29753 2384 -27224 -42143 -36291 -13105 15869 38125 40847
2042D0847j6357k9951k6820r701J0612K4695K8806J7622r77k1155k9351k3014
$$ 40847 24490 -5461 -32281 -41982 -31370 -6675 22131 39753 38776 17621 -11730 -34744
2054c4744o463J4524K7207K7146J3253o302k2903k8902k0976r40J6885K8466K5250
$$ -34744 -41207 -26683 524 27670 40923 34621 11718 -17184 -38160 -39100 -22215 6251 31501
2067C1501R492j0569k6092k7302j6031K684K0498K8543K2657M146j4896k6815
$$ 31501 40993 30424 4332 -22970 -39001 -36317 -15819 12724 35381 39527 24631 -2184
2079b184k5765j2536P067K4504K7801J8616K64j7260k9000k3465q048J0671K7117
$$ -2184 -27949 -40485 -33418 -8914 18887 37503 37767 20507 -8493 -31958 -40006 -29335 -2218
2092b218K6900J3623k665k1847k8621k0498l235J5275K6459K5753J0807q696k3307
$$ -2218 24682 38305 35640 13793 -14828 -35326 -38561 -23286 3173 28926 39733 31037 7730
2105G730k7553j7668J461J8107K7945K2533O679j1903k5970k5939j4474N506K1610
$$ 7730 -19823 -37491 -36030 -17923 10022 32555 39234 27331 1361 -24578 -39052 -33546 -11936
2118a1936K7780J8604K672j5172k6397k4529r753Q434K4508K6944J6059j667j9673
$$ -11936 15844 34448 37120 21948 -4449 -28978 -38731 -30297 -5789 21155 37214 35547 15874
2131A5874k6624k1837n563J3134K5040K5773J2165o032k1041k7258j8527p26J6178
$$ 15874 -10750 -32587 -38150 -25016 24 25797 37962 31930 10889 -16369 -34896 -35622 -19444
2144a9444K5007K3964Q949j0102k3965k7067j3990K960J9422K6614K0499M038
$$ -19444 5563 29527 38476 28374 4409 -22658 -36648 -33688 -14266 12348 32847 36885
2156C6885j3431k5821k4430j0685O502K2220K5719J8099j39j6935k6039k1695
$$ 36885 23454 -2367 -26797 -37482 -30980 -8760 16959 35058 34919 17984 -8055 -29750
2168b9750p724J1600K3364K5026J3602n103j8160k6508j8452l332J4529K3581
$$ -29750 -37474 -25874 -2510 22516 36118 31015 12855 -13653 -32105 -35437 -20908 2673
2180B673K3272J0843q272k1396k5239j5956P80J6603K5189K1726N289j0668k4148
$$ 2673 25945 36788 28516 7120 -18119 -34075 -33295 -16692 8497 30223 35512 24844 696
2193F96k3725j2102M630J9316K5683J8330K220j5134k4337k3099p871Q986K1185
$$ 696 -23029 -35131 -30501 -11185 14498 32828 35048 19914 -4423 -27522 -35393 -26407 -5222
2206e222K4620J4771j247j8456k4380j9853o089J2841K3530K3197J1465n438j9949
$$ -5222 19398 34169 32922 14466 -9914 -29767 -35856 -23015 515 23712 35177 29739 9790
2219I790k5501j6780j205J5606K4118K1133Q344q526k3205k3753j4307K944J8216
$$ 9790 -15711 -32491 -33696 -18090 6028 27161 35505 26979 3774 -19979 -34286 -31342 -13126
2232a3126K3693J9876L434j2149k2950k2296j0261M880K0419K4966J6003L43j6174
$$ -13126 10567 30443 33877 21728 -1222 -23518 -33779 -28899 -8480 16486 32489 32832 16658
2245A6658k3464k1294o032R248K2553K3311J2952m015j8895k3238j8279k374J2554
$$ 16658 -6806 -28100 -34132 -24884 -2331 20980 33932 29917 11022 -12216 -30495 -32869 -20315
2258b0315K3734K0812R525p053k0769k3418j4519P26J5651K4806J7974N458j0036
$$ -20315 3419 24231 33756 26703 5934 -17484 -32003 -31277 -15626 9180 27154 32612 22576
2271B2576k1983k1555j2016M793J8029K3465J6497K958j5063k2181k0506q081
$$ 22576 593 -20962 -32978 -28185 -10156 13309 29806 32764 17701 -4480 -24986 -33067
2283c3067P112K0742K2814J4574k716j5985k2904j8380m908J1408K1273K1457
$$ -33067 -25955 -5213 17601 32175 29459 13474 -9430 -27810 -32718 -21310 -37 21420
2295B1420J1059m972j8820k3526j5489q65J3517K3254J8961Q160q695k0183k1655
$$ 21420 32479 27507 8687 -14839 -30328 -31193 -17676 5578 24539 32699 24004 3821 -17834
2308a7834j3798L030J6771K2797J7424L057j1210k1996k0227r739O206J7722K2428
$$ -17834 -31632 -28602 -11831 10966 28390 31447 20237 -1759 -21986 -31725 -25519 -7797 14631
2321A4631J4460J067j5115k1792j8732o175Q853K0863K1013J1998l825j6444k2110
$$ 14631 29091 30158 15043 -6749 -25481 -31656 -22803 -1940 19073 31071 27246 10802 -11308
2334a1308j6598j881J0899K1505J9919Q946p148j7841k1990j4469J079J4702K1739
$$ -11308 -27906 -29787 -18888 2617 22536 31482 24334 6493 -15497 -29966 -28887 -14185 7554
2347G554J7391O664j0555k0110k0944j0692L963J7235K1475J5890J870j1954k1047
$$ 7554 24945 31609 21054 944 -20000 -30692 -26729 -9494 11981 27871 29741 17787 -3260
2360c260j9696q626P896J9280K0684J2651q79j5081k2176j6606m597J0009K0607
$$ -3260 -22956 -31582 -23686 -4406 16278 28929 28050 12969 -9207 -25813 -30410 -20401 206
2373B06J9957J0280n447j6411k1912j3856j640J2831K1135J8092O775p610j8562
$$ 206 20163 30443 24996 8585 -13327 -27183 -28823 -15992 5143 23235 30010 22400 3838
2386C838k0180j2879J993J5802K0503J7181K816j0427j9934j8964r634O458J6405
$$ 3838 -16342 -29221 -27228 -11426 9077 26258 29074 18647 -1287 -20251 -29885 -23427 -7022
2399g022K0595J4983j29j3142k0716j8611n242P913J9501J9527J0942k762j4509
$$ -7022 13573 28556 28427 15285 -5431 -24042 -29284 -21371 -1870 17657 28599 25837 11328
2412A1328k2099j4793l140J1261J9083J9121Q805o152j7788j9843j2974K44J4325
$$ 11328 -10771 -25564 -28704 -17443 1640 20761 29566 23414 5626 -14217 -27191 -26947 -12622
2425a2622J9205J6777N820q677j9182j9228j1229L541J5712K1503J4388J937j1998
$$ -12622 6583 23360 29180 20503 1321 -17907 -29136 -25595 -9883 11620 26008 27945 15947
2438A5947j9075j7898p777N888J8137J9543J2818p49j4540j9881j6271m322Q635
$$ 15947 -3128 -21026 -28803 -22915 -4778 14765 27583 26834 12294 -7587 -23858 -28180 -19545
2451a9545J9466J8617J0307n319j4954j9755j4777p01J1537J9279J7757N857o313
$$ -19545 -79 18538 28845 23526 8572 -11183 -25960 -26661 -15124 4155 21912 27769 21456
2464B1456j8306j8691j2177K364J4745J9139J6113K766r526j8762j7749r665M739
$$ 21456 3150 -15541 -27718 -25354 -10609 8530 24643 27409 17883 -879 -18628 -28293 -23554
2477b3554J6226J9259J3409P11j1849j8855j6960n648O600J8001J7991J1334k631
$$ -23554 -7328 11931 25340 26051 14202 -4653 -21613 -27261 -20661 -2660 15331 26665 24034
2490B4034j3911j9175j4775l220J0398J8126J7566Q474n473j6110j9053j2767
$$ 24034 10123 -9052 -23827 -27047 -16649 1477 19043 27517 22044 5934 -13119 -25886
2502b5886O27J1565J9094J6617M930p917j7423j7105j0988K405J4293J9175J4406
$$ -25886 -25259 -13694 5400 22017 26947 19030 1607 -15498 -26486 -24081 -9788 9387 23793
2515B3793K538j0694j7613j8051o212M855J6579J8353J1810n71j2105j8902j5802
$$ 23793 26331 15637 -1976 -20027 -26239 -21384 -4805 13548 25358 24787 12682 -6220 -22022
2528b2022m433Q004J8061J6910R765m127j4038j8728j3338j515J1145J7963J6181
$$ -22022 -26455 -18451 -390 16520 26285 22158 8120 -10608 -23946 -25461 -14316 3647 19828
2541A9828O448o691j5701j7793j1285Q75J3733J8226J3889M444q903j7177j6949
$$ 19828 26276 19585 3884 -13909 -25194 -24319 -10586 7640 21529 25973 17070 -107 -17056
2554a7056q411L348J5540J8164J2242P17j1098j7625j6037o372P697J6960J6451
$$ -17056 -25467 -22119 -6579 11585 23827 24544 13446 -4179 -20216 -26588 -18891 -1931 14520
2567A4520R887j018j3601j8021j4292j979Q411J7753J6099O912l545j5411j7314
$$ 14520 24407 23389 9788 -8233 -22525 -24504 -16093 1660 17759 24671 21126 5715 -11599
2580a1599j1789p88J1577J7252J5059N596p105j6184j7253r292K154J3311J8161
$$ -11599 -23388 -24176 -12599 4653 19712 25308 18203 2019 -15234 -24526 -22372 -9061 9100
2593I100J3556J934r543j6966j5094q130N590J4088J7595J1399p28j1256j7247
$$ 9100 22656 24590 15047 -1919 -17013 -25143 -19553 -5465 12130 23529 22801 11545 -5702
2606e702j4584m019P694J5494J6490R307k927j3706j6493j3421j425Q654J7514
$$ -5702 -20286 -24305 -16611 -1117 15373 24680 21753 8047 -8446 -21867 -23292 -14638 2876
2619B876J4590P088n865j4638j6364j1263J150J1572J6637J3736M004o716j6559
$$ 2876 17466 24554 18689 4051 -12313 -23576 -22426 -10854 5783 19519 23523 16807 248
2632B48j5501q589L804J3205J6641J2526R72j0137j7277j4169n113N598J4676
$$ 248 -15253 -23842 -20038 -6833 9808 22334 23306 13169 -4108 -18277 -23390 -17792 -3116
2645c116J5180J0860j132j1437j8360j2097l238P965J5456J5684Q061m428j2673
$$ -3116 12064 22924 21792 10355 -8005 -20102 -23340 -15375 81 15765 23826 19398 6725
2658F725j7240j0906o87J0331J6116J3879N211o166j4333j6552r002K131J2700
$$ 6725 -10515 -21421 -22108 -11777 4339 18218 23429 17263 2930 -13622 -22624 -20493 -7793
2671g793J5788J1979L096p885j6312j4676p870M565J3453J6417J0815Oj0681j5481
$$ -7793 7995 19974 23070 15185 -1127 -15803 -23673 -19108 -5655 10762 21577 21583 10902 -4579
2685d579j3578n027O713J4518J5483R379l038j2302j5601j2121j670Q006J5669
$$ -4579 -18157 -23184 -16471 -1953 13530 22909 19871 7569 -8032 -20153 -21823 -13817 1852
2698A852J3818O630m060j4063j5243j1258Q09J0928J5093J3899M176p198j5040
$$ 1852 15670 22300 18240 4177 -11066 -22324 -21515 -10587 4506 18405 22581 15383 343
2711C43j4839q627L661J2413J5943J1196P88q837j4788j3630n878N376J3419J5131
$$ 343 -14496 -23123 -19462 -7049 8894 20090 20878 12041 -2747 -16377 -22255 -16879 -3460 11671
2725A1671Q675J89j0677j5425j2845l347P144J5006J3908P048l259j1941j4472
$$ 11671 20346 20535 9858 -5567 -18412 -21759 -14615 391 14299 21347 18088 6147 -8325
2738h325j0883j712R153J5196J2133O650n761j3581j4424r327J676J0655J4821
$$ -8325 -19208 -20920 -11767 3429 15562 22212 16451 2870 -11554 -20881 -19205 -8550 6271
2751F271J2494K585p884j4421j3527p133L644J2468J5361J0108O08j0083j3683
$$ 6271 18765 21350 13466 -955 -14482 -21615 -17971 -5503 9858 19966 20574 10491 -3192
2764c192j3707m734N967J3112J4718Q355j418j1160j5608j1010j357P080J3734
$$ -3192 -16899 -21633 -15666 -2554 12164 20519 19101 7941 -7667 -18677 -20034 -12954 780
2777G80J3607O208l815j1788j5274q854j311J0130J4954J3073K560o671j2598
$$ 780 14387 20595 16780 4992 -10282 -19136 -20447 -10317 4637 17710 20270 13599 1001
2790A001j4335p331J990J2002J3795J0758J686p427j3979j2973o365M641J3109
$$ 1001 -13334 -20665 -18675 -6673 7122 17880 19566 12139 -1840 -14813 -21178 -16537 -3428
2803c428J4080R210q44r333j4844j1204m603O748J3166J3796P557k766j0884j4786
$$ -3428 10652 19862 19018 9685 -5159 -16363 -20966 -14218 -1052 12744 20301 17535 6651 -8135
2817h135j0551p91Q225J3711J2011O135n271j1852j4269p636R58Q746J4644J0980
$$ -8135 -18686 -19477 -11252 2459 14470 20605 15334 3482 -10787 -18423 -17465 -8719 5925 16905
2831A6905L014o517j3202j2924p499L334J0783J4822R297J35p784j3268j2859
$$ 16905 19919 13402 200 -12724 -20223 -16889 -6106 8716 18013 18148 10364 -2904 -15763
2844a5763m050M761J2391J3914Q003j434j0095j3840j0592k499O897J2861J2729
$$ -15763 -19813 -15052 -2661 11253 19256 17822 7727 -6113 -16705 -19204 -12307 554 13283
2857A3283O076k773j1620j3463j0047j29Q589J3616J2480L218n390j2097j3323
$$ 13283 19359 16586 4966 -8497 -18544 -18673 -10084 3532 16012 19230 13840 1743 -11580
2870a1580p480K259J0257J3158J0122K725q269j2207j2451o191L963J1597J3762
$$ -11580 -19060 -16801 -6544 6614 16736 19461 11192 -1015 -13466 -19657 -15694 -4097 9665
2883I665Q470n36q626j3388r957m493N696J2149J3045O151j759j0033j3219r828
$$ 9665 18135 17599 8973 -4415 -14372 -18865 -13169 -1020 12025 18176 16417 6384 -6835 -16663
2897a6663j732P699J2678J1489M930l386j2007j2839p427l74R156J3060J0171
$$ -16663 -18395 -10696 1982 13471 18401 15015 3008 -9831 -17258 -17632 -8476 4584 14755
2910A4755L216n381j2122j2108o702K430J0245J3041R704P29p869j2637j0965
$$ 14755 17971 12590 468 -11640 -18342 -15912 -5667 7374 17078 17807 9938 -2699 -13664
2923a3664m354L957J1656J2346O985l33r244j2536j0181k943O497J1662J2074
$$ -13664 -18018 -14061 -2405 9941 16926 16593 7349 -5187 -15368 -18311 -11814 -152 11922
2936A1922O135l412r855j1957r858p3P162J3394J0103M104l961j1103j2485p445
$$ 11922 18057 14645 4790 -7167 -17025 -17098 -9936 3458 13561 17665 13704 2601 -9884 -17329
2950a7329J484Q767J2903R378K843o822j1376j1847o016L524R832J3267Q031M95
$$ -17329 -15845 -7078 5825 15203 18046 11224 -152 -11999 -18015 -14491 -4659 8608 16639 17134
2964A7134q079j2778j0207l940N538J0809J1526P731k791r156j2086q970j989
$$ 17134 9055 -3723 -13930 -17870 -12332 -1523 10003 17734 14943 5787 -6299 -15269 -17258
2977a7258O622J1114J1637O134m039j0267j2147p834K00O979J3192R936L163m435
$$ -17258 -10636 478 12115 18249 14210 3943 -8204 -16038 -15838 -8859 4333 14269 17432 12997
2991A2997j1799j1937o449K418Q566J2849Q918O07o063j1864j1684l230L409J0026
$$ 12997 1198 -10739 -17188 -14770 -6204 6645 15563 16170 10107 -1757 -13441 -16671 -13262 -3236
3005c236J2180P432n19q003j2518r738k656N634J1550J0651N883k275r470j1296
$$ -3236 8944 16376 15857 7854 -4664 -14402 -17058 -11424 126 10777 16660 14385 4915 -6381
3019f381r291j001P095J1816J0748L952m333r183j2382o882k0R079J1819R412
$$ -6381 -15672 -16673 -9578 2238 12986 16938 12605 3422 -8960 -15842 -15862 -6783 5036 14448
3033A4448R35m583r922j2176m642J703R969J1296P931P28o711j2064r749l566
$$ 14448 15383 10800 878 -11298 -15940 -14237 -4268 7028 14959 15687 8976 -3088 -12837 -16403
3047a6403M752R733J1560N903j337p377j2473p877k911O119J0810J0862M868k341
$$ -16403 -11651 -1918 9642 15545 14208 6831 -5642 -13519 -16430 -10311 499 11361 16229 13888
3061A3888r896j1506p754q53P416J1140J0740K641m015j0210j1034n726Q29R066
$$ 13888 3992 -7514 -15268 -16121 -8705 2435 13175 15816 11801 1591 -9443 -15169 -14340 -5274
3075e274J0831Q447J573o263j0533r879m713K760J0493J0525O569P69p755j1023
$$ -5274 5557 14004 15577 9314 -1219 -11098 -15811 -13051 -2558 7967 14536 15305 7550 -3473
3089c473r592l379M980J0625J0208N728j090q951j0543q831j584O206J1200J0231
$$ -3473 -13065 -16444 -11464 -839 9369 15097 14007 5056 -5487 -14318 -15902 -9696 1504 11735
3103A1735M143l747r290j0319p104JP439J1429R180J674l878j0920j0262n023
$$ 11735 15878 12131 2841 -7478 -14582 -14581 -7142 4287 13467 15141 11263 343 -9919 -14942
3117a4942J389Q543J1559P578P95o719r543r733n166M385R663J0099O957K18q317
$$ -14942 -13553 -5010 6549 14127 14922 8203 -1340 -11073 -16239 -11854 -2191 7908 14865 15083 6766
3132F766j1246p943k577M972R581J0518N597k567q858j0352p725q48O461R976
$$ 6766 -4480 -12423 -15000 -10028 -447 10071 15668 13101 4243 -6109 -13834 -14682 -8221 1755
3146A755R787L750l299r616j1289n341P59P496J1185Q504J692n512j0202r942
$$ 1755 11542 15292 11993 2377 -8912 -14253 -13494 -5998 5187 13691 15383 9871 -331 -10273
3160a0273m408K385P744J0485P285O80o043j0183r526l258M677Q753J0034O099
$$ -10273 -14681 -12296 -4552 5933 13218 13898 7855 -2328 -11854 -15112 -10435 -1682 8352 14451
3174A4451j381p390j0268q514j872N631R385J0655M543k547r141j0375p363M43
$$ 14451 13070 5680 -4588 -13102 -14974 -9343 42 10697 15240 12693 3552 -6823 -14186 -13743
3188a3743P039J0619P815K358l674r289j0476n034J464Q248J0619P681R62o374
$$ -13743 -6704 3915 11730 14088 10414 1125 -9351 -14385 -12921 -4673 5946 13627 14589 8215
3202H215r103r640m655L876P937J1060P046j225p151r968p463l962M665R661R665
$$ 8215 -888 -10528 -15183 -11307 -3370 7690 14736 13511 6360 -3608 -11071 -15033 -10368 -707 8958
3217H958N418j894p906r763p889j172O079R524Q519M405l151q175j0328o040K38
$$ 8958 14376 12482 4576 -5187 -13076 -14248 -8169 1355 9874 14279 11128 2953 -7375 -13415 -13177
3232a3177O980R375R138P47l213r214r237o075K761Q116R165P765L25n982r341
$$ -13177 -6197 3178 12316 13063 9850 636 -8601 -14676 -11915 -3799 5366 13131 13456 7474 -1867
3247a867q109m494L710Q952R382O090j569o313j0152q094j696N263Q647R176N931
$$ -1867 -9976 -14470 -10760 -1808 7574 13664 12095 5782 -4370 -12464 -14160 -8897 -250 8926 14857
3262A4857l275p606r819o644q90N752J0072Q545L383m189q522r289o674J365P913
$$ 14857 11582 3976 -5843 -12487 -13377 -7625 2447 10992 14375 10186 1664 -7625 -14299 -12934 -5021
3277e021R249P173K728n252r424r238m746L145Q353Q913O974M62o737q585p871
$$ -5021 4228 11401 14129 8877 -547 -9785 -14531 -11386 -3033 5880 12854 13316 6579 -2006 -9877
3292i877m264M129Q779R131N527j344o922r963q134o81N207R657Q996L291k547
$$ -9877 -14141 -10012 -1233 7898 13425 12081 5159 -4804 -12938 -13619 -8412 1245 10241 13532 10985
3307A0985p865r829o514Q0O056J0017Q116K460m106q756r122m582Q06O849R490
$$ 10985 3120 -6709 -13223 -13143 -7087 2930 11046 13506 9400 644 -8478 -13060 -12254 -5405 4085
3322D085P916J876o346q521q791l850L888Q284Q444N856j56o486r460p794k638
$$ 4085 12001 13877 7531 -990 -9781 -13631 -9743 -1459 6985 12841 12685 6199 -3261 -11055 -13693
3337a3693M757P963R205M722q88p739r394p239k65M778R289Q796K206j990q578
$$ -13693 -8936 -973 8232 12954 12066 4327 -5067 -12306 -12571 -7793 1496 10292 12498 10508 1930
3352A930r017o049Q68O092J0339O972J968m344q513r258m880K839O082J0962O171
$$ 1930 -7087 -13136 -12268 -6176 4163 11135 13103 8759 246 -9012 -13892 -11053 -4971 5991 12162
3367A2162J423o306r301q387l063L290Q402Q874N306l86o807r113p890j384N150
$$ 12162 13585 7279 -2022 -10409 -13472 -10182 -1780 7094 12400 12014 5207 -3906 -11796 -13180 -8030
3382h030Q080Q535M066k352o751r785o084p80O022R738P768K638l906p294r078
$$ -8030 50 8585 12651 10299 3548 -6237 -12321 -13101 -7079 2659 10427 13065 9159 1865 -7213
3397g213o053J327P477P856Q146J241n365q232q274m009K191Q182R244N834R9
$$ -7213 -13266 -11939 -4462 3394 11540 12781 7416 -816 -9090 -13099 -10908 -2726 6518 12352 12451
3412A2451o450r467o792k066L538Q254Q941M159r98p573q497p132j412O044Q431
$$ 12451 6001 -3466 -10258 -12324 -8786 -532 8409 12568 11570 3997 -4500 -11632 -13044 -7000 1431
3427A431P866L285k293p704r528n812J276N322R508P208K140m455p443q933m273
$$ 1431 9297 12582 10289 2585 -6943 -12755 -11479 -6157 3351 10559 12699 8244 801 -8132 -12405
3442a2405R30P517R513N877J216n590q539q367k575K348Q383Q476M929n18n597
$$ -12405 -11475 -3958 5555 11432 12648 7058 -1481 -9848 -12423 -10075 -1692 6784 11713 11195 5598
3457E598r572o411j879L794Q729Q217M143k615o878p717p165k83N590Q365P132
$$ 5598 -3974 -10385 -12264 -8470 259 8476 12619 10004 3126 -4591 -11756 -12039 -6449 1916 9048
3472I048L819l225q307q170n499Q97O342R310O902Q19m614p858q415l500K097
$$ 9048 12867 9642 1335 -6835 -12334 -11437 -5095 4215 11117 11936 7322 -536 -8951 -12451 -10354
3487a0354P782Q790N094K81n152r296p300k164L864P754Q270M377n86o602r679
$$ -10354 -2572 6218 11312 11593 6441 -2855 -10155 -12319 -8455 -701 7569 11946 11360 4758 -4921
3502d921o416q58M947P785Q103M306k924p603q434n175k00N449Q530P154K618
$$ -4921 -11337 -12195 -7248 537 8640 12946 10022 2419 -6015 -11190 -11390 -5941 2589 9743 12361
3517A2361l570q187q433m743J730P688P866P478K64n747p676q130k927K264P432
$$ 12361 8791 604 -7829 -12572 -10842 -3154 4712 12190 12454 6707 -969 -9099 -12026 -9762 -2330
3532b330R264N032o74n899q487o437k625L538Q859P955L566j654o014q452o647
$$ -2330 6934 11966 11292 5393 -3094 -9531 -12156 -8618 241 8196 11762 10108 4094 -4358 -11005
3547a1005j148M960J0055O337L032k259q273q254m524m18O066Q967O419J991l803
$$ -11005 -12153 -7193 2862 9199 12231 9972 1699 -6555 -11079 -11497 -5431 3536 9955 11946 8143
3562H143q393p860m115K666O464Q299N537O77m573q948p118l088L794P015Q525
$$ 8143 -250 -8110 -12225 -9559 -3095 5204 10741 11418 6845 -2103 -9221 -12309 -8515 -1500 7025
3577G025M792r58o184q930o037j003M106Q217P435L751l392o472q258n446N35
$$ 7025 11817 10859 4675 -4255 -10292 -11295 -7189 1028 8463 12214 8822 2350 -5908 -11354 -10819
3592a0819M610Q755P207K085l347q640p193m487N07P347Q763O201O34m596q621
$$ -10819 -6209 2546 9753 11838 8491 -149 -7342 -11829 -11322 -3975 4788 10989 11623 7027 -1594
3607a594p249k638J669P109Q532N644q24n049q471p028j919L953P422P834M450
$$ -1594 -8843 -11481 -9812 -2703 5829 11473 10649 5600 -2871 -9899 -11818 -7865 -443 7391 11841
3622A1841l104n543p992o178k64N254P543P221K881k522p069q953m614J066O100
$$ 11841 8737 3194 -4798 -10976 -11240 -5986 1557 8778 11659 9137 2068 -6885 -11499 -10433 -4333
3637d333P740O303K778m910p770p620m137K376N813Q301O392M78n321q790n815
$$ -4333 3407 9710 12488 7578 -192 -7812 -11949 -9573 -3760 4541 10933 11411 6090 -2700 -8515
3652h515k455K311P082Q442M864p99o408q874o089j334M631Q697O801L328k021
$$ -8515 -10970 -8659 -1577 6865 11729 10930 4522 -4352 -10441 -11775 -7144 1553 8354 11682 9661
3667I661o110q949n274n85M966Q843O075K079k609p700p570m645J668O741P413
$$ 9661 3551 -5398 -10672 -11257 -6291 2552 8627 10706 8097 397 -7173 -11818 -10150 -3409 4004
3682D004N516J399l495r385o410k925J985O883Q104N075O6n373q354o499j579
$$ 4004 9520 10919 7424 -1961 -8371 -11296 -9311 -2428 5676 10751 10817 5444 -2910 -9409 -10988
$$ [...]
8191B85
##END NTUPLES=NMR FID
##END=
