##TITLE=1H_PR184_IN
 D2O, 8 sc, 
 26.08.2021
##JCAMPDX= 6.0         $$ Bruker NMR JCAMP-DX V2.0
##DATA TYPE= NMR FID
##DATA CLASS= NTUPLES
##ORIGIN= UXNMR, Bruker Analytische Messtechnik GmbH
##OWNER= root
$$ XWIN-NMR		Version 3.5
$$ Thu Aug 26 12:34:54 2021 Russian Standard Time (UT+4h)  she@DPX200
##.OBSERVE FREQUENCY= 200.131506
##.OBSERVE NUCLEUS= ^1H
##.DELAY= (6, 6)
##.ACQUISITION MODE= SIMULTANEOUS
##.ACQUISITION SCHEME= undefined
##.AVERAGES= 8
##.DIGITISER RES= 18
##SPECTROMETER/DATA SYSTEM= spect
##.PULSE SEQUENCE= zg30
##.SOLVENT NAME= D2O
##.SHIFT REFERENCE= (INTERNAL, D2O, 0, 15.7039)
##AUDIT TRAIL= $$ (NUMBER, WHEN, WHO, WHERE, WHAT)
$$ ##TITLE= Audit trail, XWIN-NMR		Version 3.5
$$ ##JCAMPDX= 5.01
$$ ##ORIGIN= Bruker BioSpin GmbH
$$ ##OWNER= she
$$ F:/spectra/data/she/nmr/H-F/1/audita.txt
$$ ##AUDIT TRAIL=  $$ (NUMBER, WHEN, WHO, WHERE, WHAT)
(   1,<2021-08-26 12:33:23.60 +0400>,<she>,<DPX200>,
      <created by zg, POWCHK disabled, PULCHK disabled
       configuration hash MD5:
       00 E9 B6 7A A2 85 ED C7 34 08 36 98 17 FE 4E 26
       data hash MD5: 16K
       53 FD 87 89 C4 AC A4 EA E0 DD E9 F3 C0 5C 6B DF>)
$$ ##END=
$$ 
$$ hash MD5
$$ 06 B9 59 90 66 5A 7E 2C D9 AE 44 91 23 CF 5E 5E
##$RELAX= 
##$RELAX= 
##$RELAX= 
##$RELAX= 
##$RELAX= 
##$RELAX= 
$$ Bruker specific parameters
$$ --------------------------
##$DU= <F:/spectra>
##$EXPNO= 1
##$NAME= <H-F>
##$PROCNO= 1
##$TYPE= <nmr>
##$USER= <she>
##$AMP= (0..31)
100 100 100 100 100 100 100 100 100 100 100 100 100 100 100 100 100 100 
100 100 100 100 100 100 100 100 100 100 100 100 100 100 
##$AQSEQ= 0
##$AQ_mod= 1
##$AUNM= <au_zg>
##$AUTOPOS= <>
##$BF1= 200.13
##$BF2= 200.13
##$BF3= 200.13
##$BF4= 200.13
##$BF5= 200.13
##$BF6= 200.13
##$BF7= 200.13
##$BF8= 200.13
##$BYTORDA= 1
##$CFDGTYP= 0
##$CFRGTYP= 5
##$CHEMSTR= <none>
##$CNST= (0..31)
1 1 145 1 1 1 1 1 1 1 1 1 1 1 1 1 1 1 1 1 1 1 1 1 1 1 1 1 1 1 1 1 
##$CPDPRG= <>
##$CPDPRG1= <>
##$CPDPRG2= <>
##$CPDPRG3= <>
##$CPDPRG4= <mlev>
##$CPDPRG5= <mlev>
##$CPDPRG6= <mlev>
##$CPDPRG7= <mlev>
##$CPDPRG8= <mlev>
##$CPDPRGB= <>
##$CPDPRGT= <>
##$D= (0..31)
0 1.2 0 0 0 0 0 0 0 0.06 0 0.03 0 0 0 0 0.0002 0 0 0 0 0 0 0 0 0 0 0 0 
0 0 0 
##$DATE= 1629966803
##$DBL= (0..7)
120 120 120 120 120 120 120 120 
##$DBP= (0..7)
150 150 150 150 150 150 150 150 
##$DBP07= 0
##$DBPNAM0= <>
##$DBPNAM1= <>
##$DBPNAM2= <>
##$DBPNAM3= <>
##$DBPNAM4= <>
##$DBPNAM5= <>
##$DBPNAM6= <>
##$DBPNAM7= <>
##$DBPOAL= (0..7)
0.5 0.5 0.5 0.5 0.5 0.5 0.5 0.5 
##$DBPOFFS= (0..7)
0 0 0 0 0 0 0 0 
##$DE= 6
##$DECBNUC= <off>
##$DECIM= 32
##$DECNUC= <off>
##$DECSTAT= 4
##$DIGMOD= 1
##$DIGTYP= 9
##$DL= (0..7)
0 120 120 120 120 120 120 120 
##$DP= (0..7)
150 150 150 150 150 150 150 150 
##$DP07= 0
##$DPNAME0= <>
##$DPNAME1= <>
##$DPNAME2= <>
##$DPNAME3= <>
##$DPNAME4= <>
##$DPNAME5= <>
##$DPNAME6= <>
##$DPNAME7= <>
##$DPOAL= (0..7)
0.5 0.5 0.5 0.5 0.5 0.5 0.5 0.5 
##$DPOFFS= (0..7)
0 0 0 0 0 0 0 0 
##$DQDMODE= 0
##$DR= 18
##$DS= 0
##$DSLIST= <SSSSSSSSSSSSSSS>
$$ [...]
##$SUBNAM2= <"">
##$SUBNAM3= <"">
##$SUBNAM4= <"">
##$SUBNAM5= <"">
##$SUBNAM6= <"">
##$SUBNAM7= <"">
##$SUBNAM8= <"">
##$SUBNAM9= <"">
##$SW= 20.0188882624521
##$SWIBOX= (0..15)
0 0 2 0 0 0 0 0 0 0 0 0 0 0 0 0 
##$SW_h= 4006.41025641026
##$TD= 16384
##$TD0= 1
##$TE= 0
##$TE2= 300
##$TE3= 300
##$TEG= 300
##$TL= (0..7)
0 120 120 120 120 120 120 120 
##$TP= (0..7)
150 150 150 150 150 150 150 150 
##$TP07= 0
##$TPNAME0= <>
##$TPNAME1= <>
##$TPNAME2= <>
##$TPNAME3= <>
##$TPNAME4= <>
##$TPNAME5= <>
##$TPNAME6= <>
##$TPNAME7= <>
##$TPOAL= (0..7)
0.5 0.5 0.5 0.5 0.5 0.5 0.5 0.5 
##$TPOFFS= (0..7)
0 0 0 0 0 0 0 0 
##$TUNHIN= 0
##$TUNHOUT= 0
##$TUNXOUT= 0
##$USERA1= <user>
##$USERA2= <user>
##$USERA3= <user>
##$USERA4= <user>
##$USERA5= <user>
##$V9= 5
##$VALIST= <valist>
##$VCLIST= <CCCCCCCCCCCCCCC>
##$VD= 0
##$VDLIST= <DDDDDDDDDDDDDDD>
##$VPLIST= <PPPPPPPPPPPPPPP>
##$VTLIST= <TTTTTTTTTTTTTTT>
##$WBST= 1024
##$WBSW= 4
##$XGAIN= (0..3)
0 0 0 0 
##$XL= 0
##$YL= 0
##$YMAX_a= 371975
##$YMIN_a= -395712
##$ZGOPTNS= <>
##$ZL1= 120
##$ZL2= 120
##$ZL3= 120
##$ZL4= 120
##$ABSF1= 10
##$ABSF2= 0
##$ABSG= 5
##$ABSL= 3
##$ALPHA= 0
##$AQORDER= 0
##$ASSFAC= 0
##$ASSFACI= 0
##$ASSFACX= 0
##$ASSWID= 0
##$AUNMP= <proc_1d>
##$AZFE= 0.1
##$AZFW= 0.1
##$BCFW= 1
##$BC_mod= 2
##$BYTORDP= 1
##$COROFFS= 0
##$CY= 11.3945322036743
##$DATMOD= 1
##$DC= 2
##$DFILT= <>
##$DTYPP= 0
##$F1P= 2.36226072786647
##$F2P= -0.459571619588291
##$FCOR= 0.5
##$FTSIZE= 0
##$FT_mod= 4
##$GAMMA= 1
##$GB= 0.15
##$INTBC= 1
##$INTSCL= 1
##$ISEN= 128
##$LB= 0.24
##$LEV0= 0
##$LPBIN= 0
##$MAXI= 10000
##$MC2= 0
##$MEAN= 0
##$ME_mod= 0
##$MI= 1.114404
##$NCOEF= 0
##$NC_proc= 0
##$NLEV= 6
##$NOISF1= 3.799351
##$NOISF2= 2.8
##$NSP= 1
##$NTH_PI= 0
##$NZP= 0
##$OFFSET= 15.70392
##$PC= 1
##$PHC0= -13521.5
##$PHC1= 14.40099
##$PH_mod= 1
##$PKNL= yes
##$PPARMOD= 0
##$PSCAL= 0
##$PSIGN= 0
##$REVERSE= no
##$SF= 200.130013532006
##$SI= 16384
##$SIGF1= 3
##$SIGF2= 2
##$SINO= 400
##$SIOLD= 16384
##$SREGLST= <1H.CDCl3>
##$SSB= 0
##$STSI= 0
##$STSR= 0
##$SW_p= 3612.71676300578
##$SYMM= 0
##$S_DEV= 0
##$TDeff= 0
##$TDoff= 0
##$TI= <>
##$TILT= no
##$TM1= 0
##$TM2= 0
##$TOPLEV= 0
##$USERP1= <user>
##$USERP2= <user>
##$USERP3= <user>
##$USERP4= <user>
##$USERP5= <user>
##$WDW= 1
##$XDIM= 8192
##$YMAX_p= 0
##$YMIN_p= 0
$$ End of Bruker specific parameters
$$ ---------------------------------
##NTUPLES= NMR FID
##VAR_NAME=  TIME,          FID/REAL,        FID/IMAG
##SYMBOL=    X,             R,               I
##VAR_TYPE=  INDEPENDENT,   DEPENDENT,       DEPENDENT
##VAR_FORM=  AFFN,          ASDF,            ASDF
##VAR_DIM=   8192,          8192,            8192
##UNITS=     SECONDS,       ARBITRARY UNITS, ARBITRARY UNITS
##FACTOR=    0.0002496,     1,               1
##FIRST=     0,             0,               0
##LAST=      2.0444736,     0,               0
##MIN=       0,             -395712,         0
##MAX=       2.0444736,     371975,          0
$$ Real data points
##PAGE= N=1
##DATA TABLE= (X++(R..R)), XYDATA
0@%%%%%%%%%kKqJ6j6J7k5L2m0M9n6P0q2R3j14J36j56J83k11K42k80L19l66M19
33B22m72N33o02O76p58Q50r48J055j174J304j446J600j768J954k158K380k619
50a371K884l180L502l861M265m718N232n820O499p296Q246r400J0841j2695J5187
65H315j8741K4244l4011N6587k05834p3209L94053J94908k206k88820l08855j42143
77c95712J70013L06816K58948N887k38083l28422j46954J12880K96362K63279
87C05014N0184k20095l07708j76214P7170K66793K78236P2323j82263k94656j91524
98c22740L4474K47556K77578R7767j47732k73055k11509L400K21895K73324J18263
109C19221j09357k55670k24558k5780J95880K62075J39602p3872k38451k32644
$$ plain form
0 0 0 0 0 0 0 0 0 0 0 -2 0 -8 8 -8 9 -16 16 -24 25 -31 39 -43 50 -64 72 -84 99 -112 130 -150 169 -197 222
33 222 -250 283 -319 357 -401 449 -499 556 -618 686 -760 840 -928 1026 -1132 1248 -1371
50 -1371 1513 -1667 1835 -2026 2239 -2479 2753 -3067 3432 -3864 4382 -5018 5823 -6872 8315
65 8315 -10426 13818 -20193 36394 -169440 -242649 151404 346312 344106 55286 -253569 -395712
77 -395712 -225699 81117 340065 345952 107869 -220553 -367507 -254627 41735 305014
87 305014 355198 135103 -172605 -348819 -271649 -4856 273380 345703 163440 -131216 -322740
98 -322740 -288266 -40710 236868 334635 186903 -86152 -297661 -294261 -72366 200958 319221
109 319221 209864 -45806 -270364 -296144 -100264 161811 301413 227541 -10910 -243554
119b43554m9200J65461K50391J59562m2085k20189k34008p0957J34257K37969
129H7647J77298j5096j99798k30489r2968J03140K26168J88949Q433j76916k24850
140a48482j14053P3988K13414J95515K9906j51263k18353j33033M8993J98288
150e080J98080N1948j24832k10676j47907K6201J81107J97628P3585r9230k02542
161f1718j58275M564J60570J96001R2902p6026j92176j65603j6766J38793J92805
172A15071J09743n4725j79370j69598l7930J17788J88460J23137l3731j64066
182A4779j71967n7150R7399J82447J33447j3396j47262j73168p4510P8083J73613
193D2315J41262O423j30713j72346q9746N8786J63012J47105K5501j13721j69796
$$ plain form
119 -243554 -292754 -127293 123098 282660 240575 20386 -213622 -284579 -150322 87647
129 87647 264945 249849 50051 -180438 -273406 -170266 55902 244851 253284 76368 -148482
140 -148482 -262535 -188547 24867 220382 250288 99025 -119328 -252361 -203368 -5080
150 -5080 193000 244948 120116 -90560 -238467 -212266 -31159 166469 240054 140824 -61718
161 -61718 -219993 -215429 -54859 141142 234044 158018 -34158 -199761 -216527 -77734 115071
172 115071 224814 170089 -9281 -178879 -216809 -99021 89439 212576 178845 14779
182 14779 -157188 -214338 -116939 65508 198955 185559 38297 -134871 -209381 -131298 42315
193 42315 183577 190000 59287 -113059 -202805 -144019 18993 166098 191599 77878 -91918
204i1918j01898L9308J50957J52122M2982r6311j64635j12882K0479J38160J54941
215A31305N8691p8952j57816j22261K054J24837J55104P2501o1240j50168j30107
226a56052j5011J10440J53371Q5081m3436j41354j36038l0230R5314J49925R7195
237A69205k6224j31484j39118m4740P9412J45580J07683j0108j20675j40084n8556
248a69109O2902J40463J15938M557j08128j39621p2165M6993J34141J21943J8762
259A56676r4040j37942q4810L1999J26743J25183L3323p8969j35972r5315J8123
270a35001J16901J26954M7750o4232j33020j03536M488J04705J27639O1948n0601
281A03995j28426j08890j0003R1481J28158P4278l7322j21436j12324k4773P7896
$$ plain form
204 -91918 -193816 -154508 -3551 148571 191553 95242 -69393 -182275 -161796 -23636 131305
215 131305 189996 111044 -46772 -169033 -166979 -42142 112962 185463 124223 -25945 -156052
226 -156052 -171063 -60623 92748 177829 134393 -6961 -142999 -173229 -77915 72010 169205
237 169205 142981 11497 -127621 -172361 -92949 52631 160314 150206 29531 -110553 -169109
248 -169109 -106207 34256 150194 154751 46623 -92998 -165163 -118170 15971 137914 156676
259 156676 62636 -75306 -160116 -128117 -1374 123809 157132 78163 -57809 -153124 -135001
270 -135001 -18100 108854 156604 92372 -40648 -144184 -139696 -34991 92648 154596 103995
281 103995 -24431 -133321 -143324 -51843 76315 150593 113271 -8165 -120489 -145262 -67366
292f7366J28084Q4388k4405j11502j15149l9604O5179J26191R1711j0820r9924
303B6783j17574n3747N2965J21784R6828M002q7712j19798o5359M0907J14440
314A3519J01069J9258p5820j20600p4287K8475J04736J05221L4068o5169j18623
325d8153q0780J4536R4334J09062M6596n4521j14093q6067k50Q3929J12006N6347
337A32946m3473j06736r1408j4735P4626J12501O4018l1137r8148r6529k7659
348a25734O5659J10423P0286j7480q9529j00935l8227N6064J05624P6197l503
359A08845q1471j03808m6706M5273R9027Q2407R480p4004j03861n3905L2859R2138
371F274Q8156K0776o5782j01515o0706J9682Q5505R2912L0045n6297r7174o7753
$$ plain form
292 -67366 60718 145106 120701 9199 -105950 -145554 -80375 45816 137527 126707 26783
303 26783 -90791 -144538 -91573 30211 127039 131041 43329 -76469 -141828 -100921 13519
314 13519 114588 133846 58026 -62574 -136861 -108386 -3650 101571 135639 70470 -48153
325 -48153 -128933 -114397 -20063 88999 135595 81074 -33019 -119086 -119336 -35407 76599 132946
337 132946 89473 -17263 -108671 -123406 -48780 63721 127739 96602 -1546 -98075 -125734
348 -125734 -60075 50348 120634 103154 13625 -87310 -125537 -69473 36151 112348 108845
359 108845 27374 -76434 -123140 -77867 21160 103567 113047 39043 -64818 -118723 -85864 6274
371 6274 94430 115206 49424 -52091 -112797 -93115 -7610 85302 115347 59050 -38124 -105877
383a05877O871P9157R5193L8222m5468r1987p4759m604P2493R5027M5607l3464
395G6411q7000q0704j4262O4597R2982N3187k1463q1944q4856k2902N5430Q9719
407C9195O0934j0327p6652q6652l1121M4938Q6233O7854j67p0351q6728l9142
419a01986L3687Q2601P3525Q753o2573q5502m7407K3237P8589P7239J7200n3774
431D3589q3558n5007J3499P3900P9003K5597m4159q1598o1415M566O7782P9598
443F1797L3901l4655p8878o6513l914O0492P9461M1886k5688p5509o9815j2445
455h9880N2627P8833M8865j7036p1133p2027k0687M4483P7674N4692q754o5337
467A2320p3549k8824L6405P5432N9489k09n9176p4337l6241K8427P2335O3073
$$ plain form
383 -105877 -99006 -19849 75344 113566 68098 -23889 -98648 -103252 -30759 64268 109875 76411
395 76411 -10589 -91293 -105555 -40958 52024 105211 83748 1804 -83052 -105954 -50524 39195
407 39195 100129 89802 13150 -73502 -104623 -59685 26548 94402 94235 23884 -62844 -101986
419 -101986 -68299 14302 87827 96580 34007 -51495 -98902 -75665 2924 80163 97363 43589
431 43589 -39969 -94976 -81477 -7577 71426 97023 52864 -28734 -90149 -85583 -17801 61797
443 61797 95698 61043 -17835 -84348 -88262 -27770 51691 93577 67889 -7620 -77435 -89880
455 -89880 -37253 41580 90445 73409 2276 -69751 -90438 -45955 31719 86411 77657 12320
467 12320 -61229 -90053 -53648 21784 81273 81064 21888 -52449 -88690 -60263 12072 75145
479G5145Q094n2368p4537m2606K0475O8064O6192J6042m5454p3619m8237J2260
491g0549O3359O8374K3578l8367p1689n2977L939N8212O9725L0305l0909o8970
503a5969n7173l962N2469P0111L6347k2940o5431o0879j1485M6471O9231M2112
515G8902j4858o1512o3560j8389L9519O7593M7553o882n7226o5023k4800L1923
527d6760O5403N2389M66n2241o5305l1109K4229O2688N6278P288m6422o4646l7248
540g4990J6636N9819N8785J3701l9692o3488m2953R510N6139O0023K0095l2400
552D1185o2088m7819L122N1499O0275K6562k5320o0483n1314k935M5806N9930
564C8420L2774j8563n8177n3422r242L9299N9715L8410j2639n4743n4552j5776
$$ plain form
479 75145 83239 30871 -43666 -86272 -65797 2267 68459 84501 39047 -34572 -82809 -70549
491 -70549 -7190 61184 84762 46395 -25294 -78271 -74332 -16120 53605 83910 53001 -15969
503 -15969 -73142 -77104 -24635 45476 81823 58883 -6548 -67427 -78912 -32441 36790 78902
515 78902 64044 2532 -61028 -79417 -39898 27695 75248 68366 11140 -53883 -78683 -46760
527 -46760 18643 71032 71498 19257 -46048 -77157 -52928 9760 66038 73326 26904 -37742 -74990
540 -74990 -58354 1465 60250 73951 34259 -29229 -72182 -62672 -6533 53490 73585 41185
552 41185 -20903 -68722 -65600 -14101 46174 72736 47416 -13067 -64381 -67316 -21510 38420
564 38420 71194 52631 -5546 -58968 -68210 -28911 30804 69214 56575 1832 -52720 -68496
576f8496L2750N9139M2874o889n0110n5153k2363K6484N8078M5872q39m4527n5715
589c8895k8641K0827N5932M7985N400l8569n6212l3836J5546N2500M9325J2253
601F3615l2980n6284l7698R958M8098N0572J8773k7693n5483m0420L880M2975
613a2687N1887K4597k2831n3238m2655k692L7891N2994K9253j7826m9836m4601
625d9744r416L3129N3277L2825j2138m5691m6719j5574K8673N2381L5563n891
637E0675m1193m8695k0840K4266N0039L8274O39l7192m9851k5037J9263M6981
649G329M0876O916l3414n0157k8267J3539M3612M3429J2412k9623m9036l1406
661e3790P485M0130M5490J6990k5308m7067l4461J418L7074M6684K0606k0205
$$ plain form
576 -68496 -35746 23393 66267 59378 9268 -45885 -68248 -41764 16314 62186 61347 16820 -38895
589 -38895 -67536 -46709 9223 57208 62608 24039 -32173 -66009 -50463 2037 51362 63615
601 63615 30635 -25649 -63347 -53389 -5291 45281 64054 36361 -19122 -59542 -55662 -12687
613 -12687 39200 63797 40966 -12272 -54927 -57619 -19728 33266 62519 44693 -5143 -49744
625 -49744 -59160 -26031 27246 60071 47933 2242 -44477 -60051 -31378 21003 56566 50675
637 50675 9482 -39213 -60053 -35787 14252 52526 53165 15973 -33878 -58915 -39652 7329
649 7329 48205 55121 21707 -28450 -56717 -43178 434 43863 56275 26652 -22384 -53790
661 -53790 -46305 -6175 39315 56305 30997 -16070 -50531 -49113 -12039 34645 55251 35046
673C5046m4661l7375m125L3740M6907K4008j4762m2048m0166q836L0232M5798
685B3758K7575r135l9476m2202j2989K5966M4269L1017l718l6885m3246j6824
697e1890K1095M2500L4320J171l3883m3360k0580J5855M0645L6897N606l0247
709A8129m2788k4377J0782L8647L8679R692k6008m1825k8021N956L6276L9773
721C4915J3673k1450m0724l1119J449L3431M0020J7806j6972l9303l3493k807
733d4574K9963L9971K1467j2363l7614l5258o906K6018L9652K4903q056l5262
745A941l6425j1068K1967L8774K7927l681l2536l7045j5067J7747L7685L0076
757D0295O74k9087l7563j8738J3666L5953L2064M744k5771l7374k1898R567L3707
$$ plain form
673 35046 -9615 -46990 -51115 -17375 29532 53540 38778 -3270 -43436 -52272 -22040 23758
685 23758 51333 42198 2722 -39480 -52469 -26503 17766 48783 45065 8180 -35066 -51890
697 -51890 -30795 11705 46025 47196 13313 -30047 -50627 -34772 5873 42770 48376 18129
709 18129 -24659 -49036 -38254 393 39072 48764 22756 -19069 -47090 -41134 -4858 34915
721 34915 48588 27138 -13586 -44705 -43256 -9825 30195 48001 31029 -8274 -41767 -44574
733 -44574 -14611 25360 46827 34464 -3150 -38408 -45314 -19296 20356 45259 37203 1941
745 1941 -34484 -45552 -23585 15189 43116 39435 6899 -30146 -45213 -27466 10219 40295
757 40295 40969 11882 -25681 -44419 -30753 5200 37264 42008 16237 -21137 -43035 -33468 239
770B39L3411Q891k2253l6801k4556N301L1290L4420J2523j8506l5693k6907J158
783c7483K8485L4961J5850j4708l4076k8976k852K5610L5044J8744j0779l2095
795b275l0654o532K2512L4441K1463o613l0180l1806r867J9035L3441K3950k694
808C4221k7861l2424j2939J5351L2133K6217R11k5429l2446j5792J1499L0692
820D133K8042M240k2537l2021j8678P655K9164K9374P174j9259l1156k1471M258
833c1082K7302K9729J0380j5758l0348k3722R84K5066K9793J3351j2089k9460
845e854k5455j990K2184K9591J6364q643k8228k6599n018J8959K9249J9172n560
858B8172k6598k7038q184J5623K8905K1323k643k4380k7255j1437J2546K8239
$$ plain form
770 239 33650 42541 20288 -16513 -41069 -35768 -4478 29942 42465 23959 -11734 -38641 -37483
783 -37483 -8998 25963 41813 27105 -6971 -35947 -38799 -13189 21855 40599 29820 -2275
795 -2275 -32929 -39461 -16949 17492 38955 32342 2162 -29644 -39511 -20476 12965 36915 34221
808 34221 6360 -26064 -39003 -23652 8481 34698 35609 10180 -22266 -38058 -26559 4133
820 4133 32175 36415 13878 -18143 -36821 -29166 -2 29372 36546 17287 -13869 -35340 -31082
833 -31082 -3780 25949 36329 20571 -9777 -33499 -32515 -7449 22344 35695 23606 -5854
845 -5854 -31309 -33299 -11115 18476 34840 26197 -2031 -28630 -33648 -14689 14560 33732 28172
858 28172 1574 -25464 -33648 -18025 10880 32203 29560 5180 -22075 -33512 -20966 7273
870G273K2948K22k1635k7454j4464R709K7283K3913L224j8723k7544j6984O971
883b5261K5645K4560O423j5825k7533j8969M284K3512K5054R686j3220k7078k0482
896b9204J500K0968K5635J2462j0747k6052k1442j745J8559K5973J4782q220k4561
909b092k2348m750J6060K6199J6552n708k2530k3274p797J3987K5814J7887k778
922B5222k0485k3990j0459J1776K4960J8986L74j8443k4652j2409R315K3441K0290
935B3926L381j6528k4788j4155O672K1728K1466O189j4631k4338j5682L802J9965
948b993K2478Q413j2452k3501j7121Q90J8330K3078J0295r996k2275j8518j945
961b5317J6761K3056J2135p441k0912j9832m304J4927K2732J3729m698j9613k0767
$$ plain form
870 7273 30221 30443 8808 -18646 -33110 -23401 3882 27795 31019 12296 -15248 -32232 -25261
883 -25261 384 24944 31367 15542 -11991 -30960 -26676 -3164 21890 31576 18356 -8722 -29204
896 -29204 -27704 -6736 18899 31361 20614 -5438 -26880 -28625 -10066 15907 30689 22469 -2092
909 -2092 -24440 -29190 -13130 13069 29621 23913 1383 -21891 -29688 -15701 10113 28000 25222
922 25222 4737 -19253 -29712 -17936 7024 26010 26384 7941 -16711 -29120 -19805 3636 23926
935 23926 27307 10779 -14009 -28164 -21492 236 21702 27891 13260 -11078 -26760 -22958 -2993
948 -2993 19485 27898 15446 -8055 -25176 -24286 -5956 17122 27417 17421 -4854 -23372 -25317
961 -25317 -8556 14500 26635 19194 -1718 -21550 -25854 -10927 11805 25534 20836 1223 -19544
974a9544o392J2799K2026J5354k040j8246k1318q310J0580K1122J6739L84j6769
987F385k1347j0074Q035K0191J8060K484j5018k1056j1855N620J9026J8894M591
1000B3936j2998k0649j3500L239J7955J9343O482j0842k0105j4844J093J6562
1012d328J9473Q321q716j9300j6085r53J4886J9442J0149o508j8417j6956k872
1025b1864J3071J9238J1652m408j7330j7478m908J1123J8961J3115k394j6103
1037B675j7863o755R245J8448J4118l95j4559j8051q439P387J7530J5062J601
1050B0004j3009j8018r911N417J6574J5765L547j1478j7749j1202L425J5409J6301
1063A5075N285r817j7159j2361J443J4237J6602O849q033j6589j3188n74J2958
$$ plain form
974 -19544 -25936 -13137 8889 24243 22203 3957 -17361 -25671 -15091 6031 22770 23154 6385
987 6385 -14962 -25036 -17001 3190 21250 23734 8716 -12340 -24195 -18575 451 19345 23936
1000 23936 10938 -9711 -23211 -19972 -2017 17326 23808 12966 -7139 -21983 -20890 -4328
1012 -4328 15145 23466 14750 -4550 -20635 -21588 -6702 12740 22889 16381 -2036 -18992 -21864
1025 -21864 -8793 10445 22097 17689 359 -17119 -22027 -10904 8057 21172 18778 2675
1037 2675 -15188 -21943 -12698 5750 19868 19473 4914 -13137 -21576 -14189 3341 18403 20004
1050 20004 6995 -11023 -20934 -15517 1057 16822 20369 8891 -8858 -20060 -16635 -1226 15075
1063 15075 20360 10543 -6616 -18977 -17534 -3297 13305 20154 12121 -4468 -17656 -18230 -5272
1076e272J6715Q219o103j5774j4245k174J1506J6572R539m235j4897j4895l749
1089a8793R954J6225J0702k280j3899j5312n273Q317J5617J1873n31j2877j5385
1102a1662o680O526J5011J2866R42j1646j5153q041M781J4363J3524K413j0214
1115G030j4890r374L094J3682J3881L780q520j4693j0546J645J2741J3970N295
1128A7095o935j4419j1381K05J1591J3906O737n408j3962j1976j236J0224J3897
1141H338Q114l991j3284j2486k588Q737J3819R243k683j2419j2636m092P306J3696
1155E074J0116j386j1302j2870n495N981J3456J0602R8j0104j2981o857M754J2839
1169A925J1090J635q888j3084p948L574J2001J1461L067p610j3151q626K219J1040
$$ plain form
1076 -5272 11443 19662 13559 -2215 -16460 -18634 -7128 9444 18983 14748 -149 -15044 -18793
1089 -18793 -8839 7386 18088 15808 1909 -13403 -18676 -10359 5258 17131 16600 3723 -11662
1102 -11662 -18342 -11816 3195 16061 17003 5357 -9796 -17837 -13056 1307 14831 17244 7030
1115 7030 -7860 -17234 -14140 -458 13423 17203 8683 -6010 -16556 -14911 -2170 11800 17095
1128 17095 10160 -4259 -15640 -15435 -3844 10062 16799 11391 -2571 -14547 -15783 -5559 8338
1141 8338 16452 12461 -823 -13309 -15897 -7160 6659 15902 13219 800 -11836 -15928 -8622 5074
1155 5074 15190 13804 2502 -10368 -15863 -9882 3574 14176 14274 4170 -8811 -15668 -10914 1925
1169 1925 13015 14650 5762 -7322 -15270 -11696 305 11766 14833 7223 -5928 -14554 -12335 -1295
1183a295J1808M375o569j2805r244Q25R893J2225N582n476j2249r802o02Q915
1197d419J2393O508m348j1495j0319k067Q093J2309P229k963j0691j0871l228
1210a3869P041J2100P931j653r811j1274m297N990J1667Q614k25r138j1446n298
1224a3668M976J1013R269R95q279j1529o022L627J0404R953K163p420j1326o844
1238a2688K291R803J0336L151o469j0858p671J113R151J0576M043n303j0577q367
1252a1469l7Q471J0577M963m113j0201q910j098P665J0551N776k962r702r396
1266i885k021O630J0351O610j807r101r639l072N598J0200P302p80q455r800m031
1281a1900M625R826P996K24p692r863m841L533R546Q407J155o843r818n707K578
$$ plain form
1183 -1295 10513 14888 8319 -4486 -13730 -12905 -3012 9213 14795 9319 -2930 -12732 -13334 -4419
1197 -4419 7974 14482 10134 -1361 -11680 -13747 -5654 6655 13884 10921 230 -10641 -13869
1210 -13869 -6828 5272 13203 11550 1739 -9535 -13832 -7842 3825 12439 12214 3076 -8370 -13668
1224 -13668 -8692 2321 11590 12585 4306 -7223 -13245 -9618 786 10739 12902 5482 -5844 -12688
1238 -12688 -10397 -594 9742 12893 6424 -4434 -12105 -10992 -1841 8735 12778 7475 -3102 -11469
1252 -11469 -11506 -3035 7542 12505 8392 -1809 -10719 -11817 -4152 6399 12175 9213 -489 -9885
1266 -9885 -11906 -5276 5075 11685 9878 777 -8862 -11934 -6336 3864 11166 10386 1931 -7869 -11900
1281 -11900 -7275 2551 10547 10771 3079 -6784 -11625 -8092 1454 9861 11016 4173 -5645 -11352 -8774
1296h774Q993Q758K209n925r743o469J607Q378R096L122n113r486p112O37P782
1311b040R143M118m155r273p583m18P030R347M762l163q826q014j405O228R354
1326E105N541k223q357q414k255N458R180O210j290p772q636l152M576Q934O838
1341I743k46p277q754m017L739Q613P359O78o561q821m802K821Q235P831J498
1356A0039n801q758n454J795P899P971K411m988q564o202R57P315Q287L209m122
1371E994q429o728M5O766Q310L963l194q216p098p59O035Q313M800k399p855p458
1387g910j658N321Q268N523j579p474p643k464M494Q243N980p10o839p878l286
1402i612L735Q077O440Q8o293p932m065K986P865O771Q91n535q033m717K202P440
$$ plain form
1296 -8774 219 8977 11186 5261 -4482 -10951 -9344 -966 8130 11252 6139 -3347 -10459 -9822 -2040
1311 -2040 7103 11221 7066 -2207 -9790 -10208 -3178 6169 10931 7768 -1058 -9072 -10477 -4249 5105
1326 5105 10646 8423 66 -8348 -10603 -5145 4035 10245 8955 1183 -7453 -10605 -6029 2905 9743
1341 9743 9497 2220 -6534 -10551 -6812 1801 9160 9838 3277 -5544 -10346 -7525 710 8541 10039
1356 10039 4238 -4520 -9974 -8179 -280 7691 10102 5114 -3450 -9652 -8695 -1380 6907 10116 5994
1371 5994 -2435 -9163 -9118 -2352 5958 9921 6727 -1489 -8587 -9346 -3311 5002 9802 7403 -452 -7910
1387 -7910 -9568 -4247 4021 9544 7965 491 -7152 -9616 -5122 3121 9101 8391 1552 -6326 -9612
1402 -9612 -5877 2200 8640 8728 2435 -5497 -9562 -6576 1289 8060 8951 3416 -4617 -9334 -7132 308
1418C08P034J778m864q057n261J500O950P246K592m224p894n731O63O327P527
1433E894L304l505p737o032j99N742P676L983k829p394o393j052N142P758M530
1448H888k129o913o719j916M653P756M908j296o438p010k667M027P509N409l38
1463G724o003p352l113L317P213N866L63n521p399l690K532O911O328J130n027
1478C279p382m234J830O481O607J811m435p248m798J095O100O885K427l790p128
1493b500n259L52N768P009K955l086o801n747m51N368P006L584k290o669o119
1508f880j038M743P020M178j612o371o359j708M170O921M635q76o014o542k329
1523h062L515O715N300k20n608o693k997K808O670N646M36n053o740l680K161
$$ plain form
1418 308 7342 9120 4256 -3801 -9062 -7562 -612 6634 9226 5002 -2892 -8623 -7960 -1633 5894
1433 5894 9198 5693 -2044 -8076 -8275 -2533 5143 9126 6297 -1097 -7490 -8542 -3400 4358 8888
1448 8888 6759 -154 -6873 -8789 -4136 3620 8528 7232 794 -6216 -8883 -4856 2653 8062 7724
1463 7724 1721 -5631 -8744 -5427 1786 7652 8015 2494 -4905 -8595 -6063 848 7176 8306 3279
1478 3279 -4103 -8337 -6507 -26 6581 8392 3957 -3291 -8089 -6994 -894 5991 8418 4628 -2500
1493 -2500 -7759 -7407 -1639 5370 8325 5239 -1562 -7309 -7760 -2392 4614 8198 5908 -761 -6880
1508 -6880 -7918 -3175 3845 8023 6411 40 -6319 -8027 -3857 3064 7699 6823 809 -5733 -8062
1523 -8062 -4547 2168 7468 7248 1640 -5053 -8050 -5242 1428 7074 7510 2457 -4283 -7963 -5802
1538e802O370N993J059m359o675m291J420O070O191J797l804o740m724P71N704
1553a020O312K542l133o696n143J15N140O513L152k532o385n552o16M608O642
1568C947L744j899o139n784j420M114O608M244j158n739o041k110L489O536M751
1583G143m31n347o306k683K862O351N193J54m809o442l236K273O043N532Q79m280
1599B896o438l764J487N791N793J561l802o346m243P93N435N945K291l179o212
1614a992m744J07N001O178K801k552o021n107m87M421O191L410j857n788n400
1629e839j168L955O035M009j174n479n626j749L291O052M404n22n030n799k395
1644g035K662N898M792P9m457n947k975K079N692N049P75l991n876l536J424N452
$$ plain form
1538 -5802 568 6561 7620 3261 -3414 -7705 -6285 -215 5976 7773 3969 -2771 -7495 -6724 -1020
1553 -1020 5292 7834 4701 -1995 -7138 -7023 -1883 4630 7782 5250 -1135 -6687 -7303 -2695 3947
1568 3947 7691 5792 -347 -6131 -7551 -3437 3171 7415 6257 518 -5523 -7633 -4144 2392 7143
1583 7143 6712 1365 -4941 -7624 -4762 1589 6782 6936 2127 -4315 -7551 -5278 765 6297 7176 2896
1599 2896 -3542 -7306 -5819 -28 5765 7326 3524 -2822 -7065 -6272 -837 5108 7399 4220 -1992
1614 -1992 -6736 -6629 -1628 4550 7351 4799 -1222 -6329 -6816 -2395 3796 7206 5349 -439 -5839
1629 -5839 -7007 -3052 2983 6992 5818 339 -5287 -7036 -3745 2307 6711 6189 1159 -4640 -7035
1644 -7035 -4373 1525 6317 6396 1939 -4008 -6983 -4904 788 5837 6612 2621 -3255 -6791 -5367 85
1660H5N253J425l488n904l978R15M966N497J979k883n758m366K51M568N571K538
1676F671k196n595m709l84M060N657L156j811n242m915j059L547N667L517j085
1691E279m932n094j724L042N577L980n89m533n209k229K468N399M289L0l939n445
1707c630k774K022N150M473P10l558n454l122J343M840M788J316l078n379l562
1722e915P51M440N041J845k656n192l929K32M006N145K341k142m995m179m59L655
1738b011N262K701j527m695m511j053L294N132L135j013m305m721j569K721N086
1753A926L502l38m070m862j979K236M819L858K64l677m952k480J686M560M310
1768D803P40l299m937k893J094M371M505J294k904m851l266M81M071M682J756
$$ plain form
1660 85 5338 6763 3275 -2629 -6607 -5692 -726 4771 6750 3867 -1891 -6257 -6006 -1438 4133 6671
1676 6671 4475 -1120 -5829 -6213 -2153 3504 6660 4849 -393 -5308 -6367 -2820 2847 6364 5279
1691 5279 347 -4747 -6471 -3429 2148 6128 5539 1006 -4203 -6432 -3964 1435 5724 5754 1815 -3630
1707 -3630 -6404 -4382 768 5241 5951 2393 -3061 -6183 -4840 0 4788 6104 3026 -2353 -5915
1722 -5915 -5164 -724 4317 6162 3506 -1686 -5615 -5383 -1377 3768 6109 3967 -1028 -5207 -5666 -2011
1738 -2011 3251 5952 4425 -270 -4781 -5834 -2540 2592 5727 4714 409 -4312 -5881 -3160 1926
1753 1926 5428 5090 1020 -3842 -5821 -3585 1234 5092 5356 1679 -3273 -5753 -4067 493 4803
1768 4803 5543 2244 -2693 -5586 -4492 -121 4384 5678 2774 -2077 -5343 -4862 -791 3891 5647
1783E647k354m665l782l5L786M746K278j802m562m007o01L406M765K642j172m367
1799g7m285j095K928M694L045n85m073m504j503K353M674L457j39l712m600k062
1815e484J981M393L875L35l439m566k452J358M307M072Q56k994m511k906P51M073
1831c51M374J268k442m534l355L63L770M385J848k065m407l560j06L323M429K302
1847E242j501m258l863n74K898M502K700j093m035m055j038K610M388L058n94
1862D387l752m219j529K124M339L348r2l413m268k023J651M174L653M40l040m319
1878b539k500J233L927L865Q76k570m360k777P49L649M090J320k278m168l094
1893d577J63L439M132J757j765m098l362k24L018M211K179j308l956l622o71K656
$$ plain form
1783 5647 3293 -1372 -5154 -5189 -1403 3343 5621 3819 -743 -4750 -5351 -1945 2820 5462 4290 -77
1799 -77 -4362 -5457 -2529 2165 5210 4625 552 -3952 -5455 -3102 1572 5029 4890 1178 -3422 -5484
1815 -5484 -3503 890 4765 5100 1661 -2905 -5357 -3999 308 4380 5236 2242 -2269 -5175 -4424 -351
1831 -351 4023 5291 2849 -1685 -5040 -4677 -907 3478 5326 3261 -1146 -4706 -4812 -1489 2940 5242
1847 5242 3741 -517 -4380 -4954 -2056 2446 5146 4053 18 -4037 -5075 -2465 1923 4981 4387
1862 4387 635 -3584 -5113 -2989 1350 4698 4606 1193 -3075 -5098 -3447 727 4380 4820 1780 -2539
1878 -2539 -5039 -3806 121 3986 4862 2292 -2068 -4845 -4096 -447 3643 4963 2685 -1483 -4577
1893 -4577 -4414 -975 3157 4914 3149 -949 -4311 -4535 -1517 2694 4873 3565 -391 -4013 -4684 -2028
1909b028M189K560q47l650l878j087K301M075K865l91l376l939j524J851L941
1924A062L217P5l125l956j925J430L806L418N09k859l942k271R85L647L589Q89
1940D549k422l896k621N55L399L735J188j894l843k995J72L068L818J657j455
1955C015l748l159l55K804L756K101j079l579l367o54K351L764K450p27l338l483
1971c248j086J942L781K825m28l050l602j468J577L660L015Q6k740l695j892J219
1987c104L524L176M95k362l696k248Q73L290L261R85k042l721k479M83L036L397
2003B868J378j683l580k814R1K668L520J773j341l460k941l62K384L524K114j034
2019C105l275l085p81K112L599K334o51k942l272j252J807L530K536j86k697l382
$$ plain form
1909 -2028 2161 4721 3874 224 -3654 -4741 -2440 1635 4500 4109 733 -3206 -4730 -2879 1062
1924 1062 4279 4354 1229 -2727 -4652 -3222 584 4002 4511 1652 -2290 -4561 -3576 71 3660 4549
1940 4549 2127 -1769 -4390 -3835 -436 3299 4487 2593 -1250 -4245 -4073 -1005 2813 4470 3015
1955 3015 -733 -3892 -4247 -1443 2313 4414 3335 -244 -3611 -4265 -1914 1850 4300 3573 235 -3248
1971 -3248 -4334 -2392 1389 4214 3786 736 -2866 -4334 -2757 903 3918 4004 1264 -2431 -4323 -3104
1987 -3104 420 3596 4091 1729 -1967 -4215 -3342 -52 3209 4194 2152 -1569 -4048 -3565 -529 2868
2003 2868 4246 2563 -1017 -3831 -3740 -1072 2448 4221 2880 -580 -3521 -3883 -1499 2025 4139 3105
2019 3105 -170 -3255 -4036 -1924 1675 4009 3358 416 -2856 -4108 -2301 1229 3765 3579 882 -2500
2035b500j580J436L422K734K46k412l570j836J164L116L032O74k145l568k109
2050c896P59K884L221J015j885l423k415L04K706L304J441j614l332k574r5K469
2066a131L411J612j169l159k843m43K222L391J923q38k943l018q68J951L306K208
2082C612m08k695l169j195J638L227K453O7k606l273j487J295L067K776K99k259
2098A342l242j780Q20K949K924O74k010l169k108N15K723L033J077j683l169k300
2114c404J32K520L112J347j328l036k526k84K341L125J625r66k903k735n87K054
2130a513L164J828o36k725k773q75J724L001K182k82k538k987j131J432K894K413
2146C178O5k319k979j437J048K850K552L76k014l010j710O98K648K805P02j759
$$ plain form
2035 -2500 -4080 -2644 778 3512 3758 1346 -2224 -4060 -2896 220 3252 3926 1781 -1787 -3896
2050 -3896 -3137 -253 2968 3983 2098 -1325 -3740 -3436 -730 2574 4015 2401 -931 -3505 -3600 -1131
2066 -1131 2280 3892 2723 -436 -3279 -3722 -1500 1891 3814 2976 33 -2985 -3853 -1902 1404 3612
2082 3612 3204 509 -2660 -3855 -2217 1010 3463 3530 924 -2349 -3836 -2541 526 3302 3601 1342
2098 1342 -1900 -3680 -2860 89 3013 3687 1677 -1492 -3600 -3085 -362 2671 3748 2065 -1104 -3404
2114 -3404 -3272 -752 2360 3707 2379 -657 -3183 -3467 -1126 1999 3624 2658 -245 -2980 -3567 -1513
2130 -1513 1651 3479 2843 118 -2655 -3530 -1806 1195 3377 3095 557 -2430 -3561 -2129 765 3178
2146 3178 3243 924 -2055 -3492 -2444 406 2958 3334 1320 -1690 -3400 -2702 -54 2751 3453 1694
2162A694k967k018L75K472K869J030j495k938k168P7K289K866J346j153k860k354
2178b935l17K119K893J617q39k633k610o13J745K970J831m66k430k720r80J503
2194a865K902K052j24k232k809j360J306K767K231K85k139k790j510Q82K596K479
2210B671N38j801k863j722N42K470K580R03j640k767j987J85K359K724J068j251
2226B009k669k247j62K129K737J437r38k541k471m43J933K772J616o10k460k654
2242b562o66J651K693J902k38k338k655j022J314K637K232j3k182k677j267R53
2258b238K605K380K96j933k666j536N85K515K540O12j729k641j862M04K368K608
2274B308Q01j250k729k080O6K229K614J118r96k579k298j02J873K653J537p70
$$ plain form
2162 1694 -1273 -3291 -2916 -444 2425 3455 1960 -978 -3146 -3069 -780 2086 3432 2279 -581 -2935
2178 -2935 -3252 -1133 1760 3377 2538 -95 -2705 -3318 -1573 1397 3228 2762 332 -2388 -3368 -1865
2194 -1865 1037 3089 2965 733 -2076 -3436 -2130 637 2868 3153 1014 -1776 -3286 -2404 192 2671
2210 2671 3209 1408 -1455 -3177 -2635 -165 2415 3318 1678 -1089 -3076 -2891 -532 2192 3260 2009
2226 2009 -660 -2907 -3069 -940 1797 3234 2296 -245 -2716 -3159 -1226 1546 3162 2552 92 -2562
2242 -2562 -3228 -1577 1116 3018 2780 442 -2213 -3235 -1921 716 2948 2935 753 -1924 -3191 -2238
2258 -2238 367 2747 3043 1110 -1556 -3092 -2507 8 2548 3160 1431 -1210 -3072 -2668 -300 2308
2274 2308 3109 1859 -870 -2950 -2884 -655 1959 3077 2081 -498 -2796 -2898 -1025 1628 3165 2395
2290B395k569k402m65J674K664J736m71k419k414p96J321K672J993j78k247k543
2306b049j043J114K627K178k7j887k606j386P98K608K275L52j772k605j629N99
2322b453K460K313O59j425k647j853L71K197K436R85j220k683j920J05J953K473
2338A751J340r79k567k200j69J733K626J519q23k323k239o04J515K664J669m88
2354B425k122k514q15J402K585J843j78k083k439j166J166K490K032J28j898k472
2370a616j390R09K378K150M50j637k608j456N04K168K338P42j369k563j773K94
2386b479K038K408J002j182k528j902K2J835K505J220r53k321k130l33J737K497
2402A436J411o09k229k235o48J495K468J657l13k069k354r05J292K369J923l7
$$ plain form
2290 2395 -174 -2576 -3041 -1367 1297 3033 2562 143 -2271 -3067 -1746 926 2919 2741 494 -2049
2306 -2049 -3092 -1978 649 2827 2800 913 -1693 -3079 -2281 327 2602 2954 1182 -1423 -3052 -2453
2322 -2453 7 2320 2979 1554 -1093 -2946 -2575 -378 2058 3043 1823 -860 -2780 -2675 -722 1751
2338 1751 3091 2112 -455 -2655 -2824 -1091 1535 3054 2231 -92 -2331 -2935 -1420 1244 2913 2425
2354 2425 303 -2211 -3026 -1624 961 2804 2626 543 -1896 -3062 -1896 594 2626 2754 856 -1616
2370 -1616 -3006 -2097 281 2431 2881 1244 -1364 -2820 -2316 -148 2190 2932 1563 -1000 -2773 -2479
2386 -2479 -441 1967 2969 1787 -741 -2643 -2621 -786 1719 2939 1986 -335 -2465 -2798 -1061 1436
2402 1436 2847 2238 9 -2226 -2874 -1379 1089 2746 2433 364 -1990 -2895 -1603 766 2689 2652
2418B652j971k484j118R81K394K058K22j713k467j388P07K235K186N30j513k515
2434a204j552L94K065K426O88j228k425j808J04J986K374J062j002k353k028j90
2450b691J793K422J326p73k269k195l95J563K483J518n02k108k287p40J329K412
2466H86J798k13j950k358j028J006K425J918J77j824k449j275Q88K253K071M62
2482B787j600k517j473O03K094K239P60j451k393j741K01K013K355R99j231k239
2498e94j970J0J789K421J225r18k285k006l52J642K452J354o30k096k187o50J376
2515a419K519J663l68j996k297r69J250K363J746J19j858k466j128R59K256K003
2531B377L49j793k374j341O40K200K189N87j550k430j513K80K047K376P58j240
$$ plain form
2418 2652 681 -1803 -2921 -1940 454 2512 2734 1021 -1446 -2834 -2127 108 2294 2824 1311 -1204
2434 -1204 -2756 -2362 -297 2129 2817 1589 -836 -2644 -2540 -554 1820 2882 1880 -473 -2501 -2691
2450 -2691 -898 1524 2850 2077 -192 -2387 -2782 -1219 1264 2782 2280 172 -2115 -2855 -1526 886
2466 886 2684 2471 521 -1837 -2865 -1859 566 2484 2661 837 -1612 -2887 -1999 254 2325 2787
2482 2787 1187 -1330 -2803 -2200 -106 2133 2893 1442 -951 -2692 -2491 -478 1877 2876 1645 -594
2498 -594 -2564 -2554 -765 1656 2881 1963 -322 -2328 -2680 -1038 1414 2768 2138 42 -2145 -2795 -1419
2515 -1419 1100 2763 2395 399 -1898 -2867 -1617 746 2492 2611 753 -1713 -2841 -1882 374 2377
2531 2377 2726 933 -1441 -2782 -2142 58 2247 2834 1284 -1146 -2659 -2379 -332 2044 2802 1562
2547A562k372j765L0J906K440R49r50k256j918l12J767K409J309p28k218k109
2563b256m65J529K362J498l83k079k290o59J247K349J769j37k021k267r36R32
2579a807K328J985J43j864k305j226O99K261K075M35j585k425j363M17K151K195
2595B114N95j306k308j748J85K021K313Q51j003k248j941l8J759K290J225q02
2611A959k179k084l31J572K310J510n18k226k160n43J270K365J685k84k050k174
2627a878r15J132K282J955r1j794k291j156P66K333K014K81j623k345j396N08
2643b218K261K099N71j389k342j691L22K095K258Q00j134k346j865J13J896K229
2659A659J153q91k317j933k57J607K374J353o31k221k103n36J414K479J551l99
$$ plain form
2547 1562 -810 -2575 -2545 -639 1801 2750 1800 -456 -2374 -2686 -919 1490 2799 2071 -147 -2256
2563 -2256 -2721 -1192 1170 2668 2285 206 -2084 -2743 -1496 853 2622 2485 464 -1803 -2739 -1807
2579 -1807 521 2506 2649 785 -1520 -2746 -2047 214 2289 2724 1139 -1286 -2649 -2232 -81 2114
2595 2114 2709 1403 -905 -2653 -2468 -447 1866 2717 1714 -534 -2475 -2513 -754 1536 2761 1959
2611 1959 -220 -2304 -2635 -1063 1247 2757 2239 13 -2147 -2690 -1420 945 2630 2346 296 -1878
2627 -1878 -2793 -1661 621 2576 2485 691 -1600 -2756 -1990 343 2357 2638 1015 -1330 -2726 -2218
2643 -2218 43 2142 2713 1324 -1018 -2709 -2387 -292 1966 2766 1632 -714 -2579 -2466 -570 1659
2659 1659 2812 1921 -396 -2329 -2586 -979 1395 2748 2117 -104 -2207 -2743 -1329 1150 2701 2302
2675B302k069k239p91J216K357J883j79j881k388j042J015K270J958K35j717k421
2691a491j286O85K238K064N41j569k358j584M54K108K262P78j326k424j746J77
2707b477J979K349J010j048k392j932j13J850K312J297p99k228k145l72J597K410
2723A298J478n36k211k154o98J333K475J710k09k037k342r56J111K433J879N7
2739B631j858k398j226R01K364K011K84j602k496j429N83K259K231N51j427k435
2755a056j687L68K145K203R08j201k443j863NJ960K333J187q92k446k002j88J767
2772i02K502J310q09k240k160n51J569K417J662n29k062k306p04J257K489J729
2788B672k08j921k374j045J087K387J977P4j807k383j366Q44K329K079M10j604
$$ plain form
2675 2302 233 -2006 -2797 -1581 776 2659 2480 599 -1789 -2831 -1816 454 2412 2647 930 -1491
2691 -1491 -2777 -2092 146 2210 2751 1182 -1176 -2760 -2306 -198 2064 2842 1516 -908 -2654 -2477
2707 -2477 -498 1851 2861 1813 -579 -2511 -2624 -774 1538 2835 2036 -192 -2337 -2709 -1112 1298
2723 1298 2776 2240 29 -2125 -2823 -1490 985 2695 2486 449 -1893 -2849 -1738 695 2574 2631
2739 2631 773 -1625 -2851 -1950 414 2425 2709 1107 -1389 -2818 -2235 24 2255 2806 1379 -1056
2755 -1056 -2743 -2375 -230 1973 2881 1680 -763 -2626 -2621 -661 1672 2859 1967 -479 -2481 -2669 -902
2772 -902 1600 2910 2101 -139 -2299 -2850 -1281 1136 2798 2269 207 -2099 -2803 -1546 943 2672
2788 2672 2464 543 -1831 -2876 -1789 598 2575 2649 842 -1541 -2907 -2063 266 2345 2755 1151
2804A151k487j465N29K186K226P48j442k452j702K63K071K272J001j238k380j809
2820b528o3J832K448J203r56k327j990l79J689K536J378o94k190k260n47J550
2836a298K490J640n31k001k344q52J306K442J754oj949k412j126J043K357K030
2852B543K36j801k540j311P51K286K148N18j630k469j487L71K195K302P99j401
2868A510k442j705O1K023K456J039j140k385k021j46J880K526J207p80k300k222
2884b439m06J716K512J419m48k306k312o35J461K448J719k41k098k376q55J148
2900a693K363J975K1j961k435j126R21K337K052K69j726k413j416N98K262K299
2916B327N44j558k481j568L11K187K319P64j232k465j877J97K063K285J057r96
$$ plain form
2804 1151 -1336 -2801 -2272 -86 2140 2888 1446 -1006 -2708 -2445 -374 1898 2899 1661 -719 -2528
2820 -2528 -2591 -759 1689 2892 1936 -391 -2381 -2760 -1071 1465 2843 2149 -41 -2301 -2848 -1298
2836 -1298 1192 2832 2301 300 -2044 -2896 -1590 852 2606 2600 651 -1761 -2887 -1844 513 2543
2852 2543 2779 978 -1562 -2873 -2122 164 2312 2830 1200 -1269 -2756 -2385 -190 2112 2911 1510
2868 1510 -932 -2637 -2576 -553 1903 2942 1802 -583 -2604 -2750 -870 1656 2863 2083 -217 -2439
2884 -2439 -2845 -1129 1383 2802 2354 48 -2264 -2899 -1438 1010 2729 2488 390 -1986 -2841 -1693
2900 -1693 670 2645 2666 705 -1730 -2856 -1935 402 2454 2723 997 -1416 -2832 -2234 28 2327
2916 2327 2871 1313 -1168 -2736 -2425 -238 2081 2845 1613 -852 -2729 -2532 -469 1816 2873 1877
2932A877k410k047j02J856K363J337p33k367k142m27J572K516J552n14k206k245
2948b120o99J331K525J680k16k086k335q46J016K442J943k3j878k429j191R01
2964a985K352K039K47j636k420j417O85K186K212N37j458k469j627M28K089K296
2980B059P45j215k451j793J75J952K321J062j017k383j922j69J756K473J216p87
2996B022k234k114l44J555K427J455n42k162k214o01J347K396J724l16k059k291
3012a951q38J061K433J887q9j852k335j115R25K252K039L14j750k387j401O51
3028b156K258K191M37j468k348j621M12K064K271P44j239k383j833K52J899K247
3044A727J092j037k321j995l3J749K373J214p76k293k066l28J583K450J409n37
$$ plain form
2932 1877 -533 -2580 -2682 -826 1537 2874 2141 -226 -2368 -2795 -1223 1293 2845 2331 125 -2120
2948 -2120 -2819 -1488 1037 2717 2501 415 -1920 -2766 -1750 692 2635 2612 734 -1695 -2886 -1985
2964 -1985 367 2406 2653 1017 -1403 -2820 -2135 51 2263 2800 1342 -1127 -2754 -2326 -237 2059
2980 2059 2804 1589 -862 -2655 -2480 -528 1793 2855 1838 -545 -2467 -2636 -880 1593 2809 2022
2996 2022 -212 -2326 -2670 -1115 1312 2767 2225 63 -2151 -2752 -1405 991 2715 2399 340 -1951
3012 -1951 -2789 -1728 705 2592 2503 651 -1684 -2799 -1874 378 2417 2731 981 -1406 -2807 -2156
3028 -2156 102 2293 2730 1262 -1086 -2707 -2295 -231 2040 2784 1545 -838 -2671 -2419 -520 1727
3044 1727 2819 1782 -539 -2534 -2567 -818 1555 2769 1993 -300 -2366 -2694 -1111 1339 2748 2211
3060B211k174k140o67J352K433J703l95k045k171r33J158K421J864j09j889k316
3076a697j163R64K344J970J91j632k426j433Q07K175K124M89j487k420j561N16
3092b239K073K194Q09j337k432j668K11J908K288J071j139k355j910k4J730K425
3108A605J260r55k195j959m23J485K556J392n70k197k115p17J447K482J580m11
3124B265j903k290r27J229K342J786Q4j915k460j038R53K351J909L64j784k450
3140a484j364Q03K149K145N56j582k457j465M26K026K335P10j354k383j605N9
3156b485J999K373R22j115k280j971n0J831K423J101p64k269k071l43J671K415
3172A387J399n93k138k258n32J495K297J600k66k104k246q05J179K372J769o0
$$ plain form
3060 2211 37 -2103 -2770 -1418 1015 2718 2323 278 -1893 -2826 -1668 753 2617 2508 619 -1697
3076 -1697 -2860 -1896 448 2418 2609 977 -1449 -2882 -2075 100 2224 2713 1226 -1194 -2755 -2239
3092 -2239 -166 2028 2837 1500 -932 -2600 -2389 -481 1807 2878 1739 -616 -2526 -2550 -820 1605
3108 1605 2865 1910 -285 -2244 -2667 -1182 1374 2766 2196 -1 -2116 -2833 -1386 1096 2676 2265
3124 2265 362 -1928 -2855 -1626 716 2502 2586 671 -1789 -2827 -1874 477 2386 2750 966 -1484
3140 -1484 -2848 -2045 104 2249 2805 1223 -1234 -2699 -2273 -247 2088 2798 1444 -939 -2544 -2485
3156 -2485 -486 1887 2809 1694 -586 -2557 -2607 -776 1647 2748 1984 -285 -2356 -2699 -1028 1387
3172 1387 2786 2193 55 -2203 -2735 -1240 1057 2657 2391 287 -1959 -2764 -1585 787 2556 2496
3188B496j950k359r82J014K234K006J56j799k249j305P23K222K106L67j565k274
3204a159j573M38K175K243O17j370k346j648K43K043K168Q93j073k304j886J6
3220b523J852K285J116q44k252k000j45J538K343J388p13k140k108n01J436K392
3236A124J566m21k092k140p26J181K402J630j14j890k329r57J117K201J850Q3
3252B485j711k282j179P65K185K004L21j525k368j379N73K059K105N75j317k340
3268a029j585L05K039K106Q40j166k267j687K0J794K276J029q82k252j920j61
3284b540J697K260J217o59k118k066l80J455K305J455m90k047k049o72J268K258
3300H94J606k00j877k156r40J037K256J741R5j753k234j099P71K180J910K86j531
$$ plain form
3188 2496 546 -1813 -2795 -1781 453 2459 2615 816 -1433 -2738 -2015 207 2313 2680 1115 -1159
3204 -1159 -2732 -2294 -119 2124 2741 1371 -975 -2623 -2380 -337 1831 2724 1651 -653 -2539 -2523
3220 -2523 -671 1614 2730 1886 -366 -2366 -2511 -973 1370 2758 2045 -95 -2203 -2704 -1268 1124
3236 1124 2690 2269 177 -1963 -2689 -1508 894 2524 2410 520 -1809 -2766 -1649 552 2402 2485
3252 2485 774 -1508 -2687 -1922 263 2267 2588 1063 -1305 -2684 -2111 -52 2053 2628 1311 -1029
3268 -1029 -2614 -2309 -270 1836 2676 1510 -757 -2444 -2424 -630 1646 2675 1793 -459 -2379 -2540
3284 -2540 -843 1417 2634 1975 -143 -2209 -2589 -1134 1171 2626 2136 89 -1960 -2632 -1364 894
3300 894 2500 2300 423 -1733 -2673 -1636 620 2361 2456 703 -1531 -2630 -1859 321 2231 2517 986
3317I86k241j393N95K143J945N30j263k340j542L79J956K112P22j085k273j679
3333b448J57J786K126R93q70k258j800j33J648K195J233p65k072j925l44J360
3349a117K277J436n17j988j990p07J221K360J531k96j818k152q24J042K211J727
3365B396j17j603k242j123R46K138J744L14j490k253j306O95J994J913N56j350
3381A212k350j370L74J915K135O72j188k266j525J66J703K184R21r82k158j660
3397b217j71J612K301R88p11j979j949l85J499K239J281n71j897k013n69J348
3413a194K149J467k60j842k132o93J030K154J597K5j714k192r03Q14K059J810
3429B175K31j581k144j197O20J976J951M15j430k033j433L68J902K002O29j140
$$ plain form
3317 986 -1255 -2648 -2053 90 2035 2565 1302 -1038 -2580 -2201 -245 1867 2589 1504 -769 -2448
3333 -2448 -2291 -505 1621 2614 1744 -514 -2314 -2447 -799 1396 2629 1864 -208 -2133 -2477 -1117
3349 -1117 1160 2596 2079 91 -1899 -2606 -1385 975 2506 2210 392 -1760 -2584 -1542 669 2396
3365 2396 2279 676 -1566 -2689 -1743 395 2139 2453 963 -1290 -2596 -1901 93 2006 2562 1212
3381 1212 -1138 -2508 -2134 -219 1916 2588 1400 -866 -2391 -2225 -522 1662 2583 1601 -557 -2217
3397 -2217 -2388 -776 1525 2513 1802 -177 -2126 -2511 -1012 1227 2508 1937 40 -1973 -2542 -1194
3413 -1194 955 2422 2162 320 -1812 -2505 -1475 679 2276 2301 587 -1605 -2508 -1694 365 2175
3429 2175 2406 825 -1319 -2516 -1896 80 2031 2446 1016 -1017 -2450 -2082 -180 1822 2451 1311
3445A311k092j554J15J756K081R27r45k102j736q1J667K055J048o76j996j894
3461b116k56J420K121J197m08j933j996m73J248K109J439k97j784k034o88R83
3477a468K089J655m5j732k081r05P80K059J827J52j550k095j078N79J968J787
3493A942M43j342k119j290L59J909J930N77j154k035j507J39J729K066P82r31
3509A498j986j714j7J559K004J083p45k000j754k79J388K082J301m89j840j951
3525a860n28J221K085J332k05j826j920o78R96K046J534q2j598k060q09P85J975
3542D08J668J92j505j983j133O51J851J769N06j413k060j254L81J786J867O93
3558B424j111k071j483J77J653J942Q42r16j965j633m8J541J992J039p02j938
$$ plain form
3445 1311 -781 -2335 -2220 -464 1617 2544 1599 -503 -2239 -2320 -653 1402 2450 1774 -222 -2116
3461 -2116 -2372 -952 1169 2366 1958 25 -1971 -2444 -1196 913 2352 2055 271 -1763 -2451 -1468
3477 -1468 621 2276 2231 499 -1582 -2487 -1707 352 2179 2331 781 -1314 -2392 -1813 155 1942
3493 1942 2385 1043 -1076 -2366 -2007 -98 1832 2409 1255 -780 -2287 -2148 -419 1647 2429 1498
3509 1498 -488 -2202 -2219 -660 1344 2427 1682 -318 -2072 -2351 -963 1119 2420 1931 91 -1860
3525 -1860 -2388 -1167 918 2250 2045 219 -1701 -2379 -1383 663 2197 2115 517 -1543 -2352 -1567 408
3542 408 2076 2268 763 -1220 -2353 -1702 149 1918 2424 1011 -1049 -2303 -1922 -136 1731 2424
3558 2424 1313 -758 -2241 -2064 -411 1531 2373 1457 -508 -2141 -2189 -648 1344 2383 1681 -257
3574b57j754k61J375J952J253n29j795j817m50J154K002J345j59j814j948o25
3590b328R96J990J513q0j537j940r37P96J942J647J29j402j957j191O30J878J710
3607A859M01j269j998j274M08J794J791N64j080j944j457K01J667J816Q33r43
3623A369j960j481j9J434J974R81p29j970j569j90J242K028J239o15j842j641
3639a749n02J125K040J295l76j606j802p02J028J991J371j62j470j970p58Q58
3655a389J847J512J06j411j944j010P32J781J603L60j249k008j150N63J577J824
3671A744M91j137j906j325K45J564J919O30r49j930j371j4J485J974R03q88j811
3688c76j513k10J374J905J055o41j682j705m18J325J872J144m32j635j726n92
$$ plain form
3574 -257 -2011 -2272 -897 1055 2308 1779 -16 -1833 -2283 -1129 873 2218 2059 245 -1703 -2328
3590 -2328 -1332 658 2171 2091 554 -1386 -2323 -1527 415 2062 2191 789 -1168 -2359 -1729 149 1859
3607 1859 2260 991 -1007 -2281 -1873 -79 1712 2276 1196 -748 -2205 -2004 -337 1479 2312 1369
3623 1369 -591 -2072 -2091 -657 1317 2298 1569 -401 -1970 -2160 -918 1110 2349 1734 -108 -1749
3639 -1749 -2251 -1126 914 2209 1833 227 -1575 -2277 -1249 742 2113 1951 481 -1489 -2247 -1389
3655 -1389 458 1970 2076 665 -1279 -2289 -1557 224 1827 2187 938 -1070 -2220 -1657 -80 1744
3671 1744 2235 1098 -808 -2133 -1888 -324 1595 2225 1276 -654 -2025 -2039 -554 1420 2323 1435 -376
3688 -376 -1889 -2099 -725 1180 2235 1594 -88 -1793 -2211 -886 986 2130 1698 63 -1663 -2255
3704b255J124J879J295j32j564j891o74R46J722J498Q2j460j881q53O75J716J734
3721A961J17j340j880r65M48J725J738L02j132j866j216K59J684J797N20r59j862
3738f69j368J00J536J828P66q41j794j503o3J390J850R75o68j736j603k21J222
3755g99J835J033l13j783j648m56J075J841J313k80j603j738o43Q40J919J358
3771A951o4j415j765q22O98J754J516J44j359j762r99N29J719J604L10j122j827
3788i10j109L36J596J664N04r61j802j284J30J501J713P56p94j881j341p6J395
3805e63J786Q92o97j680j491k83J278J785J097n03j665j593m22J126J819J114
3821B000k77j561j687n28R07J767J266o1j465j694p31P82J730J332J17j304j787
$$ plain form
3704 -2255 -1131 748 2043 1911 347 -1544 -2218 -1272 450 1948 2030 570 -1311 -2164 -1489 227 1961
3721 1961 2078 738 -1142 -2107 -1659 66 1804 2106 974 -892 -2108 -1849 -165 1632 2152 1193 -669
3738 -669 -2037 -1937 -401 1427 2193 1352 -442 -1945 -2008 -618 1232 2207 1539 -197 -1800 -2021 -799
3755 -799 1036 2069 1756 -27 -1675 -2131 -1056 785 2098 1818 215 -1523 -2166 -1326 593 1951
3771 1951 1887 472 -1293 -2115 -1417 337 1853 1997 638 -1124 -2123 -1594 125 1729 2039 917 -910
3788 -910 -2019 -1683 -87 1577 2081 1120 -682 -1966 -1836 -335 1378 2134 1340 -541 -1882 -1958 -563
3805 -563 1223 2115 1418 -262 -1753 -2036 -758 1027 2124 1621 -44 -1637 -2059 -933 886 2000
3821 2000 1723 162 -1525 -2053 -1146 621 1887 1826 361 -1333 -2064 -1282 448 1780 1897 593 -1194
3838a194q54O07J636J521K43j203j717j068M35J574J585L92r77j724j203K65J472
3855b10J651N80q39j761j255O1J395J618P86p09j742j347j22J310J624R37n28
3872A449j616j428l16J088J701J051l36j544j505n04R28J755J089j59j311j673
3888a331o65Q04J714J172Q2j325j601q52O20J685J366J71j141j680j026O51J461
3905A05J428L44j034j726r43L46J348J511N44r31j640j084J13J317J548O75q01
3922A120j590j178m3J182J655P31o30j456j351k13J088J683Q03m58j355j412m58
3939a882J028J572J046l21j274j517n47R49J487J160q4j237j634o16P75J472J214
3956A591R2j161j554p35M77J410J410K84j123j514r31L21J357J525L45r51j519
$$ plain form
3838 -1194 -2048 -1441 195 1716 1959 756 -961 -2029 -1594 -20 1565 1957 980 -744 -1947 -1682 -210
3855 -210 1441 2021 1182 -579 -1834 -1773 -378 1240 2026 1317 -425 -1772 -1894 -584 1040 1977 1449
3872 1449 -167 -1595 -1911 -823 878 1929 1593 49 -1456 -1960 -1032 723 1812 1653 342 -1331
3888 -1331 -1996 -1192 522 1694 1776 451 -1150 -2002 -1382 303 1669 1840 699 -981 -2007 -1356 105
3905 105 1533 1877 843 -883 -1826 -1480 -132 1379 1923 992 -648 -1732 -1619 -302 1246 1921 1120
3922 1120 -470 -1648 -1691 -509 1146 1877 1247 -209 -1560 -1773 -685 998 1801 1343 -12 -1424 -1882
3939 -1882 -854 718 1764 1443 169 -1348 -1895 -946 541 1701 1617 380 -1254 -1870 -1095 377 1591
3956 1591 1683 522 -1032 -1767 -1290 120 1530 1814 691 -823 -1754 -1433 -76 1449 1794 843 -676
3973f76j008J34J388J479M75q64j385j178l7J304J506O48n92j465j304p6J105
3990e46J521P56m09j432j354k55J014J496R03k86j364j468k97Q48J433J171j77
4007A554j321j454n30O91J509J170k8j191j428p35N49J437J311R0j062j420q85
4024a743M69J359J325K49q18j542r44K35J315J374M33p81j535j004J60J225J387
4041A164N98o49j490j140n6J071J417Q27m90j487j250j91J032J431R17l68j323
4058A3j337l30Q32J444J004k31j187j362n55P50J514J017p1j111j429o10N68J386
4076C05J128J43j028j486p03L98J359J256K03r09j420r08L15J383J131M93p99
4093H61j436r67J67J168J369N24p09j411j067rJ134J330O86n31j281j181k29J040
$$ plain form
3973 -676 -1684 -1550 -162 1317 1792 928 -457 -1635 -1672 -368 1138 1786 1194 -271 -1575 -1651 -546
3990 -546 975 1731 1322 -110 -1464 -1719 -705 791 1694 1408 44 -1424 -1721 -873 560 1731 1554
4007 1554 233 -1221 -1751 -1060 449 1619 1591 400 -1028 -1763 -1214 223 1534 1624 562 -858 -1743
4024 -1743 -1274 85 1410 1659 841 -701 -1645 -1410 -95 1279 1712 931 -604 -1608 -1448 -223 1164
4041 1164 1762 1113 -377 -1517 -1573 -502 915 1742 1252 -235 -1485 -1676 -644 787 1704 1336 13
4058 13 -1324 -1654 -822 622 1626 1395 208 -1154 -1709 -959 555 1572 1501 390 -1039 -1649 -1081 305
4076 305 1433 1576 548 -938 -1641 -1243 116 1372 1575 666 -754 -1662 -1347 36 1167 1660 861
4093 861 -575 -1542 -1375 -207 1162 1686 977 -434 -1501 -1510 -376 954 1640 1109 -172 -1353 -1582 -542
4111e42J365P98m16j308j205k56P92J441Q87k76j141j320l62O39J359J033j00
4128A388j074j351n59N38J382J143J0j001j357p26M39J300J139J51q28j366p68
4145a540L58J183J139M36q00j347r17K10J045J299M67o03j363j006O0R87J285
4162H93O78n09j336j009j18R05J249P92m62j149j129k89Q30J330Q14k57j139j186
4180a092l80O46J346Q79j05j012j273m99N83J196R54J77r90j263o53N03J169J023
4198A209J92q64j222p78L46J106J149L28q00j200q40J27R99J301M08o90j168r60
4216a357R2R03J300M78n09j160j004j00Q69J310N83l99j091j038k32P59J244P19
4234A367k51j048j162l23O67J199Q69o7j070j180l35N10J123R63N7r58j175n51
$$ plain form
4111 -542 823 1621 1205 -103 -1308 -1564 -772 669 1556 1280 139 -1181 -1543 -904 455 1488 1388
4128 1388 314 -1037 -1596 -1058 324 1467 1477 476 -881 -1607 -1168 132 1271 1422 594 -772 -1540
4145 -1540 -1182 1 1140 1576 776 -571 -1488 -1278 -233 1066 1533 930 -433 -1439 -1379 -392 893
4162 893 1571 1062 -274 -1283 -1401 -496 753 1545 1083 -66 -1195 -1484 -654 676 1490 1233 94 -1092
4180 -1092 -1472 -826 520 1399 1294 282 -991 -1490 -907 289 1243 1420 430 -833 -1486 -983 186 1209
4198 1209 1401 537 -685 -1463 -1117 -11 1138 1466 666 -534 -1374 -1247 -248 1053 1461 771 -397 -1357
4216 -1357 -1265 -362 938 1416 907 -253 -1257 -1357 -488 822 1405 1006 -85 -1123 -1355 -596 648 1367
4234 1367 1116 68 -1094 -1417 -750 449 1318 1251 181 -999 -1334 -824 299 1262 1319 361 -814 -1365
4252a365M30J115J038J41r16j110o75K64J087J133K08p41j197p07J84J003J123
4269A015L36o15j183q59P6R71J106M96m44j149r52o2R13J057O25l07j172r64k05
4288a317P93J112P48k56j071j033k57O11J180P86j63r60j121l91N78J105Q81q1
4306A144q35j150m57M00J139R04O6p89j136o77L99J047R92K35o69j149p15J70
4324a081J037R77L66n99j164p28J11Q94J107L35m91j029q17q5Q32J059N26l49
4342I01j001j038m3P00J129O17k83r87j034k00O39J090P07j54q96j089k81N52
4360f71R97Q54q5q12j075m76M33J016Q96J18q24j040n72L43R45J008J33o80j057
4379e49o36K44Q65J020K92o18j016p59J37Q59R86L92m44j005q69rP71R96N65l53
$$ plain form
4252 -1365 -935 180 1218 1359 443 -667 -1342 -1078 9 1142 1350 609 -588 -1295 -1111 -108 1015
4269 1015 1351 736 -447 -1306 -1230 -259 847 1343 899 -250 -1202 -1264 -351 706 1331 1024 -148 -1112 -1317
4288 -1317 -524 588 1336 1080 9 -1024 -1281 -670 510 1296 1133 173 -948 -1339 -761 344 1225 1144
4306 1144 309 -841 -1298 -898 241 1145 1211 422 -714 -1391 -992 55 1047 1282 613 -536 -1251 -1081
4324 -1081 -44 933 1299 700 -464 -1192 -1081 -187 920 1255 764 -265 -1082 -1167 -335 724 1250 901
4342 901 -100 -1138 -1181 -481 648 1265 982 -5 -1039 -1239 -600 490 1197 1043 147 -942 -1223 -671
4360 -671 326 1180 1095 283 -792 -1268 -835 181 1077 1195 371 -669 -1241 -898 47 1055 1188 508 -549
4379 -549 -1185 -941 -76 944 1236 618 -398 -1157 -1020 -161 825 1217 773 -232 -1101 -1110 -339 657 1222 869
4399H69r96r28p3O82J027N99k24r84q69k97O43J048O81k29p78j005l44M97J035
4418C54P24o5p24j065l89L67R97Q38N2p53r50o06L48J006P63K63o73j008o14J90
4438i45R10Q58L39n43j048o29J60O61R86M23m60j029p47L8P41R92M29l80q96p98
4458i38j29P04R24N26k37q77q25k75O29R22O39j58p90r85k17M67R96O89n8p88
4478B19r25m17M27Q91P74L9o97j007m11L04Q56Q84J44p10q82n30K10Q25Q98K06
4498A098n60r88n70J04P48R86L20n15r06o68qP19R33L91m28q00q22o4P04R27L88
4519I89k76p35q78j11O43Q47N97k71p63q25k75N80Q39O39o9q13q81k68M46P96
4539B11P41l9o30r17l93L31Q51P86O0o91q12n01K11Q57P74J50o01q70n28J36Q42
$$ plain form
4399 869 -127 -1055 -1128 -446 581 1180 956 -28 -897 -1194 -551 497 1178 949 171 -834 -1178 -681 354
4418 354 1078 1013 289 -776 -1165 -798 199 1037 1089 336 -614 -1220 -872 134 897 1160 487 -521 -1135 -945
4438 -945 -35 823 1162 619 -429 -1058 -898 -237 749 1172 712 -317 -1064 -1026 -285 707 1136 756 -140 -938
4458 -938 -1067 -363 561 1087 850 -27 -852 -1127 -498 424 1063 905 115 -870 -1087 -620 376 1065 1007 219
4478 219 -706 -1123 -696 195 969 1008 311 -696 -1107 -803 53 937 1081 371 -511 -1041 -831 -6 892 1098
4498 1098 538 -450 -1020 -916 -168 818 1138 623 -283 -951 -959 -240 693 1084 656 -144 -966 -1030 -326 601 989
4519 989 713 -22 -900 -1011 -368 479 1076 805 42 -783 -1058 -478 361 1000 931 118 -763 -1031 -585 211
4539 211 952 913 283 -634 -1027 -696 155 941 1001 310 -502 -1003 -792 65 839 989 388 -482 -1010 -874 -32
4560c2P97K67n51p91o29R5P31P77K78l13q70p24M3P00Q29L88k94q50o74j18O17
4581c24Q67M54k52p98p26j81N34Q47N31k02p07p18k77M19Q93N53m0p54p38l61
4601i80L92Q43O06J3o33p59m56L25P30P35P8n83q05n01K64P58P64J51n63p47n65
4622i33K32O16P86K23l77q22o16M5O76Q42K41l83p11n97j1N65P81L67l12p22o74
4643g84j08N52Q22L92j54p75o46j64M26P64N10q9o59p08k31L69P48O13q9n90p32
4664e33l50M15P19N53J1n60p85k95K73O17O51P5m31p79m77K66O85O26J72m80p88
4685d15l63Q1O15P08K29l85p52m85N1N47P48K24k69p11n26K4M65O92L29k75o22
4706i0n54j57N66O38L81j57o06o57j73M37P57L71p5o29o06k06M02O51M96j08n53
$$ plain form
4560 -32 765 1032 481 -310 -939 -844 -113 664 942 629 -241 -965 -922 -222 607 995 701 -149 -823 -941 -324
4581 -324 543 997 745 -53 -779 -960 -426 421 952 750 43 -675 -952 -533 360 913 873 119 -619 -980
4601 -980 -588 255 861 874 241 -518 -974 -649 81 816 894 311 -494 -995 -731 27 791 942 379 -368 -933
4622 -933 -701 -85 701 924 547 -275 -891 -846 -170 672 913 530 -181 -778 -789 -224 557 924 612 -110 -784
4643 -784 -892 -340 482 874 720 -55 -701 -865 -439 325 835 746 87 -621 -852 -483 265 878 789 199 -533
4664 -533 -883 -468 251 804 815 255 -530 -825 -552 65 716 791 360 -419 -896 -630 55 681 853 373 -415
4685 -415 -778 -697 -82 626 855 470 -282 -767 -716 -169 579 803 534 -177 -703 -679 -214 478 807 532 -90
4706 -90 -644 -801 -235 403 784 627 21 -636 -809 -372 385 756 681 52 -554 -760 -358 293 789 681 128
4727A28o38k95L74O45M90O3o15o00l29K59O23O00L5m74o45l92J94O17O12L8l48
4748C42o85l60J27N28O43J78m64n52m55R1N69O03J73l04o32m40nM79O18K93l30
4769D17n45m95l1M34O19L09j69n62n68p7L99N89L74j72m97n56r3K93N97L77m6
4790E97n41n60j75L30O11M39j09m52o28j56K11O41M53o8l99n31l70K79M90N11
4810E73N8l61n79l45J56N80M56P3l28n51l78J24N53M38K16k98n73m39Q1M97N04
4831D57K03l39n17l62k8M78N14K67k67n96l41r5M93N00K75k05n26m36l7K87O06
4852C31K57j21m77n08j00L50N22L65j59m30n07j65L69M84L91r5m32n19j83K79
4872c48M94M53m6m36n16j66J54N13M18R9m20n26k85J84M49M64R7l98m44l35J81
$$ plain form
4727 128 -510 -805 -431 214 704 767 152 -448 -777 -518 105 705 740 266 -379 -771 -577 40 652 690 342
4748 342 -343 -703 -576 -48 595 773 309 -243 -698 -607 -38 565 738 434 -198 -638 -643 -164 454 747 417
4769 417 -128 -623 -654 -220 399 708 539 -23 -591 -668 -269 320 694 522 25 -531 -624 -331 266 643 597
4790 597 56 -504 -679 -349 262 701 592 140 -488 -644 -433 208 661 593 194 -337 -707 -428 62 573
4810 573 631 270 -309 -654 -498 82 538 611 283 -268 -646 -522 31 469 685 387 -186 -625 -544 -47 457
4831 457 660 321 -196 -558 -586 -108 406 673 406 -190 -531 -626 -133 367 642 437 -89 -525 -562 -275 331
4852 331 588 467 -10 -518 -618 -268 254 619 460 30 -477 -642 -273 211 602 507 75 -444 -627 -348
4872 -348 146 599 553 117 -399 -565 -411 102 520 619 199 -327 -612 -428 21 485 582 184 -260 -595 -414
4893d14M41M47J28l29n59l03O5M83M51J89k69n32l59P0M06M39K21j88n09m20l9
4914e81M49M53K85j72n28m66pL35N15L03j03n24l94j95L84M69L22q2m38m58j57
4935e90L18M53L74o1l93m77k28K86M54L86k8k89n30k54J49N25M40pl54m73k58
4956e57J50M40M14J13l39m92l36J86L89M84J07l02m71l23P4L59N40J34k18n18
4976a66l60K3L69M58K52j34n34m30LL69M92J91j15m98m20k1L05M62L19q4n04l99
4998d22j33K47N20L62p9m38m34k07K44N33L75l0l53n45k47K45M83L77J4l85m81
5019c54k12J51M95M09K1l01m46l49J39M87L75J75l36m63l62J26M00M34K36k88
5039C37n46l20O9L37N23J86k91m28l73j9L41N51K14j98m51m14l0K99N30K93j83
$$ plain form
4893 -414 27 474 602 273 -286 -589 -524 -41 410 599 330 -202 -561 -491 -85 354 575 387 -122 -542 -581
4914 -581 -132 321 606 434 -94 -560 -567 -232 283 586 483 -41 -435 -630 -246 223 545 463 25 -433 -590
4935 -590 -272 181 555 494 101 -376 -604 -318 136 522 494 205 -325 -579 -430 95 535 528 174 -299 -557
4956 -557 -407 33 447 560 221 -271 -607 -421 -32 452 559 257 -214 -537 -463 -104 436 570 352 -166
4976 -166 -526 -503 -134 324 576 442 -92 -522 -519 -150 342 533 418 -80 -500 -521 -216 246 565 481 -23 -422
4998 -422 -555 -308 212 574 495 57 -377 -584 -340 193 568 538 185 -360 -607 -362 121 498 512 127 -354
5019 -354 -566 -415 80 489 510 209 -237 -586 -447 40 415 590 254 -209 -571 -445 -45 389 625 337
5039 337 -209 -529 -460 -123 400 586 295 -133 -506 -525 -184 367 581 383 -68 -482 -512 -213 317 610 427
5060D27m51m38r5L28M63L34p9m36m64j91L72M38K82L3m40m52k08K50M39M17K4
5081E53l57n38k30J74M87L78J22l67n42k10R5M57M94K0k51m82l67J48L48N07J38
5102E77k92m62m06J35L88N09Q6k18m42l68l9M14M47K52k02m79m08J3K94N23L23
5123F45j89m94m97pK72N05L08j06m35m39j27K61N12L08n1l90m75j26K09M49L82
5144E15k6m10m10k88K15M97M10N2l04n80k67J93M37M09J50l35n16l24J14M50M06
5165C88J45j97n79l46P3M44M68J92k37n92l03M4M29M23K51k06n24l72k4L74N08
5186C59K20j95m24m38j14L39N67K79r2m43m77j70K84M98L49j9m27n14k04K94M35
5207A07M19j2l72m93k64K17N02M17N6l78m89l32J83M47M78Q6l04n31l26J36M60
$$ plain form
5060 427 -24 -462 -557 -229 234 568 489 53 -411 -602 -230 208 490 523 83 -369 -577 -327 112 529 553
5081 553 196 -342 -572 -398 89 467 589 222 -320 -530 -435 22 516 536 285 -197 -564 -416 -68 439 577
5102 577 285 -177 -583 -448 -60 449 535 317 -125 -493 -532 -118 329 581 379 -100 -508 -495 -201 322 645
5123 645 456 -38 -535 -542 -270 235 543 437 2 -437 -564 -303 209 517 466 76 -399 -525 -316 133 515
5144 515 489 79 -331 -619 -404 93 503 555 251 -329 -596 -403 34 443 593 258 -258 -582 -468 -18 388
5165 388 533 336 -243 -589 -516 -72 396 588 351 -241 -544 -500 -71 352 603 397 -127 -499 -523 -149 359
5186 359 579 384 -40 -478 -592 -253 314 593 501 58 -419 -589 -305 193 542 523 96 -418 -622 -328 107
5207 107 526 514 142 -351 -615 -398 104 521 577 199 -290 -622 -439 8 486 572 268 -263 -589 -453 7
5228GM31J28k72m49m75O6N44M41J80k74m69l56m6L55N69K49k60m59m74oL48N13
5250B91K89j27m99m69r8L56N17L55l5n71m39j62K62N32M10n4m43n18k62L63M37
5271A35M16J4l78n64k00J15N85L75P8l89n26k20Q7N22M17J35l07o44k46R3M37
5292f5N12J55k26n95l56OM44N39K50k99n03m16K4L71N93J86k38m64m87o7M04N35
5314C03K54j13m84m23j27M05M87K77m9m98n29j08L41M41M43n6m74n47j23J93N02
5335A15M92j8m78m79k48J28N01N55P5m66m50l66J23N57M34J30k82n34l89R2M62
5356d6N63N4k29n58l68J3M88N12J78k17n55m15K7L98M82K74j01n46n07j2L25N82
5378C42K87j46n19m77p9L44M40L50Kn08n00j51K05O07L98q1l85n68j84K14N63
$$ plain form
5228 7 438 566 294 -155 -630 -564 -20 421 601 327 -142 -498 -544 -189 380 629 369 -90 -564 -570 -222 291
5250 291 580 453 -46 -515 -613 -257 260 615 580 9 -430 -592 -330 202 612 558 115 -403 -665 -302 135
5271 135 551 565 187 -377 -577 -462 123 498 576 187 -339 -559 -472 50 467 602 295 -349 -595 -502 -65
5292 -65 447 602 376 -219 -575 -569 -125 414 664 365 -138 -554 -530 -159 434 620 382 -82 -569 -636 -232 303
5314 303 557 444 -40 -463 -590 -185 302 579 530 32 -497 -605 -264 177 620 564 90 -457 -580 -387 115
5335 115 607 589 111 -368 -616 -488 13 568 643 177 -273 -639 -516 41 475 605 323 -211 -600 -508 -46
5356 -46 517 571 342 -216 -584 -571 -83 429 607 390 -165 -580 -553 -155 327 601 500 -46 -553 -565 -240 342
5378 342 629 483 -36 -513 -592 -248 192 542 544 36 -464 -615 -410 197 595 514 129 -439 -623 -409 154
5399A54M19J1m58m55l43J92N43M63L9k65n40m56K44M36M89J78l37n80l50Q3M13
5420a20N51K41l15o05l83R1L94N87K34k35n15m96k1M28N27K93k19n29m21j27L90
5441b50N28L38j06m94n51j35L71N47L52r7m16n23k94L33O65L22k8m54n33k55K31
5462d49N94M15J3l67n72l05K17M87N53J18m38o03k80Q2N35N20J54l70n01m54J8
5483f33N45N89J44k53n97m34K4M29O25J75j39o39l92r4L81O71K78k36m46n79q0
5504f61K97N58M54j05n30n06j30K90N58M79j57m22o13k40L26N64L83P3l91n96
5524c69l27K25N45M82P8l36o81k33Q4N62M90J29l44o06l07O9N28M82K48l78n34
5545a93m20L9M57N47K72l07n05m54n9M41N88K79k01m76n48j28M23N85L24j59n05
$$ plain form
5399 154 573 584 126 -329 -672 -480 63 526 565 300 -240 -696 -452 -16 473 651 314 -266 -616 -533 -120
5420 -120 431 672 357 -248 -631 -540 -146 441 675 440 -75 -571 -592 -164 363 656 437 -92 -513 -640 -250
5441 -250 278 616 510 16 -535 -670 -299 248 600 503 87 -436 -730 -397 268 590 562 108 -425 -680 -449
5462 -449 145 560 573 206 -366 -671 -454 33 586 704 266 -337 -617 -535 0 520 674 304 -197 -651 -633
5483 -633 -88 501 645 392 -205 -639 -615 -186 439 614 475 -164 -556 -650 -269 402 680 444 -2 -581 -661
5504 -661 -364 194 648 543 13 -493 -623 -333 225 704 547 125 -488 -728 -402 162 545 618 227 -369
5524 -369 -696 -471 74 556 634 298 -383 -616 -532 30 520 649 305 -301 -608 -539 -11 471 719 341 -193
5545 -193 -613 -574 -117 430 702 395 -110 -564 -623 -182 406 685 484 8 -540 -668 -245 340 664 505 0
5566@n25j29L52N48L60l5n36m60j90K49N78M27pn07n43k31J76N49N40N4m86n99
5588d15k11J09N30M72J57l50n86m09J56N51N36J42m03m64m86J17M52N48K18k08
5608D56o48l72m1N46M72K52j91n32n92J0L70N82L40j86n12n29k0K85N86L32m3
5629E65m86n99j51K67N87M84q1n31m81k75K38O11M28M4m13n96l11K64N36M24J13
5650F37l96n67l59K10M60M67K26l70n78l67J09M59O04L8j60n99l97Q4L56N67K41
5671F65k18n50m82q2M58O13K44j14o30l98j44L33N77L99j17n53m74k29L82O23
5691C03L29j06m49m99k17L11N52L46J8l61o05l17L06N37M31O7m41o07k71K20N07
5712E4M64J54m11n68k92Q6M86N20J40k80o35l81R7N09M92K27k76n06m72m6N11
$$ plain form
5566 0 -525 -654 -302 246 606 571 35 -425 -615 -366 212 639 632 125 -418 -649 -473 76 616 670 184 -415
5588 -415 -626 -517 13 485 642 292 -294 -703 -547 4 540 682 279 -185 -671 -554 -102 446 664 456
5608 456 -192 -564 -605 -59 413 665 474 -58 -650 -640 -270 312 652 466 -46 -575 -595 -310 276 608 565
5629 565 79 -520 -671 -404 183 667 586 55 -426 -701 -463 148 576 620 207 -389 -700 -436 100 524 637
5650 637 241 -326 -685 -475 -15 452 678 308 -270 -637 -528 -69 535 573 413 -186 -583 -499 -143 424 665
5671 665 447 -103 -585 -667 -209 404 648 534 -96 -494 -638 -305 272 671 554 1 -473 -702 -320 303
5691 303 632 526 77 -422 -639 -328 224 570 588 227 -378 -695 -389 148 579 646 205 -402 -673 -453 54
5712 54 518 672 261 -307 -599 -513 -27 493 633 353 -282 -663 -566 -57 435 662 386 -120 -592 -638 -127
5733a27N01K49j79n31m66m5M06N47K78j20m79n81r0L38O01L18n7n38n07r3L03
5754b72M76M23m1m92n38j89K12N74L64J13m76n03k65J43N24N45N8m38n09l37J51
5775d77N13M32J49k72o19l62J24M81N38J78l65m55m49L4M16N28K35k16m76n02
5795e65l3L91N22L02j11n07n11j56M01N67L00r3n18m40k42L62N71L18pm38n51
5816d38j78K25O01L59k4l68n72k03J79M81M54O2l52n14l71J91M67N15J45l94n34
5837b69l37K5N43M29K05k20n27m25nM63N41J89k16m98m21p1M06N30K98k00m85
5858d5m03j47L58N30L06r1m73m81j37L25M60L87o5m86m82j81K82M94M09j5m61
5879H4m74j98J95M45M38j8k68m66l31J67M13N43K3k70n53k91P7M45N19J31l01
$$ plain form
5733 -127 374 623 444 -87 -553 -598 -192 355 633 513 34 -547 -637 -299 302 620 563 25 -482 -575 -272
5754 -272 204 627 586 94 -444 -633 -421 153 517 630 154 -349 -614 -471 53 598 656 218 -291 -628 -477
5775 -477 36 468 617 345 -274 -636 -512 -31 507 685 320 -135 -584 -550 -134 394 629 413 -63 -565
5795 -565 -598 -207 315 617 506 -1 -512 -668 -267 300 600 507 -11 -451 -693 -331 240 558 551 113 -438
5816 -438 -616 -391 210 569 545 177 -395 -598 -419 62 516 578 226 -288 -659 -468 -1 514 659 265 -269
5837 -269 -606 -581 -38 391 596 376 -151 -576 -581 -118 423 612 396 -102 -523 -594 -188 342 640 440 -45
5858 -45 -448 -595 -237 293 599 508 35 -446 -583 -258 202 589 524 38 -444 -625 -343 151 560 545 84
5879 84 -390 -588 -393 52 490 472 204 -262 -593 -426 -13 530 553 283 -270 -561 -484 -39 480 611 310
5900C10m21m67O3M54L88J93j28m78m34J7L02M99K44j37m87l60j06L18M64L62j50
5921D46m48m10j22K64M67L54p7l71m76j70J90N02L75p0l52n01j29J78M54L48O9
5942E21k63n31l28J96M22M22J29l20n50k22J04M35L90J53k73m74l60P3M32M46
5962D02J42j85m62l53mL08M89K29j78m37l58j24L49M75K72j86m05m18p7L07M89
5983B75L05j74l48m83j16L24L72L47o1m29l82j76K02M18M02l6l29m50j88J28M24
6004B5M10Q0k88n09k56J32M24L96Q4k40m63k84N8L92M06J50j94m36l57j3M19L68
6026C04K73k43m47l94L0L90M00K02j58m08m24K1K76M16L01r1m51l77r9K56M36
6047B13K45m0k92m47k70L78L55L32k3l62m30k03K69L73L11Q0l82l70k65J29M64
$$ plain form
5900 310 -111 -578 -515 -61 327 520 392 -86 -520 -503 -201 298 542 405 -82 -442 -548 -230 234 596 446
5921 446 -2 -412 -534 -270 197 551 474 103 -373 -543 -353 149 524 454 102 -399 -528 -350 104 452 521
5942 521 258 -273 -601 -405 17 439 568 248 -302 -524 -420 15 405 558 285 -189 -549 -476 -44 402
5962 402 544 359 -103 -456 -460 -152 337 566 388 -49 -407 -531 -182 293 565 379 -26 -444 -521 -214 275
5983 275 580 406 58 -425 -541 -217 155 502 441 12 -370 -546 -344 74 476 440 111 -339 -527 -399 25
6004 25 435 515 227 -282 -538 -406 18 414 498 258 -205 -489 -431 -39 367 517 323 -113 -470 -483 -64 304
6026 304 577 334 -113 -507 -477 -87 313 515 357 -51 -475 -454 -178 238 539 448 -3 -380 -479 -223 213
6047 213 458 418 126 -321 -591 -213 142 474 451 89 -341 -544 -275 98 409 489 107 -263 -528 -399 65
6068F5L46O0k90l32l05J9L74M21J57k32m79k76L1M00L86J50k16l89l43rL34M50
6090C22J88j69m24l41l7L20M40J33n9l86l75q0K36M11L21j26l31m14q3J76M58
6111A80K96j9l84l99k19K59L87L93p3l50l22k48J60M07L75M6l25m29j62P4L97
6132D4L77M6k54m18k75R6L22L86J30j52m38l16k7L67M85P3r6m48l35j5K80M09
6154B41K61j55l84m04j9K58M93J44n8l56l52j28J82N52J41q8l78l04r7K11M54
6175B14K61p4k97l69k29J70M49L09K1k56m14k82J62L78L85O5k83m19k45N9L66
6196b9L87R7k30l91k98Q8L25L05K46k45l68l46K2L91L20K61k33m45k51m8L28M34
6218C20J72k06l28l43r5L24M47J38n7l35m48j8J78M20K67p2l01l77j72K25L72
$$ plain form
6068 65 411 471 181 -151 -456 -437 -63 358 515 283 -196 -472 -441 -41 345 495 279 -110 -453 -462 -128 322
6090 322 510 341 -83 -424 -461 -141 299 432 373 -13 -388 -468 -232 179 500 374 43 -371 -454 -278 180
6111 180 476 457 73 -326 -545 -286 101 494 421 71 -251 -499 -339 68 443 489 164 -265 -427 -353 44
6132 44 421 467 213 -205 -480 -384 -62 324 454 302 -136 -452 -479 -112 373 446 350 -98 -433 -448 -168 241
6154 241 502 347 -37 -441 -460 -202 291 435 377 21 -331 -459 -277 275 416 328 -50 -354 -451 -240 214
6175 214 475 401 104 -265 -494 -324 125 434 455 199 -215 -497 -335 43 428 493 210 -209 -454 -395 -29
6196 -29 358 455 225 -166 -464 -376 -51 254 500 255 -113 -459 -437 -46 274 535 302 -143 -394 -442 -114 320
6218 320 492 286 -42 -385 -480 -156 291 429 372 37 -411 -429 -251 169 436 364 63 -314 -486 -261 111
6239A11L37j1l13l84j82J80L05M01ql08m07k04K03K92L62O2k86l27k51M4M14L65
6261C95N4k17l88k80O1L31M44P0k43l79k61M5K38L65K24j76l23l43k1K73L70J75
6283D14r6l70l79k5K69L89K12l4l69l78q6K14M19K24n3k99l60j63K12M20K86n2
6305C95l19l63j83J43M78K57Qk76m13k17J20M61K78J06k77m33k35O3L81L29J76
6326D79k70l54k73O3L16L75J74j93m01l63N3K76M57J41j73l43l38r7L59M08J86
6347D82j45l61l57r9L03L79K36q0l53l57r0J98L96L16j5m02m17j21K18M34K86
6368D51J3l16m73j24J25L96L20M9k36m48k43J31M34K92J65l38l98k29L8M03L39
6389C51J42k62l59l49L5M00L83J03j30m09l35l4L42L63J93q7m06l49k4L16L42
$$ plain form
6239 111 448 437 124 -260 -442 -262 43 444 436 128 -279 -483 -280 12 374 436 150 -177 -428 -384 30 395
6261 395 449 232 -156 -436 -375 -44 400 470 227 -152 -413 -368 -130 235 459 283 -40 -383 -404 -131 239 414
6283 414 318 -52 -431 -456 -187 202 414 380 11 -367 -453 -239 180 404 351 52 -308 -471 -259 161 447 395
6305 395 76 -287 -470 -327 151 408 416 140 -273 -490 -370 91 369 475 198 -235 -470 -407 -26 303 479
6326 479 209 -145 -418 -355 -39 336 510 317 -84 -447 -394 -118 339 480 307 -36 -374 -471 -112 296 482
6347 482 337 -24 -381 -480 -177 202 438 358 5 -352 -442 -244 152 468 453 51 -366 -487 -269 165 451
6368 451 464 148 -325 -449 -324 72 392 441 205 -243 -486 -355 79 371 536 198 -200 -429 -391 12 351
6389 351 493 231 -128 -477 -442 -42 341 444 314 -95 -430 -464 -122 241 434 347 -59 -408 -432 -116 226
6410B26K90j20l87l88j62L19M14K88q0m02l18j42J33N00L34l7l41l95k39J49M49
6431I1L29Q0l59l84k32J96L69L13L5k08m55k62Q4L86M22J09k66m03l43J00L37
6452f1L90J98k01m47l07k3L23M51K18k69l78k78j63L61M24K80j65m03l47j28L34
6473a91M43K28k0m05m36j01K21L80L42J0l72m41j65J86L90L90J9l79m03k14J28
6494c90L74M18N7k69l85l03J11L84M23O0k05m46l18Q9L08M42J59k12m22l35r0
6515e50M12M61J98j62m42m02J9L06M49K39j91l53l49j74L03M39K94o4l26n26p6
6536d95K24M63K78k1l26m80j60K13M33L49L4m23l60k70K26L99L71K0l08l99l22
6557e54J81L82M72P5l14m28l51P3M02M01J87k08m98l03K9L70L92K07j75m53l70
$$ plain form
6410 226 516 396 9 -379 -541 -222 192 480 400 -2 -320 -462 -329 171 505 468 127 -268 -507 -358 91
6431 91 420 500 141 -243 -475 -279 90 403 438 230 -225 -487 -403 -17 405 514 248 -155 -498 -398 -61
6452 -61 329 527 326 -121 -428 -451 -128 323 541 272 -106 -384 -547 -186 238 518 353 -50 -397 -525 -191
6473 -191 252 480 460 55 -381 -482 -261 119 461 471 99 -342 -507 -321 69 459 478 99 -304 -518 -390
6494 -390 -16 402 459 190 -195 -498 -387 -3 420 480 275 -171 -489 -400 -92 350 509 297 -125 -460 -550
6515 -550 -138 323 521 359 -83 -485 -466 -160 289 528 337 -16 -365 -539 -236 203 497 433 107 -419 -495
6536 -495 -271 192 470 449 123 -357 -517 -304 129 478 512 89 -271 -541 -315 84 455 475 167 -232 -554
6557 -554 -373 9 481 556 242 -186 -537 -464 -62 339 526 318 -180 -483 -454 -84 308 515 340 -113 -483
6578d83j6L44M07L15k32m43l55l8K86M63K71j01l43m57j41L28L89L03Nm45m65
6599d08j56K84M54K84N1l89m38k11K09L69M21O5l39m76k33J43L93L81J22k71m68
6620b13l45Q9M66M13J31k73m93k97P0L77M57J67k13m80l57l4M13M41K32j42m00
6641Im80o6L67L77L40j40l22n25l5K12M98K49l7m13l94j57K15M49L49M0m16m32
6663c12k60K01M29M64jl58m23k66J14M74L76Q2k87m71l15R1M06M29J65k69m51
6684a82k95k4L87M49K00j91m35l70nL17M90J76j16m66m04m1L13M49K44j06l54
6705C6m57j11K27N42K66m7l65m60j78K18M75L59kl75m80k32K00M39L85O4l09m87
6727b92k48J07M55M38J31l35m63l38Q6L57N00J49k54m36l32OL30N22K17j90n27
$$ plain form
6578 -483 -499 -155 252 567 335 -108 -463 -501 -215 248 519 418 75 -382 -523 -195 194 497 502 57 -408
6599 -408 -564 -280 174 458 509 120 -318 -529 -320 49 470 535 196 -280 -513 -370 23 404 526 255 -213
6620 -213 -558 -469 -3 410 541 268 -225 -522 -452 -75 382 549 336 -144 -501 -535 -122 319 551 409 9
6641 9 -471 -537 -170 207 547 407 85 -440 -475 -263 235 484 447 34 -360 -517 -302 147 496 536 120 -312
6663 -312 -572 -371 58 522 521 163 -260 -526 -412 62 438 520 233 -238 -553 -462 -56 373 538 269 -182
6684 -182 -477 -501 -114 335 535 344 -91 -461 -466 -149 341 517 401 -65 -469 -510 -197 252 496 390 36
6705 36 -421 -532 -305 237 503 456 91 -369 -547 -329 146 505 503 128 -352 -584 -384 55 440 504 195 -292
6727 -292 -540 -433 22 460 591 256 -207 -545 -459 -102 398 547 293 -143 -475 -469 -139 383 600 410 -117
6748a17l96oL29N34K02j25m52l85j03K93N03J81km38m70j25K99M30L55k6l91m55
6770c65k10J77N25L74L2l84m74k22J61M60L79J06l61m86k44Q3M53M59J12k66n29
6791b20l28N6M46M43J73k68l99m43M6L58M98J71j43m86l75r2L83M88K27o3m68
6812Dm67j28L40M65L25p7m17m59j69K61M97M09p0l66n01j79J58M97M43l6l48n03
6834c21k51J42M93M16M7l01n17k89J04M80M63J47l62m57l00J0M10M66J71j53n18
6855a20m48M3M13M93J74j86n04l06j38L65M72L12r5n25m13j16L36M89L41q4m06
6876I7n39j20K48N41K96J8l89n33k29K77M52M16K6m45m20k83J36M71M65J04l46
6897B43n41k71O8M32M64K28k81n36m09J27M11N00J30k40m41m14q6M80M68K39j73
$$ plain form
6748 -117 -513 -519 -190 344 546 421 -31 -416 -519 -226 277 458 456 18 -452 -577 -278 152 507 481 90 -365
6770 -365 -575 -398 127 501 533 149 -325 -547 -386 74 453 559 198 -288 -532 -449 4 463 575 309 -220
6791 -220 -548 -492 -46 397 570 302 -97 -540 -494 -136 362 533 390 -96 -471 -563 -180 308 535 472 4
6812 4 -463 -591 -251 214 539 462 45 -414 -583 -322 175 584 514 148 -353 -532 -374 123 566 530 182 -321
6834 -321 -572 -430 63 479 526 225 -292 -581 -477 3 466 613 251 -206 -506 -496 -86 380 551 398 -120
6855 -120 -568 -525 -112 381 555 369 -135 -441 -579 -214 258 570 475 -50 -463 -579 -243 246 587 503 97
6876 97 -442 -562 -314 227 523 541 152 -381 -610 -333 119 535 561 116 -304 -587 -451 20 485 589 243
6897 243 -298 -569 -501 -69 395 623 342 -194 -603 -476 -65 435 565 325 -116 -530 -616 -136 332 571 398
6918C98m52m44r3L68M92K66j6m66n55r4L32M55L24K9m93m80j81K75N03L94k8l93
6940A41n42j58J41N23L86N0l29n36k58J21M73M60P9k60n13l76J05M82M36J54k72
6961C07m41m53M3M50M94J76k25m49m30p7M18N33K37j13n17m54m1K75N47K94j04
6982D70m42n19q8L22M39M27j11m40m72j47J71N38M17J1m33m77k99J58N68M93N5
7003F41m29m65l19J32M41M60J71l44n46l27Q8M25M40K59l07n20l90O2L87N04K28
7024E91j97m67m32p6L85M90L35k27m55m44p4K83N96L37j63m28n56j14K35N46M03
7045E68m7m59m58j95K53M78M75n9l96n29k35J76N06M39O8l90n00l23J29N11N18
7066E30J26l98m68m11J46L34N76K00k74n01l92K1L71N19L45l28m58m89p1M12N60
$$ plain form
6918 398 -54 -498 -591 -223 269 535 519 53 -502 -596 -264 191 515 544 51 -429 -610 -335 168 562 534 141
6940 141 -401 -559 -418 105 491 541 212 -324 -582 -461 12 472 551 291 -222 -598 -493 -11 425 579 307
6961 307 -134 -587 -544 -94 400 576 351 -98 -528 -605 -187 346 583 470 -47 -501 -542 -267 280 574 470
6982 470 28 -491 -579 -257 182 609 498 58 -414 -561 -390 148 565 576 143 -334 -633 -475 93 586 641
7003 641 212 -253 -572 -440 1 461 632 288 -258 -585 -497 -72 368 627 320 -200 -590 -528 -141 363 591
7024 591 394 -73 -505 -581 -196 294 629 402 -53 -497 -571 -288 308 645 482 54 -502 -616 -381 165 568
7045 568 521 62 -396 -591 -338 140 615 556 160 -369 -604 -428 78 517 585 195 -305 -628 -499 12 530
7066 530 656 258 -210 -621 -475 -141 435 635 361 -140 -532 -511 -140 379 724 396 -62 -551 -622 -210 350
7087C50K74j41n23l96j07K91N59K89n9n03m78k58L61N63M28r4m50n41j78K36N44
7108A67L45P6m48m92k65K14M72M05J47m29m98l20J79M25N07J11l28n54l16R3M60
7129d9M71K16k87n43l66kM55M64K83k70m84m22m8L94N25K96j49n21m07j23K99
7150b68N42L12j07m19n16j15K16N45M18n1m10n74k54K89M84M94l1l95m83k94J61
7171d56N46M47N6l54n50l19R8N16N14J53l08o10l41R8M21N42J73k77n15m00l3
7192e99M85M90K30j65n34m60n6L80O03L26j95m83n38p8K93N11L62p9m71m63j66
7213f07K59N09M34j3m40n13k91L13M89M31N7m50n66k68K42M51N05M5l34m81l81
7234f09J17M70N06J53l25n56l32O7M34N07J85k39n06m10k1M41N70J64j93n21m25
$$ plain form
7087 350 624 483 -40 -436 -543 -252 307 596 537 34 -444 -702 -341 222 650 556 106 -435 -613 -377 167
7108 167 512 588 140 -352 -617 -403 69 474 621 192 -306 -626 -447 -22 485 596 268 -286 -602 -509 -49
7129 -49 422 638 351 -192 -558 -560 -105 359 642 372 -112 -534 -582 -188 337 633 484 -37 -444 -567 -268
7150 -268 274 586 479 60 -456 -571 -355 190 608 557 147 -427 -681 -392 92 586 555 160 -323 -617 -456
7171 -456 90 537 593 239 -311 -630 -532 -16 498 651 343 -267 -608 -510 -89 453 626 349 -166 -566 -599
7192 -599 -114 376 606 441 -93 -553 -609 -229 374 700 505 22 -516 -594 -301 210 572 493 22 -441 -607
7213 -607 -348 161 595 582 142 -371 -662 -349 140 571 628 178 -388 -656 -414 37 542 587 253 -228 -609
7234 -609 -492 -22 484 637 312 -244 -576 -509 -75 432 617 378 -128 -538 -559 -118 452 616 423 -98 -523
7255e23l1L39N28L47j84n07m40j01L07M90L76o4m57n67j68K70N26M38L0n00n09
7276d00k68K40N21N03l7l65n83k45J99M55M88J24m07m88l70J68M37N74Q1l05n64
7297b42l22K5M55N22J41j96n31l76n7M75M55K90j81n50m88o7M08N43L43j86m34
7318B7n14j21K80N59L58j14m02n35j44K08N71M11o3l91o01j55K55M74M35K2l64
7339A96n98j94J05N63M12Q6l18n47l27J14N00M05K10k82n24l41mM33M76K33k17
7360C81m88m87n0M74N11K81j77n36m32n2K73O10L27j59n30m42j89M02N31K98o9
7381D77l66n37j96L54L81M55Jm24n35k68K11N07M17J23m45m46l30R0N80N02O8
7402F19l30n61l71J54M43M51K22k91n26l92jM19N38K82k95m87m51pM33N07K82
$$ plain form
7255 -523 -554 -215 313 660 476 -31 -471 -572 -265 225 601 537 80 -487 -655 -385 141 579 609 109 -400
7276 -400 -668 -428 93 596 559 194 -389 -634 -435 20 508 632 225 -263 -633 -465 -28 546 627 322 -242
7297 -242 -564 -539 -84 438 579 383 -148 -524 -581 -106 349 639 458 -92 -580 -647 -239 304 647 461 27
7318 27 -487 -608 -328 231 589 475 73 -462 -606 -398 173 584 521 130 -471 -626 -371 103 538 560 196
7339 196 -402 -596 -491 72 484 570 252 -295 -622 -508 -8 397 607 325 -199 -540 -544 -111 365 598 381
7360 381 -107 -594 -644 -170 341 622 445 -91 -523 -575 -302 308 635 476 -54 -496 -685 -283 248 546 477
7381 477 111 -426 -622 -268 113 568 569 145 -390 -658 -447 60 477 600 155 -291 -621 -531 49 551 619
7402 619 289 -272 -643 -489 -46 405 627 336 -190 -582 -583 -164 374 656 361 -126 -577 -584 -151 356 638
7423F38j72n81m38j19M14N49L43k10m02m84j86L23N41L88j00m11n37k17L03N17
7443A59M13j0l86n84k73K89M88M10J00m13n55k09J27M97M14J53l64m89m22R1M91
7464g3N21J58k46n62l55j3M67M94K87k33n91m55K3L70N86K82k50m53m78j17M34
7485b04N31K92j79l84n72j10L77M88L26l8m74n05j54K41N19L51K4l54m89l40K13
7506d41N65M45j3k72n65l04J25M71M87J18l58n00l88M5N33N51N8j60n59m19N8
7527e23M23N23K03k48m63m36l4L69M66K84q5n30m99n3L91M84L41j48m92m40j58
7548f25L26N47L63p6m39n31j60K29N48M04q1l46n19k54J82N09M30J49m49n33k64
7569e90J67M55L99J88l05n13l95J02M37M86J93k51o12l51N4L65N39K34j27o08
$$ plain form
7423 638 466 -115 -553 -672 -258 291 634 424 22 -462 -648 -325 216 604 504 93 -444 -661 -358 159
7443 159 572 562 176 -408 -681 -392 96 506 606 193 -362 -571 -444 53 467 620 256 -233 -655 -564 -73
7464 -73 448 606 360 -202 -557 -570 -103 391 678 445 -146 -601 -578 -208 378 660 410 -43 -521 -638 -204
7485 -204 327 619 440 56 -516 -626 -249 239 565 527 53 -452 -606 -365 154 505 529 175 -314 -654 -441
7506 -441 124 569 556 284 -281 -585 -460 11 498 616 258 -242 -630 -585 -52 499 557 397 -162 -581 -523
7527 -523 -100 423 626 378 -85 -521 -555 -186 280 564 479 -51 -550 -603 -212 272 613 465 -27 -467 -625
7548 -625 -299 248 611 535 96 -435 -595 -366 182 586 505 159 -360 -614 -432 77 507 656 207 -326 -590
7569 -590 -423 32 431 619 314 -199 -594 -492 -55 431 624 373 -239 -590 -536 -171 368 602 475 -133
7589a33m14pL62N24L03k53m37m73q7L07O08K92j04m68n39j02K70N10L76j9l72
7610A44n87j98L07M83L81J5m27m61k56J89M69M40R9l05n28k94M0M70M53J68l07
7631B95n03l79R3M14M66L29l65n83l20KL89N80K13k34m84m31p2L47N63L07j45
7652D82n31n04l3K92N68L23j15m12n39j72L02N28M13m6m43n29j76K23N18L90J5
7673E54l99m71k92J31M70M43J76l60n33l05P4N01M48J92k85n84k80l6M55N15J73
7694E87k46m64m24K8L53N35K17k25l93m35j10L50N10L12j53m19m83j67L91N17
7714B81L24l6n15m95j91K76N95L25ol95n28k39K30M45M48M2l99m98l04J76N34
7735G0M03J13l86n12k90J40M22M95J90l79m52l87O6L81M98K06j82m63m26l3L60
$$ plain form
7589 -133 -547 -554 -192 332 635 382 -55 -528 -615 -308 300 592 488 20 -519 -621 -351 159 535 516 144
7610 144 -443 -641 -334 149 530 545 118 -343 -599 -410 59 499 598 293 -235 -529 -489 -19 434 602 295
7631 295 -208 -587 -494 -80 386 715 350 -233 -553 -551 -162 418 631 397 -87 -518 -590 -243 320 627 482
7652 482 -49 -553 -586 -294 274 597 482 70 -469 -641 -339 189 602 556 113 -416 -592 -369 149 539 554
7673 554 155 -316 -608 -477 -7 436 612 252 -281 -586 -512 -11 437 629 344 -240 -520 -556 -101 414 587
7694 587 341 -123 -547 -519 -166 369 586 361 -32 -467 -577 -227 283 595 442 23 -460 -627 -236 281
7714 281 605 569 54 -441 -632 -356 239 564 558 163 -365 -604 -374 71 519 561 162 -336 -640 -464 70
7735 70 473 586 200 -312 -602 -462 -40 455 645 266 -186 -573 -507 -126 372 578 396 -67 -493 -526 -166
7756a66N20K70j99m76m28j14L73N02K98j64m25m62j26K66O10K88p7m34m93j18
7776e55J46N43L97K0l93n24k18K01M68M33R5l86n31k84O0N52M66Q5l42m73m23
7797f63J66M27N01J78k38o36k93O1M01M97K19k46m88m28l1M01N39K55j61n06n19
7818e64n2L90N19L24j62n03m43q7L19M77L56o6m51m33k33K76N01L97j3l91n44
7839c83k61K34M87M37K8l79m14l56J85M76M46Q9l17n59l08J13M30N39J57l07n69
7860b32l60R0L79M84K83k39n04m85R5L31N16L22k34n42m14p9L59N58K96j64n01
7881d1m73j49L57O02K55L7m59n59j81K77N21L91k5l80n15l09K60M81M25J04m47
7902A72m43l72J92N02M54R6k90n85l41J00N08M45J93k78n49l81PM58N71J73k73
$$ plain form
7756 -166 354 624 425 -51 -479 -593 -220 282 580 416 -9 -471 -597 -331 279 567 490 56 -437 -555
7776 -555 -409 134 531 551 158 -366 -584 -383 85 518 613 227 -304 -588 -528 24 490 575 233 -240 -663
7797 -663 -497 -70 431 609 371 -265 -558 -497 -96 401 620 374 -114 -542 -573 -172 367 622 461 -45 -564
7818 -564 -616 -226 293 617 455 -48 -491 -578 -259 218 574 508 57 -376 -609 -333 168 565 552 161 -383
7839 -383 -644 -410 77 514 542 163 -251 -607 -422 54 500 589 272 -287 -595 -482 -52 487 644 337 -232
7860 -232 -592 -502 -123 361 644 405 -99 -584 -489 -158 358 680 446 -96 -510 -589 -230 328 624 460 -41
7881 -41 -514 -663 -306 296 551 588 129 -430 -611 -334 187 578 553 173 -342 -651 -391 90 515 619 172
7902 172 -271 -643 -451 51 505 601 311 -274 -615 -515 -7 438 631 353 -196 -577 -570 -112 459 632 359
7923C59n09l97J1L87N44K02j85n14m29j03M32N84K68k10m88m25k02L64N86L54
7943F29j19m96m34j99K62N91L44m8l78n55k08J98N10N07k3m24m99k94K08M70N47
7964E89J0l43n71k94Q6N11M83J96k93o19m04J65L43N69K01k93n14m48L8M32N29
7985C73K76j80n30m83p5M08M65M31k05m91m80k22M30N61L53p9m31n67k35L54N25
8006A98M45p4m75n20k40K27N86M58rl72n85l68K90N17M53R7l59o11l14J84M37
8027c5N00J58k99n40l95O5M49N25J87k80m91m58M6M00N38L03l09m28m68j07M22
8048b17N40L19j44n08n64r3L94N30M15j10n57n27j23L12N40L72o3l74n74j81K02
8069d11N92M13K0m46n47k40J39N73L99J38m01n65l01J32M54N31K03l43n83l85
$$ plain form
7923 359 -150 -547 -536 -149 395 597 412 -102 -531 -634 -202 382 650 440 -48 -473 -675 -311 275 629
7943 629 510 14 -420 -619 -357 234 578 530 152 -403 -611 -413 97 604 581 157 -342 -636 -428 42 589
7964 589 599 256 -315 -609 -523 -12 471 667 374 -245 -649 -484 -141 428 629 336 -178 -626 -588 -156 373
7985 373 649 469 -61 -544 -619 -211 254 685 480 -11 -491 -713 -283 278 631 552 121 -446 -681 -327 198
8006 198 643 569 94 -426 -666 -439 147 605 596 224 -361 -729 -439 78 531 628 269 -342 -656 -472 -35
8027 -35 465 623 324 -216 -611 -546 -97 428 615 335 -156 -614 -568 -168 370 673 364 -64 -532 -639 -217
8048 -217 323 642 498 -10 -574 -667 -273 257 672 562 5 -522 -645 -333 207 579 516 142 -432 -613 -411
8069 -411 181 594 614 168 -379 -619 -480 93 492 630 229 -336 -637 -505 -51 480 683 340 -243 -628
8089f28K1M95N58K13l12n90l39k5M36N95K60k29n61m76n7M73N08L15j26n91m74
8110e34o7L89M93L27j7n58n60p6K20N76M78q3n03n37j54K19N24M84m6m45n35k41
8132f46K13N08M83Q9m36m92m15K09M93N39J67l91o08l56R6M77N55K01l15n46m10
8153e85j4M86N53K30k11n20n34m6L70O21K88j30n75n31q8L67O49L08o6o07m44
8174d79k40L77N19M78o1n39n43k26L06N81M87o8m69n26l02K33O16
$$ plain form
8089 -628 -607 -112 446 659 347 -243 -582 -607 -171 424 684 455 -106 -582 -639 -166 342 657 531 -60 -534
8110 -534 -601 -212 281 608 591 33 -527 -603 -383 193 671 588 85 -452 -606 -387 137 621 575 130 -405 -646
8132 -646 -433 75 558 647 211 -281 -696 -487 6 545 712 321 -287 -643 -547 -70 485 686 371 -175 -585
8153 -585 -599 -113 440 670 459 -61 -595 -641 -271 350 638 508 -67 -598 -686 -319 330 638 572 -35 -479
8174 -479 -719 -342 177 655 594 55 -488 -714 -408 173 660 592 123 -403 -705 -472 144
8191A44
$$ Imaginary data points
##PAGE= N=2
##DATA TABLE= (X++(I..I)), XYDATA
0@%%%%%%%%%%%%%%%%%Qj3J3j6J6j8K2k6L0l4M0m8N4o1P0p8Q8j00J11j25J40j55
39h2J74j93K13k38K63k91L24l56L90m31M76n26N79o35P02p78Q63r58J068j201
59f37J361j548J782k083K483l050L898n312Q100j5632P5134K81566K1676k31368
73A36370l27683j89850Q9049L12756K88162O3171j98019l20471k18115N8574K82415
84b3641K90070R7808j59121l13557k31124K4621K49057K88129J31323j26118k96136
95f8689k38993q425K12959K85832J57131r5161k74057k41553m3623J79537K80412
106A45370J74999o5004k46934k44235p5645J48719K71277J86852l3888k17503
116D4008k46113j03014J21712K56756J95371j857j89577k46167j24325R5019K37830
$$ plain form
0 0 0 0 0 0 0 0 0 0 0 0 0 0 0 0 0 0 0 8 -5 8 -8 8 -10 12 -14 16 -18 22 -26 28 -33 37 -41 47 -53 58 -67 73 -82
39 -82 92 -101 112 -126 137 -154 170 -186 204 -227 249 -277 302 -333 369 -409 454 -504 564 -637
59 -637 724 -824 958 -1125 1358 -1692 2206 -3106 4994 -10638 64496 346062 367738 136370
73 136370 -191313 -381163 -292114 20642 308804 371975 173956 -146515 -364630 -306056 -23641
84 -23641 266429 364237 205116 -108441 -339565 -314944 -65887 222242 353565 227447 -68689
95 -68689 -307682 -316107 -103148 182684 339815 244654 -29403 -270956 -314579 -135042 145370
106 145370 320369 255365 8431 -235804 -311449 -162730 108547 295399 261511 44008
116 44008 -202105 -305119 -183407 73349 268720 266863 77286 -168881 -293206 -198187 39643
127C9643K01666K8924j64260k43778j40016O7123K15699K07705N5746j40837k36397
138a08782j52322L8860J93680K12523P8759j17918k23849j62021J0712J73591
148e6767K14614R7190r3203k08719j71083j5247J53504K12894J12049o8088j92387
159a5243j79377l8488J33521K06145J24971m2910j76430j84890n8542J12581J96921
170G8259J36691j8235j60404j87139p5075R0597J86238J47411L892j43465j85755
181a26985r0319O8518J74536J55646K3787j26347j81703j04132M6488J62523J60826
192A62838M1427j07766j76147j16382K6011J49466J63720N7869q8393j68919j26889
203a83165P194J35185J64037P3632o9427j60702j34743j1237J19640J62611Q7382
$$ plain form
127 39643 241309 270233 105973 -137805 -277821 -210698 5001 212706 268452 127615 -108782
138 -108782 -261104 -222244 -28564 183959 262718 144800 -79049 -241070 -230358 -56767
148 -56767 157847 255037 161834 -46885 -217968 -233215 -79711 133183 245232 177144 -15243
159 -15243 -194620 -233108 -99587 106558 231529 188619 12189 -172701 -231243 -118662 78259
170 78259 214950 196715 36311 -150828 -225903 -135306 50932 198343 202235 58770 -126985
181 -126985 -217304 -148786 25750 181396 205183 78836 -102867 -206999 -160511 2012 162838
192 162838 204265 96499 -79648 -196030 -170019 -20553 143167 201036 112643 -56276 -183165
203 -183165 -175971 -40786 123251 196883 127456 -33246 -167989 -179226 -59586 103025 190407
214A90407n0895j51400j40775k8529J03163J59790R9252l3446j40016j44711m5055
225a82215Q7187J55487J09361j5895j27403j46793o0127P1469J49740J17235J667
236A59713j13875j48066p3167N5625J41492J23866J8480j00660j47639q4583L9733
247a29081J31516J29078L4520q7802j44927r3828K2827J21007J33661M8518p4147
258I1342j39739j02112N863J10219J36861O0507n9754j32320j10150j0392R9608
269e0067J37036P1064m4277j24230j17243k5368Q8581J34598Q0521k7506j15833
280G276j23057l7887P6046J30000R0096j1184j07165j26341m8998O2025J23777
291C4588R9397M016r8444j26477n9493M6175J17267J07379J7086q8096j24282
$$ plain form
214 190407 139512 -11888 -152663 -181192 -78029 81761 181013 147567 7551 -137160 -182215
225 -182215 -95028 60459 169820 153925 26522 -120271 -180398 -108929 40811 158046 159713
236 159713 45838 -102228 -175395 -119770 21722 145588 164068 63408 -84231 -168814 -129081
247 -129081 2435 131513 166033 78231 -66696 -160524 -137697 -16690 116971 165489 91342
258 91342 -48397 -150509 -144646 -34427 102434 162941 103187 -29133 -139283 -149675 -50067
269 -50067 86969 158033 113756 -10474 -127717 -153085 -64504 70094 150615 123109 7276
280 7276 -115781 -153668 -77622 52378 142474 131290 24125 -102216 -151214 -89189 34588
291 34588 133985 138001 39557 -86920 -146413 -100238 17029 124408 141494 53398 -70884
302g0884o9972K9899J10663J13269K8634p5609j20100q0732J4780J03843J16079
313I9870L9788o1382j15194r0527J160R5982J15929N0640m5815j10768r8503j0313
325a29133Q5478J13928O1913l1328j05960j03646k1118P3183J10771P2917j8164
336A08841j00276j05439l2023N9573J08093Q2177o821r2374j05277m3033M5946
347h0613J05127Q9127L411q2230j04011n4476L3584J01358R2938J3790p0540j02686
359e5221o4863K2604R5935R4503K4812n8210j01539p3100J2645Q8119R5090L6349
371A17124m6612r9585p8920K668P8314R5283M7532l6095r6179q2371q228O7509
383c9560R5533N7004k6414r0599q4650j9499N6763R5391O4333j6962q2937q6432
$$ plain form
302 -70884 -140856 -110957 -294 112975 141609 66000 -54100 -134832 -120052 -16209 99870
313 99870 139658 78276 -36918 -127445 -126285 -30303 85626 136266 90451 -20317 -118820 -129133
325 -129133 -43655 70273 132186 100858 -5102 -108748 -129866 -56683 54088 127005 108841
336 108841 8565 -96874 -128897 -69324 38769 120946 114125 21751 -83526 -126559 -80613
347 -80613 24514 113641 117052 34822 -69189 -123665 -90081 11277 104215 118005 47465 -55221
359 -55221 -120084 -97480 -1545 92958 117770 59560 -41979 -115079 -102434 -14315 80775 117124
371 117124 70512 -29073 -107993 -105325 -27011 68272 115804 79709 -16470 -98841 -107069 -39560
383 -39560 55973 112977 86563 -4036 -88686 -108185 -51422 43969 108302 91340 8403 -78029
395g8029l0776M7339R3781O9500o782p4160q7920m0952L8280R0414P3156M126
407I7977o4962q9256m9420K9283Q4894P6456J5161n6218q9410n6107J9786P7905
419c911P9343K5768m7974q7761o1266R371P0583Q1800L4894l9585q4509o5679
431h8926j108O3057Q3515M2352l0983p9583o9759j1282N5815Q3503M8760k1578
443G3783p4067p3317k0613M8477Q2010N4255j1829o8134p6109k8631M0648P9208
455B5681N9400k276o2130p7658l5691L2421P5421O3882O754n5890p7642m2208
467h9936K3443P1301O7599J5003m8909p6694m8244J4676O6541P0374K2587m1520
479D6221p4746n3709O281O1450P1687K9846l3677p2175n8212j968N5600P2253
$$ plain form
395 -78029 -108805 -61466 32315 101815 95033 20873 -67047 -107999 -69719 20695 93851 97977
407 97977 33015 -56241 -105661 -76378 8516 84972 100133 43915 -45495 -101602 -81816 -3911
419 -3911 75432 101200 53226 -34535 -95801 -86430 -15847 65953 100847 61262 -23247 -88926
431 -88926 -90034 -26977 56538 98890 67907 -11676 -81435 -92717 -36902 46601 95361 73783
443 73783 -284 -73601 -94214 -45737 36273 90528 78699 10565 -65544 -94175 -53527 25681
455 25681 85081 82805 20675 -56983 -92674 -60253 15168 79050 85804 29914 -47728 -89936
467 -89936 -66493 4808 72407 87410 38501 -38193 -86437 -71761 -5220 65154 87741 46221
479 46221 -28525 -82234 -75953 -14503 57184 87030 53353 -18822 -77034 -79002 -23402 48851
491D8851L6539k5719o9065o1785r677M9022P1968M2746j7993o5116o4320j7224
503h1773M2118P0939M8127j0300o0271o5993k4705L4932O9421N2348k556n4466
515A7821o7211l1575K7843O6619N5925N317m8315o7776l7762K0775O2827N8601
527F3089J3291m2115o7507m2807J3370N8083O0997K0657l5870o6284m6757N633
539f6220N2744O2963K7178k9639o3544n0366k190M7484O3947L2796k3035n9931
551g813n3448r937M2277O4059L7184j5994n5475n6389j6734L6965O2741M1133
563F8569q309n1115n8753k2588L1420O0000M4977o10m6951o0002k7435K4942N6751
576A0896M8669O436m2645n9972l1626J7747N3051N2159J2551l7986n8387l5974
$$ plain form
491 48851 85390 59671 -9394 -71179 -80856 -31834 40134 82880 64887 -229 -64549 -81773
503 -81773 -39655 31284 79411 69111 8840 -57153 -81858 -46926 22495 74843 72287 17821
515 17821 -49390 -80965 -53122 13497 69422 74739 26424 -41352 -79114 -58339 4488 63089
527 63089 76380 34265 -33242 -76049 -62679 -4596 56401 77058 41188 -25096 -71853 -66220
539 -66220 -13476 49487 76665 47026 -16518 -66884 -69074 -21590 42357 75153 52118 -7813
551 -7813 -61261 -71198 -28921 35138 72322 56328 853 -55536 -72270 -35305 27436 68569
563 68569 60260 9145 -49608 -72196 -40776 19224 64201 63591 16640 -43362 -70797 -45855 10896
576 10896 59565 66001 23356 -36616 -68242 -50495 2556 54715 67266 29280 -29107 -65081
588f5081J0341M9791N4531J7600l2364n6096m0259L211M6469N5700K2128k5841
600D0130n3557m4394k952M2652N5452K6688j8928n0917m7919q278L8144N4055
612C0176L1452j2053m8449n0166j3094L2463N2353L6281n757m5672n1122j7699
624f1287K6143N0526M0592k90m2093n0860k2755J9595M8942M3823M559l7432m9888
637c0425k7948J3442M7089M5822R347l1890m9117l2749Q029M4545M6569J4326
649E7040k6026m8254l6756L246M0940M6712J9590k0363m7205l9664j425L6450
661a5715M6544K4720j5187m5681m1376o208L1379M6502K9193j0608m3141m2300
673d1878j1432K6405M6183L2794o102l9738m2990j6598K1614M5516L5350j557
$$ plain form
588 -65081 -54740 -4949 49582 67182 34818 -21278 -61537 -58326 -11857 43843 65971 40130
600 40130 -13427 -57821 -60773 -18121 37331 64019 45091 -5826 -53745 -62023 -23879 30176
612 30176 61628 49575 1126 -49040 -62134 -29671 22682 58963 53206 7534 -43588 -61287
624 -61287 -35144 15382 55974 55684 13591 -37269 -60024 -40429 8513 52336 56895 19463 -30425
637 -30425 -58373 -44931 2158 47980 57327 25437 -23680 -56429 -48400 -3855 42714 57040
649 57040 31014 -17240 -53996 -50750 -9810 36902 56492 36129 -11076 -50740 -52165 -15715
661 -15715 30829 55549 40362 -5319 -46695 -52903 -21524 24978 54171 43563 422 -41878
673 -41878 -53310 -26905 19278 52072 45970 6232 -36758 -53356 -31742 13774 49124 47567
685D7567l5495m3542k1413J7203M3877L7144L589l1175m4037k5628J3018M1464
697B572L8544Q730k6869m4121k8753Q378L8292L9837J3666k2757m3441l1330L629
710d3623L4623M0931J8192j8695m1853l3531j381L1031M1620K1890j4521l9644
722d961l5321o308K7432M1653K5025r997l6900l7046j0747K3647M0960K7855n384
735C9908l3923l8318j4877J9844L9609L0207o11l0887l8862j8538J5577L7802
747F931L2414L922k7585l8940k1808J1147L5615L4207Q079k3975l8478k4733O755
760c6449L3109L5426J1957k0163l7355k7415K394L0459L6016J5540j6106l5970
772h557k9632j635K7295L6147J8941j2068l4193l1359n525K3898L5826K2023q140
$$ plain form
685 47567 12072 -31470 -52883 -35680 8197 45341 48930 17755 -26282 -51910 -38892 2572
697 2572 41116 49846 22977 -21144 -49897 -41519 -3227 36610 50276 27519 -15922 -47252 -43623
710 -43623 -9000 31931 50123 31428 -10425 -43956 -45337 -14306 27314 49204 34683 -4961
722 -4961 -40282 -46590 -19158 22495 47520 37523 623 -36423 -47170 -23523 17437 45292 39908
735 39908 5985 -32333 -47210 -27366 12243 42450 41839 10952 -27910 -46448 -30871 6931
747 6931 39345 43267 15682 -23258 -45066 -33919 1696 35903 43982 20007 -18471 -43204 -36449
760 -36449 -3340 32086 44043 23880 -13475 -40890 -38496 -8037 27979 43519 27413 -8557
772 -8557 -38189 -39824 -12529 23618 42559 30491 -3702 -35061 -40586 -16688 19138 41161 33021
785C3021l2275l2283r336K0244L5246K4608m314k9613l3052j2988J6636L4371
797A0265K6529n16k6656l3371j6439J3125L2905K8173L226k3399l3547j9350R627
810b9428L0917K9290P054k0266l3333k1689O095K8487L0235J0753j7296l2580
822a1761k3522K406K5685L1019J4024j4178l1300k5044j478K2987L1566J6504
834C6908j0868k9456k6432n250K0408L1465J8728p457k7231k7690q717J7782L0713
847A2903K0705l747k4864k8898j1534J4848K9450K2369J27k2575k9504j4043J1808
860b2955K7701K4107L634k0395k9401j6218Q413K5879K5622O716j8092k8787j8007
873c1783M591K4152K6850R288j5476k7509k0114J148K2413K7410J1566j2397k6171
$$ plain form
785 33021 746 -31537 -40873 -20629 14617 39225 34911 5298 -27754 -40742 -24106 10265
797 10265 36794 36278 9622 -23749 -40188 -27063 5842 34015 37241 13842 -19705 -39055 -29428
810 -29428 1489 30779 37833 17567 -15766 -37455 -31360 -2873 27362 38115 20819 -11761
822 -11761 -35283 -32877 -7192 23827 37851 23673 -7627 -32671 -34149 -11162 20404 36908
834 36908 26040 -3416 -29848 -35098 -14690 16775 35503 28046 815 -26875 -35592 -17810 12903
847 12903 33608 29861 4997 -23901 -35435 -20587 8863 31232 31359 8784 -20720 -34763 -22955
860 -22955 4746 28853 32487 12092 -17309 -33527 -25114 765 26387 33103 15011 -13776 -31783
873 -31783 -27192 -3040 23810 33098 17622 -9887 -30001 -28853 -6440 20970 32536 20139 -6032
886f032k1996k044K0559K7355J3718r013k4926k3668m690J8358K6759J5869n573
899B4676k3554k4878p025J5705K5880J8117k494k2182k5334r316J2717K5011K0047
912B7370K88k0521k5335j1483R625K4081K1668K632j8399k4915j3911O653K3092
925H45K2777M804j5818k4313j6240L983K1917K3209P204j3013k3877j8175J501
938b5196K0328K3273R649j0240k3324j9599q68J8212K3186J2199p669k2527k0632
951b3208l182J5792K2976J4448n207k1377k1080n619J3166K2862J6184k964j9656
964C135k1408q110J0742K2444J7523o94j7714k1575j0520Q578K1664J8400J768
977B4233j5619k1658j2551O365K0591J9065M173j3457k1686j4090M213J9040J9631
$$ plain form
886 -6032 -28028 -30072 -9513 17842 31560 22547 -2379 -26047 -30737 -12379 14380 30249 24676
899 24676 1122 -23756 -30781 -15076 10804 28921 26427 4245 -21089 -30405 -17688 7323 27370
912 27370 27658 7137 -18198 -29681 -20056 4025 25693 28325 9926 -14989 -28900 -22247 845
925 845 23622 28426 12608 -11705 -27945 -23962 -2045 21164 28368 15355 -8522 -26697 -25196
938 -25196 -4868 18405 28054 17814 -5510 -25109 -25977 -7765 15421 27620 19951 -2576 -23208
951 -23208 -26390 -10598 12378 26826 21619 242 -20838 -26457 -13291 9571 25755 22791 3135
964 3135 -18273 -26383 -15641 6803 24326 23632 5918 -15657 -26177 -17599 4065 22465 24233
977 24233 8614 -13044 -25595 -19230 1361 20426 24599 11142 -10544 -24634 -20421 -1381 18250
990A8250O500j1442k1279j5338J929J7281K0029Q565r325k0584j6360l71J5463
1003f682K0379J0494p450j9539j7198k651J3700K0263J2009n217j8251j7914m906
1016b2963J1984J9912J3281k966j6875j8536o754J0079J9353J4374p63j5408j8801
1029a4083q466Q062J8488J5464J305j3934j8726j0070N992J7498J6304L262j2161
1042H935j8539j1442L835J6414J6943M965j0359j8069j2798K017J5201J7110O777
1055B0990q577j7462j3816R2J3714J7270Q373o643j6769j4583j860J2206J7167
1068A0102R876m747j5952j5158l591J0529J6951J1193l049j4704j5578n399Q877
1081a0650J6635J2148j205j3514j5682p032P173J6104J2928N72j1966j5952q459
$$ plain form
990 18250 24750 13308 -7971 -23309 -21380 -4099 15930 24495 15170 -5414 -21774 -22145 -6682
1003 -6682 13697 24191 16741 -2798 -19996 -22647 -8947 11316 23325 18108 -143 -18057 -22963
1016 -22963 -10979 8933 22214 19248 2373 -16163 -22917 -12838 6515 20889 20126 4718 -14083
1029 -14083 -22549 -14487 4001 19465 20770 6836 -11890 -21960 -15968 1530 17834 21096 8935
1042 8935 -9604 -21046 -17211 -797 16146 21111 10752 -7317 -20115 -18098 -2897 14213 20990
1055 20990 12413 -5049 -18865 -18773 -5059 12211 20584 13941 -2828 -17411 -19271 -7065 10102
1068 10102 19978 15231 -721 -15879 -19470 -8941 8010 19203 16154 1450 -14128 -19527 -10650
1081 -10650 5985 18133 16928 3414 -12268 -19300 -12127 3977 16905 17477 5511 -10441 -18900
1094a8900N595J5255J3522K378j0578j5896r630L963J4161J4063M099r087j5755
1107f810j0500K219J2932J4542N674p740j5210j1377M38J1860J4818O942o282
1120A1506j4500j2076j242J0615J4861Q127m846j3511j2708k923R443J4858Q905
1133A6509l036j2557j3398m347Q252J4326R821j267j1613j3829n500O886J3639
1146C886J0758L10j0682j3933o590N339J2950J1550J862r751j3815p555L727J2222
1160B78J2275L040q640j3353q627K114J1510J2722M204p292j2886r536O13J0752
1174b826J2825N196n807j2393j0386o72R860J2696O315m295j1875j1146j820Q893
1188e435J2362P422k839j1366j1547k846P429J2237Q426j598j0793j1637l977
$$ plain form
1094 -18900 -13305 1950 15472 17850 7272 -8624 -18254 -14291 -130 13933 18032 8945 -6810
1107 -6810 -17310 -15091 -2159 12383 18057 10317 -4893 -16270 -15832 -3972 10846 17788 11506
1120 11506 -2994 -15070 -16312 -5697 9164 17291 12445 -1066 -13774 -16697 -7254 7604 16509
1133 16509 13473 916 -12482 -16829 -8577 5749 15570 14303 2690 -11139 -16639 -9753 3886
1146 3886 14644 14954 4272 -9661 -16251 -10912 2038 13588 15450 5699 -8116 -15671 -11944 278
1160 278 12553 15593 6953 -6400 -15027 -12913 -1403 11319 15523 8231 -4655 -14191 -13578 -2826
1174 -2826 9999 15195 9388 -3005 -13391 -14063 -4203 8493 14808 10513 -1362 -12508 -14328 -5435
1188 -5435 6927 14349 11510 144 -11403 -14249 -6820 5417 13843 12245 1452 -10185 -14162
1201a4162O105J1938R267m33r951j1611n106M837J1569R896O55q770j1648o279
$$ plain form
1201 -14162 -8057 3881 13148 12715 2764 -8847 -13953 -9116 2453 12349 13004 4234 -7414 -13693
$$ [...]
8191F61
##END NTUPLES=NMR FID
##END=
