##TITLE=1H_PR184_CR2
 d2O,8 sc, 
 29.9.2021
##JCAMPDX= 6.0         $$ Bruker NMR JCAMP-DX V2.0
##DATA TYPE= NMR FID
##DATA CLASS= NTUPLES
##ORIGIN= UXNMR, Bruker Analytische Messtechnik GmbH
##OWNER= root
$$ XWIN-NMR		Version 3.5
$$ Wed Sep 29 13:03:54 2021 Russian Standard Time (UT+4h)  she@DPX200
##.OBSERVE FREQUENCY= 200.1313468511
##.OBSERVE NUCLEUS= ^1H
##.DELAY= (6, 6)
##.ACQUISITION MODE= SIMULTANEOUS
##.ACQUISITION SCHEME= undefined
##.AVERAGES= 8
##.DIGITISER RES= 18
##SPECTROMETER/DATA SYSTEM= spect
##.PULSE SEQUENCE= zg30
##.SOLVENT NAME= CDCl3
##.SHIFT REFERENCE= (INTERNAL, CDCl3, 0, 15.7039)
##AUDIT TRAIL= $$ (NUMBER, WHEN, WHO, WHERE, WHAT)
$$ ##TITLE= Audit trail, XWIN-NMR		Version 3.5
$$ ##JCAMPDX= 5.01
$$ ##ORIGIN= Bruker BioSpin GmbH
$$ ##OWNER= she
$$ F:/spectra/data/she/nmr/H-F/1/audita.txt
$$ ##AUDIT TRAIL=  $$ (NUMBER, WHEN, WHO, WHERE, WHAT)
(   1,<2021-09-29 13:02:20.84 +0400>,<she>,<DPX200>,
      <created by zg, POWCHK disabled, PULCHK disabled
       configuration hash MD5:
       00 E9 B6 7A A2 85 ED C7 34 08 36 98 17 FE 4E 26
       data hash MD5: 16K
       A3 E8 EF 6F 0E 9F 27 CE 42 73 B7 C7 CF 21 76 46>)
$$ ##END=
$$ 
$$ hash MD5
$$ A2 54 4A FC E6 CB 56 E2 14 95 7F D0 EA 68 E0 3C
##$RELAX= 
##$RELAX= 
##$RELAX= 
##$RELAX= 
##$RELAX= 
##$RELAX= 
$$ Bruker specific parameters
$$ --------------------------
##$DU= <F:/spectra>
##$EXPNO= 1
##$NAME= <H-F>
##$PROCNO= 1
##$TYPE= <nmr>
##$USER= <she>
##$AMP= (0..31)
100 100 100 100 100 100 100 100 100 100 100 100 100 100 100 100 100 100 
100 100 100 100 100 100 100 100 100 100 100 100 100 100 
##$AQSEQ= 0
##$AQ_mod= 1
##$AUNM= <au_zg>
##$AUTOPOS= <>
##$BF1= 200.13
##$BF2= 200.13
##$BF3= 200.13
##$BF4= 200.13
##$BF5= 200.13
##$BF6= 200.13
##$BF7= 200.13
##$BF8= 200.13
##$BYTORDA= 1
##$CFDGTYP= 0
##$CFRGTYP= 5
##$CHEMSTR= <none>
##$CNST= (0..31)
1 1 145 1 1 1 1 1 1 1 1 1 1 1 1 1 1 1 1 1 1 1 1 1 1 1 1 1 1 1 1 1 
##$CPDPRG= <>
##$CPDPRG1= <>
##$CPDPRG2= <>
##$CPDPRG3= <>
##$CPDPRG4= <mlev>
##$CPDPRG5= <mlev>
##$CPDPRG6= <mlev>
##$CPDPRG7= <mlev>
##$CPDPRG8= <mlev>
##$CPDPRGB= <>
##$CPDPRGT= <>
##$D= (0..31)
0 1.2 0 0 0 0 0 0 0 0.06 0 0.03 0 0 0 0 0.0002 0 0 0 0 0 0 0 0 0 0 0 0 
0 0 0 
##$DATE= 1632906140
##$DBL= (0..7)
120 120 120 120 120 120 120 120 
##$DBP= (0..7)
150 150 150 150 150 150 150 150 
##$DBP07= 0
##$DBPNAM0= <>
##$DBPNAM1= <>
##$DBPNAM2= <>
##$DBPNAM3= <>
##$DBPNAM4= <>
##$DBPNAM5= <>
##$DBPNAM6= <>
##$DBPNAM7= <>
##$DBPOAL= (0..7)
0.5 0.5 0.5 0.5 0.5 0.5 0.5 0.5 
##$DBPOFFS= (0..7)
0 0 0 0 0 0 0 0 
##$DE= 6
##$DECBNUC= <off>
##$DECIM= 32
##$DECNUC= <off>
##$DECSTAT= 4
##$DIGMOD= 1
##$DIGTYP= 9
##$DL= (0..7)
0 120 120 120 120 120 120 120 
##$DP= (0..7)
150 150 150 150 150 150 150 150 
##$DP07= 0
##$DPNAME0= <>
##$DPNAME1= <>
##$DPNAME2= <>
##$DPNAME3= <>
##$DPNAME4= <>
##$DPNAME5= <>
##$DPNAME6= <>
##$DPNAME7= <>
##$DPOAL= (0..7)
0.5 0.5 0.5 0.5 0.5 0.5 0.5 0.5 
##$DPOFFS= (0..7)
0 0 0 0 0 0 0 0 
##$DQDMODE= 0
##$DR= 18
##$DS= 0
##$DSLIST= <SSSSSSSSSSSSSSS>
$$ [...]
##$SUBNAM2= <"">
##$SUBNAM3= <"">
##$SUBNAM4= <"">
##$SUBNAM5= <"">
##$SUBNAM6= <"">
##$SUBNAM7= <"">
##$SUBNAM8= <"">
##$SUBNAM9= <"">
##$SW= 17.3497169576618
##$SWIBOX= (0..15)
0 0 2 0 0 0 0 0 0 0 0 0 0 0 0 0 
##$SW_h= 3472.22222222222
##$TD= 16384
##$TD0= 1
##$TE= 0
##$TE2= 300
##$TE3= 300
##$TEG= 300
##$TL= (0..7)
0 120 120 120 120 120 120 120 
##$TP= (0..7)
150 150 150 150 150 150 150 150 
##$TP07= 0
##$TPNAME0= <>
##$TPNAME1= <>
##$TPNAME2= <>
##$TPNAME3= <>
##$TPNAME4= <>
##$TPNAME5= <>
##$TPNAME6= <>
##$TPNAME7= <>
##$TPOAL= (0..7)
0.5 0.5 0.5 0.5 0.5 0.5 0.5 0.5 
##$TPOFFS= (0..7)
0 0 0 0 0 0 0 0 
##$TUNHIN= 0
##$TUNHOUT= 0
##$TUNXOUT= 0
##$USERA1= <user>
##$USERA2= <user>
##$USERA3= <user>
##$USERA4= <user>
##$USERA5= <user>
##$V9= 5
##$VALIST= <valist>
##$VCLIST= <CCCCCCCCCCCCCCC>
##$VD= 0
##$VDLIST= <DDDDDDDDDDDDDDD>
##$VPLIST= <PPPPPPPPPPPPPPP>
##$VTLIST= <TTTTTTTTTTTTTTT>
##$WBST= 1024
##$WBSW= 4
##$XGAIN= (0..3)
0 0 0 0 
##$XL= 0
##$YL= 0
##$YMAX_a= 693939
##$YMIN_a= -695977
##$ZGOPTNS= <>
##$ZL1= 120
##$ZL2= 120
##$ZL3= 120
##$ZL4= 120
##$ABSF1= 10
##$ABSF2= 0
##$ABSG= 5
##$ABSL= 3
##$ALPHA= 0
##$AQORDER= 0
##$ASSFAC= 0
##$ASSFACI= 0
##$ASSFACX= 0
##$ASSWID= 0
##$AUNMP= <proc_1d>
##$AZFE= 0.1
##$AZFW= 0.1
##$BCFW= 1
##$BC_mod= 2
##$BYTORDP= 1
##$COROFFS= 0
##$CY= 11.3945322036743
##$DATMOD= 1
##$DC= 2
##$DFILT= <>
##$DTYPP= 0
##$F1P= 2.36226072786647
##$F2P= -0.459571619588291
##$FCOR= 0.5
##$FTSIZE= 0
##$FT_mod= 4
##$GAMMA= 1
##$GB= 0.15
##$INTBC= 1
##$INTSCL= 1
##$ISEN= 128
##$LB= 0.24
##$LEV0= 0
##$LPBIN= 0
##$MAXI= 10000
##$MC2= 0
##$MEAN= 0
##$ME_mod= 0
##$MI= 1.114404
##$NCOEF= 0
##$NC_proc= 0
##$NLEV= 6
##$NOISF1= 3.799351
##$NOISF2= 2.8
##$NSP= 1
##$NTH_PI= 0
##$NZP= 0
##$OFFSET= 15.70392
##$PC= 1
##$PHC0= -13719
##$PHC1= 11.80085
##$PH_mod= 1
##$PKNL= yes
##$PPARMOD= 0
##$PSCAL= 0
##$PSIGN= 0
##$REVERSE= no
##$SF= 200.130013532006
##$SI= 16384
##$SIGF1= 3
##$SIGF2= 2
##$SINO= 400
##$SIOLD= 16384
##$SREGLST= <1H.CDCl3>
##$SSB= 0
##$STSI= 0
##$STSR= 0
##$SW_p= 3612.71676300578
##$SYMM= 0
##$S_DEV= 0
##$TDeff= 0
##$TDoff= 0
##$TI= <>
##$TILT= no
##$TM1= 0
##$TM2= 0
##$TOPLEV= 0
##$USERP1= <user>
##$USERP2= <user>
##$USERP3= <user>
##$USERP4= <user>
##$USERP5= <user>
##$WDW= 1
##$XDIM= 8192
##$YMAX_p= 0
##$YMIN_p= 0
$$ End of Bruker specific parameters
$$ ---------------------------------
##NTUPLES= NMR FID
##VAR_NAME=  TIME,          FID/REAL,        FID/IMAG
##SYMBOL=    X,             R,               I
##VAR_TYPE=  INDEPENDENT,   DEPENDENT,       DEPENDENT
##VAR_FORM=  AFFN,          ASDF,            ASDF
##VAR_DIM=   8192,          8192,            8192
##UNITS=     SECONDS,       ARBITRARY UNITS, ARBITRARY UNITS
##FACTOR=    0.000288,      1,               1
##FIRST=     0,             0,               0
##LAST=      2.359008,      0,               0
##MIN=       0,             -695977,         0
##MAX=       2.359008,      693939,          0
$$ Real data points
##PAGE= N=1
##DATA TABLE= (X++(R..R)), XYDATA
0@%%%%%%%%%Qj6J6j8J9k6L7m5N8o9Q5j07J24j49J75k03K42k80L25l77M30m95N67
$$ 0 0 0 0 0 0 0 0 0 0 8 -8 8 -10 9 -17 20 -25 33 -36 49 -58 66 -83 92 -111 131 -149 176 -201 229 -266 301
32C01o43P29q23R29j045J171j312J464j633J817k014K236k475K735l024L333l673
$$ 301 -342 387 -436 493 -552 619 -693 771 -862 955 -1059 1177 -1298 1437 -1587 1746 -1927
49a927M048m456M910n411N970o594P289q083Q989j0036J1264j2721J4495j6703
$$ -1927 2121 -2335 2575 -2836 3134 -3460 3829 -4254 4735 -5301 5963 -6758 7737 -8966
63h966J9540k3348K8749l7078N1767q5378L09226L2364n87979k85572j02129L19434
$$ -8966 10574 -12774 15975 -21103 30664 -54714 254512 286876 -301103 -586675 -688804 -369370
75c69370M84469M33437J12822j64828m56139m72358k38117J20909L54404M84350
$$ -369370 115099 548536 661358 496530 40391 -431967 -670084 -549175 -194771 289579
85B89579L34629l623l21962m36035l94335j21562K32895M37657L98641K14863
$$ 289579 624208 620585 298623 -137412 -531747 -653309 -420414 17243 415884 630747
95F30747j09964l95064m41745k59129N722L00881M54319L37835N8340k09962m06516
$$ 630747 520783 125719 -316026 -575155 -569433 -268552 185767 523602 581942 371980 -34536
106c4536m01967j56328J50129L48456M06422K57315n5472l14607l90894l06055
$$ -34536 -436503 -592831 -442702 -94246 312176 569491 514019 199412 -191482 -497537
116d97537o0174K44807L95019L32202J36910j39301l66699l76509j91931N6753
$$ -497537 -557711 -312904 82115 414317 551227 411926 45227 -331282 -523213 -466460
126d66460K92035L95456K67754Q606k25356l64614l28662r9452J70002L29734
$$ -466460 -174425 221031 488785 497391 272035 -92579 -421241 -520693 -350691 -20957
136b0957L43437J88575q5741l01455l47349k39430j0927K42277L55937K77966
$$ -20957 322480 511055 425314 123859 -223490 -462920 -473847 -231570 124367 402333
146D02333Q1201j59403l34122l22574j42563Q9644K81987L42358K13192k3423
$$ 402333 483534 324131 -9991 -332565 -475128 -385484 -103497 238861 452053 428630
156D28630k31266l29324k68006n7889J78687L10437K93789J33258j06096k85567
$$ 428630 197364 -131960 -399966 -457855 -279168 31269 325058 458316 352220 66653
166F6653l10024j87009K7888K36988L19359K33630L8794j75156l05228k75053
$$ 66653 -243371 -430380 -402492 -165504 153855 387485 426279 251123 -54105 -329158
176c29158j02607J14282K72938K96770J65588m9381k33672l00310k15583k0030
$$ -329158 -431765 -317483 -44545 252225 417813 368432 134760 -165550 -381133 -401163
186d01163J84241K91688K52154Q4758j25080k69032k76668j43228O2506K33734
$$ -401163 -216922 74766 326920 411678 286598 17566 -259102 -402330 -339824 -106090
196a06090K85465J93771L030j89373k81122k30694o7193J33744K66014K57074
$$ -106090 179375 373146 376176 186803 -94319 -325013 -392206 -258462 7552 264626
206B64626J21300p1434k33459k74975j70126J4062J87311K73380K16334M3929
$$ 264626 385926 314492 81033 -193942 -364068 -350006 -162695 110685 327019 370948
216C70948j41662k52991k45447j07452R0492K30428K54024J58976k4517j99646
$$ 370948 229286 -23705 -269152 -376604 -286112 -55684 198340 357316 332799 133153
226A33153k59858j91756l7460J46664K58144K23679Q3819q8756k29477k52909
$$ 133153 -126705 -318461 -355921 -209257 48887 272566 356385 267629 38152 -214757
236b14757j33042M2717J88250K54292J86920J0953j55552k37902k16369p7981
$$ -214757 -347799 -305082 -116832 137460 324380 335333 179781 -58121 -274490 -352471
246c52471J12150K27684K25641J27789m6694k06229k41662j57270j0602J55826
$$ -352471 -240321 -12637 213004 340793 294099 87870 -153792 -311062 -321664 -165838
256a65838K49233J95354N0005j04651k23751k31429j01080O8452J89321K34638
$$ -165838 83395 278749 328754 224103 352 -231077 -332157 -263705 -74384 160254
266A60254J58890j7160j67989k23447j87544n0542J29832K24276J99425R6074
$$ 160254 319144 301984 133995 -89452 -276996 -327538 -197706 26570 225995 322069
276C22069o5875k09528k24187j24972J5647J62297K37869J68657J8835j19337
$$ 322069 256194 46666 -177521 -302493 -286846 -124549 113320 281977 300812 181475
286A81475k15246k08599p2281R0639J89715K13046J31103m0872j76783k09129
$$ 181475 -33771 -242370 -314651 -224012 -34297 178749 309852 268980 92197 -116932
296a16932j58579k4710J42261K18332J74630O6241q2837k07695k06379r5518L9296
$$ -116932 -275511 -300221 -157960 60372 235002 301243 218406 10711 -195668 -291186 -251890
307b51890J65638K22333J43953o682j31491k04403j84363m7956J07289J87810
$$ -251890 -86252 136081 280034 273352 141861 -62542 -246905 -294861 -187572 238
317B38J91188J04120n8041j80691j95166j30996k461J48111K09904J52305M0253
$$ 238 191426 295546 237505 56814 -138352 -269348 -271809 -123698 86206 238511 278764
328B78764r5394k00996j88014p1897N8280J65445K05515J21818k6532j39820j92631
$$ 278764 183370 -17626 -205640 -277537 -219257 -53812 151703 273521 246989 107169 -85462
339h5462j60744k7561J18201J84244J70577P9496p1116j80605j81701j06128J7487
$$ -85462 -246206 -273767 -155566 28678 199255 278751 207635 27030 -154671 -260799 -243312
350b43312J50940J99011J32953J6506j06529j92526j69256n1093P5572J65758
$$ -243312 -92372 106639 239592 256098 149569 -42957 -212213 -263306 -187734 -21976
360b1976J86478R9618m3181j46895j81452j35938p458J26558J80252J50891N3673
$$ -21976 164502 264120 220939 74044 -107408 -243346 -250804 -124246 56006 206897 260570
371B60570q4234j78090j67733q2661L8732J53141J85646J13432n450j18237j82941
$$ 260570 176336 -1754 -169487 -252148 -213416 -60275 125371 238803 233353 115116 -67825
382f7825j48621l0949R0914J65774J67095P6257n8272j52465j70120j10572J2967
$$ -67825 -216446 -247395 -156481 9293 176388 252645 194373 41908 -128212 -238784 -225817
393b25817J32297J74528J31285K8621r6611j72731j52787o0246N8158J54115J70308
$$ -225817 -93520 81008 212293 240914 144303 -28428 -181215 -241461 -183303 -29188 141120
404A41120R3816k5037j28338j72008j26711j2110J02638J64318J47199N3075p0653
$$ 141120 234936 209899 81561 -90447 -217158 -229268 -126630 37688 184887 237962 167309
415A67309j53842j58586q6702L1750J34789J65864J13730N846j06580j64820j36774
$$ 167309 13467 -145119 -231821 -200071 -65282 100582 214312 220158 113578 -51242 -188016
426a88016m1174P4628J53183J53510P5311m0367j35364j60872j04631L895J10613
$$ -188016 -229190 -154562 -1379 152131 227442 187075 51711 -109161 -213792 -209897 -99284
437i9284J61198J28400L0998q0467j52122j46691o4688M9118J35104J55218R6546
$$ -99284 61914 190314 221312 140845 -11277 -157968 -222656 -173538 -38434 116784 213330
448B13330j4157j15186j55170j20206k3569Q8574J51405J35682N6248n3508j39706
$$ 213330 199173 83987 -71183 -191389 -214958 -126384 25021 160703 216951 163443 23737
459B3737j49636q2526J9949J15694J55851J10270R427q9254j47498j33723m4130
$$ 23737 -125899 -208425 -188476 -72782 83069 193339 202766 113512 -33986 -167709 -211839
470b11839O5176J34490J42226P9059l2218j22461j44291j01477o654R9200J48513
$$ -211839 -146663 -12173 130053 209112 176894 54433 -89858 -191335 -197989 -98789 49724
481D9724J17103L6711o4921j41109j37149o0799L5604J18228J47942R2247j0503
$$ 49724 166827 203538 138617 -2492 -139641 -200440 -164836 -46608 101334 193581 183078
492A83078r7013j40571j18811k5272P8467J32012J27506O2014m6940j26768j32896
$$ 183078 86065 -54506 -173317 -198589 -120122 11890 139396 201410 154470 27702 -105194
503a05194q2293P837J06067J43698R9395J8339p3138j39052j24685m1464M8966
$$ -105194 -187487 -179650 -73583 70115 169510 187849 114711 -24341 -149026 -190490 -141524
514a41524J17999J37773P5973k7042j02243j31585j03560r941Q8754J28358J11871
$$ -141524 -23525 114248 190221 163179 60936 -70649 -174209 -184150 -95396 32962 144833
525A44833M5749n7433j28186j21643o4325K0802J09965J36344Q3485J471p9893
$$ 144833 190582 133149 4963 -116680 -181005 -160203 -50238 86106 169591 171062 91169
536I1169j34014j11709k4540O0784J16341J25708O0481m1027j06288j22251q7047
$$ 91169 -42845 -154554 -179094 -118310 -1969 123739 184220 143193 36905 -85346 -172393
547a72393M404R5935J24208R6464K9216o6604j27444j10390m6476L3885J10570
$$ -172393 -167989 -72054 52154 148618 177834 111230 -16214 -126604 -173080 -139195 -28625
558b8625J28333O8469j4672q5758j27223r8129r170P1094J14106J12453M5013
$$ -28625 99708 168177 153505 67747 -59476 -157605 -166775 -95681 18425 130878 175891
569A75891n2006j09172j12356p0709J7309J00551J19281Q1781J3012p3664j24502
$$ 175891 123885 14713 -97643 -168352 -151043 -50492 68789 150570 163582 89918 -34584
580c4584r9115l0468M5489J10599J17898N4544k7889r0747j19203q4117L764P9208
$$ -34584 -133699 -164167 -118678 -8079 109819 164363 136474 45727 -73476 -157593 -153829 -74621
592g4621J11236R8516L0357o0513j09690j03078n4537K8971J02625J12826O8270
$$ -74621 36615 135131 165488 104975 -4715 -107793 -162330 -133359 -30734 82092 150362
603A50362j883p9309j19095q8113j6293N6098J08624J06831M1420l9364r4399
$$ 150362 148479 69170 -49925 -138038 -154331 -98233 10391 117222 158642 119278 24879
614B4879j10445o9046J4895Q4741J07987Q4755J5952o7353j08908r3569l8525
$$ 24879 -85566 -154612 -139717 -54976 53011 137766 153718 86365 -22543 -116112 -154637
625a54637L9785J02220J05997N5478j6211q3994j11870p6582l478O5260J06149
$$ -154637 -114852 -12632 93365 148843 132632 48638 -63232 -139814 -143292 -78032 28117
636B8117R4247K8566m8674r7292j01036n3892K5524Q8713J03759P0698J136p2379
$$ 28117 122364 150930 102256 4964 -96072 -149964 -124440 -35727 68032 138730 139866 67487
648F7487j05994q4008k3279N0512J00718R6806M3255k9316q7853j03732o3941
$$ 67487 -38507 -122515 -145794 -95282 5436 102242 145497 116181 28328 -75404 -139345
659a39345P841P3374J02974Q0621J5854n6363r8383r1684l8359L5188R0094R8753
$$ -139345 -131504 -58130 44844 125465 141319 84956 -13427 -105111 -143470 -108282 -18188 80565
671H0565N7423j2539p6511j00850p4296r890N9509R7764Q6993L2012l9660r0685
$$ 80565 137988 125449 48938 -51912 -126208 -136098 -76589 21175 108168 140180 100520 9835
683I835r4719n1356J7096P8648R8773O7970M283o1330r7523q2570k4682M3094
$$ 9835 -84884 -136240 -119144 -40496 58277 126247 130530 69200 -28323 -110893 -135575 -92481
695i2481Q9234R2447M6073k4193p8875r4412o4865J257O6490R4184P6155K1988
$$ -92481 -3247 89200 135273 111080 32205 -62207 -127072 -125815 -59325 34859 111014 133002
707A33002m7639r1941q5668l9034K5349Q1428R4508N5092o656o4946r4762p3717
$$ 133002 85363 -6578 -92246 -131280 -105931 -24503 70005 125097 118441 53495 -41267 -114984
719a14984j1737N0527Q6895Q5431L5261l5064q0565q6995n4612J0972P2587Q9939
$$ -114984 -126721 -76194 10701 96132 131393 96329 15764 -71231 -125843 -114871 -42284 47655
731D7655O4849J1896n4231r2040p6379k6666L2730Q3008Q9104M3351j7834o7621
$$ 47655 112504 124400 70169 -21871 -98250 -124916 -92186 -9178 79926 123277 105443 37822
743C7822r0790o4576N86N7211Q4199P6503K4586m4000q2036p8540m3739K0093
$$ 37822 -52968 -117544 -116958 -59747 24452 100955 125541 81541 -495 -79035 -122774 -102681
755a02681P6525Q5325N3586J339n8909r0714o7148j4478L9852Q2074Q2703L2338
$$ -102681 -26156 59169 112755 114094 55185 -35529 -102677 -117155 -77303 4771 87474 119812
767A19812k7708o9664q4876n5133J0784O2927Q0713O6709J4824n1125q1819p0694
$$ 119812 92104 22440 -62436 -117569 -106785 -43858 36855 103564 118388 67263 -14556 -85250
779h5250l2651K7690P8718Q0271M2631q347o2333q7338n8889l363M6127Q0491
$$ -85250 -117901 -90211 -11493 68778 111409 103062 40729 -46609 -105498 -108861 -62734 17757
791A7757P4963K2440l6557p0629p8228m5075J9341O7084P6850N6380N007n6076
$$ 17757 92720 115160 78603 7974 -70254 -115329 -95988 -28904 47946 104326 109333 53257
803E3257q1011o2447k1366L4849P9130P4420L1934j8266o4679q2617m9522O896
$$ 53257 -27754 -90201 -111567 -76718 2412 76832 108766 90500 25821 -56796 -106318 -99422
815i9422N2030P7813O6007J2362m3966p1602p0608l4212K7437P0081P2336M5640
$$ -99422 -47392 30421 96428 108790 64824 -6778 -77386 -111598 -84161 -14080 58256 103896
827A03896m896o0228p8738n3981r985M1741P7715O7782K1871k7473o6627p6351
$$ 103896 99000 38772 -39966 -93947 -103932 -62191 15524 83306 105177 77704 11077 -65274
839f5274m0106J6130N6909P3757N6556L119m9651p1656o2423k3277L4244P1195
$$ -65274 -105380 -89250 -32341 41416 97972 101091 51440 -20216 -82639 -105916 -71672 -477
851d77O7231L5355j4445o2660p4623m6142L94M7366P5009O0298J2661l5133o7412
$$ -477 66754 102109 87664 25004 -49619 -95761 -95367 -48001 27008 87306 99967 64834 -2578
864b578o8913l0884K3258O0661O9605M6487n471n3304p0442n4739j2744L9720
$$ -2578 -71491 -102375 -79117 -18456 51149 97636 92165 38861 -31581 -86320 -99064 -59344
876e9344P0369O2045K5760k3013o3341o9780l8509R313N1977P1265N2316N025
$$ -59344 11025 73070 98830 75817 12476 -57304 -95813 -86500 -34523 36742 89058 94083
888I4083m1569o7253o1424k1869K9221O2649O5676L6243j3177n5897o8071m6991
$$ 94083 52514 -14739 -76163 -98032 -68811 -6162 59514 95757 82580 26683 -41388 -88379
900h8379k826M4346O8409N6456J6787l1018o3855o3550l0825J7184N6233O7191
$$ -88379 -91205 -46859 21550 78006 94793 63775 -80 -63630 -94455 -77271 -21038 46153
912D6153M3357k637m6446o7190n3276j2148L4420O3782O0739K6432k1307n7237
$$ 46153 89510 86873 40427 -26763 -80039 -92187 -57767 6015 66754 93186 71879 14642
924A4642o4924l9378P067M8758O5236N0074Q304l8156o3686n6986k2610K4341
$$ 14642 -50282 -89660 -82593 -33835 31401 81475 89779 51623 -12063 -69049 -91659 -67318
936f7318N9359O2253L4239r624n0335o5645m5194l171L8693O3439N5722J6870
$$ -67318 -7959 54294 88533 78909 28574 -37071 -82265 -85436 -46743 16696 72418 89288
948H9288k8288n7530o0727l2106J5446N2259O1410M3050J062m3578o2777m9854
$$ 89288 61000 3470 -57257 -89363 -73917 -21658 39752 82802 83864 40286 -22491 -72345
960g2345j5237K9689O1204N7464K5413j5943n2429o3512l7615N466M1911O1643
$$ -72345 -87582 -57893 3311 60775 86188 70245 17816 -45696 -83311 -77845 -35934 25709
972B5709N0314Q802l4424n7124n5388k5262K2258N4900N7064L5659n403m7935
$$ 25709 76023 84825 50401 -6723 -62111 -87373 -65115 -10215 46849 82508 77105 29170
984B9170o1243m2425p413L4045O1411N2321J6871k1974n3173o0311l0541J3347
$$ 29170 -32073 -74498 -81911 -47866 13545 65866 82737 60763 7590 -52721 -83262 -69915
996f9915M4990N9123M4072J044m0167n6034m9457j7986K8684N6890N2377K7488
$$ -69915 -24925 34198 78270 79314 39147 -16887 -66344 -84330 -55646 1244 53621 81109
1008H1109j1887n1143n9143l5034P30L8205O0446M7152Q338k8200n3526n5824
$$ 81109 69222 18079 -41064 -76098 -75368 -37163 23283 70435 78773 50573 -2953 -58777
1020e8777k3194K0692M7768N4987L7572n936m4710n4757m2810j0366L3413N7427
$$ -58777 -81971 -61279 -13511 41476 79048 73112 28402 -26355 -69165 -79531 -46118 11309
1032A1309M7652J9636j7872n2770n6208k8113Q100M1077N8686M1289J275l3454
$$ 11309 58961 78597 60725 7955 -48253 -76366 -68266 -27189 31497 72786 74061 40607
1044D0607n2820n0418j6629K6437M9403N1213L0551j2346m7307n3067l6328l376
$$ 40607 -12213 -62631 -79260 -52823 -3420 47793 78344 65998 18691 -34376 -70704 -74080
1056g4080L7158N6872M2940J2370k3404n2907n2714k1479J4450M3425N5558L5434
$$ -74080 -36922 19950 62890 75260 51856 -1051 -53765 -75244 -60794 -17369 38189 73623
1068G3623n121l7572n1755m4530j0198L1024N0636M6892K3001j7333m9120n0799
$$ 73623 68502 30930 -20825 -65355 -75553 -44529 6107 52999 76000 58667 9547 -41252
1080d1252k9953L591L9986N5499L7984N058k8361n2558m8151j5500K0846M5679
$$ -41252 -71205 -67614 -27628 27871 65855 70913 42552 -10006 -58157 -73657 -52811 -7132
1092g132N1659K9116j1155m1025n0718l8149l361L4884N1266M2153J5653k2974
$$ -7132 44527 73643 62488 21463 -29255 -67404 -70765 -35881 15385 57538 73191 50217
1104E0217m9983m7825k3335J0552M2528N2819L2845j608l3624n1312m2683r336
$$ 50217 234 -47591 -70926 -60374 -17846 34973 67818 66210 32586 -18726 -61409 -70745
1116g0745K6141M7290M7215K2095j6193m3767m8745l1619L359L7841N0312L7929
$$ -70745 -44604 2686 49901 71996 55803 12036 -36709 -68328 -64969 -27128 23184 61113
1128F1113Q129k7590m9573m4340j7700J7192M4255M9266K7534p281l7493m9885
$$ 61113 69242 41652 -7921 -52261 -69961 -52769 -8514 40752 68286 61005 23512 -26373
1140b6373l6773l865L0237M8171M2710J5366k0419m5423m6552k5116R503L9587
$$ -26373 -63146 -67011 -36774 11397 54107 69473 49054 3631 -42921 -68037 -58534 -18947
1152a8947M8900L3362J374l1347m8588m0536j2141K2442M5643M5280K2207j2267
$$ -18947 29953 63315 64689 33342 -15246 -55782 -67923 -45481 162 45442 67649 55382
1164E5382m0448m7974l0826J491L3004M8257L8359Q717k4313m5364m4251j8951
$$ 55382 14934 -33040 -63866 -62375 -29371 18886 57245 65962 41649 -3715 -47966 -66917
1176f6917J5243M0712M6463K9104m872l5362m6436l6043o885K7226M6459M0828
$$ -66917 -51674 -10962 35501 64605 59733 24371 -22065 -58108 -64993 -37767 8692 49520
1188D9520J6171j6387m3002m5598k4402O815L5556M7698L3459J826k8022m4900
$$ 49520 65691 49304 6302 -39296 -63698 -56883 -21327 26371 59830 61656 33634 -11266
1200a1266m0871j3051K1053M1674M3298K3879j0401l8673m4544l0473j562L1138
$$ -11266 -52137 -65188 -44135 -2461 40837 64716 54315 15642 -28902 -59375 -60937 -29799
1212b9799M6449L5935J0184k0315m4018m2808j8368J2230L6698M6265K8639m292
$$ -29799 16650 52585 62769 42454 -1564 -44372 -62740 -50510 -13812 32453 61092 56800
1224E6800l1166m3729l6754p573K5750M1924L9132J9095j5340m0608m1900k4924
$$ 56800 25634 -18095 -54849 -62422 -36672 5252 44384 63479 48139 7531 -34369 -59293
1236e9293L019L4014M5700L1195M406k3705m4171l9671j2284J6913L7609M3666
$$ -59293 -56274 -22260 23440 54635 59041 35336 -8835 -48506 -60790 -43877 -6268 37398
1248C7398K3996r585l4118m1595l2391k697K9669M1829L5095J3678j9122m2229
$$ 37398 61394 51809 17691 -23904 -56295 -58992 -29323 12506 47601 61279 42157 -72
1260g2l9278j9312Q037L5762M4522K6335j333k6786m3279l6194o961K1787L8239
$$ -72 -39350 -58662 -50625 -14863 29659 55994 54661 27875 -15404 -51598 -58559 -36772 1467
1273A467M0122J9063j4963l5917l9612k7215K440L2590M1534L0582P837k2801
$$ 1467 41589 60652 45689 9772 -29840 -57055 -54615 -22025 19509 50091 57928 35127
1285C5127m2761l6142j3549J2994L7034M2479K1500p039k9629m1888l1918j569
$$ 35127 -7634 -43776 -57325 -44331 -7297 35182 56682 49643 20014 -21874 -53792 -55361
1297e5361K5802L8568L6040J4028j9084l8028l6955k1866P338L4962M0362K5989
$$ -55361 -29559 9009 45049 59077 39993 1965 -34990 -56856 -49518 -14556 25806 51795
1309E1795K391k5868m2349l2933q422J7432L7476L9820J7066j1547l2171l9945
$$ 51795 54186 28318 -14031 -46964 -55386 -37954 -478 39342 56408 44861 12690 -27255
1321b7255k7240K765K8801L8305L2237Q561k2184l8479l4713j6357J1481L5997
$$ -27255 -54495 -51730 -22929 15376 47613 56174 33990 -4489 -39202 -55559 -44078 -8081
1333h081L8782K2137k983k8580m1031k9433l612K1389L7710L6137J2777j5472
$$ -8081 30701 52838 49855 21275 -19756 -49189 -52801 -31412 6298 42435 55212 39740
1345C9740l4070l7640k2400O808L1253L7847K7660L490k4798l8826l1754j1404
$$ 39740 5670 -31970 -54370 -47562 -16309 21538 49198 52688 27890 -10936 -42690 -54094
1357e4094J5968L6467L6834J7891q133l0613l9145k5585N22K5112L7628L2143
$$ -54094 -38126 -1659 35175 53066 44933 14320 -24825 -50410 -49888 -24776 12852 44995
1369D4995Q333j9238l5502l4960j7136J0774L2927L6420K3178r39k7430l8113
$$ 44995 53328 34090 -1412 -36372 -53508 -42734 -9807 26613 49791 48852 21422 -16691
1381a6691k9029n995K0046L6735L3674J3758j2599l2809l6600k1447M714K8008
$$ -16691 -45720 -51715 -31669 5066 38740 52498 39899 7090 -29510 -50957 -46243 -18235
1393a8235L7185K7629L825k2064l6265l2158j1760J4496L3446L5446J9372o927
$$ -18235 18950 46579 50404 28340 -7925 -40083 -51843 -37347 -3901 31545 50917 43990
1405D3990k9000l6302k6039r64K3111L5997L0291R432j6068l4116l3128j6149
$$ 43990 14990 -21312 -47351 -48315 -25204 10793 41084 50516 34448 332 -32796 -48945
1417d8945Q291K9518L5057K2160M87k3955l5731k9389o810J7781L3236L3503J5520
$$ -48945 -40654 -11136 23921 46081 46568 22613 -13118 -42507 -49317 -31536 1700 35203 50723
1430E0723j1256l0555l4299k2713K271K6339L5334K6870O390j9252l5191l0954
$$ 50723 39467 8912 -25387 -48100 -45829 -19490 15844 42714 49104 29852 -5339 -36293
1442c6293j2651J1037L1357L5285J9144n142k5394l5485k6505k375K0935L3023
$$ -36293 -48944 -37907 -6550 28735 47879 42737 17343 -18142 -44647 -47022 -26087 6936
1454F936L0969J1602j5189l1435l1853j8875N753K8873L4054K2905K466k1754
$$ 6936 37905 49507 34318 2883 -28970 -47845 -42092 -13219 20835 43740 46206 24452
1466B4452l5458k8117p895J4323L1874L3453J4923r140k6803l4220k3201J936
$$ 24452 -11006 -39123 -47018 -32695 -821 32632 47555 38415 11612 -22608 -45809 -43873
1478d3873K3667L2120K8040P745j8376l2198k9462j4831R285L0468L2874J8604
$$ -43873 -20206 11914 39954 47699 29323 -2875 -32337 -47168 -37883 -7415 25459 44063
1490D4063j408k3745l5003k5081l501J6923L1963L1336J1206j3011k7608l2452
$$ 44063 42655 18910 -16093 -41174 -44675 -27752 4211 35547 46753 33742 6134 -26318
1502b6318j9829N604K5892L1401K4276M450k1227l2556k6633j0680J2063L1388
$$ -26318 -46147 -40543 -14651 16750 41026 45476 24249 -8307 -34940 -45620 -33557 -2169
1514b169L1141J5156n323k5048l4199k2047N74J9501L1397K8635P730j6175k8649
$$ -2169 28972 44128 38805 13757 -20442 -42489 -41915 -22414 8983 37618 45348 29173 524
1527E24l0151j6097Q929K7738L0157K0705O12k3264l2485k3646o750J5078L1536
$$ 524 -29627 -45724 -36795 -9057 21100 41805 42417 19153 -13332 -36978 -43728 -28650 2886
1540B886K9299J1370r024k6351l2451j8923M417K2145L0646K5234M049j9032k9208
$$ 2886 32185 43555 34531 8180 -24271 -43194 -38777 -16632 14014 39248 43297 24265 -4943
1553d943k7335j2422J2253K8776K8914J6833l244k4880l1906k0747k355J7669
$$ -4943 -32278 -44700 -32447 -3671 25243 42076 38832 13952 -17954 -38701 -41056 -23387
1565b3387L1496K6839P568j2604k7480l0224j5408P937K4077K9835K1682K65k1326
$$ -23387 8109 34948 42516 29912 2432 -27792 -43200 -35263 -11186 18649 40331 40596 19270
1578A9270k9468k4534p977J4718K9517K7199J2986p085k5827l0502j8100J676
$$ 19270 -10198 -34732 -42709 -27991 1526 28725 41711 34626 8799 -21703 -39803 -38127
1590c8127J9919L0759K4010M283j5674k7838k7643j1866J0541K5704K8332J8154
$$ -38127 -18208 12551 36561 40844 25170 -2668 -30311 -42177 -31636 -5932 22400 40554
1602D0554l254k2742k9243k1721m173J7153K9524K5121R633j0505k6560k8749
$$ 40554 37300 14558 -14685 -36406 -40579 -23426 6098 31219 40852 30347 3787 -24962
1614b4962j5257N119K2250K9418K1068J246j8118k8315k4885q336J2929K6600
$$ -24962 -40219 -35100 -12850 16568 37636 38882 20764 -7551 -32436 -40772 -27843 -1243
1626a243K7039J4320o257k3561k8888j8941k19J9362K8561K3234O310j3738k7114
$$ -1243 25796 40116 33859 10298 -18590 -37531 -37750 -18388 10173 33407 39717 25979 -1135
1639a135k6581j2109P908K4275K7836J7702j576k0171k8323k2065m425J4856K7102
$$ -1135 -27716 -39825 -31917 -7642 20194 37896 36320 16149 -12174 -34239 -38664 -23808 3294
1652C294K5723J0321r529k4405k7451j6245L601K1096K7447K0954L333j6971k7095
$$ 3294 29017 39338 29809 5404 -22047 -38292 -34691 -13595 13852 34806 38139 21168 -5927
1665e927k3692r307J0581K5633K6471J4069m688k1322k8307j9203n82J6951K7029
$$ -5927 -29619 -38926 -28345 -2712 23759 37828 33140 11818 -16489 -35692 -36274 -19323 7706
1678G706K3644P051j2800k4933k5532j3552P041K2784K6214J7890M15j9228k7330
$$ 7706 31350 38401 25601 668 -24864 -38416 -31375 -8591 17623 35513 35928 16700 -10630
1691a0630k0760o123J3089K6429K4680J0396p226k2759k7252j6121K739J8529
$$ -10630 -31390 -37513 -24424 2005 26685 37081 29855 7096 -20156 -36277 -33538 -15009
1703a5009K6503K1696L753j5517k4972k3668j0655R894K4060K4705J5047k383
$$ -15009 11494 33190 36943 21426 -3546 -27214 -37869 -27975 -3915 20790 35837 33454
1715C3454k0866k6874j8294k649J4613K6603K3090O992r884k3101k6112j3544
$$ 33454 12588 -14286 -32580 -35229 -20616 5987 29077 36069 26185 3084 -23028 -36572
1727c6572O060J9946K5425J9219P28j7831k4465k1328q025J2263K5125K3039J2021
$$ -36572 -30512 -10566 14859 34078 34806 16975 -7490 -28818 -36843 -24580 545 23584 35605
1740C5605n183k2204k6215j5291K65J6378K6471K1175L811j2675k3050k4425j0913
$$ 35605 30422 8218 -17997 -33288 -33023 -16645 9826 31001 34812 22137 -913 -25338 -36251
1753c6251R073K1094K3939J6861k260j9454k4251j8938m853J4180K5447K1292
$$ -36251 -27178 -6084 17855 34716 32456 13002 -11249 -30187 -35040 -20860 4587 25879
1765B5879Q574p627k2599k5114j2869L497J7718K5708J8823R04j4704k3119k2254
$$ 25879 34453 26826 4227 -20887 -33756 -30259 -12541 13167 31990 32894 18190 -4929 -27183
1778b7183q120J1327K2039K2677J3616m725k0724k3723j6144j745J5728K5317
$$ -27183 -35303 -23976 -1937 20740 34356 29631 8907 -14816 -30960 -32705 -16977 8340
1790H340J9363N530j0063k2837k3574j0272O483J8989K4280J6524j830j6729k2670
$$ 8340 27703 33233 23170 333 -23241 -33513 -27030 -8041 16239 32763 30933 14204 -8466
1803h466k0075n212J3268K2725K0726J0589p102k1412k2932j3506J200J6955K4722
$$ -8466 -28541 -33753 -20485 2240 22966 33555 26453 5041 -17891 -31397 -30197 -13242 11480
1816A1480J7339K954j2234k2920k1726p827Q687K0069K3002J3655l917j8147k2530
$$ 11480 28819 31773 19539 -3381 -25107 -32934 -24247 -4178 18824 32479 28562 10415 -12115
1829a2115j7231k629J4876K2625J9446P552r145k1841k1871j1189M077J8227K3279
$$ -12115 -29346 -31975 -17099 5526 24972 32524 23379 1538 -20333 -31522 -27445 -9218 14061
1842A4061J5668K28j4187k2675j9461n450J0593K0940K1327J0791n914j8858k2277
$$ 14061 29729 29957 15770 -6905 -26366 -31816 -21223 -283 21044 31835 25921 7063 -15214
1855a5214j4642K34J5981K2566J7512M859j1547k1647k0396q898O818J8992K2103
$$ -15214 -29856 -29622 -13641 8925 26437 31296 19749 -1898 -22294 -31192 -24374 -5382 16721
1868A6721J3436k183j5992k2235j7051l119J2565K1250J9655Q182q062j9784k1252
$$ 16721 30157 27974 11982 -10253 -27304 -30423 -17858 3392 23047 31229 23167 3383 -17869
1881a7869j2218L168J6666K2044J6065J789j3480k1458j8834o306Q940K0024K0475
$$ -17869 -30087 -26919 -10253 11791 27856 29645 16165 -5293 -24127 -30433 -21493 -1469 19006
1894A9006J1007m108j7422k1921j4682m73J3953K1556J7893N213r847k0126k0344
$$ 19006 30013 25905 8483 -13438 -28120 -28593 -14640 6916 24809 30022 20175 49 -20295
1907b0295r826N928J7552K1051J4124o87j5248k0888j6826m663J1275K0416J9382
$$ -20295 -30121 -24193 -6641 14410 28534 27847 12599 -8289 -25115 -29778 -18503 1913 21295
1920B1295Q280o030j8669k1304j1948K024J4965K1490J6267J885j1580k0016j9009
$$ 21295 29575 23545 4876 -16428 -28376 -26352 -11387 10103 26370 28255 16675 -3341 -22350
1933b2350p324Q336J8389J9813J1919l123j6731k0372j4541k224J2748K1251J7059
$$ -22350 -29674 -21338 -2949 16864 28783 25660 8929 -11443 -25984 -28208 -15460 5791 22850
1946B2850N757p955j9172k0355r432M336J5960K1034J4244n91j3434j9590j7474
$$ 22850 28607 20652 1480 -18875 -28307 -23971 -8011 13023 27267 26676 13242 -6348 -23822
1959b3822n142J0612J9038J8304R572n140j8223j9523j2143l3J4482K1007J5364
$$ -23822 -28964 -18352 686 18990 28562 23422 5199 -14324 -26467 -26500 -12018 8989 24353
1972B4353K938r766j9381j9167o989O882J6633J9786J2555l043j5090j8869j5833
$$ 24353 27291 17525 -1856 -21023 -28012 -21130 -4497 15289 27844 24801 9711 -9158 -24991
1985b4991k627J2414J9355J6466P392p242j8989j8685r539K300J5228K0792J3424
$$ -24991 -27618 -15204 4151 20617 28009 20767 1778 -16907 -26446 -24146 -8918 11874 25298
1998B5298M59j1492j9475j7527m613R130J7053J8818J0216n224j6406j8350j3427
$$ 25298 25757 14265 -5210 -22737 -27350 -18220 -1167 17651 27867 22643 6237 -12113 -25540
2011b5540n25J3980J9421J4860M716q890j9632j7500p419M782J6226K0091J1404
$$ -25540 -26065 -12085 7336 22196 26912 18022 -1610 -19110 -26529 -21747 -5521 14570 25974
2024B5974k016j3005j9105j5744k415J1037J7435J7162Q038p176j7342j7493j1008
$$ 25974 23958 10953 -8152 -23896 -26311 -15274 2161 19323 27361 20185 2843 -14650 -25658
2037b5658J478J5348J9193J2924K241j0622j9226j6439n098O693J6860J8820R591
$$ -25658 -24180 -8832 10361 23285 25526 14904 -4322 -20761 -25859 -19166 -2306 16514 26105
2050B6105m042j4272j8564j3564p39J2473J7732J5645N683q819j7700j6680r002
$$ 26105 22063 7791 -10773 -24337 -25076 -12603 5129 20774 26457 17638 -62 -16742 -25744
2063b5744L831J5778J8485J1599Q7j2106j8915j4918l242Q849J6786J7723P641
$$ -25744 -21913 -6135 12350 23949 24036 11930 -6985 -21903 -25145 -16296 490 18213 25854
2076B5854n735j5415j7598j1782J318J3606J7693J3992L304j0062j7939j5657
$$ 25854 20119 4704 -12894 -24676 -23358 -9752 7941 21933 25237 15175 -2764 -18421
2088a8421o852N993J6094J7811R742k377j3063j8317j3477j323J0553J7316J5742
$$ -18421 -25273 -19280 -3186 14625 24367 21990 8927 -9390 -22867 -24190 -13637 3679 19421
2101A9421N856p362j6309j6860r487L407J4271J7437J2545P69j1145j7908j4838
$$ 19421 25277 17915 1606 -15254 -24741 -21334 -7063 10374 22919 23688 12543 -5365 -20203
2114b0203m458P808J6466J6894Q130m344j4540j7342j1501J65J1977J7550J4163
$$ -20203 -24661 -16853 -387 16507 24637 20293 5753 -11589 -23090 -22925 -10948 6602 20765
2127B0765L490q854j6717j5959p093N088J4919J7048J0825j456j2667j7066j3311
$$ 20765 24255 15401 -1316 -17275 -24368 -19280 -4361 12687 23512 22056 9389 -7677 -20988
2140b0988k811R811J6581J5096O664o262j5369j6488r370J943J2958J7474J2301
$$ -20988 -23799 -13988 2593 17689 24353 18091 2722 -13766 -23136 -21193 -8235 9239 21540
2153B1540J415j0040j6659j5079m908O922J4960J6435R111l579j3472j6689j1889
$$ 21540 22955 12915 -3744 -18823 -23731 -16809 -1849 14586 23697 20118 6646 -10043 -21932
2166b1932o71J1258J6700J3504M736p514j6155j5562p403L530J3972J7142J0501
$$ -21932 -22603 -11345 5355 18859 23595 16081 -74 -15636 -23039 -19509 -5537 11605 22106
2179B2106q26j0834j6589j3933k938Q828J4959J5333P540n523j4363j5460j0531
$$ 22106 21280 10446 -6143 -20076 -23014 -14186 773 16106 23646 18123 3760 -11700 -22231
2192b2231R68J2571J6442J1827K905q545j6857j4244n290N184J4352J6381Q914
$$ -22231 -21263 -8692 7750 19577 22482 13937 -2920 -17164 -22454 -17270 -2918 13463 22377
2205B2377k941j1422j6247j2856r59J0439J5043J4014N625p004j5126j4545q289
$$ 22377 19436 8014 -8233 -21089 -22048 -11609 3434 17448 23073 16069 943 -13602 -21891
2218b1891K189J3426J6259J0322Q93r797j6539j3382l186O698J4363J5761P041
$$ -21891 -19702 -6276 9983 20305 21198 11401 -5138 -18520 -21706 -15008 -645 15116 22157
2231B2157m398j2647j5289j1148P85J1459J4882J2628L962q489j5450j3668o523
$$ 22157 17759 5112 -10177 -21325 -20540 -9081 5801 18429 22391 13902 -1548 -15216 -21739
2244b1739L918J4055J5916Q512r35j0625j6319j2213j317Q058J4386J4790N584
$$ -21739 -17821 -3766 12150 20662 19727 9102 -7217 -19430 -20747 -12689 1697 16487 22071
2257B2071o332j3111j4694r530K291J2411J4851J1071K254r569j5691j2586m495
$$ 22071 15739 2628 -12066 -21596 -19305 -6894 7957 19028 21282 11713 -3978 -16564 -21059
2270b1059N358J4185J5226P197k717j1474j5856j0979J88R537J4535J3403M148
$$ -21059 -15701 -1516 13710 20907 18190 6716 -9140 -20119 -19931 -10394 4141 17544 21692
2283B1692p705j3815j3882p677L750J2906J4773R572L94j0451j5787j1562k680
$$ 21692 13987 172 -13710 -21387 -17637 -4731 10042 19614 20008 9557 -6230 -17792 -20472
2296b0472O712J4749J4113N823m543j2404j4971r557J642J0964J4443J1797K545
$$ -20472 -13760 989 15102 20925 16382 3978 -10993 -20550 -18908 -7944 6499 18296 20841
2309B0841q952j4199j2846n933N164J3615J4305Q069j497j1482j5134j0574j059
$$ 20841 11889 -2310 -15156 -21089 -15925 -2310 11995 20064 18567 7085 -8049 -18623 -19682
2322a9682Q369J4688J2872M255n979j3201j3987p793L064J1688J4328J0219Q56
$$ -19682 -11313 3375 16247 20502 14523 1322 -12665 -20458 -17394 -5706 8622 18841 19697
2335A9697r840j4426j1909l864O581J3819J3414O556l329j2074j4432r378L97
$$ 19697 9857 -4569 -16478 -20342 -13761 58 13472 20028 16699 4625 -9807 -19185 -18788
2348a8788R821J4463J1757K606p204j3573j3420n868M468J2278J3908Q886j151
$$ -18788 -8967 5496 17253 19859 12655 -918 -14338 -20206 -15738 -3460 10448 19334 18183
2361A8183j0249j4339j0843k191P830J3832J2618N087n043j2534j3660q183K004
$$ 18183 7934 -6405 -17248 -19439 -11609 2223 14841 19928 14885 2351 -11309 -19492 -17488
2374a7488J0916J4048J0331J188q362j4070j1816m329N409J2995J3327P190k800
$$ -17488 -6572 7476 17807 18995 10633 -3437 -15253 -19582 -14173 -1178 12149 19339 16539
2387A6539j1186j3591r957k82R036J3466J1680L697o458j3170j2572o472L317
$$ 16539 5353 -8238 -18195 -18477 -9441 4025 15705 19402 12944 -226 -12798 -19270 -15953
2400a5953J1664J3804Q742n26r282j3918j1073k181O659J2903J2821N655m664
$$ -15953 -4289 9515 18257 17731 8449 -5469 -16542 -18723 -12064 839 13660 19315 14651
2413A4651j1406j3075q797J213J0338J3034J0382K488p726j3549j1484m964M355
$$ 14651 3245 -9830 -18627 -17414 -7076 5958 16340 18828 11102 -2447 -13931 -18895 -14540
2426a4540J2542J2996P161j812r659j3864r998o16P741J2809J1954M161n976j1763
$$ -14540 -1998 10998 18159 16347 6688 -7176 -17174 -17790 -10049 2760 14714 18875 12899 1136
2440A136j2446p272K464J1059J2845R153J132q988j3355j0478l454N417J2705
$$ 1136 -11310 -18582 -16118 -5059 7786 16939 18071 9083 -4272 -14750 -18204 -12787 -82
2453h2J2571N472k930j0394j3225r202J084Q736J2389J1239K672p094j1995j1659
$$ -82 12489 17961 15031 4637 -8588 -17790 -16706 -7970 4419 15658 18330 11236 -759 -12418
2467a2418o071L934J1739J2263P652l64r553j3230r553j827O402J2752J1955M277
$$ -12418 -18489 -14555 -2816 9447 17099 16735 7182 -6048 -15601 -17428 -11026 1726 13681 17958
2481A7958m701j0669j2904p622K492R520J2185R982J414q235j2315j0420m691
$$ 17958 13257 2588 -10316 -17938 -15446 -5926 6259 16241 17655 9420 -2895 -13315 -18006
2494a8006N159J2096J1618O089j601j0197j3092q403j34P365J2696J1006K728
$$ -18006 -12847 -751 10867 16956 15355 5158 -7934 -16337 -16471 -9106 3590 14596 17324
2507A7324n685j1269j1926o212L659J0259J1841Q539J19r063j2453r404k954N939
$$ 17324 11639 370 -11556 -17768 -14109 -3850 7991 16530 16649 7586 -4867 -14271 -17225 -11286
2521a1286J2412J1137M691l139j0356j2817p244J338Q128J2425J0059J520o952
$$ -11286 1126 12263 16954 13815 3459 -9358 -16602 -15264 -7136 5289 15348 16868 9916
2534I916j1268j1141n021M463J1002J1410P225j177r749j2001q531j539O858J2213
$$ 9916 -1352 -12493 -17514 -13051 -2049 9361 16586 15409 5660 -6341 -14872 -16411 -9553 2660
2548B660J0543L476m523j0832j1791n960K208R190J1785Q957K79p744j1604j0008
$$ 2660 13203 16679 12156 1324 -10467 -16427 -14219 -5029 6756 15713 15992 8248 -3356 -13364
2562a3364l561N528J1192J1012N601k408r957j1781p458k82P883J1806R752K334
$$ -13364 -16925 -11397 -205 10807 16408 14000 4043 -7738 -15196 -15478 -7595 4211 13963 16297
2576A6297n778j0840j1348m884L496J0018J1252P588j229p800j1916q643j824
$$ 16297 10519 -321 -11669 -16553 -13057 -3039 8213 15801 14572 6772 -5144 -13787 -15611
2589a5611N858J1462R845M500l597j0410j0908o748J257Q725J1257Q578J530o742
$$ -15611 -9753 1709 11554 16054 12457 2047 -8861 -15609 -14352 -5627 5630 14208 15738 8996
2603H996j1298r850m002M431J0259J0985O222j988r057j1137q480l54P064J1501
$$ 8996 -2302 -12152 -16154 -11723 -1464 9521 15743 13755 4698 -6439 -14919 -15273 -8209 3292
2617C292R589K996n011j0456j0339n815K325R697J0572Q103j12p690j0802q915
$$ 3292 12881 15877 10866 410 -9929 -15744 -13419 -3722 6850 14953 14841 7151 -3651 -12566
2631a2566k690M865J0920R786M459k479r126j0915p044P32P397J0924R229J836
$$ -12566 -15256 -10391 529 10315 14774 12295 3169 -7746 -14790 -14058 -6661 4263 13492 15328
2645A5328n956j0436r866m815L695R910J0725O200q15q202j1250p938j345N794
$$ 15328 9372 -1064 -10930 -15745 -12050 -2140 8585 14785 13970 5768 -5482 -13420 -14765 -8971
2659h971J0815R855L580m060r393j0805o328J967Q796J0271Q054J111p144j0563
$$ -8971 1844 11699 15279 11219 1826 -8979 -15307 -13340 -4544 5727 13781 14892 7748 -2815
2673b815q951l584M443J0477J0003N126j981q410j1267p049J31O490J0701R185
$$ -2815 -11766 -15350 -10907 -430 9573 14699 12718 4308 -6959 -14008 -13877 -7387 3314 12499
2687A2499K496n327r500j0096n186L026R125R921P321p3q016j0613p902k374N194
$$ 12499 14995 9668 168 -9928 -15114 -12088 -2963 6958 14279 14206 6190 -4423 -12325 -14699 -9505
2702i505J0549R611M000k917r111j0670o239J211P121J0534Q687J141o217r733
$$ -9505 1044 10655 14655 11738 2627 -8043 -14282 -13071 -5950 4584 13271 14412 8195 -1538
2716a538r176m456M298R326R725N989j032q436j0207p317j192N830J0759Q791
$$ -1538 -10714 -15170 -10872 -1546 8179 14168 13136 4700 -5507 -12824 -14016 -8186 2573 11364
2730A1364L037l848r390j0330n351K313P945J0155P735M4o742r669q727l161M859
$$ 11364 14401 10553 1163 -9167 -14518 -12205 -4260 5895 13630 13674 6932 -2737 -11464 -14625 -9766
2745i766R867R018M969j910q737j0469o119kO295J0545Q356J752m872r138r857
$$ -9766 101 9119 14088 12178 3441 -7028 -13147 -13149 -6854 3691 12047 13799 8927 -211 -10068
2760a0068m200L429Q100R794O710o56p794r503p908j994N664R970Q690L552k811
$$ -10068 -14268 -10839 -2739 7055 13765 13109 5315 -4188 -12096 -14090 -8426 1544 10234 13786 10975
2775A0975r033j0169n104R21P176J0260P558P16n713r334q987l261M275Q421R380
$$ 10975 1942 -8227 -13331 -12410 -5234 5026 12584 13300 7587 -1747 -10734 -13995 -9720 -1299 8081
2790H081N714j639q095r643o871q36O135R990P997K559l625r226r613m433K026
$$ 8081 13795 12156 4061 -5582 -12453 -13289 -7154 2836 10833 13392 9767 541 -9072 -13505 -11479
2805a1479P759R917O670k22o406r273q286k222M761R258Q506M662k603q462r351
$$ -11479 -3720 6197 12867 12645 6239 -3034 -11320 -13542 -8781 477 8983 13645 11042 2580 -6771
2820f771n955K12O670R877P481J717m882r278q794l784L142Q231R372N731r76
$$ -6771 -12726 -12514 -5844 4033 11514 13231 8349 -929 -9723 -13507 -10365 -2134 7238 12969 11993
2835A1993o949r605p144j345N247R310Q373L411l561q279r283n135J505P068R580
$$ 11993 5044 -4561 -11705 -13050 -7803 1507 9880 13291 9730 1451 -7832 -12967 -11462 -4394 5186
2850E186O885O36n571r414q201k408L538Q634R032M436j711p303r509o262l22
$$ 5186 12071 12707 7136 -2278 -10479 -12887 -9349 -715 8317 12753 11042 3739 -5770 -12032 -12354
2865a2354O086R122P844K263m295q594q723m352K538P666R042N911j2o458r116
$$ -12354 -6268 2854 10698 12961 8666 72 -8651 -13003 -10465 -2799 6243 12154 12142 5684 -3432
2880c432p350j937M526Q958Q271L756k653p697r388n235R13O150R174P263J262
$$ -3432 -10782 -12719 -8193 765 9036 12792 10139 2442 -6946 -12181 -11268 -5118 4056 11319 12581
2895A2581n146q494q175l619L264Q176Q306N529j120p032r033o333j157N182R026
$$ 12581 7435 -1059 -9234 -12853 -9589 -1413 6893 12422 11302 4270 -4763 -11096 -12253 -7071 1955
2910A955P826K615l277p950r073m461J874O793Q722O521J64n539q689p288k688
$$ 1955 9781 12396 9119 1169 -7904 -12365 -10491 -3698 5024 11545 11709 6170 -2519 -9807 -12495
2925a2495M151Q315P808M419j529p623q963n265k63N472Q979P301J706m081p959
$$ -12495 -8344 -29 7779 12198 10669 3046 -5917 -11182 -11445 -5973 3006 10307 12013 7932 -27
2940b7q526l715K639P165Q400N850m26o671q181o729j938M553Q736P520L331k396
$$ -27 -8553 -12268 -9629 -2464 5936 11786 11360 4689 -3492 -10221 -12159 -7606 1130 8650 11981 9585
2956I585p807q610m781Q61O053Q942O706N46m614q035q051l093L608P471Q092
$$ 9585 1778 -6832 -11613 -10752 -4699 4243 10949 11495 6881 -1154 -9205 -12298 -8690 -1219 6873
2971F873M997j364o779q332n953j098N215Q941O945K415l433p968q284l798J671
$$ 6873 11870 10506 3727 -4605 -10558 -11656 -6441 2500 9445 11860 8427 459 -7825 -11623 -9952
2986i952O232Q942O086j32n586q035p381k269M471P505P693M254k024p390q136
$$ -9952 -3720 5222 11308 11176 5590 -2445 -9826 -12095 -7624 -119 7574 11828 9804 2414 -5722
3001e722n201n7N596Q807O546J452l755q284p883l295K808O749Q369N364r90o188
$$ -5722 -10923 -10980 -5384 3423 9969 11421 7666 -618 -8501 -11796 -8988 -2239 6130 11494 10504 4316
3017D316p872o645j361M900P978P285L294k886p872p847m528P74O300Q648O083
$$ 4316 -3556 -10201 -11562 -6662 1316 8601 11895 9009 1137 -6710 -11238 -10464 -4164 4484 10567
3032A0567N59m596q316p443k278L242P291P945M621j704o644q057n894k17N166
$$ 10567 11126 6530 -1786 -9229 -11507 -8265 -974 6971 11592 9888 3244 -4813 -10707 -10924 -5758
3047e758Q175O752K405l523p787p751l796J789O550Q456N240L7n615p971o949
$$ -5758 2417 9169 11574 8051 264 -7487 -11283 -9494 -2944 5512 10752 10789 5174 -2797 -9746
3062i746j696M246P632P532L560k329p168p904n029K61N940Q284O044J514m211
$$ -9746 -11442 -7196 436 7968 11528 9199 2031 -5873 -10902 -10641 -4701 3583 9627 11141 6930
3077F930p824p582k848K619O959Q070N025j327n984p894o306r01M631P786P413
$$ 6930 -894 -8476 -11324 -8705 -1746 6324 11349 10022 4038 -3856 -10162 -11063 -6432 1354 8767
3092H767K647l154p183p758m485J420O116Q198N829N30n167p693p040k393L505
$$ 8767 11414 8260 1077 -6681 -11166 -9746 -3630 4568 10397 10927 5760 -1933 -8973 -11366 -7861
3107g861P530P462L935j724o272q102n413J7N087Q029O564J748l550p524p468
$$ -7861 -331 7131 11066 9342 3070 -5032 -10445 -10428 -5341 2688 9252 11000 7450 -74 -7542
3122g542l748K378O557P797N255k75n693p897o348j688M228P837O872L368k350
$$ -7542 -11290 -8912 -2355 5442 10697 10422 4729 -3168 -9516 -11204 -6976 861 7733 11101 8751
3137H751p023p637m722O48N589Q121O017J032m333p257p279l038K866O942P519
$$ 8751 1728 -5909 -10631 -9983 -4394 3727 9744 10776 6443 -814 -8093 -11131 -8265 -1323 6196
3152F196M667j031o262p528n842j138M835P959O659K331k663p320p754l836J350
$$ 6196 10863 9832 3570 -3958 -9800 -10938 -6103 1856 8515 10846 8183 863 -6891 -10727 -9377
3167i377N920P934N750J53m785p591o862k260L743P288O871M328j811o887p462
$$ -9377 -3457 4477 10227 10380 5595 -1996 -8858 -11118 -7375 -87 6784 11112 9301 2414 -5048
3182e048n065k36N110Q213O177J433l369p402p308l276K358O123P732N282q72
$$ -5048 -10113 -10349 -5239 2974 9151 10584 7215 -187 -7495 -10771 -8413 -2290 5442 10724 9852
3197I852n623p239o272j671M524P503O563L201k175p268p413m145L68N649Q137
$$ 9852 4229 -3010 -9282 -10953 -6429 1074 7637 10838 8663 1395 -6018 -10163 -9795 -4146 3991
3212C991N715N68m291p228p184k338L086O609P336M567j479o164p275n629q15
$$ 3991 9706 10274 5983 -1245 -8429 -10767 -7681 -1072 6264 10831 9352 3188 -4087 -9716 -10531
3227a0531M935P766N986K469l088p201p158l466J367N858P919N127j55m837p374
$$ -10531 -5596 2170 8156 10625 7537 336 -6822 -10288 -8921 -3063 4856 9983 9828 4991 -2383
3242b383o555j582L738O768P174L585k233o404p134m937P0N349P731N571J451
$$ -2383 -8938 -10520 -6782 -14 7160 10745 8512 2108 -5026 -9963 -9893 -4544 3187 8758 10209
3257A0209l546p407o827k838K159O392P625M428r49n306p194o000r76M413O898
$$ 10209 6663 -744 -7571 -10409 -8250 -1858 5767 10195 9246 3940 -3254 -9254 -10230 -5817 1081
3272A081O658K869k841o721p039m051P28N780P596N164Q36m509p224o753j942
$$ 1081 7739 10608 7767 1046 -5993 -10044 -9316 -3536 4060 9224 10060 5551 -1673 -8426 -10368
3287a0368K982O526P419L804j660n897p049n503k7M850P064O161K143l395p102
$$ -10368 -7386 -860 6559 10363 8703 2806 -4243 -9746 -9773 -4923 2141 8302 10445 7050 -52
3302e2o688l442J566O357P305M594j89m801p321n986j378L720O589O970L109k361
$$ -52 -6740 -10182 -8616 -2259 5046 9640 9451 4650 -2671 -8657 -10035 -6315 274 7244 10353 7992
3318G992o068p164m696N19N330P250N648J366m112o994o665k593K383O517P001
$$ 7992 1924 -5240 -9936 -9417 -4087 3163 8811 10177 6065 -929 -7594 -10187 -7804 -1287 5714
3333E714M208p95n584p281n437q94M358P196O262K508k803o493p207l782J250
$$ 5714 9922 9127 3543 -3738 -9175 -10069 -5711 1485 7747 10255 7452 959 -6248 -10030 -8780
3348h780N536P358N129M79m401p134o260k070L080O732O687L571j282o168o972
$$ -8780 -3244 4114 9243 9722 5321 -1813 -8073 -10143 -7063 -331 6356 9927 8645 2477 -4495
3363d495m870l69M783P575N754J588l232o733o989l095K065N964P042M627k24
$$ -4495 -9365 -9734 -4951 2624 8378 9966 6734 1 -6988 -10083 -8018 -2054 4988 9615 9391
3378I391n297o829n944j518M070O850O467K997k280o254p215m007M59N179P711
$$ 9391 4094 -2735 -8679 -10197 -6127 723 7190 10187 7907 1653 -5562 -9569 -9110 -3931 3780
3393C780N050Q63l966o687o703k412K671O335O978M067j358n459o981n189p39
$$ 3780 8830 9693 5727 -960 -7663 -10075 -7404 -1069 5909 9976 8618 3159 -3822 -9011 -9750
3408i750M315P186O178K182l130o632o691l526J273N768P169M852O3m354o840
$$ -9750 -5435 1751 7929 10111 6981 349 -6342 -9868 -8595 -2827 4342 9194 9257 4903 -1937
3423a937o308j729L611O353O548L500j735o117o802m660k21N198P268N261J595
$$ -1937 -8245 -9974 -6363 -10 6538 10038 8303 2186 -4616 -9276 -9497 -4299 2969 8230 9825
3438I825l455o949o706k492K146N776P170M314p41n110o798n564j234M131O571
$$ 9825 6370 -579 -7285 -9777 -7631 -1855 5315 9629 8888 3778 -3020 -8584 -9818 -5687 884
3453H84O241K943k616o412o443m038M92N483P229M752Q39l781p178o099j952K562
$$ 884 7125 10068 7452 1040 -5403 -9441 -8949 -3466 3763 8515 9354 5573 -1605 -7704 -9656 -7094
3469g094O285O874L935j844n394o805n136m02M850O819N711K104l072o786o553
$$ -7094 -809 6065 10000 8156 2762 -4043 -9179 -9581 -4731 2088 7799 9903 6831 45 -6508
3484f508l062J339N859P177M198j55m254p083n782j303L476O275O643L177k428
$$ -6508 -9570 -8231 -2372 4805 9003 8848 4594 -2489 -8271 -9574 -6098 177 6820 9997 7569
3499G569n608o693m778N24N275O733N354J485l920o838o177k526K218N925P008
$$ 7569 1961 -4732 -9510 -8986 -3711 3022 8376 9861 5941 -897 -7074 -9600 -7382 -1457 5551
3514E551L732p27m918o934n400o36M044O509O118K579k877o161o431l966R71N605
$$ 5551 9283 8556 3638 -3296 -8696 -9332 -5288 1221 7339 9918 7041 880 -5551 -9517 -8546 -2941
3530b941O778M725O12m035o971n758j832K516O433O719L197j497n303o739m963
$$ -2941 3837 8562 9174 5139 -1832 -7590 -9422 -6906 -473 6246 9443 7946 2643 -4096 -9059
3545i059k7M611O423N887J861l444o393o100l318J748N727O804M377l13m708o737
$$ -9059 -9086 -4475 1948 7835 9696 6252 -141 -6241 -9559 -7811 -2084 4720 9097 8784 4076 -2661
3561b661n584j208L584O407O200K693k169n739o722l839M25N143O646N141J017
$$ -2661 -8245 -9453 -5869 538 6738 9431 7262 1523 -5199 -9038 -8613 -3470 3176 8317 9334
3576I334l964o530o012k229K284O073O615L697j041n226o740m901m55M086O696
$$ 9334 5370 -1160 -7172 -9401 -7117 -1044 5571 9268 8227 3001 -3739 -8640 -9095 -5009 1687
3591A687N696K186k799o241o336l444J313N367O648M573O8m064o550n772j761
$$ 1687 7383 9569 6770 529 -5807 -9251 -7938 -2571 4077 8650 8718 4654 -1896 -7668 -9429
3606i429L179O098O419L274j896n579o534m151J5M443O716N413J176l166o557
$$ -9429 -6250 -152 6267 9541 7645 2066 -4468 -8619 -8604 -4161 2555 7968 9144 5978 -579
3621e79o040k662J858N506O892M043n77m825o398n270j103L857O117N973K616
$$ -579 -6619 -9281 -7423 -1917 4975 9018 8441 3616 -2782 -8052 -9155 -5298 819 6792 9408
3636I408k325o203o031l778N09N244O868M581N84l605o676n870j872K425N841
$$ 9408 7083 880 -5151 -8929 -8420 -3176 3692 8273 8857 5252 -1424 -7294 -9166 -6741 -900
3651i00O583L473j365n185o198n030l22M447O226N484J983k853o193o119l103
$$ -900 5683 9156 7791 2606 -3592 -8622 -8944 -4497 1729 7213 9196 6343 150 -5969 -9072
3666i072J205N612O589M426m18l896o822n448j224L228N910O291K946k131n543
$$ -9072 -7867 -2255 4334 8760 8342 4446 -2376 -7824 -9048 -5820 90 6381 9327 7196 1653
3681A653n984m482J74N101O433M771J385l426o410n863k467J893N681O710L684
$$ 1653 -4331 -8813 -8639 -3538 2895 7666 9051 5625 -785 -6648 -9115 -7222 -1541 5169 8853
3696H853q98m364o736n189o59L951O140N881K499k869n850n862l756Q51N277O165
$$ 8853 7955 3591 -3145 -8334 -8993 -5042 1098 6979 9478 6609 759 -5103 -8859 -8008 -2731 3434
3712C434M764P05l864o696n568j777K496N929O406L217j439n000o613m647lM522
$$ 3434 8198 8903 5039 -1657 -7225 -9002 -6506 -577 5829 9046 7607 2607 -4006 -8653 -8656 -4134
3728d134O188N342J767l135o128o027k982J457N727O464M070l10m248o794n156
$$ -4134 2054 7396 9163 6028 -100 -6127 -9109 -7652 -1925 4539 8609 8299 4051 -2743 -7899
3743g899r31L121O240O141K562k270n403o455m093Q84M698O387N035R63l812o387
$$ -7899 -8830 -5709 531 6672 9234 6964 1561 -4894 -8987 -8103 -3405 2982 8017 8980 5168 -1219
3759a219n596k188K018O123O259L466r46m886o646m829j82L893O202N624K020
$$ -1219 -6815 -9003 -6985 -862 5397 8863 7917 3031 -3615 -8444 -8626 -4733 1469 7093 9113
3774I113k821n773o181l486J473N192O441M387M39m459o450n297j542K652O313
$$ 9113 6292 519 -5662 -9148 -7675 -2483 3958 8345 8784 4325 -2125 -7422 -8964 -6312 1
3789AO210K685j542n325o461m297M20M275O556N191J192l134o174n974k729K105
$$ 1 6211 8896 7354 2029 -4432 -8729 -8309 -4034 2522 7713 8905 5771 -403 -6377 -9106 -7001
3805g001N370O519L823m48m616o691m999q63L613O318N865K102k339n619o257
$$ -7001 -1631 4888 8711 8263 3647 -3044 -8043 -8906 -5293 1025 6890 8992 6653 1034 -5223
3820e223l692R63M878O546M727M61l764o313n872j730K592N758O388L346j294
$$ -5223 -8915 -7952 -3074 3472 8199 8660 4896 -1417 -7289 -9019 -6427 -669 5719 9065 7771
3835G771n290o333m581j09M079O557N204J875k986o140n913l103J398N370O569
$$ 7771 2481 -3852 -8433 -8542 -4463 2094 7298 9173 6187 47 -5866 -8969 -7571 -2201 4368
3850D368M127j24m447o318n417j161L455N786O114K701k100n561o013m057L55
$$ 4368 8495 8371 3924 -2394 -7811 -8972 -5517 269 6383 9084 6984 1423 -4590 -8647 -8292
3865h292M991O252M763J152l374o505n698k279K241N452O558L491r65m832o199
$$ -8292 -3301 2951 7714 8866 5492 -1013 -6711 -8990 -6749 -1297 5261 8752 7787 2955 -3244
3880c244m927n01L886N974N700K301k726n967n895l464R23N343O394M386M93m136
$$ -3244 -8171 -8672 -4786 1188 6888 9189 6463 496 -5399 -8863 -7940 -2597 3797 8183 8676 4540
3896D540o617n098j693K739N839O375K830j565n052o394m730L87M471N986N429
$$ 4540 -2077 -7175 -8868 -6129 -290 6085 8915 7350 2298 -4096 -8826 -8439 -3968 2018 7447
3911G447J680l304o263n797k754J808N568O276L835j54m661o513m955q74L104
$$ 7447 9127 5823 -440 -6237 -8991 -7183 -1615 4661 8496 8342 3681 -2832 -7787 -8661 -5557
3926e557O284N896K450k283n480o180m176Q65N115O346M731Q74l974o360n393
$$ -5557 727 6623 9073 6790 1310 -4870 -9046 -8181 -3066 3280 8011 8885 4911 -1449 -6842
3941f842k206K360O044O317L159j128m875o750m445M1L796O139N690J835l186
$$ -6842 -9048 -6688 -644 5673 8832 7704 2829 -3921 -8366 -8325 -4529 1610 7300 9135 5949
3956E949n714n923l402J718N393O093M157L53m506o527n022j459K991O048O197
$$ 5949 235 -5688 -9090 -7372 -1979 4114 8271 8624 4118 -2409 -7431 -8890 -5899 149 6346
3971F346K487j671n380o485m039M24M697O062N394J074l641o143n613k598K102
$$ 6346 8833 7162 1782 -4703 -8742 -8318 -3621 2441 7835 8909 5268 -875 -6488 -9086 -6984
3986f984N913O147L588o50m802o575m504p41L420O421N758J962k588n409o250
$$ -6984 -1071 5076 8664 8014 3212 -3363 -7867 -8608 -5188 1233 6991 8953 6365 956 -5294
4001e294l614J221M917O301M628O65m409o157n304j942K750N981N948L130j231
$$ -5294 -8908 -7687 -2770 3531 8159 8824 4415 -1742 -7046 -8988 -6238 -257 5691 8821 7590
4016G590n385o377m412K24M176O535N224J282l085n960o152k594J740N554O188
$$ 7590 2205 -4172 -8584 -8360 -4184 2351 7575 8857 5772 -188 -6340 -8934 -7194 -1640 4548
4031D548M044m84m452o558m746j037L254O259N779K358k053n676o237l731Q68
$$ 4548 8592 8108 3656 -2902 -7648 -8685 -5431 828 6607 8965 6912 1236 -5001 -8732 -7864
4046g864M822O210M747P27l731o178n718j959K505N654O397L036q94n087o384
$$ -7864 -3042 3168 7915 8642 4911 -1267 -6985 -8944 -6439 -785 5612 8648 7754 2667 -3717
4061c717m710j06L913O526N274J607k600n904o070l024J305N239O254M293L2m048
$$ -3717 -8427 -8533 -4620 1906 7180 8787 6187 283 -5787 -8811 -7506 -2267 3987 8280 8312 4264
4077D264o481n227j246K793O008N901K906j638n380n955m320J95M413O282N203
$$ 4264 -2217 -7444 -8690 -5897 111 6012 8918 7280 1900 -4055 -8375 -8180 -3767 2515 7718
4092G718J269l432o330n463k698J914N790O270L361k90m740o355m877n81L394
$$ 7718 8987 5555 -775 -6238 -8936 -7022 -1232 5038 8399 8109 3369 -2986 -7863 -8444 -5050
4107e050N967N783K306k471n583o135l615J031N017O196M700L73l844o373n130
$$ -5050 917 6700 9006 6535 952 -5183 -8798 -7767 -2750 3446 8146 8519 4675 -1698 -6828
4122f828j925K522N901O135K932j343m875o596m265J8M151O148N460J292l013
$$ -6828 -8753 -6231 -330 5805 8737 7394 2519 -4077 -8342 -8324 -4173 1975 7435 8727 5714
4137E714n931n816k905J685N592O085L748J49m524o489m851j102L127O183N984
$$ 5714 -217 -6033 -8938 -7253 -1661 4424 8172 8321 3797 -2692 -7543 -8645 -5518 665 6649
4152F649K139j934n372o259m002Q62M651O187N025Q76l839o120n377k484K318
$$ 6649 8788 6854 1482 -4777 -8779 -7917 -3266 2921 7946 8822 4983 -1137 -6514 -8998 -6680
4167f680O072N982L256q29n023o398m270o29L714O472N479J624k825n324o173
$$ -6680 -608 5374 8630 7801 2778 -3620 -7890 -8519 -4805 1667 7146 8770 5945 621 -5552
4182e552l388J723M984N965M700L9m387o312n041j560K842O176N842K644j325
$$ -5552 -8940 -7217 -2233 3732 8432 8471 4084 -2228 -7269 -8829 -5987 189 6031 8675 7350
4197G350n342o446l842K15M209O392N162Q30l256n762n870k585K077N628N821
$$ 7350 2008 -4438 -8280 -8065 -3856 2536 7698 8528 5272 -490 -6360 -8945 -6868 -1240 4581
4212D581L992n23n008n988m787r43L601O350N419K177k391n355o536l150R87M841
$$ 4581 8573 8050 3042 -2946 -7733 -8676 -5075 1275 6694 8871 6480 1125 -5411 -8561 -7574 -2733
4228b733O119M846L12l862o212n316k041K753N930N677L291j178n297o386l941
$$ -2733 3386 8232 8544 4682 -1530 -6846 -8887 -6134 -204 5473 8764 7586 2289 -4097 -8038
4243h038k64M264O138N165J290k667o092n844k652J612N296O136M100l91m396
$$ -8038 -8302 -4038 2100 7265 8555 5888 -204 -6048 -8700 -7088 -1792 4344 8444 8053 3657
4258C657o104n163j172L375O160N413K653j926n571o151l602O01M504O528M556
$$ 3657 -2447 -7610 -8782 -5407 753 6166 8819 6893 1322 -4829 -8431 -7830 -3326 3202 7758
4273G758P25l457o033n767k085K390N602O105L428j053m832o213m622m63L966
$$ 7758 8483 5026 -1007 -6774 -8859 -6469 -867 5238 8666 7613 2781 -3432 -8054 -8517 -4551
4288d551O097N457J665k594n668o141k883J199N198O124M062K55m144o159n205
$$ -4551 1546 7003 8668 6074 406 -5735 -8618 -7419 -2221 3903 7965 8220 4076 -2083 -7288
4303g288j445L032N794N688L004j779m996o439l929L04M302O317M927J156l330
$$ -7288 -8733 -5701 93 5781 8785 7006 2010 -4429 -8358 -8054 -3752 2565 7492 8648 5318
4318E318o036n547k574K009N529O035L702m18m844o370m474q18L595O066N682
$$ 5318 -718 -6265 -8839 -6830 -1301 4734 8436 8018 3174 -3196 -7670 -8488 -4893 1173 6855
4333F855J611k169n413o139l237J016M875N976M628M19l961o087n337j712K685
$$ 6855 8466 6297 884 -5255 -8492 -7476 -2601 3375 8003 8422 4461 -1626 -6963 -8675 -5990
4348e990N671N880L054j360m979o242m203L4L950O307N176J198l013n519n923
$$ -5990 -319 5561 8615 7255 2276 -3966 -8169 -8135 -4185 2122 7298 8496 5483 -36 -5959
4363e959k801J890N125O110M056k31m732o096m851r23L056O099N507K274j791
$$ -5959 -8760 -6870 -1745 4365 8421 8190 3458 -2638 -7489 -8412 -5356 743 6250 8524 6733
4378F733n389o284l576J006M178O369M898L98l645n804n447k337K626N650N723
$$ 6733 1344 -4940 -8516 -7510 -3332 3037 7935 8333 4688 -1116 -6563 -8900 -6274 -624 5099
4393E099L494q57n294o078l944p20L713O416M970J742k442n747o094k725J453
$$ 5099 8593 7736 2442 -3636 -7580 -8300 -4587 1829 6799 8541 6099 352 -5742 -8467 -7014
4408g014M631O183M352j15m131n908n028j675L246N675N416L024j607n510n934
$$ -7014 -2383 3800 8152 8037 3906 -2002 -7030 -8705 -5459 216 5632 8656 7049 1539 -4395
4423d395l707J75M362O321M615Q19l020n728n796k296K284N121N921L829r47m627
$$ -4395 -8102 -7927 -3565 2756 7371 8190 5170 -558 -6354 -8650 -6366 -1245 4676 8505 7558 2931
4439B931n966m512r36L827N980N046K293k397n648n898k968R00M797O122M343
$$ 2931 -3035 -7547 -8483 -4656 1324 6370 8663 6266 618 -5280 -8248 -7348 -2551 3571 7914
4454G914R1l623n996n203j693K708N686N574K971j203n264n923m009j77M267O138
$$ 7914 8005 4382 -1614 -6817 -8510 -5802 -116 5458 8429 7226 1962 -3961 -7970 -8147 -3880 2258
4470B258M879J324k908n821n678k382J565M955O339L590n45m072n945n018r04
$$ 2258 7137 8461 5553 -268 -5946 -8328 -6763 -1808 4531 8121 7576 3504 -2441 -7459 -8363
4485h363L499N772N477K121j963n477n801l330M29M717O018M440O30l517n848
$$ -8363 -4864 908 6385 8506 6543 1066 -4735 -8065 -7636 -2919 3099 7539 8169 4652 -1196
4500a196n463j784K258N358N925L310j216m757n888m331l77L899N867N123J708
$$ -1196 -6659 -8443 -6185 -827 5098 8408 7192 2435 -3453 -7784 -8161 -4262 1605 6728 8436
4515H436k568n707n646k780J186N073N962L970o8m080n891n051j224L099N540
$$ 8436 5868 161 -5485 -8265 -7079 -2006 3956 7926 7858 3778 -2113 -7164 -8388 -5289 251
4530B51N601K650j754n280n685l927L13M304O178M604R10l155n693n490k186J872
$$ 251 5852 8502 6748 1468 -4217 -8144 -7831 -3527 2651 7255 8165 5010 -683 -6173 -8359 -6487
4546f487N176N842L626o33m495o157m463l86L441N916N112J902k307n463n690
$$ -6487 -1311 4531 8157 7524 3029 -3128 -7591 -7977 -4536 1380 6492 8394 6087 624 -5066
4561e066l247J246M510O174M191J51l920n695n121j590K882N580N441K939j453
$$ -5066 -8313 -7067 -2557 3617 7808 7959 4039 -1656 -6777 -8367 -5485 95 5536 8475 7022
4576G022n263n840l776q2M143O098M788J064k993n575n522k222J668M868N840
$$ 7022 1759 -4081 -7857 -7939 -3796 2302 7090 8154 5161 -414 -5936 -8158 -6490 -1622 4218
4591D218L945o66m239n814m645j088L430N786N230K201k162n431n630l183O20
$$ 4218 8163 7497 3258 -2556 -7201 -8289 -4859 927 6157 8358 6196 765 -4865 -8048 -7428
4606g428M428O411M102M02l426n604n315j710K466N038N609L398j516m620n799
$$ -7428 -3000 3411 7513 7915 4489 -1115 -6430 -8140 -5674 -636 4973 8371 6855 2235 -3564
4621c564m226J37L823N728M810J438k572n555n652k412J254M870O055L945p18
$$ -3564 -7790 -7653 -3830 1898 6708 8146 5574 19 -5633 -8045 -6791 -1921 4134 8079 7361
4636G361l776n817m745j347L434N299N256K623j843n165n576l545L41M244O133
$$ 7361 3585 -2232 -6977 -8324 -4890 409 5665 8288 6445 1280 -4296 -7841 -7500 -3256 2877
4651B877M212R17k951n892n398j822K006M967N935L419j226m437n544m481l95
$$ 2877 7089 8006 5055 -837 -6235 -8057 -6051 -1084 4851 8270 7044 2607 -2937 -7418 -7813
4666g813L632N456M837K237k663n504n208k860R51M790N932L746O8l508o031n014
$$ -7813 -4181 1275 6112 8349 5686 182 -5026 -7886 -6935 -2145 3787 7533 7601 4093 -1938 -6952
4682f952j129K838N194N592K779j840m829n587l852Q5M282N786M414J352l044
$$ -6952 -8081 -5243 -49 5543 8322 6482 1653 -3934 -7786 -7701 -3419 2367 6781 8133 5089
4697E089n849n091k186J611N181N793L174m98m022o092m363o87L536N389N142
$$ 5089 -760 -5851 -8037 -6426 -1245 4548 7722 7224 3202 -2890 -7253 -7940 -4404 985 6127
4712F127K115k444m911n534l353R42M641N698L933O85l457o109m840j530K309
$$ 6127 8242 5798 887 -4647 -8000 -7058 -2417 3281 7214 7899 4442 -1667 -6507 -8037 -5728
4727e728N284N676K673j227m466n863l806j1L678N670M837J306k802n427n266
$$ -5728 -444 5232 7905 6678 2212 -3651 -7457 -7468 -3790 1880 6717 8023 5221 -206 -5472
4742e472k731J781M797N734L464l39l723n791m636r87L065N394N295K224j891
$$ -5472 -8203 -6422 -1625 4109 7573 7234 3511 -2280 -6916 -7903 -4838 556 5851 8075 6184
4757F184m885n715l216M06M290N683M244R61l582n491m861k176K278N312N405
$$ 6184 1299 -4416 -7632 -7226 -2936 2747 6991 7952 4370 -1121 -5982 -8158 -5880 -568 4837
4772D837L115j114m323n754m051j57L447N644M730J578k546n216n341k660J092
$$ 4837 7952 6838 2515 -3239 -7290 -7447 -4000 1644 6374 7952 5406 190 -5151 -7811 -6719
4787f719M686N770L641J64l900n678m644j174K671N386N160K617j586m827n663
$$ -6719 -2033 3737 7378 7542 3642 -2036 -6680 -7854 -5183 203 5363 7980 6394 1567 -4096
4802d096l474L12M026N601M452J020l002n562n058j958J716M852N617L328p86
$$ -4096 -7570 -7258 -3232 2369 6821 7841 4839 -723 -5781 -7739 -6023 -1171 4446 7774 6988
4817F988m138n448m642m05L258N396N048J834k050n180n388k939O98M560N597
$$ 6988 2850 -2598 -7240 -7645 -4387 1009 6057 7891 5841 661 -4727 -7666 -6968 -2408 3189
4832C189L929L49l456n576m838j270K329N276N285K591j382m548n419l946k4M071
$$ 3189 7118 7467 4011 -1565 -6403 -7673 -5344 -68 5217 7808 6426 1878 -3541 -7487 -7511 -3440
4848c440N440M416J601k891n450m985k518J584M743N610L328l96l773n624m717
$$ -3440 2000 6416 8017 5126 -324 -5309 -7827 -6243 -1500 4110 7438 7042 3269 -2355 -7072
4863g072m63K925N141N397K001k000m989n266l381N27M668N345M068O91l332n527
$$ -7072 -7535 -4610 531 5928 7929 5929 940 -4326 -7707 -7180 -2512 2833 6901 7592 4260 -1267
4879a267m824j664J941N169N568K684j125l923n725m133j27L706N158M777J576
$$ -1267 -6091 -7755 -5814 -645 4923 7607 6482 2559 -3166 -7299 -7426 -3720 1438 6215 7791
4894G791k571n071n071k785J194M759N406L505Ml445n830m261j377K734N241N436
$$ 7791 5220 149 -4922 -7707 -6513 -1754 3652 7157 7161 3716 -2114 -6375 -7752 -5018 223 5659
4910E659K025j635m541n483l680O10L990N331M487J047l313n333m702k233J767
$$ 5659 7684 6049 1508 -3975 -7655 -7045 -3055 2276 6763 7810 4497 -836 -5538 -7771 -6004
4925f004N039N418K830l67m109n824l922l04K966N453N045J604k446m740n239
$$ -6004 -965 4453 7283 6916 2807 -3017 -6939 -7243 -4277 1176 6221 7825 5379 639 -4600
4940d600l153J061M653N220L823L53l545n418m427j630K182N429N253K498j360
$$ -4600 -7753 -6692 -2039 3181 7004 7357 3812 -1606 -6033 -7663 -5481 -52 5201 7699 6339
4955F339m609n469l416J44L713N459M416J126k981m997n019k533J786M701N315
$$ 6339 1730 -3739 -7155 -7011 -3298 2161 6577 7703 4722 -275 -5294 -7827 -6041 -1340 3975
4970C975L316j88m274n275m201q40K907N393M857J892j803m710n478k886Q25L972
$$ 3975 7291 7103 2829 -2446 -6647 -7487 -4580 813 5670 7562 5759 1049 -4429 -7315 -6490 -2518
4986b518N348L974O15l378n269m749j700K224N163N113K722r88m304n804l411
$$ -2518 2830 6804 7419 4041 -1228 -5977 -7677 -5453 -290 4823 7545 6557 2253 -3551 -6962
5001f962k98L461N619M390J378k558m906n195k568J434M506N351L544j80l676
$$ -6962 -7260 -3799 1820 6210 7588 5030 124 -5071 -7639 -6205 -1699 3652 7196 7016 3340
5016C340n505m317q96K531N267M919K106j639m623n302l130M85M077N304L926
$$ 3340 -2165 -6482 -7378 -4847 420 5339 7445 5806 1183 -4119 -7249 -6764 -2687 2617 6543
5031F543P48l056n249m478k110K027M803N191K933r82l882n416m114j71L451N127
$$ 6543 7291 4235 -1014 -5492 -7602 -5575 -772 4419 7352 6370 2488 -2928 -7042 -7213 -3762 1365
5047A365M469J731k404m855n107k608J150M439N335L457K20l476n572m472j158
$$ 1365 5834 7565 5161 306 -4801 -7409 -6259 -1820 3515 6972 7192 3716 -1856 -6328 -7486
5062g486K423N177N099K205j387m544n224l593N43L913M978M317J021k798n221
$$ -7486 -5063 114 5213 7418 6031 1487 -3737 -7330 -6787 -2874 2104 6421 7442 4644 -577
5077e77m689k227J646M666N220K943l73l895n389l961m50K699N257M766J775k057
$$ -577 -5266 -7493 -5847 -1181 4039 6982 6609 2714 -2675 -6636 -7086 -4387 870 5636 7411 5354
5093E354m522n216l050J150M082N035L860M70l242n413m389j584K192N140M755
$$ 5354 832 -4384 -7434 -6284 -2202 2833 6693 7163 3921 -1492 -5881 -7465 -5273 -133 4622
5108D622K555r96m013n741l356J65L194N298M612J020k586m872n003k481J724
$$ 4622 7177 6181 2168 -3573 -6929 -6764 -3570 1728 6340 7360 4774 -98 -5101 -7582 -5858
5123e858M426N203L268k73l724n422l849j136K902N154M888J812j858m184n594
$$ -5858 -1432 3771 7039 6766 3042 -2380 -6229 -7365 -4463 691 5579 7391 5533 1349 -4245
5138d245k950P42L863N358L973K54l108m860m586j993K291M784M800K783p16m232
$$ -4245 -7195 -6453 -2590 2768 6741 6995 3887 -973 -5559 -7552 -5261 -477 4323 7106 6390 2158
5154B158n489l274l14L093N307M435J376k361m595n214k468J432M023N035L661
$$ 2158 -3331 -6605 -6919 -3826 1481 5916 7292 4931 336 -4878 -7346 -5914 -1891 3144 6805
5169F805N3l801m804m284j281K565N213M601J981j096m613n257k813J95L469N450
$$ 6805 6858 3057 -1747 -6031 -7312 -4747 466 5067 7048 5952 1339 -3918 -6731 -6536 -3067 2383
5185B383L770R02l007m774m581j942J846M514M842L231q58l947n040l649o93K952
$$ 2383 6153 7055 4048 -726 -5307 -7249 -5403 -889 3953 7184 6326 2379 -2661 -6310 -7003 -4051
5201d051N318M179J695j741m650n412k441J167L819N254L508J48l191n055m255
$$ -4051 1267 5446 7141 5400 750 -4662 -7103 -5936 -2117 3137 6645 6793 3602 -1453 -5708
5216e708j523K383M847M572K776j323m410n162l114k2L481N363L844J109k604
$$ -5708 -7231 -4848 -1 4571 7347 6024 1614 -3548 -6662 -6684 -3203 2160 6004 7113 4509
5231D509m924m792j952J645M228N190L186n90l910m953m041n88K821M963M437
$$ 4509 -415 -5207 -7159 -5514 -1286 3904 7090 6500 2590 -2363 -6404 -6992 -4171 792 5229
5246E229K249k162m470n010k747O29L948N074L629M18k965n206m159j534J988
$$ 5229 7478 5316 846 -4164 -6911 -6282 -2334 2740 6369 6787 3822 -1384 -5543 -7077 -5089
5261e089M776M888K378r69m108m883l529j86L292N113M263R18k197m646m919k344
$$ -5089 -313 4575 6953 5984 1876 -3007 -6536 -6722 -3430 1683 5946 6864 4667 21 -4898 -7242
5277g242J566M277M884L176k7l669n061l982p22K587M623M825J859j623m429m979
$$ -7242 -5676 -1399 3485 6661 6634 2965 -2096 -6078 -6800 -4213 410 5235 7094 5471 1042 -3937
5293c937k806M61L782M996L743O02l023m782m414j774K039M376M971K589o64l971
$$ -3937 -6743 -6282 -2500 2496 6239 6841 3818 -964 -5378 -7152 -5113 -737 4234 6823 6159 2188
5309B188n022l479m21L155M784M506J283k001m833m853k240R92M149M806L424
$$ 2188 -2834 -6313 -6734 -3579 1205 5711 6994 4993 160 -4693 -6933 -5941 -1792 3014 6438
5324F438M4l545m543m193j171K641M519M613K059j287m276m943k933J76L345N367
$$ 6438 6482 2937 -1606 -5799 -6970 -4329 190 4803 6862 5575 1299 -3644 -6577 -6401 -3056 2311
5340B311L715P54k494m702m515k073J787M238M693L175o99l821m784l610p62K984
$$ 2311 6026 6780 4286 -416 -4931 -7004 -5217 -979 3714 6889 6190 2369 -2415 -6025 -6787 -3803
5356c803N021M077J460j683m551m906k339Q93L535N123L565m0k897m699m321j440
$$ -3803 1218 5295 6755 5072 521 -4385 -6724 -5831 -2296 2827 6392 6352 3455 -1244 -5565 -7005
5372g005K457M640M372K330j041m159m778l157r2L460M971L756J011k311m760
$$ -7005 -4548 92 4464 6794 5753 1594 -3184 -6341 -6433 -2973 1998 5754 6765 4454 -306
5387c06m635j741J410L942M946L101n55l447m687l948p67K877M674M137J842j625
$$ -306 -4941 -6682 -5272 -1330 3616 6717 6162 2715 -1972 -5920 -6687 -3810 864 5001 6843 5218
5403E218m560m642k454L63L630N168L305M52k771m715m370j227J861M419M679
$$ 5218 658 -3984 -6438 -6075 -2445 2723 6028 6480 3709 -1006 -5376 -6603 -4742 -323 4356
5418D356K356j088l798m753l323j07L140M827L914J203k054m961m241k110J193
$$ 4356 6712 5624 1826 -2927 -6250 -6357 -3217 1610 5524 6727 4673 -288 -4529 -6639 -5446
5433e446M009M799K973l18l157m684m050o67K512M444M514J812j718l969m620
$$ -5446 -1437 3362 6335 6017 2860 -1824 -5874 -6541 -4029 415 4929 6741 5023 1054 -3566
5448c566k786L38L504M794L565O46k704m760l945j643J673M147M866K380q41l478
$$ -3566 -6352 -6014 -2510 2284 5849 6495 3791 -969 -4914 -6557 -4884 -737 4129 6509 5668 2190
5464B190m765l624J3K775M516L987J502j900m444m352k231P98L816M761L008J32
$$ 2190 -2575 -6199 -6186 -3411 1105 5092 6594 4694 250 -4102 -6333 -5535 -1719 3042 6050 6182
5480F182l089m712l737j090K164M303M633J785j315l830m621k848J82L384M580
$$ 6182 3093 -1619 -5356 -6446 -4282 21 4654 6439 5124 1294 -3327 -6175 -5993 -2609 1971
5495A971L733O81k466m511m199j639J450L973M622K630n07l424m557l462n51K756
$$ 1971 5704 6385 3919 -592 -4791 -6430 -4980 -1007 3615 6245 5738 2314 -2243 -5705 -6256 -3500
5511c500M432L933J379j420m123m389k601O43L676M515L271L43k962m473l882
$$ -3500 932 4865 6244 4824 701 -3688 -6289 -5646 -1970 2545 5816 6159 3197 -1276 -5158
5526e158j223K115M284M114K208r03l887m435l254L1L343M276L822R91k269m312
$$ -5158 -6381 -4266 18 4132 6340 5437 1550 -2885 -6139 -6108 -2765 1511 5333 6324 4055 -257
5542b57m123j917J321L688M548K700j89l129m537l656o56K521M246M070J714j527
$$ -257 -4380 -6297 -4976 -1288 3260 5960 5771 2642 -1895 -5551 -6207 -3686 560 4630 6344 4817
5558D817m032m205k641M16L259M702L237M34k489m496m071j071J702L824M453
$$ 4817 785 -3420 -6061 -5645 -2386 2316 5553 5987 3498 -998 -5069 -6140 -4438 -614 3839
5573C839K363r30l502m233l167k61K956M251L628J318j941m363m007k178J024
$$ 3839 6202 5272 1770 -2463 -5630 -5891 -2935 1316 4944 6262 4321 -42 -4049 -6227 -5203
5588e203L712M480K946l46k810m485l522q83K204M122M111K049j674l626m183
$$ -5203 -1491 2989 5935 5589 2779 -1706 -5228 -6111 -3907 215 4326 6375 4701 1075 -3108
5603c108k833L03L290M290L338P89k418m238m073j324J421L775M322K442o01l414
$$ -3108 -5941 -5638 -2348 1942 5280 6069 3651 -587 -4660 -5984 -4563 -788 3534 5976 5375 1961
5619A961m274l579Q9K732M075L901J293k036m085l839k240P65L686M261K727M38
$$ 1961 -2313 -5892 -5803 -3071 1004 4905 6198 4162 77 -3762 -6002 -5237 -1551 2710 5437 5875
5635E875k751m495l661j061J966M221M097J971j322l552m129l039L15L108M170
$$ 5875 3124 -1371 -5032 -6093 -4127 94 4191 6162 4840 1288 -2841 -5880 -5565 -2457 1713
5650A713L437R46k304m232l861j779J456L774M351K191j92l263m450l201l28K520
$$ 1713 5150 6096 3792 -440 -4301 -6080 -4624 -850 3501 5692 5500 2237 -2213 -5414 -5742 -3222
5666c222L928L930J377j584l868m137k378O76L639L978L104M22k811m455l322
$$ -3222 706 4636 6013 4429 561 -3576 -5954 -5278 -1639 2339 5443 5865 3054 -1401 -4723
5681d723j163J669M034M152J880q75l351m458k786O4K848M078L629R43k179l859
$$ -4723 -5886 -4217 -183 3969 5849 4974 1623 -2835 -5621 -5557 -2709 1369 4998 5941 3762 -97
5697i7l823k021J343L531M048K612k44l063m173k994q54K285L915M072J263j347
$$ -97 -3920 -5941 -4598 -1067 2981 5593 5349 2286 -1887 -4881 -5735 -3450 465 4537 5800 4453
5713D453l597m116k370M87L159M110K950M20k382m026l563j171J483L789L970
$$ 4453 856 -3260 -5630 -5143 -1984 2126 5076 5496 3114 -912 -4475 -5646 -4163 -374 3596
5728C596K150q59l116m134k972k3K651L961L322J266k110l717l907j833J032L345
$$ 3596 5746 4887 1771 -2363 -5335 -5358 -2707 1254 4576 5842 3732 15 -3892 -5725 -4693 -1348
5744a348L931K811N3k806m251l181p14J898M032L698J425j136l264m120k470K49
$$ -1348 2583 5394 5447 2641 -1610 -4791 -5505 -3607 425 4123 5548 4412 1148 -2972 -5442 -5193
5760e193L144L825L293L33k097l964l434j413J192L600L929K258n10l131m058
$$ -5193 -2049 1776 5069 5402 3305 -659 -4093 -5506 -4314 -714 3215 5473 4963 1832 -2226
5775b226k936k38K449L742L638J140j473l806l723k023P89L285L937K604Q7k432
$$ -2226 -5162 -5400 -2951 791 4429 5569 4096 290 -3433 -5456 -4667 -1382 2555 5159 5246 2814
5791B814m116l286o97J423L859L754J956j231l360l849k591J76K805L920L245
$$ 2814 -1302 -4588 -5285 -3862 -3 3751 5707 4476 1116 -2733 -5324 -5148 -2343 1577 4822
5806D822P56k071l801l732j395J020L552L772K271k96k928l969k885l13K035L832
$$ 4822 5578 3507 -294 -4026 -5421 -4401 -849 2923 5194 4898 1970 -1999 -4884 -5197 -3162 670
5822F70L659J230j672l393l747k146O47K979M006K610M06k279m032l176j173J644
$$ 670 4329 5559 3887 494 -3253 -5399 -4752 -1773 2233 4843 5249 2970 -1062 -4238 -5411 -3767
5838c767L683L562J798q98k806l975k671J84K453L764L173R62k012l360l736j732
$$ -3767 -84 3478 5276 4378 1572 -2403 -5074 -4890 -2437 1327 4500 5462 3450 90 -3646 -5378
5854e378J099L128L793K266j53k664l874k854n57J872L868L472J186r62l378l758
$$ -5378 -4279 -1151 2642 4908 4755 2091 -1783 -4637 -5194 -3322 546 4018 5204 4242 864 -2894
5870b894k239N57K674L878K877K04k223l673l071j298J325L616L415J940m73k961
$$ -2894 -5133 -4576 -1902 1976 4853 5057 2834 -839 -3910 -5208 -3883 -267 3148 5088 4615 1654
5886A654l821k565j22J989L965L277O33j502l264l823j678R03K891L778K555P
$$ 1654 -2167 -4732 -4854 -2865 1100 4377 5010 3508 244 -3579 -5257 -4354 -1463 2315 4870 4877
5902D877k696l640k772r71J879L585L431J430r27l174l757k271M09K548L660K997
$$ 4877 2181 -1459 -4231 -5202 -3323 262 3693 5123 4196 1022 -2735 -5006 -4597 -2049 1611 4608
5918D608L21j885l347l476j280J348L029L673K039m60k941l627k536l76K033L926
$$ 4608 4929 3044 -303 -3779 -5059 -3711 -682 2991 5030 4570 1629 -1998 -4534 -4910 -2877 1049
5934A049K787J197j357l461l415j965P78K952L591K514J69k389l484l003j144
$$ 1049 3836 5033 3676 215 -3200 -5165 -4387 -1435 2156 4670 4839 2450 -1034 -4037 -5181
5949e181J787L425L292J645q62k928l659k224n3K603L663K775P61j941l453l309
$$ -5181 -3394 31 3323 4968 4106 1178 -2481 -4705 -4758 -2155 1508 4283 5044 3103 -350 -3659
5965c659j448J182L031L636K038m45k411l784k581k70J703L733K954J277j247
$$ -3659 -5107 -3925 -894 2742 4780 4335 1924 -1860 -4441 -4711 -3008 725 3679 4956 3709
5980C709l380l352j818N59K578L681K463L29k076l456l235j140J611L271L367
$$ 3709 329 -3023 -4841 -4282 -1704 1977 4440 4769 2693 -763 -3998 -5138 -3527 -256 3111
5995C111J799p44k779l739k325O5K253L577K934P57j705l274l108j554P22K921
$$ 3111 4910 4166 1387 -2352 -4677 -4612 -2359 1218 4152 4909 3204 -70 -3178 -4732 -4010 -1089
6011a089L632K325l26k357l708k631p12J840L434L326R88j241k767l465j915L19
$$ -1089 2543 4868 4542 2185 -1523 -4154 -4866 -3026 408 3734 4722 3481 714 -2751 -4666 -4347
6027d347K551L527K543L14j982l361k804j217J227L071L260J882l60k764l644
$$ -4347 -1796 1731 4274 4588 2606 -755 -3559 -4776 -3549 -478 2782 4664 4304 1540 -2104
6042b104k308j51K075L323L071Q12j481k968l245k005J139K625L231K537jk471
$$ -2104 -4412 -4563 -2488 835 3906 4718 3237 269 -2976 -4981 -3842 -1217 2014 4551 4550 2079
6058B079l336k655q79J760L234L046J311p77k932l254k096Q3K428L552K482N37
$$ 2079 -1257 -3912 -4791 -3031 203 3249 4560 3783 851 -2403 -4499 -4416 -1988 1564 4046 4583
6074D583j818l008l047j399J070L047L239J988n19k662l233k183p35K034L498
$$ 4583 2765 -243 -3290 -4689 -3619 -572 2667 4655 4136 1474 -1759 -3942 -4677 -2643 855
6089H55K716J048j354k788l357j750O12K543L442K374M6k288l009k785r71J588
$$ 855 3571 4619 3265 477 -2880 -4630 -4018 -1475 1967 4341 4387 2099 -910 -3695 -4666 -3078
6105c078L015L010J710p01k938l233k069l7K301L472K417O11j436l202l122j291
$$ -3078 -63 2947 4657 3956 1018 -2215 -4284 -4321 -2020 1452 3869 4480 3044 -158 -3280 -4571
6121d571R49K581L285K377o06k298k943k732n15J950L032K810J256j103k941l421
$$ -4571 -3622 -1041 2244 4621 4015 1717 -1226 -3958 -4473 -2523 509 3319 4575 3472 531 -2890
6137b890j328K37K342L366K137L15j785l134k919o98J360K781K984J630p00k484
$$ -2890 -4218 -3981 -1639 1727 3864 4179 2394 -740 -3659 -4357 -2997 -216 2768 4398 3698 1214
6153A214l199j979l60K253L179K398R30j286l144l039j192N42K768L109J960k5
$$ 1214 -1985 -3964 -4324 -2071 1108 3506 4436 3150 6 -3033 -4225 -3683 -915 2194 4154 4129
6169D129j989l461k469o19J697K844L004J269q32k720l195j928J77K347L229K417
$$ 4129 2140 -1321 -3790 -4409 -2712 132 3136 4405 3573 853 -2342 -4270 -4093 -1746 1483 3900
6185C900L44j688l266k494j105J032K771L226J533n12k402l078k208k27J800K781
$$ 3900 4244 2556 -710 -3204 -4309 -3277 -506 2720 4253 3741 1339 -1739 -3947 -4174 -2374 407
6201D07K906J057j317k758k847j615L95K697L099J964Q8j930l270k531o72J378
$$ 407 3313 4370 3053 295 -2552 -4167 -3772 -1075 2024 3988 4076 2146 -1124 -3655 -4327 -2949
6217b949L050K854J314q45k486l184j880J45K279K950K401M21j405l075k647j126
$$ -2949 101 2955 4269 3424 938 -2246 -4126 -3981 -1702 1248 3649 4070 2665 -410 -3057 -4183
6233d183Q40K706K879J824k65k236l226k048m09J645L029K734J011j300k559k915
$$ -4183 -3343 -637 2242 4066 3801 1565 -1661 -3709 -4118 -2473 556 3290 4301 3001 442 -2473
6249b473j494K64K339L146K095Q2j871k938k589o34J118K821K871J421n15k799
$$ -2473 -3967 -3703 -1364 1782 3877 3959 2088 -850 -3439 -4073 -2955 -134 2737 4158 3643 844
6265H44k738j974j4J826L140K367N68j236k915k824j075Q88K199K990J957j28
$$ 844 -1894 -3868 -3882 -2056 1084 3451 4019 2783 -132 -2956 -4031 -3143 -944 2046 4003 3875
6281C875k168k907k474k53J606K727K629J087p93k719k856j431K8K160K958K112
$$ 3875 1707 -1200 -3674 -3927 -2321 406 3035 4122 3329 610 -2246 -3677 -3649 -1489 1469 3581
6297C581L77j567l144k529p77J071K737K713J673o16k175k923k366qJ925K935
$$ 3581 3958 2391 -753 -3282 -4059 -2988 -251 2462 4135 3519 1344 -1579 -3945 -3953 -2028 907
6313I07K335Q25j208k824k695j115M35K232K998J945p2j848k780k501o53J403
$$ 907 3242 4067 2859 35 -2660 -3775 -3340 -1108 1890 3835 3763 1915 -865 -3366 -4019 -2616
6329b616K828K457J361r65k290k820j627p8K204K843J913P76j516k884k551q57
$$ -2616 212 2669 4030 3065 775 -2045 -3672 -3750 -1546 1297 3210 3986 2470 -414 -2965 -3822
6345c822P72K364K995J530l42k179k734k168k61J716K691K476R56j271k629k390
$$ -3822 -3050 -686 2309 3839 3497 1318 -1416 -3584 -3845 -2129 562 3038 3994 2723 94 -2296
6361b296j603L95K258K945J926J09j695k819k370p08J250K377K800J310o48k257
$$ -2296 -3899 -3504 -1246 1699 3625 3734 2039 -780 -3150 -3858 -2608 -231 2569 3879 3231 974
6377I74k787j896J15K114K416K228O89j361k638k516j230Q20K238K816J593o5
$$ 974 -1813 -3709 -3594 -1480 936 3164 3853 2492 -146 -2662 -3892 -3072 -834 1982 3575 3510
6393C510j997k728k254k99J489K468K595J057j016k292k657j633K50K428K634
$$ 3510 1513 -1215 -3469 -3768 -2279 189 2784 3841 2825 533 -2124 -3757 -3507 -1079 1555
6408A555J703M53j728k568k309p93R72K564K697J170n62k108k827j667j44J633
$$ 1555 3258 3711 1983 -585 -2894 -3687 -2715 -151 2546 3716 3154 1046 -1781 -3448 -3592 -1959
6424a959K825K191O59j189k255k840j248Q05K167K701J616l2j728k849k088m77
$$ -1959 866 3057 3716 2527 272 -2568 -3816 -3011 -844 1857 3473 3441 1713 -1136 -3224 -3701
6440c701J298K562K538R26o20k260k699j727K66K030K521K062L71j594k662j948
$$ -3701 -2403 159 2697 3623 3003 743 -1956 -3683 -3417 -1387 1134 3196 3567 1973 -689 -2637
6456b637j106R20K446K505J628m01k103k806j877k3J339K698K376P76j190k230
$$ -2637 -3743 -2823 -377 2128 3756 3355 1252 -1554 -3431 -3454 -2115 583 2959 3735 2545 315
6472C15k595j505N53K298K715J530R6j558k609k234n59J124K515K413J137p56
$$ 315 -2280 -3785 -3232 -934 1781 3311 3407 1849 -760 -2994 -3553 -2429 86 2499 3636 2880
6488B880j968k630j644o9J837K536K052N75j370k328k359j167R38K101K623J569
$$ 2880 912 -1718 -3362 -3431 -1594 942 2994 3569 2199 -129 -2488 -3655 -2717 -616 2007 3576
6504C576m13j763k567k116k72J570K397K211Q85q60k238k455j446J93K076K550
$$ 3576 3163 1400 -1167 -3283 -3555 -1985 412 2623 3508 2648 410 -2045 -3491 -3298 -1222 1328
6520A328J929K67j644k531k293n51J141K248K425J327r01j795k615j563j97J979
$$ 1328 3257 3524 1880 -651 -2944 -3495 -2354 -106 2319 3646 2745 950 -1665 -3228 -3425 -1446
6536a446K203K203O36j413k196k148j294O37K015K520J679k59j684k476k060m14
$$ -1446 757 2960 3596 2183 -13 -2161 -3455 -2818 -803 1717 3396 3137 1453 -1023 -3083 -3497
6552c497J197K425K420R10q12k070k335j621K37J936K382J812M30j443k394k109
$$ -3497 -2300 125 2545 3455 2643 573 -1762 -3383 -3146 -1210 1172 2984 3414 1971 -423 -2532
6568b532p84O33K374K333J166l07j803k531j810P1J462K243K464M05j134k135
$$ -2532 -3316 -2683 -309 2024 3190 2883 1080 -1451 -3261 -3190 -1728 515 2979 3384 2250 115
6584A15k107j468O78J759K557J529K07j836k231j898o89J086K171K214J278n76
$$ 115 -1992 -3460 -2782 -1023 1534 3063 3270 1434 -797 -2695 -3384 -2298 -127 2087 3365 2789
6600B789j866k579j544K87J573K301J888M42j291k266k078r40O35K348J971J420
$$ 2789 923 -1656 -3200 -2913 -1340 961 2849 3291 2000 -266 -2344 -3284 -2649 -301 1670 3090
6616C090p6j701k503j852L1J108K256K226O86r30j864k462j296N45J691K164J780
$$ 3090 3014 1313 -1190 -3042 -3011 -1903 353 2579 3265 2335 471 -1991 -3287 -2742 -1051 1113 2893
6633B893L07j591k092k120n57Q43K221K099J042l34j853k289j508o6J306K599
$$ 2893 3200 1609 -483 -2603 -3160 -2317 -96 2003 3045 2711 858 -1431 -2939 -3005 -1699 900
6649I00J818L39p70k354k038j143N81J959K218J559k10j538k334j639m56J123
$$ 900 2718 3057 2287 -67 -2105 -3248 -2667 -708 1510 3069 2859 1321 -1013 -2652 -3108 -1985
6665a985K168K048Q71o21k056k379r64K30J605K251J650K46j366j919k104r26
$$ -1985 183 2231 3102 2481 425 -1954 -2918 -2688 -1083 1168 2818 3064 1698 -221 -2325 -3251
6681c251R21J934K334J122m12j712k256j436j58J291K243J841R70j364j868k211
$$ -3251 -2330 -396 1938 3060 2648 936 -1320 -2756 -2914 -1623 620 2461 3431 2067 199 -2012
6697b012r29L00J919K106J562k06j342k080j874l16Q02K146K027R25n62j899k141
$$ -2012 -2941 -2641 -722 1384 2946 2740 1398 -682 -2556 -2872 -2070 76 2103 3028 2466 567 -1574
6714a574j436J93J571K155J641M39j105k117j916q29N16J992K092J336l12j597
$$ -1574 -3010 -2817 -1246 909 2550 2989 1884 -233 -2149 -2978 -2462 -470 1622 2958 2646 1049
6730A049k082j661j95J126K161J891Q49q95j909k119j122K94J741K128J400L66
$$ 1049 -1033 -2694 -2889 -1763 398 2289 3138 2243 334 -1785 -2907 -2613 -872 1256 2656 3022
6746C022j422k063j876m87P63J693K421R39n33j551k223j590J35J300J946J953
$$ 3022 1600 -463 -2339 -2826 -2063 -370 2051 2990 2457 906 -1317 -2907 -2772 -1472 474 2427
6762B427N10r94j829j889j206N81J776K041J266M0j453k125j656l52R26K133J904
$$ 2427 2937 1943 114 -1775 -2981 -2400 -624 1417 2683 2723 1270 -855 -2511 -2863 -1937 196 2100
6779B100Q54o20j608k360j225K20J514J899J551O43j192k070j767q55P62J984
$$ 2100 2954 2334 726 -1634 -2859 -2639 -1125 774 2325 2968 1776 -294 -2061 -2916 -2154 -170
6795a70J702J343m09j521k125j458k27J304K053J879N64r83j754j842j327O96
$$ -170 1532 2875 2466 945 -1180 -2638 -2865 -1561 492 2371 2935 1952 198 -1644 -2971 -2275
6811b275J560J863J439K5j264j932j692m53Q90J921J621J079n69j339k171j249
$$ -2275 -715 1148 2587 2612 1348 -584 -2276 -2729 -1839 82 1703 2782 2213 874 -1297 -2546
6827b546L6J126J952J910K32r49k067j714p68O48J643J888J174j59j299j973j451
$$ -2546 -2510 -1384 568 2478 2710 1761 -306 -2020 -2788 -2140 -497 1391 2565 2406 1107 -866 -2317
6844b317l75J054J949J736P00o84j799j883j008L35J317K077J307L45j295j728
$$ -2317 -2692 -1638 311 2047 2747 2063 264 -1619 -2627 -2292 -975 1102 2409 2754 1459 -269
6860b69j918o03Q88J783J716J088j91j788j921j202k60J154K025J556O55r24j625
$$ -269 -2187 -2790 -1902 -119 1597 2685 2494 706 -1215 -2417 -2677 -1523 502 2058 2713 1789 164
6877A64j938r53N14J608J752J327R1j435j801j431m82R80J648J741R98p18j680
$$ 164 -1774 -2727 -2213 -605 1147 2474 2565 1130 -671 -2102 -2584 -1604 44 1785 2783 2065 385
6894C85j829j040Q4J397J938J408J02q03j838j813n90N32J859J685J155k36j517
$$ 385 -1444 -2484 -2400 -1003 935 2343 2445 1642 -196 -2009 -2599 -2067 -208 1477 2632 2396 879
6911H79j778j339k29J011J885J724O07q28j744j776p40J24J329J931J254K02j179
$$ 879 -899 -2238 -2467 -1456 429 2153 2760 1932 188 -1588 -2328 -2204 -875 1056 2310 2512 1333
6928A333j766j749l97Q93J663J611J058n10j511j816j008l5Q35K086J515L30r88
$$ 1333 -433 -2182 -2579 -1686 -23 1588 2646 2136 625 -1191 -2199 -2234 -1399 687 2202 2532 1544
6945A544j431j851p00M69J525J734J108j15j258j879j529q8R78J747J558P97o74
$$ 1544 113 -1738 -2438 -1969 -444 1290 2398 2283 1025 -854 -2383 -2471 -1493 254 1812 2609 1935
6962A935j673j596j079K21J213J777J231L11j146j654j459o22O80J675J671Q48
$$ 1935 262 -1334 -2413 -2192 -979 798 2029 2340 1194 -460 -1919 -2541 -1861 -186 1485 2333
6978B333j27j549j514j370K1J089J659J275M25m44j649j685r32M74J447J667J117
$$ 2333 2206 657 -857 -2227 -2206 -1117 542 1817 2242 1798 149 -1536 -2468 -1994 -547 1120 2237
6995B237P2j172j823j483k53Q51J768J464P19m35j496j654j155J73J244J496J570
$$ 2237 2309 1137 -686 -2169 -2422 -1571 197 1661 2380 1945 449 -1205 -2360 -2187 -943 553 2123
7012B123L20q32j791j654o42O72J503J746Q66k11j209j609j263j83P48J713J520
$$ 2123 2443 1611 -180 -1834 -2476 -1804 -301 1445 2311 2100 891 -718 -1981 -2164 -1416 297 1817
7029A817O09p56j363j720q50L41J141J632J155J68q62j776j533l90P53J491J532
$$ 1817 2426 1670 307 -1413 -2263 -1922 -781 851 2006 2174 1312 -464 -1997 -2387 -1634 -143 1389
7046A389Q75q6j467j878j156J27J218J341J592L15q01j468j582q02N54J230J648
$$ 1389 2264 2178 711 -1167 -2323 -2196 -978 363 1955 2270 1469 1 -1581 -2383 -1829 -599 1049
7063A049J242j42j133j567j432l11R07J591J492N64m79j412j703q12K42J131J619
$$ 1049 2291 2149 1016 -551 -1983 -2294 -1387 204 1696 2260 1781 369 -1334 -2146 -1904 -773 846
7080H46J325j05p10j567j628m31O30J357J590R47l17j180j561j219k35R25J733
$$ 846 2171 2066 1356 -211 -1839 -2270 -1640 -283 1307 2254 1937 757 -804 -2023 -2258 -1333 400
7097D00J396M16o67j380j577p21M09J183J564J220j55r06j544j617j66N78J565
$$ 400 1796 2212 1545 165 -1412 -2133 -1724 -541 1023 2243 2088 1182 -362 -1979 -2145 -1567 -2
7114bJ333R25k72j482j638r58n5J072J716J233L57p67j755j189o85M24J278J659
$$ -2 1331 2256 1984 502 -1136 -2094 -2149 -1077 639 1872 2229 1462 -293 -1482 -2167 -1743 -465 1194
7132A194R77l13j063j470j238j30P23J636J380L36k72j438j719o99K31J187J586
$$ 1194 2171 1858 795 -675 -1913 -2043 -1320 316 1696 2032 1760 322 -1397 -2096 -1865 -678 908
7149I08R77K63r65j258j635m36P04J310J498P33r8j288j500j264m5J123J392J437
$$ 908 1885 2148 1183 -75 -1710 -2146 -1442 -132 1366 2099 2001 713 -787 -2051 -2096 -973 419 1856
7167A856K51o17j521j522n22K16J360J515Q82K29j247j375j400j41O80J659J187
$$ 1856 2107 1490 -31 -1553 -2075 -1859 -499 1016 1898 2127 880 -495 -1895 -2036 -1356 303 1490
7184A490N96l29j442j368j012k0J106J754R51L75p58j425j412p13P17J215J533
$$ 1490 2086 1757 315 -1053 -2065 -2085 -979 775 1726 2101 1343 -82 -1494 -2207 -1490 -275 1258
7201A258P46k63r96j392j330k46J150J374J361L61m99j353j535p89M24J156J317
$$ 1258 2004 1741 745 -647 -1977 -2223 -1073 301 1662 2023 1524 171 -1364 -2153 -1729 -573 744
7218G44J267j29q72j581j072l66N49J356J487O36k81j171j576r55J5R19J482J231
$$ 744 2011 1882 1010 -571 -1643 -2009 -1460 -104 1383 2019 1738 567 -1009 -1964 -1949 -1030 452 1683
7236A683K70o43j397j269o88K47J418J374J069k23r33j444j147m39R77J349J260
$$ 1683 1953 1310 -87 -1356 -2044 -1797 -379 995 2064 1841 908 -536 -1683 -2122 -1145 204 1464
7253A464M52k54j261j615o34N0J098J589J026K6o88j544j348o40P56J403J365
$$ 1464 1916 1662 401 -1214 -1848 -1798 -700 889 1915 1941 1253 -291 -1639 -2279 -1523 -120 1245
7270A245O77r7j303j283j009j31R79J396J231K80o81j307j254p62K89J186J552
$$ 1245 1922 1825 522 -761 -1770 -1901 -922 474 1705 1985 1304 -3 -1257 -2019 -1730 -544 1008
7287A008Q62o2p71j417j165l40N33J261J455P18o16j080j464p86L5J106J393R80
$$ 1008 1870 1808 1037 -380 -1545 -1885 -1352 -91 1364 2082 1466 386 -1078 -1864 -1829 -723 670 1650
7305A650J71p51j203j310n52N31R54J573Q99K5j109j516j085k00Q86J180J341
$$ 1650 1821 1070 -133 -1443 -1995 -1464 -510 1063 1962 1987 878 -638 -1723 -1923 -1037 143 1484
7322A484N03n23j175j572m53q0J142J459Q11K73q89j467j108l26N16J337J193
$$ 1484 1987 1464 289 -1283 -1736 -1816 -674 785 1596 1869 980 -487 -1595 -1921 -1405 -68 1125
7339A125Q55m09j015j316r77k18Q67J565J125K83n99j183j222q77M67J078J238
$$ 1125 1980 1571 556 -760 -1737 -1955 -1088 477 1602 1885 1286 103 -1119 -1996 -1529 -451 787
7356G87Q82J28p62j554j116j53N45J306J250N67m64j086j243p90L2J018J295R26
$$ 787 1669 1797 1035 -519 -1635 -1788 -1243 63 1313 1880 1416 330 -913 -1703 -1671 -653 642 1568
7374A568L50r04j214j220l69L95J282J106R04m5j106j433j052j32Q10J241J154
$$ 1568 1918 1014 -200 -1420 -1789 -1394 -112 994 1898 1853 747 -686 -1738 -1870 -1060 181 1335
7391A335N53n13j264j243o58K21R38J473J017j19o72j670j002j98M12J343J204
$$ 1335 1888 1375 111 -1132 -1790 -1569 -631 842 1859 1740 1068 -602 -1604 -1802 -1390 -47 1157
7408A157O62l58r62j311j060J55J033J007J116M22o63j227j207n81L53Q87J513
$$ 1157 1819 1461 499 -812 -1872 -1717 -684 323 1439 1861 1198 -29 -1236 -1817 -1464 -577 936
7425I36P70o3r31j189r59m66Q17J225J305L38k52j098j280r30O0J167J242R74
$$ 936 1706 1643 712 -477 -1436 -1902 -1085 140 1445 1783 1531 433 -847 -1777 -1717 -550 692 1666
7443A666Q4p69j196j299l76N78J189J285Q80m50j106j152j021k46R97J312J049
$$ 1666 1750 981 -215 -1514 -1890 -1312 -123 1162 2042 1592 486 -666 -1687 -1933 -936 376 1425
7460A425L72m25j265j263o16J80R35J278J104O6p39j347j340m14O71J215J490
$$ 1425 1797 1372 107 -1156 -1772 -1592 -657 621 1725 1791 1052 -295 -1635 -2049 -1378 -163 1327
7477A327M19j93j058j356p98J5R26J219J037K94n59j126j490m14J65J207J277
$$ 1327 1746 1553 495 -861 -1659 -1644 -718 501 1538 1832 1273 147 -1343 -1757 -1592 -385 892
7494H92J002j67r37j283j153p4O87J054J292M45l96j190j294n12m9R74J325J046
$$ 892 1894 1727 790 -493 -1646 -1720 -1033 21 1313 1758 1362 172 -1122 -1634 -1683 -709 616 1662
7512A662J05n59j321j318l21M13J080J325Q09l16j056j284q01k58J010J276Q40
$$ 1662 1767 1208 -113 -1431 -1752 -1339 -259 1066 1875 1559 503 -781 -1582 -1840 -830 446 1286
7529A286M31m38j235j088n99K07Q80J535O75j0q82j308q80l85N11J415J236N77
$$ 1286 1717 1279 44 -1044 -1643 -1436 -556 979 1654 1644 762 -546 -1426 -1811 -1300 115 1351 1928
7547A928n35r45j377p31p7R16J425Q48J91n13j390j054k46J32J144J409N74j3
$$ 1928 1393 448 -929 -1660 -1737 -821 604 1452 1643 1130 -260 -1314 -1560 -1428 -284 1125 1699 1686
7565A686j001j259r33j74O78J295J164L70l72j289j210p12J59Q14J444R80Q5p92
$$ 1686 685 -574 -1507 -1681 -1003 292 1456 1826 1454 165 -1045 -1757 -1598 -784 660 1640 1725 933
7583I33j094j092n75N92J164J127P30l48r69j148q28k49R05J173J123L76n72j140
$$ 933 -161 -1253 -1828 -1236 -72 1055 1785 1437 468 -680 -1508 -1757 -852 321 1444 1820 1248 108
7601A08j202p31L08J182J235O13j1q32j190r47l40O90J163J108O65m43r26j219
$$ 108 -1094 -1825 -1517 -335 900 1513 1502 670 -520 -1467 -1807 -1117 46 1154 1819 1376 450 -769
7619g69j122K14J058J078J046J53n76j248j137m88L41J246J167P76j39j125j128
$$ -769 -1891 -1677 -619 459 1505 1658 1082 -166 -1303 -1791 -1450 -204 963 1739 1600 475 -653
7636f53j029J27O91J212J127J54l70j132j219p15J25R43J277J035K0o81j052j214
$$ -653 -1682 -1555 -864 348 1475 1629 1259 127 -1092 -1807 -1682 -739 538 1573 1593 912 -140 -1354
7654a354l34M86J171J037O95k51j122j274p48N3R51J081J117L32o45j101j392
$$ -1354 -1688 -1202 -31 1006 1701 1450 328 -946 -1694 -1641 -690 391 1508 1840 1195 94 -1298
7671a298l97L69R47J298P22j99o48j326r19j52M41J353J149L94l10j194j077q43
$$ -1298 -1695 -1326 -379 919 1641 1442 794 -532 -1451 -1603 -1162 191 1340 1734 1424 230 -847 -1690
7689a690M1R27J236J032K0o57j082j187k80L05J134J218O16j49j151j052p52k73
$$ -1690 -1649 -722 514 1546 1566 909 -173 -1360 -1640 -1335 -201 1017 1633 1484 333 -719 -1471 -1744
7707a744Q10J239R74M44m94r91j254o74L40R25J177Q70J13p59j352j096l01O72
$$ -1744 -934 305 1279 1723 1229 238 -1016 -1690 -1350 -425 752 1622 1735 976 -376 -1472 -1773 -1101
7725a101J359Q78N50j65j148j087p87O5O77J268R58K28n94j204j082m86M34R30
$$ -1101 258 1136 1686 1521 373 -714 -1501 -1436 -759 509 1467 1695 1101 -103 -1185 -1671 -1237 -307
7743c07J107P46m6q13j244r39j49N92J295J043K80m55q69j214n27l4J015J129
$$ -307 800 1546 1500 687 -557 -1496 -1645 -1053 242 1285 1565 1110 241 -973 -1500 -1534 -519 610
7761F10Q34J50o08j297r32o57P52R20J247N85j96j081j132q69J07P04J178R19
$$ 610 1444 1594 986 -311 -1243 -1900 -1148 -228 1019 1604 1408 327 -805 -1674 -1567 -863 315 1234
7779A234M06m00j107j184n18L73Q67J280P42l21p28j111q93k12N74J292P50P35
$$ 1234 1640 1240 133 -1051 -1569 -1196 -329 951 1693 1372 644 -467 -1360 -1572 -998 294 1044 1779
7797A779l25j066j309p77N6R74J046J080L52n79j419j117l42K22J204J107Q28
$$ 1779 1454 388 -921 -1698 -1642 -668 378 1458 1810 1231 -188 -1305 -1647 -1425 -221 886 1714
7814A714j71j029j019r09j69O86J161J002L34m56r00j005r32K71P88J545M90K00
$$ 1714 1543 514 -505 -1414 -1583 -897 264 1266 1600 1144 244 -761 -1693 -1422 -634 911 1401 1601
7832A601p25j151j067l40N61J180R54M64j32r58j261o85Q9N42J330J024J85n14
$$ 1601 876 -275 -1342 -1682 -1121 59 1013 1477 1345 387 -874 -1559 -1470 -928 402 1426 1611 1097
7850A097j197j000n97L65Q98J408N74Qp56j293r86k52N71J290J085L76m13q94
$$ 1097 -100 -1100 -1697 -1332 -434 974 1548 1556 800 -493 -1479 -1731 -1160 130 1215 1591 1178 284
7868B84j090q16J27P37J336R47K62q38j002j001o43M89J090J184N91k30r27j124
$$ 284 -806 -1622 -1495 -758 578 1525 1787 949 -53 -1054 -1697 -1208 -118 1066 1657 1427 500 -624
7886f24q16k24Q19J163R68K28l14j142j138n18N1J094J136P33K72r26j184q91
$$ -624 -1440 -1664 -845 318 1286 1514 1200 58 -1080 -1598 -1547 -453 683 1416 1688 762 -422 -1313
7904a313m51P43R72J210N00l02j041j178o43n6R20J145R92P8l48j289j281l04
$$ -1313 -1764 -1021 -49 1161 1661 1359 318 -860 -1503 -1559 -639 506 1498 1576 1228 -61 -1342 -1646
7922a646L49J099J014R12k55p77j169j020j54N35J102J150N48n07r18j196n35
$$ -1646 -1297 -198 816 1728 1473 696 -473 -1493 -1647 -1112 -10 1140 1688 1181 263 -933 -1468
7939a468o5R32J188Q88R3o91j096j009m70M17R09J369O89k31r16j143r50p7P89
$$ -1468 -1533 -601 587 1475 1568 877 -219 -1228 -1698 -1281 -372 997 1686 1455 539 -604 -1554 -1631 -842
7958h42J084J234K20o24r99j132m59J8J089J109Q79L2p54j197r98k92N90J102
$$ -842 242 1476 1696 1072 73 -1059 -1518 -1500 -411 698 1577 1609 855 -342 -1340 -1632 -1042 60
7976F0J000N02k29r56j160o63j97J009J050J032J30o36j023j093o44M87J184J113
$$ 60 1060 1562 1333 377 -783 -1446 -1643 -634 416 1448 1578 942 -81 -1174 -1818 -1331 -147 966
7994I66M66k1q81j049r50j67P29J062R65N59o48q71j169o53K91P97J373P16M6
$$ 966 1432 1411 530 -519 -1469 -1636 -907 155 1120 1679 1031 160 -1009 -1662 -1371 -574 799 1515 1561
8013A561o57j331q91k73K88J176J390M51l32p55j441p82k0P43J101R59M70n39
$$ 1561 904 -427 -1318 -1591 -1303 -127 1263 1714 1382 627 -814 -1596 -1616 -873 228 1187 1657 1118
8031A118j117r90o05M9J166J222N91Q6q01j352p52j84P81Q63J020N50m28j020
$$ 1118 1 -989 -1594 -1545 -379 843 1434 1520 719 -633 -1385 -1569 -788 75 1095 1645 1217 197
8049A97j146o49j7J164Q72R97M34j134r56r51l34K97R06J276O78l03n59j366r19
$$ 197 -949 -1598 -1615 -451 421 1418 1852 718 -238 -1189 -1523 -1226 -320 956 1634 1331 772 -594 -1513
8068a513j86P37J188J085L53o33q65j118p18K50R59J152Q57K4p77j225r98k90
$$ -1513 -1699 -962 226 1311 1664 1031 166 -952 -1670 -1420 -461 691 1548 1572 795 -430 -1428 -1718
8086a718M05J249J179N58m18q24j384o52J70P97J043R15L06o06j107j253l18L78
$$ -1718 -1313 -64 1115 1673 1255 431 -953 -1605 -1435 -638 405 1320 1626 1020 -87 -1340 -1658 -1280
8104a280R28J153O52Q6q22j305j017j24P36J028J094M24j40j114j178q45L57P92
$$ -1280 -352 801 1453 1539 717 -588 -1605 -1729 -993 35 1129 1553 1413 299 -879 -1724 -1367 -575
8122e75J165R08P5n95j245q23o79O10Q12J161Q12k95p65j231r19N1N64J362P73
$$ -575 590 1498 1573 978 -267 -1090 -1769 -1159 -347 814 1626 1331 566 -665 -1584 -1533 -969 393 1166
8141A166M46m71j131j021o86O6J271J165Q18j19o63j420q30k69M75J285J068N56
$$ 1166 1612 1141 10 -1011 -1697 -1631 -360 805 1623 1504 841 -579 -1409 -1678 -1203 82 1150 1706
8159A706l01j067j345o38J00R27J103R58J83o23j180r10o01L77R10J251P60j29
$$ 1706 1405 338 -1007 -1645 -1545 -618 485 1443 1626 1003 -177 -1087 -1688 -1311 -401 850 1610 1481
8177A481p02j424p57k29O26J271Q84N17m69j087j067o00n9J127
$$ 1481 779 -645 -1402 -1631 -1005 266 1150 1667 1198 111 -956 -1556 -1615 -488
8191d88
$$ Imaginary data points
##PAGE= N=2
##DATA TABLE= (X++(I..I)), XYDATA
0@%%%%%%%%%%%qJ6j6J7j8K5l3M1n4O2p3R0j03J21j43J63j90K17k48K87l26L72
$$ 0 0 0 0 0 0 0 0 0 0 0 0 -8 8 -8 9 -9 16 -17 24 -30 32 -41 49 -54 67 -76 87 -103 114 -134 153 -173 199
33A99m20M74n36O01o77P54q39R37j039J155j279J413j563J723j902K099k309K544
$$ 199 -221 253 -283 318 -359 395 -444 493 -546 609 -670 743 -820 903 -999 1100 -1209 1335
51A335k803L088l412L769m171M631n155N767o486P347q403R732j1466J3827j7254
$$ 1335 -1468 1620 -1792 1977 -2194 2437 -2718 3049 -3437 3910 -4493 5239 -6227 7600 -9654
66i654K2718l2829N7871k41403m92680P8494L01275M98325M04590J07232k83694
$$ -9654 13064 -19765 38106 -203297 -695977 -617483 -316208 182117 586707 693939 410245
77D10245m41924m41712k13425J50666M42798M46015K82433k6875l55744m90054
$$ 410245 -31679 -473391 -686816 -536150 -93352 352663 635096 608221 252477 -237577
87b37577l30370o0601K45514M61607M18482J32979j64426l89636m49662k49716
$$ -237577 -567947 -628548 -383034 78573 497055 630034 465608 75972 -373690 -623406
97f23406R2127L36010M27559L29584L0556k88336m13932l54796j38792J84308
$$ -623406 -531279 -195269 232290 561874 592430 304094 -109838 -464634 -603426 -419118
107d19118M07056L84128J97396p3508l42669m23765k59136K372K53714M09465
$$ -419118 -12062 372066 569462 495954 153285 -270480 -529616 -527244 -273530 135935
117A35935L38472P3790j91821l59031l74273j77110J23183L25254L68629K51089
$$ 135935 474407 548197 356376 -2655 -376928 -554038 -430855 -105601 263028 514117
127E14117j8107k83089l72305k85287p4717J97876L69006L25733J34655j08781
$$ 514117 496010 212921 -159384 -444671 -519388 -321512 47494 373227 507882 399101
137C99101l20585l64318k01207M3253K55750L60241K73009L2096k04041l31855
$$ 399101 78516 -285802 -487009 -443756 -188006 172235 445244 477340 273299 -58556
147e8556l10694j21586J39006L08783L22215J88676n1334k70679l34354k32973
$$ -58556 -369250 -490836 -351830 -43047 279168 467844 416510 145831 -188523 -421496
157d21496k7174K03636L32511K77938Q9445j33671k99644l12312j55695P1096
$$ -421496 -448670 -245034 87477 365415 454860 321189 21545 -290767 -446462 -375366
167c75366K54628L18367K18153Q1k09246l07830k58586p5156J50048K91185K83386
$$ -375366 -120738 197629 415782 415863 206617 -101213 -359799 -434955 -284907 6278 289664
$$ [...]
##END NTUPLES=NMR FID
##END=
