##TITLE=1H_PR184_CR
 D2O,8 sc, 
 27.9.2021
##JCAMPDX= 6.0         $$ Bruker NMR JCAMP-DX V2.0
##DATA TYPE= NMR FID
##DATA CLASS= NTUPLES
##ORIGIN= UXNMR, Bruker Analytische Messtechnik GmbH
##OWNER= root
$$ XWIN-NMR		Version 3.5
$$ Mon Sep 27 13:23:46 2021 Russian Standard Time (UT+4h)  she@DPX200
##.OBSERVE FREQUENCY= 200.1314
##.OBSERVE NUCLEUS= ^1H
##.DELAY= (6, 6)
##.ACQUISITION MODE= SIMULTANEOUS
##.ACQUISITION SCHEME= undefined
##.AVERAGES= 8
##.DIGITISER RES= 18
##SPECTROMETER/DATA SYSTEM= spect
##.PULSE SEQUENCE= zg30
##.SOLVENT NAME= MeOD
##.SHIFT REFERENCE= (INTERNAL, MeOD, 0, 15.7039)
##AUDIT TRAIL= $$ (NUMBER, WHEN, WHO, WHERE, WHAT)
$$ ##TITLE= Audit trail, XWIN-NMR		Version 3.5
$$ ##JCAMPDX= 5.01
$$ ##ORIGIN= Bruker BioSpin GmbH
$$ ##OWNER= she
$$ F:/spectra/data/she/nmr/H-F/1/audita.txt
$$ ##AUDIT TRAIL=  $$ (NUMBER, WHEN, WHO, WHERE, WHAT)
(   1,<2021-09-27 13:21:47.32 +0400>,<she>,<DPX200>,
      <created by zg, POWCHK disabled, PULCHK disabled
       configuration hash MD5:
       00 E9 B6 7A A2 85 ED C7 34 08 36 98 17 FE 4E 26
       data hash MD5: 16K
       2F F1 BB 5E 56 51 5C D3 0C 9B 74 AC BD F1 B9 47>)
$$ ##END=
$$ 
$$ hash MD5
$$ 2D 68 F3 02 9C 33 25 67 D8 BC 53 4A CE 01 1D 16
##$RELAX= 
##$RELAX= 
##$RELAX= 
##$RELAX= 
##$RELAX= 
##$RELAX= 
$$ Bruker specific parameters
$$ --------------------------
##$DU= <F:/spectra>
##$EXPNO= 1
##$NAME= <H-F>
##$PROCNO= 1
##$TYPE= <nmr>
##$USER= <she>
##$AMP= (0..31)
100 100 100 100 100 100 100 100 100 100 100 100 100 100 100 100 100 100 
100 100 100 100 100 100 100 100 100 100 100 100 100 100 
##$AQSEQ= 0
##$AQ_mod= 1
##$AUNM= <au_zg>
##$AUTOPOS= <>
##$BF1= 200.13
##$BF2= 200.13
##$BF3= 200.13
##$BF4= 200.13
##$BF5= 200.13
##$BF6= 200.13
##$BF7= 200.13
##$BF8= 200.13
##$BYTORDA= 1
##$CFDGTYP= 0
##$CFRGTYP= 5
##$CHEMSTR= <none>
##$CNST= (0..31)
1 1 145 1 1 1 1 1 1 1 1 1 1 1 1 1 1 1 1 1 1 1 1 1 1 1 1 1 1 1 1 1 
##$CPDPRG= <>
##$CPDPRG1= <>
##$CPDPRG2= <>
##$CPDPRG3= <>
##$CPDPRG4= <mlev>
##$CPDPRG5= <mlev>
##$CPDPRG6= <mlev>
##$CPDPRG7= <mlev>
##$CPDPRG8= <mlev>
##$CPDPRGB= <>
##$CPDPRGT= <>
##$D= (0..31)
0 1.2 0 0 0 0 0 0 0 0.06 0 0.03 0 0 0 0 0.0002 0 0 0 0 0 0 0 0 0 0 0 0 
0 0 0 
##$DATE= 1632734506
##$DBL= (0..7)
120 120 120 120 120 120 120 120 
##$DBP= (0..7)
150 150 150 150 150 150 150 150 
##$DBP07= 0
##$DBPNAM0= <>
##$DBPNAM1= <>
##$DBPNAM2= <>
##$DBPNAM3= <>
##$DBPNAM4= <>
##$DBPNAM5= <>
##$DBPNAM6= <>
##$DBPNAM7= <>
##$DBPOAL= (0..7)
0.5 0.5 0.5 0.5 0.5 0.5 0.5 0.5 
##$DBPOFFS= (0..7)
0 0 0 0 0 0 0 0 
##$DE= 6
##$DECBNUC= <off>
##$DECIM= 32
##$DECNUC= <off>
##$DECSTAT= 4
##$DIGMOD= 1
##$DIGTYP= 9
##$DL= (0..7)
0 120 120 120 120 120 120 120 
##$DP= (0..7)
150 150 150 150 150 150 150 150 
##$DP07= 0
##$DPNAME0= <>
##$DPNAME1= <>
##$DPNAME2= <>
##$DPNAME3= <>
##$DPNAME4= <>
##$DPNAME5= <>
##$DPNAME6= <>
##$DPNAME7= <>
##$DPOAL= (0..7)
0.5 0.5 0.5 0.5 0.5 0.5 0.5 0.5 
##$DPOFFS= (0..7)
0 0 0 0 0 0 0 0 
##$DQDMODE= 0
##$DR= 18
##$DS= 0
##$DSLIST= <SSSSSSSSSSSSSSS>
##$DSPFIRM= 0
$$ [...]
##$SUBNAM2= <"">
##$SUBNAM3= <"">
##$SUBNAM4= <"">
##$SUBNAM5= <"">
##$SUBNAM6= <"">
##$SUBNAM7= <"">
##$SUBNAM8= <"">
##$SUBNAM9= <"">
##$SW= 20.0188988654967
##$SWIBOX= (0..15)
0 0 2 0 0 0 0 0 0 0 0 0 0 0 0 0 
##$SW_h= 4006.41025641026
##$TD= 16384
##$TD0= 1
##$TE= 0
##$TE2= 300
##$TE3= 300
##$TEG= 300
##$TL= (0..7)
0 120 120 120 120 120 120 120 
##$TP= (0..7)
150 150 150 150 150 150 150 150 
##$TP07= 0
##$TPNAME0= <>
##$TPNAME1= <>
##$TPNAME2= <>
##$TPNAME3= <>
##$TPNAME4= <>
##$TPNAME5= <>
##$TPNAME6= <>
##$TPNAME7= <>
##$TPOAL= (0..7)
0.5 0.5 0.5 0.5 0.5 0.5 0.5 0.5 
##$TPOFFS= (0..7)
0 0 0 0 0 0 0 0 
##$TUNHIN= 0
##$TUNHOUT= 0
##$TUNXOUT= 0
##$USERA1= <user>
##$USERA2= <user>
##$USERA3= <user>
##$USERA4= <user>
##$USERA5= <user>
##$V9= 5
##$VALIST= <valist>
##$VCLIST= <CCCCCCCCCCCCCCC>
##$VD= 0
##$VDLIST= <DDDDDDDDDDDDDDD>
##$VPLIST= <PPPPPPPPPPPPPPP>
##$VTLIST= <TTTTTTTTTTTTTTT>
##$WBST= 1024
##$WBSW= 4
##$XGAIN= (0..3)
0 0 0 0 
##$XL= 0
##$YL= 0
##$YMAX_a= 283702
##$YMIN_a= -278093
##$ZGOPTNS= <>
##$ZL1= 120
##$ZL2= 120
##$ZL3= 120
##$ZL4= 120
##$ABSF1= 10
##$ABSF2= 0
##$ABSG= 5
##$ABSL= 3
##$ALPHA= 0
##$AQORDER= 0
##$ASSFAC= 0
##$ASSFACI= 0
##$ASSFACX= 0
##$ASSWID= 0
##$AUNMP= <proc_1d>
##$AZFE= 0.1
##$AZFW= 0.1
##$BCFW= 1
##$BC_mod= 2
##$BYTORDP= 1
##$COROFFS= 0
##$CY= 11.3945322036743
##$DATMOD= 1
##$DC= 2
##$DFILT= <>
##$DTYPP= 0
##$F1P= 2.36226072786647
##$F2P= -0.459571619588291
##$FCOR= 0.5
##$FTSIZE= 0
##$FT_mod= 4
##$GAMMA= 1
##$GB= 0.15
##$INTBC= 1
##$INTSCL= 1
##$ISEN= 128
##$LB= 0.24
##$LEV0= 0
##$LPBIN= 0
##$MAXI= 10000
##$MC2= 0
##$MEAN= 0
##$ME_mod= 0
##$MI= 1.114404
##$NCOEF= 0
##$NC_proc= 0
##$NLEV= 6
##$NOISF1= 3.799351
##$NOISF2= 2.8
##$NSP= 1
##$NTH_PI= 0
##$NZP= 0
##$OFFSET= 15.70392
##$PC= 1
##$PHC0= -14079.23
##$PHC1= 11.60089
##$PH_mod= 1
##$PKNL= yes
##$PPARMOD= 0
##$PSCAL= 0
##$PSIGN= 0
##$REVERSE= no
##$SF= 200.130013532006
##$SI= 16384
##$SIGF1= 3
##$SIGF2= 2
##$SINO= 400
##$SIOLD= 16384
##$SREGLST= <1H.CDCl3>
##$SSB= 0
##$STSI= 0
##$STSR= 0
##$SW_p= 3612.71676300578
##$SYMM= 0
##$S_DEV= 0
##$TDeff= 0
##$TDoff= 0
##$TI= <>
##$TILT= no
##$TM1= 0
##$TM2= 0
##$TOPLEV= 0
##$USERP1= <user>
##$USERP2= <user>
##$USERP3= <user>
##$USERP4= <user>
##$USERP5= <user>
##$WDW= 1
##$XDIM= 8192
##$YMAX_p= 0
##$YMIN_p= 0
$$ End of Bruker specific parameters
$$ ---------------------------------
##NTUPLES= NMR FID
##VAR_NAME=  TIME,          FID/REAL,        FID/IMAG
##SYMBOL=    X,             R,               I
##VAR_TYPE=  INDEPENDENT,   DEPENDENT,       DEPENDENT
##VAR_FORM=  AFFN,          ASDF,            ASDF
##VAR_DIM=   8192,          8192,            8192
##UNITS=     SECONDS,       ARBITRARY UNITS, ARBITRARY UNITS
##FACTOR=    0.0002496,     1,               1
##FIRST=     0,             0,               0
##LAST=      2.0444736,     0,               0
##MIN=       0,             -278093,         0
##MAX=       2.0444736,     283702,          0
$$ Real data points
##PAGE= N=1
##DATA TABLE= (X++(R..R)), XYDATA
$$ [...]
2868b448k420l57M202L940R70J85n31l850m361l57K302J835K663L670j52m209
2884A082k948j432j325O01M514M042K00j164j546m234l478J030L134K053K458
2899B987K329p59m692k994p93n87J874M615L167o95j713k240l445k869J924L339
2915e52K529K131J216k421m629k303k08K16L067M240K422j654k639k393l307j063
2931e348K518L691K398J367j68l056m416j633M42J563L243L586J355k513l075
2946d6k475k416J02L027M121J887J97j180l516l979r05J201K703L286K902J54
2962E063l292k952k269j530J164L581L458J619r20k311l451k694j27K049L018
2977D06L367J296r17l604l350j888j2K257L959K644N83j418l109l525j731R20
$$ plain form
2868 -2448 -4868 -5225 -1023 2917 3887 4072 3541 -309 -4670 -5027 -2725 -890 1773 5443 5291 1082
2884 1082 -1866 -3298 -4623 -4022 492 4534 4734 3570 2024 -2210 -5688 -4658 -1524 529 2987
2899 2987 5316 4557 -135 -3129 -3922 -4509 -2635 1980 5147 4452 2739 499 -2946 -5815 -3891 -552
2915 -552 1977 4108 5324 2903 -1726 -4029 -4237 -4021 -954 3286 5708 4054 1415 -978 -4285 -5348
2931 -5348 -2830 861 3259 4626 4458 1402 -3014 -4647 -4205 -2642 601 4187 5542 3029 -46
2946 -46 -2521 -4937 -4835 -1808 2313 4200 4397 3217 -299 -4278 -5183 -3982 -1279 2007 4909 5063
2962 5063 1771 -1181 -3450 -4980 -3816 -235 3223 4842 3922 1611 -1840 -4534 -4661 -2612 406
2977 406 3773 5069 4152 548 -2802 -4690 -4702 -2445 1514 4158 4741 3323 214 -3311 -5042 -4122
2993d122K634L507K498K28j999l354l225j043J080L371K908K255j43k469l377
3008a251k842l76J227L200L247K096j167k682k968k678o23K261L532K688R43q11
3024C796l201l530j841N77J780L436L607K56j773l195k620k348M76L447L717J456
3040D040N52j588l814l639m96J473K420L633K580l05l509l030j856j773J794M095
3056E77L151M98l86k109l850k977O76K698K177K711K250j468m275k511j065r01
3072d804K253N009K218o10j179k350m068j853J660L430K361J729J452k514m582
3087a848k281J66M42K266M656J902j858j999k265l952p02K967L615J673J651K55
3103D688l805m278r40P99N79L681M107N44l201k215k024k881K1L800L894O39R12
$$ plain form
2993 -4122 -1488 2019 4517 4745 2746 -608 -3833 -4876 -3796 -425 2483 4738 4595 2126 -1251
3008 -1251 -4093 -4469 -3242 -42 3205 5301 4134 1452 -1516 -4194 -4817 -2556 976 3664 4607 3796
3024 3796 595 -2935 -4776 -4199 -2419 1017 4624 4880 3107 -88 -2708 -5056 -4580 -1133 2584 4040
3040 4040 4592 3004 -810 -4449 -4945 -3472 -1052 2581 5161 4856 1347 -1683 -3539 -5312 -3518 577
3056 577 3728 4226 3840 1731 -2119 -5096 -4420 -1722 455 3166 5416 3948 -327 -2838 -3903 -4804
3072 -4804 -2551 2458 4676 4066 2887 537 -3531 -5384 -3724 -294 2067 3796 5248 2734 -1848
3087 -1848 -4129 -3963 -3521 -1255 3401 5303 3445 1446 -819 -4771 -5473 -2506 1109 2782 4433 4688
3103 4688 883 -3395 -4335 -3536 -2957 724 4831 5375 2174 -41 -2065 -4946 -4925 -1125 2769 3408 4320
3120D320m39m278m054j49J697J653L133L517o12l519k643j678k028R14M643L620
3136D097l54J95j354m434l675J442K219J788L371K627j927m383k216j066j415
3151e085K257N061K366m85j275k202m035k169K031K693K146K881J226k928m157
3166a675k086l21R3L053M703J290j528j784k411l707j249L371K801K076K096q5
3182D637l457m354j046M20J094K922M210Q47k722k193k503k820M8L853K918J705
3198C559Q67o56m130l309p86R99K015L488L154p55l015k406k428j655J121M144
3214B07K916Q80n9j839l687k921K57J674K781K943K072j355l401k596j809p09
3230d646K032L938K657L26j211k327l787j966R32K549L353K299O83j978l531k795
$$ plain form
3120 4320 3881 -397 -4451 -4600 -2903 -1250 1883 5400 4788 1269 -1374 -3052 -5080 -4166 477 4097
3136 4097 3743 3938 2584 -1850 -5525 -4083 -1864 -76 3295 5922 3995 -388 -2604 -3670 -5085
3151 -5085 -2828 2233 4599 4114 2839 637 -3398 -5567 -3536 -843 1303 4184 5410 2482 -1675
3166 -1675 -3761 -4082 -3989 -936 3767 5057 3529 1745 -666 -4373 -5622 -2251 550 2626 4722 4637
3182 4637 1180 -3174 -4220 -3800 -2706 216 4426 5273 2551 358 -2145 -4965 -4917 -1064 1854 3559
3198 3559 4426 3770 -360 -3669 -4455 -3456 -1441 2047 5201 4446 1431 -975 -3403 -5058 -3937 207
3214 207 3123 4003 3944 2105 -1582 -4503 -4246 -2572 209 3152 5224 3869 468 -2128 -3937 -4646
3230 -4646 -2614 1324 3981 4307 3096 769 -3018 -4984 -4052 -1503 1850 4149 4832 2854 -677 -3472
3246c472r67L28L174L830J527j93k022l191l303o94J941K758L370J589n19k923
3262A233l279k110n1J334L434K921J320j223k667l257k020K39J942L266L118M44
3278D644j465k949l066j856P48K561L316K152L96j593l869k779j153R51L192L291
3294B521K183m24k792k691k384j110J606L459K683J197k90k225l765k715O30J608
3310b509K629L246J811j625l352k516j721o75K647L759K743l04j112k651l516
3325c146j982J503K706K684K462O95k859l442j892n66J90K864L928J287q50j739
3341A843k766l414n38K778K565K026K042r9l673l298j226l13J213L262L830J44
3357D376j919j948k590k867N18L406K615J659J213r16l929l579M6P53J390L662
$$ plain form
3246 -3472 -4439 -4111 -937 2893 4420 4227 2205 -986 -4289 -4983 -3042 -284 3086 4675 4156 1233
3262 1233 -2046 -4156 -4207 -2873 561 3482 4802 3579 912 -2345 -4365 -4126 -2184 1082 4200 4644
3278 4644 3179 230 -2836 -4692 -3944 -1383 1933 4085 4481 2888 -981 -3760 -4913 -3962 -770 2521
3294 2521 4704 4280 1488 -1203 -3587 -4697 -3091 368 3051 4248 3958 1733 -2032 -4747 -4117 -2509
3310 -2509 120 3366 5177 3552 200 -2316 -4037 -4712 -2065 1694 4437 4133 3021 370 -3146
3325 -3146 -5128 -3625 -919 1765 4227 4922 2063 -1379 -3271 -3837 -3647 -783 3145 4432 3582 1843
3341 1843 -923 -4337 -4875 -2097 468 2494 4536 4437 764 -2534 -3760 -4073 -2860 402 4232 4376
3357 4376 2457 509 -2081 -4948 -4430 -1024 1591 3250 4463 3547 -382 -3961 -3915 -3162 -1772 1890
3373A890L222j248k326j998k406k397J625M188K270P31O25j844m550k269R53J307
3389b227J915L457K060j761l242j897j942r93K140M396J799j13k78k452m053j821
3405e012J861K040K142K933J264l047l264j976p06m94L139M322Q37q03j076k571
3421d11l842o10K764K048K176K318K43l790l267j174l88N55L788L993N1j772j367
3438A315l090k958L23L647J950J687J763j134l973l071J28K02J277L673K953q82
3454C810k149k045k661k003J473L717K439P60P75j682m187k450N44J317J820L656
3470C134J684j661k679k265j770j216K084M288K043L41o56k296l875j477J150
3485c171J571K408K922R36k190l281j873j267k06L081L619J190m3j184l029l242
$$ plain form
3373 1890 5112 3864 1538 -460 -2866 -5263 -3638 550 2820 3551 4176 2332 -2218 -4487 -3534 -2227
3389 -2227 -312 3145 5205 3444 202 -1695 -3637 -4630 -2490 1906 3705 3592 3314 862 -3191 -5012
3405 -5012 -3151 -1111 1031 3964 5228 2181 -1083 -3059 -3765 -4259 -1120 3202 4039 3236 2160 -411
3421 -411 -4253 -4863 -2099 -51 2125 4443 4686 896 -2371 -3545 -3933 -3378 410 4403 4454 2682 1315
3438 1315 -1775 -4733 -4410 -763 1187 2874 4637 3503 -470 -3541 -3413 -3211 -1934 1739 4692 3810
3454 3810 1661 -384 -3045 -5048 -3575 142 2581 3341 4116 2434 -1753 -4203 -3659 -2342 -522 3134
3470 3134 4818 3157 478 -1787 -3557 -4773 -2689 1599 3642 3983 3327 1031 -2844 -4321 -3171
3485 -3171 -1600 808 3730 4666 2476 -805 -2678 -3945 -4151 -1070 2549 3739 3696 2512 -517 -3759
3501c759p87J721K689K421J906p3k609l154j794l60P58L478K568J007p33j972
3517A307l085k391K51J846K788K312J308j196l183k770j147L87J839L067K424
3532C757M41j617k941k522j449J183K498K789J640J5j783l198k114p15J320K468
3548b28K807J554m21k273l040k502j02J910K846K554J227j189k716k579j770m8
3564c970K195L032K076O71q37k869l217j129O82K234K506K598K70k026k863k030
3580b677j370N46K990K947J457k79j517l437k571j20J460K510K289J939n28k421
3596A218l384j288n73J455L578K453O12j585k028k493k118M82K582K483J803J155
3612D352j589l425k601n82N46J738L528K212q77j622j991k639j513J028L721J775
$$ plain form
3501 -3759 -4546 -2825 -136 2285 4191 4118 1509 -1645 -3439 -3799 -3041 437 3005 4012 3279 1307
3517 1307 -1778 -4169 -3918 -2072 716 3028 4336 3140 -43 -2813 -3960 -3573 -1734 1333 3757
3532 3757 4198 2581 -360 -2882 -4331 -3148 -650 2139 3779 3794 2011 -1187 -3301 -4016 -2696 -228
3548 -228 2579 4133 3712 1439 -1601 -4103 -4205 -2295 551 3105 4332 3143 427 -2152 -3922 -3970
3564 -3970 -1775 1257 3333 4004 3167 298 -2919 -4048 -3366 -1132 1374 3972 4242 2216 -647 -2677
3580 -2677 -4047 -3501 -511 2436 3893 3614 2097 -1340 -3911 -4031 -2571 -61 2228 4167 3639 1218
3596 1218 -2166 -3454 -4027 -2572 1006 3459 4071 2486 458 -2035 -4153 -3671 -1089 1394 3197 4352
3612 4352 2763 -662 -3263 -3845 -3299 -1561 1967 4179 3302 1680 -311 -2950 -4463 -3435 286 2061
3628B061J632M40k365l687j888L50R94J933L749J370j589k533j929k028r06K549
3644a847L550J296O28j74k869l781j057J278J580K468K809O82k596k611j663j554
3660c861o3L544L280L71j24m57l255l270l88K207J879J820K853l46l576k530r29
3677b845r53O00L806L201k28j123r71l303k856J041K529J569K457J793j361m043
3693f87k184m04j89J538L874K297j073j639j519k840k075J882L451J668J315Q00
3709D215k272l743j744L60N07K068L958J204j910j982j734k666p70K729L327J099
3725B646O42L44l131l364j044J094J272K092L357N18k410k513k024j338Q6L001
3741g72L165R06O7q87l151l199J08J635J482K558K511n84k994k344j353j063J637
$$ plain form
3628 2061 3693 4133 1768 -1919 -3807 -3457 -2463 -530 3219 4589 3000 467 -1462 -3490 -4396 -1847
3644 -1847 1703 2999 3627 3453 584 -3197 -4254 -2976 -1396 1072 3881 4563 1967 -644 -2307 -3861
3660 -3861 -3924 -380 2900 3271 3147 2690 -565 -3835 -4223 -2016 -137 1683 4536 4190 614 -1916 -2845
3677 -2845 -3798 -3198 608 3809 3581 2458 1487 -1816 -4672 -3631 -1102 467 2924 4717 3356 -687
3693 -687 -2871 -3275 -3464 -1926 1948 4245 3172 1533 14 -2826 -4901 -3019 432 2100 3415 4215
3709 4215 1943 -1800 -3544 -3184 -2677 -609 3349 4553 2643 661 -1073 -3739 -4509 -1780 1547 2646
3725 2646 3288 3632 501 -2863 -3907 -2813 -1541 551 3908 4426 2016 -497 -2521 -3859 -3773 -772
3741 -772 2393 3299 3366 2479 -672 -3871 -3763 -2128 -646 1912 4423 3839 845 -1499 -2852 -3915 -2278
3758b278K795K513O89j014j420l131k227N68K433J844J972J445j196l266k218
3773b491p97j38J746L363K007j71j315j996k917j685J463K847K111J581J08j719
3789A997l298j986l54J059K298L123J189q79k244k115k252m34J876K487K394P39
3805C600n33k379k911j407L85J668K637K296N54j680k215k805j044N00K235K742
3821A643J585J67j657k433k332o02P23K340K537J498J12k263k747j815l31J150
3837b425K564K676J004r06k302k523j542L1J554K533K506K91o88k239k721j886
3853d073J055K221J953J927O91j633k824k013j051M45K130L123J739o30j082k615
3869f37k367j041J467K475K176J522j67k117k815j732K63Q02J951L380P13j258
$$ plain form
3758 -2278 517 3030 3719 2705 1285 -1846 -4073 -3505 -1072 772 2744 4189 2993 -273 -2491
3773 -2491 -3288 -3426 -1680 1683 3690 3519 2204 208 -2709 -4394 -2931 -84 2027 3608 3716 1997
3789 1997 -1301 -3287 -3641 -2582 -284 2839 4028 3149 905 -1210 -3462 -3896 -2020 467 2861 3600
3805 3600 3067 688 -2223 -3630 -3245 -1577 1060 3356 3910 2230 15 -2790 -3834 -3334 -1099 1643
3821 1643 3228 3395 1738 -695 -3027 -3629 -2906 -566 1971 3469 3581 1318 -1429 -3244 -3575 -2425
3837 -2425 139 2815 3819 2913 611 -1912 -3454 -3423 -1869 664 3170 3461 2773 534 -2187 -4073
3853 -4073 -3018 -797 1156 3083 3774 2141 -683 -2696 -3747 -3302 -1172 1951 3690 3060 1978 -637
3869 -637 -3004 -4045 -2578 -103 2073 3595 3428 1311 -1504 -3236 -2973 -2171 -220 3160 3873 2615
3885B615j870k353j931j42K326K832J066R51l50l041l004p76P46J414K770K435
3901C688K3k323j970j395j756L83K993K762N84J0r02l528k270J54J647J679K374
3918B153K267j248k919k020r87j038J266L449K029k9l37j557l153j941R94K155
3934i16J531K109J494j848l280j237n27o19J908L661J140o16j081j630k929j120
3950c960J639K480J411J590P93k628l035j037p4L7K763L281N73j621j545j983
3966a316k070o05K599K606J273Q12j82k885k846n46P08P83K679K689M3k388j637
3983b83j803j666M88L086K016R72O71j467l266k214K98J192J573K269K154q86
3999C134k705j887j094j172J321L186K210n3k17j746l209j680J069J377K179J946
$$ plain form
3885 2615 745 -1608 -3539 -3681 -1355 1477 2543 3494 3144 103 -2901 -3677 -2931 -1517 1253 3688
3901 3688 3711 1388 -582 -1977 -3733 -3350 -357 2405 2989 2999 2097 -1431 -3701 -3547 -1900 -221 2153
3918 2153 4420 3172 253 -1767 -2754 -3792 -2526 923 2952 2923 2586 1029 -2124 -4065 -3071 -916
3934 -916 615 2724 4218 2370 -910 -2147 -2674 -3293 -1385 2276 3416 2800 1719 89 -2840 -3960
3950 -3960 -2321 159 1570 3160 3953 1325 -1710 -2747 -2821 -2784 -21 3260 3833 2212 667 -1316
3966 -1316 -3386 -3991 -1392 1214 2487 3299 3117 232 -2614 -3160 -2452 -1669 1010 3699 3742 1354 -283
3983 -283 -2086 -3752 -3264 -178 1838 2810 3481 2014 -1252 -3466 -3168 -1976 -403 1866 4020 3134
3999 3134 429 -1458 -2552 -3724 -2403 783 2993 2940 2723 977 -2232 -3912 -2843 -1466 713 2659
4015B659J187j751k608j593p52l06J935L211J354o58r56j678k929j062J704K178
4031f5J514J715N31k168k957j297l29O57K280K867O53j195j153k266k228j13K358
4048a196K034J338J030n28k731k326p00N71R80K623K082Lj680j845j841j249N41
4065b894K429K136J066O96j654k844k072K72P16K076K153J613p61k003k145j647
4081b863n37J391K574J946P19o00k033k374j349P8J699K045J960N28q96k268k196
4098b176j170L17K142K396J705l38j106k369j731q87O59K191K220J266n9j644
4114A416k379j854n73J417K225J721J254k70k317k069j573r6J412K293K198M71
4130C276j247j766k163j336J0K469J867J517O88r09k948k053n61P18J709K374
$$ plain form
4015 2659 3846 2095 -513 -2106 -2858 -3164 -1229 1982 3336 2678 1722 44 -2885 -3947 -2243 -65
4031 -65 1449 3164 3695 1527 -1430 -2727 -3056 -2399 -119 2748 3401 2206 1053 -1213 -3441 -3554 -1196
4048 -1196 838 2176 3206 2678 -53 -2379 -3079 -2508 -1528 1095 3177 3180 1500 -345 -2186 -3435 -2894
4065 -2894 -465 1671 2737 3433 1779 -1065 -3137 -2865 -2149 -73 2080 3693 2932 929 -1216 -2863
4081 -2863 -3400 -2009 565 2511 3230 2630 597 -1777 -3126 -3048 -1349 696 2656 3184 2288 20 -2176
4098 -2176 -3346 -3029 -887 1509 3214 2876 1770 -599 -2330 -3217 -2558 -367 1853 3119 3060 1416
4114 1416 -963 -2817 -3390 -1973 252 1973 3227 2957 640 -1429 -3002 -3098 -1686 607 2805 3276
4130 3276 2029 263 -1900 -3236 -3226 -757 1110 2627 3315 2406 -542 -2595 -3156 -2438 -729 1645
4146A645J622l10j721j663j788r79O46K749J512J148k36j233k902j456N6R17K028
4163C5K251J581j494k236j611j283o20J880K590J421M05k94k016l073q73R70J786
4180e81J469J948J046k071k149j485j040K2K211K820J001o98q78k029k893n2J296
4197b063K452Q67J913J50k514k502p21m40O59K525K902j16j233j020k247k198
4213c586M61K444J517J378R29l79l228j828n35J70J313K911J714p16j615j216
4229b66j757j728J462K659J438L71Q67j347l122j631P81M14J620K360J441j248
4245B314k144j092j481q77J666K687J126L31j9j917l068q29J040J352J366K446
4261B901P37k194k190r61j274M6K114L084M86m02n33k007k820m68J682J549J538
$$ plain form
4146 1645 3267 2957 1236 -427 -2215 -3194 -2548 201 1713 2861 2625 1392 -1510 -2966 -2910 -1993 35
4163 35 2286 3867 2373 137 -1474 -2757 -3377 -1497 1093 2514 2919 2625 609 -2464 -3337 -2367 -581
4180 -581 888 2836 3882 1811 -338 -1823 -2863 -2841 -630 2190 3191 2493 1615 -414 -3307 -3359 -2063
4197 -2063 389 1256 3169 3319 805 -1697 -2418 -2858 -2199 326 3228 3112 1879 859 -1388 -3586
4213 -3586 -3125 -681 836 2214 3143 2764 -464 -2292 -2827 -2657 -1344 1567 3281 2565 950 -266
4229 -266 -2023 -3751 -2289 370 1808 2179 3046 1699 -1423 -3054 -2273 -1859 -239 2121 3562 2314
4245 2314 170 -922 -2403 -3280 -1614 1073 2199 2530 2511 594 -2474 -3303 -2263 -911 455 2901
4261 2901 3638 1444 -746 -1707 -2981 -2935 -821 2263 2749 2347 1814 -193 -3013 -3481 -1799 -250 1288
4278A288K021k02k402k275p84m08L01K664K543p4p56r17k574j732O88K016J391
4295G88J209J008p90k362k026n73K59J351K292J877n84j082j529j860j484R57
4311b549K682J283J328J08j251k871j494M18O61J450K289J376j189j653j727j374
4327b513q10J865K294J290O02k58k267k371q62N83J266J922J745N79j618j353
4343I4k002r29L61J872K372Q26j27r33k058j964m87J237J625J516J707l92j912
4360H06j975j296l42R55K363J787P76q31j611j965j479m3J705J645K047M60r26
4377B076j916k044q49K50J622K118J405J70j191j976k088n02P41J562K183J287
4393B848l37j321k024j608k94Q68J851J849R60m77j225k389j073p7P84J788K488
$$ plain form
4278 1288 3309 3107 705 -1570 -2354 -2762 -2461 203 2746 2672 1916 999 -1575 -3307 -2619 -603 788
4295 788 1997 3005 2215 -147 -2173 -2746 -2487 -1136 1156 3033 2449 1367 -162 -2022 -3506 -2549
4311 -2549 133 1416 2744 2852 1601 -1270 -2764 -2346 -1685 -235 2054 3430 2241 588 -1139 -2513
4327 -2513 -3323 -1458 836 2126 2728 2470 203 -2168 -3030 -2447 -1181 741 2486 3065 1447 94
4343 94 -1908 -2837 -2476 -604 1768 2594 2467 1534 -524 -2488 -2975 -1738 -113 1403 3110 2718 806
4360 806 -1169 -2465 -2807 -1852 511 2298 3074 2243 632 -1333 -2812 -2855 -1150 495 2542 3002 2076
4377 2076 160 -1884 -2733 -2483 -861 1257 2662 2832 1641 -335 -2423 -2925 -2184 -622 1561 2848
4393 2848 2511 1190 -834 -2442 -2736 -1868 -17 1832 2792 2315 1090 -1299 -2372 -2449 -1665 123 2611
4410B611O41j428j662j446j443L2J633J846J834K67r56k071j901q21Q58J048J782
4427H24J947K74j852j835j030j066N40K366J633P69k85j042j788k295J75J371
4443a294J399J226J484j80k324j766r01k07Q66K298J737K82q63j001k308j622
4459c174P58J940J242J502P12j002k392j806OL1J300K248J425o32j119j311k038
4476b310p23J018K269J235J034J98j686k425j106K84M27J681K585O14j573j403
4492A19j240j476m74K168K191M78P27l06k185k078p18R60R07J689K342m34j498
4509A172j754q58j180K87K520J616K70R3p12k141j906J87J109J221J249J648l94
4526B427j992j638q29n90P64K721J529m07k78r81k581j267P98J813J155J406J093
$$ plain form
4410 2611 3252 1824 162 -1284 -2727 -2695 -1062 784 2618 2885 1929 -142 -2043 -2864 -2006 -958 824
4427 824 2771 3045 1193 -642 -1672 -2738 -2198 168 1801 2570 2285 1243 -545 -2840 -2665 -1294
4443 -1294 105 1331 2815 2635 311 -1455 -2356 -2563 -1697 601 2338 2620 1757 756 -1552 -3174
4459 -3174 -2416 -476 766 2268 2980 1978 -414 -2220 -2214 -2183 -883 1365 2790 2158 1039 -272 -2310
4476 -2310 -3033 -2015 254 1489 2523 2721 1035 -1390 -2496 -2212 -1785 -104 2481 3095 1522 119
4492 119 -1121 -2597 -3071 -903 1288 1766 2493 2187 2 -2076 -2794 -1834 -927 762 3104 2670 1172
4509 1172 -582 -1440 -2620 -2333 187 1803 2073 2166 1454 -687 -2593 -2406 -1297 -76 1173 2821 2427
4526 2427 435 -1203 -2032 -2622 -1858 863 2392 1985 1707 726 -1855 -3122 -2324 -511 644 2050 3143
4543C143j378k257j432l35k68J700K482J023p79n78j425k084q06J405J600J277
4559A288J116J37j467k218j034J46L49J541K379L52j106j250r40j650k91J527
4575a121J931Q46P14k75k010j654p15N50P39J781J912j64j350j311j392j288M98
4592b309K079K025K90K55j016k061j497k59J002J179J741J103j03j738j608j079
4608a996k91Q28J886J991k54l74j096j950j450N68J262J348J907L01j199j613
4624a32j794n40L89J201K037J056j85q43j632j539o42Q22J578J394J094l8j210
4641A016j809j330l56P00K030J499P29o44j355j350j244k87J217J715J516L87
4657B434r60j275j677r82M23J342J386J464K76r41j651j430q98O60J325J798J182
$$ plain form
4543 3143 1765 -492 -1924 -2259 -2527 -827 1655 2678 1899 1321 -104 -2188 -2994 -1589 11 1288
4559 1288 2404 2541 1074 -1144 -2178 -2032 -1683 -142 2237 2589 1483 233 -707 -2357 -2648 -1121
4575 -1121 810 1656 2370 2095 85 -1569 -2284 -1734 -995 786 2698 2534 1184 -127 -1519 -2807 -2309
4592 -2309 -230 1795 2085 2340 1324 -737 -2234 -2493 -1491 -312 1429 2532 2429 691 -917 -1996
4608 -1996 -2287 -1459 427 2418 2164 1790 694 -1256 -2706 -2138 -876 472 2379 2680 1481 -132
4624 -132 -1926 -2466 -2077 -876 1161 2217 2032 1189 -443 -1982 -2624 -1802 -224 1170 2264 2226 1016
4641 1016 -793 -2123 -2479 -1779 251 1750 2479 1835 480 -870 -2114 -2401 -1184 531 2047 2434
4657 2434 1474 199 -1478 -2460 -2037 -695 691 2155 2431 1490 -161 -1591 -2489 -1829 -504 1294 2476
4674B476l92r30j730j539l38R10J623J541N77J38j569j780j188J17P89J450J433
4691A588R59q20j597j525n07k44P18K147J348K56o99j391j606r98M77J402J325
4708H33J047J93o90j694j457m17L9K036J847M34k33r40j512j461n04J294J351
4725A66J190P60Q7j415k094n05j98M63J701J881M81j183o57j612j318O6J324J786
4743I23O36P75l74k143j535m94Q18L81J848J615k57j302j237q99j132M99J759
4760a19J581K62N91j316j834j306M12O06J010J697J264r88j866q22j270k64J199
4777a163K119J105k12j41j205k058o35P06Q31P21J881N10j447j558p52r03M11
4794a790J081K129P40n54n42j184k146j63J523R12R20J315k8k029j240n70j53
$$ plain form
4674 2476 2084 1154 -576 -2115 -2453 -1543 80 1621 2198 2336 767 -1013 -2201 -2084 -1295 155 1588
4691 1588 2547 1727 130 -1395 -1902 -2146 -1428 719 2067 2323 1624 233 -1373 -2371 -1894 -492 833
4708 833 1880 2073 1383 -311 -1768 -2185 -2146 -110 1737 2171 1938 998 -514 -1975 -2479 -1185 166
4725 166 1356 2116 2203 788 -1306 -1811 -2009 -1546 155 2036 2517 1334 677 -935 -2253 -2187 -863 923
4743 923 1559 2334 1960 -183 -1718 -2212 -1394 -1013 835 2450 2193 891 -346 -1245 -2377 -1878 -119
4760 -119 1462 1724 2315 999 -835 -2141 -1729 -1123 -113 1584 2848 1860 -6 -828 -2098 -2362 -1163
4777 -1163 956 2061 1849 1708 503 -1555 -2190 -1484 -653 68 1949 2459 1012 -546 -1298 -2201 -1790
4794 -1790 -709 1420 2160 1606 1064 -120 -2266 -2429 -906 6 926 2241 2213 184 -1056 -1626 -1779
4811a779L86J600J617N09j054o80j537j186p9J597J348N11Q04k65k138j172k39
4828a757J99M47J641J763l04j561o69r99j083N72J995J114n5M73n86k031j009
4845a850n5O21Q32J833P60o54j281q69j055l02J108J883P19M1l6j308j937n71
4863b121N36Q78J120J444L48j188j271j063n26K90J054J750O33k50n98j154j434
4880a552l67O14J636O78P19J28j447j398q98R9P54J276J524N1l86j070j342p59
4898a740j89R83J447J095K14m77j089j580o16M03R47J345J027j11q42o81j276
4915a140r88P00J226J134P86j80q74j320j072j71P65P57J605O07l01j005j311
4932g82r06m87J612O96J278N20l54j707j014o29j7R33J213J391J01p76j109j107
$$ plain form
4811 -1779 -1393 207 1824 2333 1279 599 -938 -2124 -2203 -606 742 1253 2057 1792 -346 -1518 -1757
4828 -1757 -1558 -1111 530 2293 1989 428 -241 -1240 -2323 -1751 244 1358 1303 1776 1190 -841 -1850
4845 -1850 -1905 -1284 -452 1381 2141 1487 206 -663 -1718 -2020 -912 971 1690 1731 1695 387 -1550 -2121
4863 -2121 -1585 -707 413 1857 2205 1017 -254 -1317 -1843 -1553 -499 1251 1884 1634 1036 -118 -1552
4880 -1552 -1919 -1305 331 1009 1728 1856 409 -989 -1887 -1788 -1034 242 1766 1817 1431 361 -981 -1740
4898 -1740 -1929 -946 501 1596 1810 1333 244 -1336 -1952 -1549 -602 743 1770 1659 817 136 -1140
4915 -1140 -2128 -1428 -202 932 1718 1538 664 -656 -1728 -1899 -1134 -377 1228 1835 1534 529 -782
4932 -782 -1688 -2175 -563 133 1411 1931 1577 -130 -1144 -1773 -1790 -857 356 1747 1848 1072 -37 -1144
4950a144o51K93J038J243J228j59p60j475j011k47M25R55J732M00k60n88j590
4967e71j098J04N27J016J362L84k05j278j272n38Q0K81J463J261L3j11j555r15
4985a032p85M57J031N96J055N24o18j631j028OJ42P98J390P17r0p76j202p39o77
5004a862P72J314J026L73J93j249j715k30k18N83J045J267N82o27j403p20o73
5021a542j26J069J279O76J09k04j096j442l35J58J056Q83J241J98j188j015p11
5038i90m08k6J471J399J07m02n71j099j136L81P23N87P95J200q03r91q69n01m67
5057a600N79J670Q90P9q04n27j280j082Q85P51Q81O68N75n17j495r63q0o8Q48
5076e90J482Q63o30l13q65j209o28P65J482M66P79J40r69j549p84L02L37J052
$$ plain form
4950 -1144 -1795 -1502 -464 779 2007 1848 1088 -387 -1398 -1645 -1220 -265 1467 1867 1607 1019 -571
4967 -571 -1669 -1565 -1038 -22 1340 1724 1519 241 -1031 -1569 -1489 -1208 255 1516 1549 1438 -117 -1032
4985 -1032 -1817 -1360 -329 267 1322 1846 1228 -403 -1431 -1425 -1283 -485 905 1622 1532 756 -446 -1185 -1862
5004 -1862 -1090 224 1250 1623 1816 567 -1148 -1378 -1596 -1013 32 1299 1881 1254 -149 -869 -1542
5021 -1542 -1668 -599 680 1356 1465 1261 165 -1277 -1612 -1454 -398 485 1726 1924 736 -279 -990
5038 -990 -1398 -1424 47 1446 1553 1151 580 -519 -1655 -1274 -551 36 831 2031 1228 237 -632 -1133 -1600
5057 -1600 -1021 649 1539 1618 814 287 -993 -2075 -1190 -439 442 1110 1685 1168 -327 -1290 -1370 -1438 -590
5076 -590 892 1755 1125 812 -53 -1262 -1890 -1125 357 823 1602 1742 773 -776 -1560 -1258 -921 131
5094A31J208K69m45j024p22j234L2J238J303M53o3M87j595j314j88M96M21J040
5112D93J360m14r15p20p78n46K13J230R71O26l67k74j328j102n1Q73L86J261O52
5131A570j77r74j172l71j89M69J248P27K8m85j72j280q45M37O98Q55O96L27j62
5150A228j551r75J24J00M13J516M81r2o81n89r65n13M09J364N58L96Po83j331
5169g84m47j28O62N08J106R51j020q42r77m35p0J094Q03N44L37k23j182j180j60
5188a443M36O85N66J102O2o91r25q13m58L70Q54R06O15k6m63j099q17q3M57N98
5208a67J366P5j28r18n54q82RM33J004Q63J11m15q32r18m32J13Q40J029P50j58
5228A189l39o12r90n44J09Q79J029M16J67n75r64o36j67J17Q23J118J46m9p57
$$ plain form
5094 131 1339 1608 1163 139 -583 -1817 -1785 -547 756 1209 1146 1633 38 -1276 -1464 -968 -547 493
5112 493 1853 1439 524 -196 -974 -1520 -1307 -77 894 1520 1153 879 -449 -1551 -1602 -729 -343 918 1570
5131 1570 1393 419 -753 -1124 -1313 -844 404 1131 1159 674 502 -778 -1623 -1186 -488 367 1063 1390 1228
5150 1228 -323 -1298 -1174 -1074 -661 855 1336 1244 563 -26 -991 -1504 -1095 269 827 1223 1230 547 -784
5169 -784 -1231 -1359 -697 -189 917 1868 848 6 -971 -1406 -1476 -382 421 965 1302 1079 -103 -1283 -1443
5188 -1443 -1007 -322 244 1346 1408 717 -208 -1021 -1479 -1109 -255 651 1266 1240 777 -322 -1139 -1222 -765 -167
5208 -167 1199 1274 1146 228 -326 -1208 -1199 -766 238 1101 1212 797 -35 -953 -1385 -1272 -432 597 1347 1189
5228 1189 850 238 -752 -1296 -1187 -308 721 1137 1304 729 -235 -871 -1038 -921 -98 1020 1166 1117 360
5247C60o50o98q6J83J052P11L55n3j139r44k82m8O18P73R74o8k10p72p61n46k65
5268a496Q37J356L84M63n67j035j193J58J82K39J155Q14j8r37n02o53k52J49Q56
5287f0R03M01j30o15r04q79L32M56N90R40K10p5j352n85j08l83N46J428N11l7
5307A189k84r44j011j60L41N90Q84M67N02q14j002q85LL39N20J174M41l86o43
5326C21o83p49l78R99M96N84P37k04p95j106n9n7K60O46J451r5p18n40n64q56
5346a310L07O25J009K10K32j00j328o33l29N85M67P12Q58k47r26k76p37m56K83
5365a054J133Q65pR3n54p53r32K84L30N75Q06R75q69p95n09n90JM4J184O97Lj63
5387G64l60j263o26Q06O30N10M57L78o87j123k76k12p2R99P20K89Nn31n50r85
$$ plain form
5247 360 -290 -988 -1074 -891 161 872 1227 1174 35 -909 -1191 -1239 -621 152 1126 1058 848 76 -685 -1231 -1496
5268 -1496 -659 697 1081 1544 977 -58 -1251 -1093 -911 -672 483 1297 1279 342 -160 -813 -1065 -916 -60
5287 -60 843 1244 1114 499 -405 -1284 -952 -496 94 1034 1244 1169 -183 -768 -876 -1259 -713 715 1226 1189
5307 1189 905 -39 -1050 -1210 -869 -279 605 1072 1574 760 -242 -1127 -1124 -785 -265 909 1350 964 321
5326 321 -362 -1111 -1489 -490 6 590 1327 1123 328 -778 -837 -894 -634 12 1463 1368 650 110 -454 -1310
5346 -1310 -1003 -378 631 841 1073 973 -355 -988 -1317 -732 -265 447 1305 1058 132 -144 -881 -1337 -1054
5365 -1054 79 944 937 1030 476 -277 -1209 -925 -595 -20 786 1761 892 97 -412 -1002 -1001 -957 227 924 927 764
5387 764 404 -859 -1485 -679 -49 461 918 1296 609 -514 -790 -1002 -1074 -75 645 934 939 408 -142 -1127
5407a127j95Q31O35M01J99L12p41j153p9MJ60R80P76j50j5q79n93l85Q9P39N78
5428C87L22M46k97r85j069P1N24J68Q88O87qj013j03q19n10N38O32P80P8K49m71
5449D95j011n92J32M33N34R09J9p7p60p84k87k22P52P65M87n4l6o16o47m52L85
5470f27J97Q17O65o3p83m21n07k53K93O51L43O49k5p13n35n33l46O51P11N73L24
5491A068l53o87l82l51j68L35P05P45j63j5o83n11n06J99K75Q18N89k8j14q80
5511a07p07j17j2P04N72N26j02k73o46p38j03M67M34N87P18l10q19l97n02p9M31
5532d73N35L50N48k67m17q74o91N26M41M51O47K79l66o02o51j93k80P90O77L21
5552G51K4l66m97o44k42M70N42N85L05m3p61m40k86j33J04N25Q63Q1l3n75k70
$$ plain form
5407 -1127 -1322 -491 144 545 744 1056 315 -838 -917 -913 -753 227 1003 853 838 -41 -634 -1019 -930 -191 387
5428 387 709 1155 858 -127 -1196 -1125 -601 -433 455 1142 1134 121 18 -801 -1311 -773 -141 639 717 966 495
5449 495 -516 -1108 -976 -543 -9 900 919 842 82 -702 -989 -1211 -459 306 793 739 703 87 -560 -1012 -627
5470 -627 -430 387 1052 989 206 -215 -722 -975 -682 -31 312 961 936 223 -312 -845 -1191 -540 171 744 1068
5491 1068 715 28 -354 -705 -873 -538 167 912 749 734 51 -460 -966 -767 -492 326 915 887 773 -107
5511 -107 -814 -931 -943 -239 333 859 757 484 -162 -900 -1003 -536 -102 485 1203 893 74 -323 -825 -904 -473
5532 -473 62 412 960 693 276 -598 -1289 -763 -322 129 776 1055 689 87 -564 -757 -1037 -247 430 751
5552 751 775 409 -88 -732 -974 -504 38 623 928 885 124 -316 -602 -735 -631 -106 757 838 805 230 -40
5573d0j015K46N44K94M23K23K00p88o66m0N2L17N34O66j4j86q67m72n28L43M52
5594c22R11M4K64k47j045m48J02J71L42P66N65l27n62n33m10l28N91O19M51J23
5614G27K25o75j014k24J39K49Q19M25K83k04r14l52k95O3M96O72L13m2j65n53
5634b7q40j76L84L52O86M03J24m63o04n14j88M48L10Q08J87m39j29n43q94L27
5654g88O04M05K42L39k25o13p06K54j75M73M86N60l13Q3m47p77k46J91Q27%K31
5675D05K53oj037l00j31K61O32N53N77n14k94m95l29l30M29M73K28M51Q8m27o51
5696a64o00K27J19O06L88J31j38p55k20j27l33L72O27M53k9J49j102k53k08L27
5716e30L55M75N59k28l55m01p45J10l9P72O04N33l19m00n16p18K04J69N56M08
$$ plain form
5573 -40 -1055 -809 -265 29 452 675 875 87 -579 -619 -567 -250 284 950 936 750 -117 -589 -1117 -774 -322
5594 -322 589 633 897 650 -395 -843 -741 -570 -228 538 1103 776 214 -319 -729 -1057 -466 153 604 727
5614 727 952 277 -737 -961 -822 -573 246 671 954 750 -164 -516 -811 -748 -252 420 733 691 526 -27
5634 -27 -867 -1043 -659 -307 379 782 906 443 -161 -675 -863 -415 -105 703 890 451 322 -221 -1115 -788
5654 -788 -184 221 463 802 577 -36 -742 -488 -663 -190 296 856 543 626 179 -598 -844 -653 174 174 405
5675 405 658 652 -385 -685 -816 -555 77 630 1207 693 399 -96 -425 -755 -326 147 375 826 914 487 -164
5696 -164 -764 -537 -418 188 576 707 569 -186 -406 -533 -866 -494 133 586 557 706 -396 -649 -857 -530
5716 -530 -175 300 859 631 276 -125 -870 -760 -799 -27 577 1110 791 391 -125 -843 -639 -470 86 494
5736D94M49m29m85n17j35j11N64M01P85l58p6n61m28l84M68mN60L11K17l99o15
5757b53k86k95J31K26Q54L87m02n9o25k83k91M81M25P55M2n21k60k22k04k29N3
5778e76N90Q33m06L11o14n20l38J8M42N09L94j77N3o53l88k31J67M34L99K66L34
5799H47m54k95n84k12K23N76J88L62O1n75p4q53j2R6R07M93pl77j62m58l83K00
5821d93J44L95L17N09p33k66m70K5J76O8Q33J33j86Mn32n26O8K96K81L98J98J51
5843G90m66o75j50o5J35J49N95L07j58o64j27k43k99M66N26M06R0J09n61p55J26
5864d64J54J75J93N07n8l42o0m18j24j58M50N73L40k30J32o30n29o6L84J74O21
5885F24k63K25p80j17L8l67M32K96L23J79k65l89q9m62l9O36L71j59M5J95n84
$$ plain form
5736 494 943 514 29 -488 -623 -734 -170 231 1016 658 582 21 -407 -791 -323 -327 233 544 761 362 -253
5757 -253 -539 -834 -703 -477 377 764 362 303 -322 -605 -896 -415 10 765 807 286 26 -196 -400 -629 -576
5778 -576 14 847 441 752 138 -382 -720 -702 -260 249 643 466 519 -134 -522 -753 -586 -152 247 513 847
5799 847 393 98 -486 -698 -475 101 289 651 712 137 63 -790 -802 -706 201 694 687 310 148 -310 -693 -493
5821 -493 -349 46 363 872 139 -127 -597 -572 -396 -328 505 638 452 456 -76 -602 -534 -238 43 441 639 790
5843 790 324 -351 -501 -566 -431 -282 313 620 462 -202 -329 -572 -871 -405 121 527 617 726 165 -590 -464
5864 -464 -310 -135 58 565 507 165 105 -313 -437 -595 -145 428 768 538 670 40 -489 -555 -171 3 624
5885 624 361 586 -194 -311 -273 -640 -208 88 411 590 325 -64 -153 -615 -654 -18 353 194 239 434 -150
5906a50l81j7j81N59L87K72r9l7m94O3m61r7Q16k02M96l2m45l89K4j79N5L64M76
5929C48J46r8k10j72n22R2K26L15J91K26P2m54n86q4L66j41O15J49K65p41l16
5950c13r9k79K47M39J01K79m4J59p38n03K36L47J74M41J27r6n37k83L6j93J21
5971c78N60K34j53R1j80l51m6j92K89J70L52J77j68l58n22J94j60L38L65L67M4
5992F73m98k13j23j99JO01j49L31Q3l77o29J22j89J26M50P34k82j59p1m02k83
6013d53J36L1L98J86r9P3j70l87K2Pr0M79K97l0q2l98l54j69L70K25m6P02o7k84
6037B97q02J93j80N3N05J44M1r4n3m74J41k31N3L82M73Jj38k41l74l12N67j77
6059b26J72N12o4k50l2m76j82M35j48N05J47p8J09k57n51k84N77O6M22J0r0j37
$$ plain form
5906 -150 -531 -548 -729 -170 217 489 390 353 -141 -78 -539 -636 180 -22 474 442 -3 -392 -368 -547 -492 -128 348
5929 348 494 396 186 14 -508 -416 -190 125 316 542 614 160 -426 -510 -144 -285 330 479 744 3 -313
5950 -313 -412 -691 -444 -5 96 375 331 490 -248 -751 -515 -168 6 447 574 478 -59 -342 -306 -499 -378
5971 -378 182 416 263 354 174 -177 -223 -415 -126 44 396 573 405 47 -475 -281 -441 -103 262 629 673
5992 673 175 -38 -161 -360 -359 242 93 424 507 130 -499 -377 -566 -440 10 744 462 303 232 -170 -453
6013 -453 -317 -286 112 298 199 272 102 -285 -263 -256 -346 133 430 400 318 -80 -434 -603 -233 -8 -54 648 581 297
6037 297 -505 -312 -492 -439 66 210 251 157 104 -370 -229 -460 -407 -25 448 449 311 70 -304 -616 -49 -226
6059 -226 -54 458 394 144 112 -364 -546 -111 -259 246 393 315 424 167 -384 -668 -91 -25 397 407 317 180
6081A80k43l09J35J87J9L90k28K23n66j33J3l6p7O40K22J81m47ll74M8j07J90
6103i5K78O7K23k50m35k11J60L38j66L75M20n16J31n70L13m74K79P3M46k40R4
6124B40K2l83k2j96m6O35l3K27m25q4N4k94K1J58J26N78j53j12j41o02k72N34
6146a68J33K51J60J16q5o38n5NK2L50L99k40M9m9k71r2k91K75J22L09K55l87l02
6169a32J58j77k99J28M11K92k9j73k03r4l46M29K41K8J46J75l50k37j33J7N7l37
6191d28O23K0K6M1k83k72O8J03L25J46j54M4k27k97M9L0nK47R1L24l71k27j26
6214b53J00N5n0L46R6j3j37p4l60j95L68J71j51L65q6J03n49M6J11p3J58O04j42
6237D40j26l43j28k21J96O5K56k45O49l56k49j71J7j26M58l4J25L61l43K3n65
$$ plain form
6081 180 -63 -372 -237 -50 -31 359 131 354 -212 -345 -332 -368 -445 195 417 598 151 148 -226 -178 -285 -95
6103 -95 183 250 473 223 -212 -423 -263 75 -91 284 704 188 319 -251 62 -412 -133 -60 386 146 240
6124 240 262 -121 -143 -339 -385 250 217 444 19 -65 -11 -305 -284 -126 0 578 425 313 172 -430 -702 -168
6146 -168 -35 216 376 492 407 -231 -286 -281 -259 91 490 250 299 250 -21 -113 -404 -129 -7 302 557 170 -132
6169 -132 26 -151 -450 -322 89 381 352 179 -24 -118 -464 -35 206 234 380 555 205 -32 -165 -148 -91 -428
6191 -428 195 215 241 282 -1 -273 -205 -102 223 369 215 259 32 -265 -216 -186 -191 56 147 471 100 -127 -253
6214 -253 -153 -98 -148 198 294 281 144 70 -290 -485 -117 54 -97 268 182 285 -264 -218 -107 -180 -22 582 440
6237 440 314 -29 -157 -378 -182 -117 139 -106 543 187 -62 -233 -216 -342 116 82 207 568 225 248 -317
6258c17R8J45J94j40M83n9j15l55r4k34L13J30N33o20K6O8j20j81p8K28M4K95
6280B44k18P6M18n19j96o1J38L90j11K14n57J19L0K5k74M01k84O31m8m05j28k35
6302c50J68M3K71K20J5j51k54p8K1m39M57k4J98j1O5Nj69n0j67J69J20r4R2j69
6326a12r3j1j06K90oJ21N8p3o9M5p6l33J15M00K69l23J24k26q0j72r5M13j29J85
6350A16J84o4m11j05j05J95J60l4M24j45k10J15n19J62j19L11l3K90J18l76j22
6371a68P9j76J28K31k84M46j44O0k50l40J51K65R1j48J63K39k92L0m41N71l19
6392a08Q6Q0J89J53l37n0j81MM34k82l4K29p2m65K94r9J71J45m2K24n10J34k63
6415c00J98j13j9K60L21k48l7l11J11N2J75r7pJ75k50J59j00j14J11R4P8k84J33
$$ plain form
6258 -317 -219 -74 120 -20 463 404 289 -66 -160 -394 -81 49 582 -38 -12 56 -64 -245 -323 -95 -51 244
6280 244 26 102 520 1 -195 -256 -118 272 161 375 -182 -63 -33 -8 -282 119 -165 466 418 13 -115 -350
6302 -350 -182 -139 132 352 367 216 -38 -116 -95 -534 -77 -101 97 86 151 156 -13 -63 -230 -61 59 -35 57 -112
6326 -112 -205 -216 -322 -32 -38 83 141 68 -1 44 -32 -365 -250 150 419 96 220 -6 -86 -258 -353 60 -69 116
6350 116 300 236 -175 -280 -385 -190 -30 -64 360 215 5 120 -399 -237 -356 -45 -78 212 330 -46 -168
6371 -168 -89 -265 -137 94 -190 256 112 172 -78 -418 -267 -2 89 -59 104 343 51 81 -360 211 -108
6392 -108 -22 58 247 400 63 13 -168 -164 270 -12 -46 183 111 -354 -60 -159 12 157 115 339 -171 -37 -300
6415 -300 -102 -215 -234 26 347 99 62 -249 -138 -86 89 -8 -15 160 -90 69 -31 -145 -34 60 138 -146 -13
6438a3M52m73J00j47l37K34j3L40n3r1L19l32l5q2J16P1K36l6k51j51L77m14j05
6461b88K69J89O1j4m47K66k30J23M5O9K04J5k55lj11j06J3K42N2o6L28l52p5J70
6485I9l43o7J42L21Q2l09J14M3K9j14Kj43J81J57K35m01J90l59P0J45j69K25o4
6508F6J65k41j82nQ9n6j17L10N5J15l24k33K52R6K32M2n8k5j39K8J1l23K87l5
6532A0k0J53m6N4j84Q1J4r6L8j58L15q1R5%l08L12l3k04P1M31k15m31J68K1q8
6557a01L67l67K79j90M61n10q6j8K22m1J43O1L2k89p1N0J3M7QJ18J20m2j10J12
6581B08l10K4N4N0J08M4j59k71K26p6p8J33q3M19j58q0k18J46j55R7J70J26J00
6604C17l15m09M62j55q0O8J53J52l7K33k48l58L8Q1J39J57Q1r5l24J12k28o1J06
$$ plain form
6438 -13 439 -34 66 -81 -418 -184 -197 143 90 -1 318 -14 -49 -131 -15 56 292 256 5 -146 231 -183 -288
6461 -288 -19 170 231 217 -230 36 -194 -71 -26 43 247 262 7 4 -107 -213 -200 42 94 28 356 4 -71 99
6485 99 -244 -311 -169 152 234 -75 39 82 111 -3 -1 -144 37 194 429 28 218 -141 -71 74 -95 130 66
6508 66 231 -10 -192 -197 -108 -164 -281 29 84 199 -125 -358 -106 -10 222 264 206 181 42 70 81 -242 45 10
6532 10 -10 143 97 151 -33 48 62 -34 4 -154 161 80 175 175 -133 179 146 -58 13 444 229 -202 -34 -13 -101
6557 -101 266 -101 178 -12 449 -61 -147 -165 57 16 159 220 252 -37 -108 -58 -45 2 10 128 248 206 96 208
6581 208 -102 -78 -24 26 134 178 19 -252 -26 -102 -180 -47 -130 289 131 51 -167 -21 -176 -79 91 217 317
6604 317 2 -407 55 -100 -180 -112 41 193 156 389 141 -217 -179 -98 41 198 279 184 -140 -28 -256 -317 -211
6627b11L70k54L30Q4j72j69k54j25K50K69O5J69k7o38L31k13n1J93k19O03j5j91
6649A25m0l31r6K12K67j57L65k58o0m3p8J00M4q1j7K4J56j09k24O7K15j76J27
6672C2K08L9J0j00j69k07Q6K24k6J08J69j78k95k04J4J59J94J25n5k11J98j49
6694b8N3n95N13q1M07j94OL01l26j80k5K74l93L56M36m53J79k50p1J31j25m8L13
6717B00k42K69l92P9K10l12L60j26J17j66N5Nl29j65K25P3J65J50p2q5K7p7l01
6740c32Q4N03O5j47p7k50j79L11l09K37J46RL55m80J72Q1l03J41J72k74K04O9
6762A98M9o17M42j44j30K98J35%n7k23O1p9k34M14Q4j45K06R8l32N9m17L34j67
6785a67L33mK15o29K30k91K7R7M0L66k21L63m61J49J38l99o4J93J89L19q4j73
$$ plain form
6627 -211 159 -95 235 319 147 -22 -276 -401 -151 118 183 352 325 -313 18 -195 -246 -53 -272 331 316 125
6649 125 85 -246 -342 -130 137 -20 345 87 27 -16 -94 6 50 -31 -48 -24 132 23 -201 -134 81 -95 32
6672 32 240 279 289 189 20 -187 -101 123 97 205 374 196 -99 -303 -289 -130 64 189 134 -77 121 -28
6694 -28 25 -570 -57 -138 269 75 81 382 56 -124 -149 125 -268 88 524 71 250 0 -71 60 -65 -113 200
6717 200 -42 227 -165 -86 124 -188 172 46 163 -3 52 57 -272 -437 -212 -139 26 176 104 19 46 -31 -332
6740 -332 -248 255 320 173 96 -154 -333 -22 -331 -94 52 61 416 -64 108 189 -114 27 199 -75 129 198
6762 198 247 -370 72 -72 -202 96 231 231 174 -49 12 -67 -301 113 197 52 258 356 24 83 -334 0 -167
6785 -167 166 162 377 -252 -22 -313 -286 -189 -149 217 -4 359 -102 47 185 -214 -278 -85 104 423 339 166
6807A66j05l16l7R6L59l8M2p5J31m36j89L46k8L92r7k86J35P3m00O7N5J13J46
6830A14R8O4L3l25j53Q8m13M30R2J36j15J35j3l23r5J96K53j39J10Q8k59M8l25
6853b75J2N9N00j19O8J28j89k73k27P3J95j07J33M4J42K6l20n7K39k83L4L67j85
6876a5J64ll08j1RK98n0O1J60k91k88K41l36K76O0M3L21l18j69L70n59Q8K71J77
6900A91L4K2nm51o8j35K50jK10M13j19Nr4n47n4L47J28j5Q6J40k45k96q2P5L6
6925a75J11J44L88k62l20rk08R5k7K65K53p8n9j07J3j55j06K88r1L21j16k35j4
6948h4j62O6j06K45Q0L13l05Q1k0k60J84j34p4L59K08j58j44l87K4k54K99J46
6970h3K31Q4j37k05j25k05J94m4O00K0j57j32l01J24n0K61k65K68K46j60q8j42
$$ plain form
6807 166 61 -255 -292 -196 163 125 167 92 223 -213 -402 -56 -84 308 211 -75 60 133 -267 -200 -145 -32 114
6830 114 212 276 309 -16 -169 -81 -494 -64 28 164 49 184 171 -152 -247 -51 202 63 173 261 2 50 -275
6853 -275 -263 -204 296 177 245 373 184 -89 -316 -243 -48 -155 -22 22 164 190 -130 -187 52 -231 -197 170 -15
6876 -15 149 146 -162 -173 -164 134 84 145 305 14 -274 -33 -369 -93 -33 10 331 13 -156 214 -345 -257 14 191
6900 191 225 247 242 -209 -277 -412 -162 -163 47 460 341 346 252 -295 -349 -2 126 111 197 337 92 -204 -286 -211 -175
6925 -175 -64 80 468 206 -114 -123 -331 -236 -263 2 255 177 118 11 24 -131 -237 51 -40 281 165 -70 -84
6948 -84 -246 -180 -286 -41 39 352 47 128 108 -152 32 -102 -176 183 391 233 89 -298 -274 -528 -229 -83
6970 -83 148 232 95 -110 -235 -440 -246 -290 310 330 173 41 -260 -136 -186 75 -190 78 324 164 76 -66
6992f6j31K1N2J74j1L1J70p2q3l65P1K01J19K70J69n22J46l35k0p8o3J35M84j0
7016B87j76k01K09m45K82K23l94M31j0l77K30k07q0n7M97l21O00k05k44J32m32
7037b58K28k43K43j14L76O9k20l60j35J93j21N28M17m67j01J11k90j73K4L22M28
7058D57l91K54l72K66k75k76M3K30J91K95M6l07j97j23Q4j17M7J95K96k64N9k43
7080a02K8R1l36L26p8L90qk67nk89n8K77J77J77M2k19o7k10k64J34J79L03Q2p6
7104B27j01k40j6l3j46L36L96%j63q6l14k02J17k35L04L72k60L24m4k79k73J09
7126b07L75j80R7J6Oq5l7k70K16K2L12n6J36j51j85k48k0J22J63J12k23K37J01
7149B53k83k06oK8K67J26Q4k35J41l86rJ48K3L45l8M1q4k29r5k29j04M93L6l74
$$ plain form
6992 -66 -197 -176 -124 50 39 70 240 168 85 -280 -209 -8 111 381 550 28 174 -161 -181 -259 -322 -187 297 287
7016 287 111 -90 119 -326 -44 179 -215 216 206 -171 59 -148 -228 -285 212 -109 491 286 42 174 -258
7037 -258 -30 -273 -30 -144 232 301 81 -279 -414 -221 -342 186 603 136 35 146 -144 -317 -293 29 457
7058 457 66 320 -52 214 -61 -337 -294 -64 127 422 468 161 -36 -159 -75 -192 -145 50 346 82 141 -102
7080 -102 -74 17 -319 7 -71 319 311 44 39 -250 -308 -31 146 323 365 146 79 -131 -395 -261 -82 221 303 227
7104 227 126 -114 -130 -163 -309 27 423 423 260 174 -140 -342 -225 -460 -156 216 -44 280 236 -43 -316 -207
7126 -207 168 -12 85 101 107 22 -15 -285 -69 -47 265 209 345 194 9 -239 -259 -137 26 138 -85 152 253
7149 253 -30 -236 -242 -214 53 179 263 28 169 -217 -226 -78 -55 290 252 293 209 -20 -115 -344 -448 45 81 -293
7173b93N08Kj42k36j50j35L41L84K49k31l76o3j90r0K68J08Q2L26l92M08m66j84
7195b72J00j8J02M74l13Q9k53Pk26L7K79J84j48K04k66K16k89j67ko2L57J65P6
7218B74j59j07l39q2J73M9K80l5K74k24l2l14L20j95J99j11K62k36O5k6k74J20
7240a18j1K28k14L91j36m5mj80l8j17Q8O54k03J61n19Kl5J55m10O88n1j06k40
7263f0J33k43k8J39r0M61J01J00n73K4j93L21n28M12J67J41pk92K2m07k59L83
7285b76M43K0M35n90j27m3K52k11pO8J85K13k80k50J6j69k44O55n2J58L06m23
7307G9k9j79l43J83J64M42J09r3l74o2l1k96K61N08L3r0K63m48j19n62L38Q2K07
7330D3M01J7l05k65k43R3m3J58J79K43J8m3j42l91q0M39j18k5J29k38K93l67J
$$ plain form
7173 -293 215 217 75 -161 -311 -446 -105 279 528 297 -79 -142 -332 -422 -154 -46 36 362 -30 378 -88 -272
7195 -272 -172 -190 -88 386 73 162 -91 -84 -310 -273 6 190 42 246 -20 196 -93 -260 -262 -324 33 198 274
7218 274 115 8 -331 -413 -240 -191 89 54 328 104 72 -242 78 -117 82 -29 233 -3 62 36 -238 -118
7240 -118 -129 99 -115 276 140 95 91 -89 -127 -244 -156 498 295 456 -63 -61 -96 59 -351 337 286 180 -60
7263 -60 73 -170 -198 -59 -149 312 413 513 -60 -36 -229 92 -436 -24 143 284 277 -15 7 -400 -659 -276
7285 -276 167 187 622 32 -95 -138 114 -97 -104 -36 149 362 82 -168 -152 -321 -565 90 38 196 502 79
7307 79 50 -129 -472 -289 -125 317 426 333 -41 -103 -134 -430 -169 339 372 282 545 97 -22 -584 -246 -164 43
7330 43 444 461 156 -109 -352 -259 -302 -144 35 278 296 253 111 -280 -360 79 -39 -64 65 -173 120 -247 -246
7353b46q7K92K03K76q8q2k98r9L1J04j0O8J41l0J7j74m10K95k80J0M17L4%m8J37
7378A73m47j5j56O2O57k27L56m07J56k00l93L35j29L59L01l36m8N9m95k1L42m0
7400a14M08k48K32j84k09j46l3K10K94K79k45p1j58j26O2q1J27K0Q1J61n4m00
7422a95o6j22L13k30O18K0r3j42m51L99m13Qj2N44K0R6n01r2J16l53M56R7K54
7445B71j14K72m52k25K7J62J73k71K20J55k8k80k63j26J64J50N77j25J98l49j69
7466c3k59R7k07J27M80j66M21l45n70J6J79lP1L21L38k06k87j38o9j73K78L30
7488B02n9J66m9k24k1m73L79oN4P12j91l13k02j06k71J93R6M39j99J48O3l17k04
7511a83n4K58R3J33O3J82j50m45o5l15J76K74M15J1l57O0k31m11J06L68J40n7
$$ plain form
7353 -246 -333 -41 162 438 350 268 -30 -129 -98 6 -4 64 205 175 192 18 -392 -97 -377 -367 50 84 84 36 173
7378 173 -274 -289 -445 -383 274 47 403 -4 152 -48 -441 -106 -235 124 425 89 41 100 -395 -416 -74 -114
7400 -114 294 46 278 94 -115 -261 -294 -84 210 489 244 173 15 -111 -49 -130 -3 17 98 259 205 -195
7422 -195 -261 -383 -70 -300 318 338 245 103 -348 51 -362 -354 -366 178 198 294 -207 -299 -183 -536 -80 17 271
7445 271 157 429 -23 -248 -221 -59 114 -157 63 218 190 -90 -353 -479 -315 -165 412 287 485 136 -33
7466 -33 -292 -195 -402 -275 205 39 460 115 -455 -439 -260 -263 -192 129 467 261 -26 -164 -233 -406 -128 202
7488 202 143 309 260 36 15 -458 -79 -85 -31 681 490 177 -25 -131 -402 -209 -113 326 127 275 338 21 -183
7511 -183 -237 21 114 247 310 492 342 -103 -168 -483 -307 -33 382 393 36 96 -135 -546 -440 -72 68 11
7533A1P8M31o51j31j79k4L53K34K03k24J04q0m39RJ78J41j05J46M9L21p72K12
7555a35k51J85P6N54k27J49Oo12n9R3K68o6J22L05j47k56m2m15j05K83K13K66
7577B05K30m78P8j41k64M9K60K65K50j37l3l36k28n5L3R8K03K28K00m20l40K3
7599c10O3K04K17J85K5j50k84p8L08m47J9L00P8K01J12m81m15K60LP6J68L23N8
7622D35k65k06p2j76PL49rm0L25j53m89K23l79M58l31O48m2P1k07j80k81j87O12
7645A11p7j2M6L64n08k23L45k61K4M45J21rk19j05j59j5j5K16L87r3k48j4J5l87
7669b71k2j12M33J8K61O9l40k61J14l52L04K71K55k83N38n18m03M9j16M36j20
7690e0K4M64k91j66P0l21k24O61k43K88L0p5k26l17Q4q7L14M98j97j1o8k93j92
$$ plain form
7533 11 89 520 -131 -262 -441 -465 -112 122 325 101 205 125 -314 -305 -127 14 -91 55 104 425 -347 -135
7555 -135 -386 -201 -125 429 202 351 357 -255 -314 -221 47 -19 103 408 261 5 -37 -452 -557 -274 -61 205
7577 205 435 -43 35 -106 -370 -321 -61 204 454 317 284 -52 -280 -335 -302 -204 -1 227 427 7 -333 -310
7599 -310 -247 -43 174 359 384 234 -50 -128 180 -267 -248 52 130 331 443 -38 -453 -193 -190 -114 54 377 435
7622 435 170 -36 -108 -284 -277 72 63 23 348 195 -294 -71 -450 8 -323 325 283 354 147 -33 -314 -501 111
7645 111 34 22 68 432 -76 -299 46 -215 -191 254 375 366 147 42 -117 -132 -147 69 456 363 115 101 116 -271
7669 -271 -293 -405 28 46 307 376 36 -225 -111 -463 -159 112 367 84 622 104 -299 -250 -366 70 -50
7690 -50 -26 438 147 -19 51 -270 -494 167 -76 212 242 167 -59 -376 -292 -379 -65 433 236 225 157 -136 -328
7713c28j18L36K74j37K80j26m1l42j58q9J14L90L23J7l09J00l93J53j90L21k07
7734a30L71q0k80K53m77J21R5N3L1L75J23k20l30q0K7N9K36J94K4J13m33k24L07
7757A28k15k00N82k98J83kJ45m34oj29J29K19O3K20l73L0l28n5jK96L2L78J61
7780E25l81j14k26k86O26k73J74J00M15m79k01l8k6J36J53O9j74L24j79m62k24
7801e41L01K21p3L32j17J02j87k61j93Q3J31J99J39j35K13l20j22J95j98J34K94
7822A97J83k67K84j63m41N9k60M92l0J80k0J10m97k31J7J43L37Q1J68l85k0k1
7844h4j99L45k55L07L60m01r5M8k26L9j22K96L46l4Q5j17m87j93J88j98L15L23
7866B41j0p4j53j78k04J35J16l2M62Pk15J8j02K23l38K87O8j05J50J14j61j48
$$ plain form
7713 -328 -446 -110 164 27 307 181 140 -202 -360 -449 -335 55 378 395 86 186 -207 -54 -244 77 -130
7734 -130 241 161 -119 134 -343 -222 -127 -74 -43 332 455 235 -95 -175 -148 -89 147 341 365 478 45 -179 128
7757 128 -87 -287 295 -3 180 178 323 -111 -117 -246 -117 102 165 385 12 42 -286 -341 -342 -46 -14 364 525
7780 525 144 30 -196 -482 144 -129 45 145 560 81 -120 -158 -184 -48 105 174 0 324 145 -317 -541
7801 -541 -240 -19 -92 240 123 225 38 -223 -416 -333 -202 -3 136 1 214 -106 -228 -33 -231 -97 197
7822 197 380 113 397 234 -207 -148 -408 84 54 234 214 324 -173 -404 -387 -244 93 174 342 -43 -63 -84
7844 -84 -283 62 -193 114 474 73 -22 26 -200 -161 -283 13 359 325 410 293 -194 -387 -199 -397 -82 241
7866 241 231 157 4 -174 -378 -243 -127 -159 303 310 95 113 11 234 -104 183 251 146 296 410 249 101
7888A01k28q7J5K23J62J01k17Jk68n8K5L7K51M61l55j00k13r2j37K66K54Ln0J90
7912B85k44k21K1j32L32P9mK68k92j7l51j11Q7K37K72J30j47J20j08l02jj97L73
7935G7j81K04m8L54m79l16L00k5K33r3O1Q5K29o48J69l02L25N2N26m29L48o79
7957b37J28k15R8K80rK47k93L60n02m3oj14K51J2L76j89N0j97j49Q1J83k59R2
7980e5L76k75k6q5K2j44j33K30L32j09J29k62n1m74L8L73n5M41l10L0n0k40k6
8003c24Q4J14J54Q9M2n7k39J31J00k39L89j23J4j81j93K37k49P8l1K38J31oK23
8026C82k17l60J23k60K86qK92p1j68l6l72L03j59J39k57N64Mj16r7k16J31l11
8048d24K41L35J30p6k53m0j99K22j62J72P4J69J85j83j45k42J1J95j80N31k6k19
$$ plain form
7888 101 -127 -214 -199 24 186 287 70 71 -197 -255 -230 -193 58 519 164 64 -149 -241 -378 -112 142 145 95 285
7912 285 41 -180 -159 -291 41 120 116 384 92 75 -276 -387 -300 -63 209 339 192 312 204 -98 -99 -296 77
7935 77 -104 100 52 406 -73 -389 -89 -114 119 26 87 172 401 -247 -78 -380 -55 -3 523 94 442 -237
7957 -237 -109 -324 -226 54 45 292 -1 359 -143 -186 -192 -306 -55 -43 333 144 194 -3 -152 -71 112 -147 -55
7980 -55 321 46 20 -65 -43 -187 -320 -90 242 133 262 0 -51 -525 -487 -114 -169 272 -38 -8 -58 -298 -324
8003 -324 -240 -126 28 117 159 102 -137 -6 94 -145 244 121 135 -46 -239 -2 -251 -173 -204 34 165 159 382
8026 382 165 -195 -72 -332 -46 -54 238 167 -1 -37 -409 -106 -265 -126 -383 181 185 69 -28 -244 -113 -424
8048 -424 -183 152 282 206 -47 -87 -286 -64 -226 -54 20 189 374 191 46 -196 -185 10 -170 361 335 116
8070A16j32k38MK9K9L51k02N1K04k50l55O8L12j83K43J85j37o7pl5k55K00j1Q5
8094EK55n5j14q3j80k28J63Q1K93R5J53m74j92L0K66l28M21N9K29k45j5m07j89
8117d60M38K46l58N17k24j35R6k60N1l98K44M12k6J12k01k91N30o67j73L66J94
8138A3K7K28j56k62l3Q2m9L00L0o3K70l46q2N4m29L51K70k43M66r0j98k01j70
8161b31j37Q4L47lK43j04j89k18P5k9L01j80L43k73J27j49q4j54J75J50n2J30
8183A72J08o2m02K46k42N5P4M26
$$ plain form
8070 116 -16 -254 -250 -221 -192 159 -43 8 212 -38 -393 -325 -13 -196 47 232 95 28 21 -14 -269 -69 -80 5
8094 5 260 205 91 8 -172 -400 -237 -156 137 232 385 -89 -281 -251 15 -313 108 167 396 151 136 -271 -460
8117 -460 -22 224 -134 383 159 24 120 -140 -89 -487 -243 169 143 255 54 -237 293 -374 -547 -181 13
8138 13 40 268 112 -150 -183 -101 -150 150 180 117 387 41 -41 13 -416 -65 205 -38 428 338 140 -61 -231
8161 -231 -368 -284 63 60 303 199 10 -208 -133 -162 139 -41 302 29 156 7 -77 -231 -56 94 42 172
8183 172 280 218 -184 62 -180 -125 -51 375
8191C75
$$ Imaginary data points
##PAGE= N=2
##DATA TABLE= (X++(I..I)), XYDATA
0@%%%%%%%%%%%%%jRj6J6j6J6k4L2l4M2m9N7o6P5q9J00j12J28j49J73j93K18k48
36a31K77l11L47l86M30m75N29n88O48p15P91q74R62j059J168j287J417j564J727
55I06j911K123k364K646k978L375l864M479n280O375p969J0510j5206K6760j09677
70i2075j86018J11682Q6525Q1079J63773J18736j33398j87375p6135o1552n9594
81b34352J32887K28831P9268m3429k6548j13037k05566o8982J20645J10059Q3051
92F2827J35049M3883j60664j72622n1574l3917l566J58982J95444K6470p0146
103A30166n0627j20010j69895j0029J48373J09307O5806R4418n149j77088j52538
114a37266j9193N695L3120J56925J58140j1903r8287p1313j06729j17576L2043
$$ plain form
0 0 0 0 0 0 0 0 0 0 0 0 0 0 0 -1 8 -8 8 -8 8 -16 16 -18 24 -25 32 -34 41 -48 52 -60 68 -81 92 -101 117 -131
36 -131 146 -165 182 -204 226 -249 280 -308 340 -375 416 -458 504 -555 613 -674 743 -821 906
55 906 -1005 1118 -1246 1400 -1578 1797 -2067 2412 -2868 3507 -4462 6048 -9158 17602 -92075
70 -92075 -278093 -166411 -79886 1193 164966 283702 150304 -37071 -113206 -174758 -234352
81 -234352 -101465 127366 206634 163205 136657 23620 -181946 -250928 -130283 -20224 62827
92 62827 197876 241759 81095 -91527 -143101 -177018 -180584 -21602 173842 200312 130166
103 130166 79539 -40471 -210366 -220395 -72022 37285 103091 197509 192360 15272 -137266
114 -137266 -156459 -150764 -117644 39281 197421 185518 87231 15918 -90811 -208387 -176344
125a76344J54948J05234M8918M6069n0558j69582j18990N021L6355O5964J45589
136I2624J05758m6962j06927p8980r2471o6346P1721J51095Q6126K5735O358q0405
148F7326j55671q2440L3079O1187Q1077J21109O0576p2563j14934p7167o3279
159a41700j8776R1366J37768O8562P06l4073r5422j25894m7585N1542Q1028Q8657
171E6179Q6517J5035q6847j09830p1305l3684K4956J03408J13833M4185k1276
182A21171o2464j00687r2990j2027O7084Q9927Q2927N2415k3063r5241r9717n5042
194a27707j893N6562J01700Q7989K1752m4054q3457r1511n5529J5054P5578R4662
206D9146O9810J2371n2072q9985q4599l9177K8655Q2308Q9093N5960R99n9154
$$ plain form
125 -176344 -21396 83838 132756 178825 128267 -41315 -160305 -155284 -118929 -52965 92624
136 92624 198382 151420 44493 -34487 -126958 -193304 -121583 29512 115638 141373 147731 67326
148 67326 -88345 -170785 -137706 -76519 4558 125667 186243 113680 -1254 -78421 -141700
159 -141700 -160476 -69110 68658 137220 137926 103853 8431 -117463 -165048 -113506 -32478 56179
171 56179 142696 157731 70884 -38946 -110251 -143935 -118979 -15571 98262 142447 121171
182 121171 58707 -41980 -134970 -146997 -79913 10014 92941 145356 122293 27052 -72665 -127707
194 -127707 -129600 -73038 28662 116651 138403 94349 10892 -80619 -136148 -121094 -45516 49146
206 49146 118956 131327 79255 -10730 -95329 -134506 -105851 -23543 65550 121510 122509 63355
218F3355r6043p6393j6345L8611P6721Q9421N1753k2546p3007q0278o4015j8751
230a27517N3585R4452P0952K5421j7493p1945r7988n1385J7626N2853P3409Q0890
242A02860K7356n4822q1921o1952m4268l33P5854R8378M3490l221k9295p7628
254e502r3971k4334M9329N9382O2584O7334M534q0584q3126l8916k2900J6324
266h9846Q9313R2224J5920k8613l8366p7188q0628M138P1449N9054N0083N0031
278A17571k0126r6495p3421j6550m327L1168R7209P6650j3573m6006m0436p3214
290f1550o3825L2316Q6900N0996L3233L2376l9941j05399n8380Q326J2735L9938
302c2275R6219N7683m0064n9396l8811o2183m3136N5547R3662L8865J5102J3863
$$ plain form
218 63355 -32688 -109081 -125426 -86815 -10094 79327 131080 108534 35527 -44751 -108766 -127517
230 -127517 -73932 20520 91472 116893 99400 27455 -70533 -121918 -104292 -51439 21970 102860
242 102860 130216 75394 -6527 -68479 -112747 -113080 -37226 61152 104642 101421 72126 -5502
254 -5502 -99473 -123807 -74478 -15096 47488 114822 119356 38772 -44354 -83270 -106170 -89846
266 -89846 -533 91691 107611 78998 40632 -36556 -117184 -113046 -41597 17457 67540 117571
278 117571 97445 950 -72471 -89021 -93348 -62180 35029 111679 98106 52100 11664 -61550
290 -61550 -125375 -93059 -6159 44837 78070 110446 70505 -34894 -93274 -84948 -72213 -32275
302 -32275 63944 121627 81563 22167 -16644 -78827 -121963 -66416 27246 66111 81213 95076
314I5076n5913j04838l8103L0513K5496M5914Q8046L3476o2225o4579l2849m9228
326h9214k0275P5306R1172K1134j811k386o7483r6439j4177M9592L3361M6117
338B4897P5426Q655p9953o3983k2225l1860M48Q5536Q2740M057j9625j7623o9566
351b3076q0446P852O3400L8514M1274N6045j4849q8254n7702j0460j4337K0307
363f1732Q9210O6976j5188l2551k7198o8196o0340L0109P1607L6619L3483L5872
375I8671l4665r1646m6037M494J723L3679Q6130M8590l2682m3203l1928n9374
387f6248l8662M7203P4682L2801K0268J4455m8680q5966l3161J8002J7556M3534
399d216P5313K7354m5699m9340l4489m6162j4289N9062P0466K5341P667n799n8675
$$ plain form
314 95076 39163 -65675 -103778 -73265 -47769 -1855 86191 119667 57442 -7137 -39986 -89214
326 -89214 -109489 -34183 56989 78123 76312 73926 6443 -89996 -104173 -54581 -21220 24897
338 24897 100323 108978 29025 -34958 -57183 -89043 -88595 -3059 79681 83738 64113 46490 -23076
351 -23076 -103522 -95670 -32270 6244 47518 103563 88714 460 -57242 -67702 -82039 -61732
363 -61732 27478 94454 79266 46715 19517 -48679 -109019 -78910 -7303 29316 62799 98671
375 98671 64006 -27640 -73677 -69183 -67460 -33781 52349 100939 68257 25054 -6874 -66248
387 -66248 -104910 -57707 16975 49776 70044 84499 35819 -50147 -83308 -65306 -47750 -4216
399 -4216 71097 98451 52752 3412 -31077 -77239 -91528 -32466 38000 63341 71008 65209 6534
412F534p5159j5613K9551K9530M7168O0289O240n5892n2053l0735k9447O987O5560
425g040O3921J4182p355k2705o0401o0239k75M0004L9574M4807M0386j3049o0516
438A1294n0161k4419j1059K5671O5963N0988M271k1007l6776n7287m0474J4775
450f8221M6820M3505L8618J9256k9320o0741m4370j5261P292L9943O0553L6476
462G4550p749l2841m5083m7618k0116K6636N0210M5163K6923k347m0767n5389
474b8428l6914m371K5615M8210M8619K1156j6588m2809m9428l3438M81L4113M9664
487A5882M2310J3859k2136m6583m6307k6710O371L9993N1079L4268N421k4676
499D2771m8728m7507j7010J8533L7868M6673L5743j572l8764m6344l4594j6488
$$ plain form
412 6534 -68625 -84238 -54687 -25157 22011 82300 88540 32648 -19405 -50140 -79587 -72600 -7040
425 -7040 56881 71063 63708 41003 -19398 -79637 -79912 -39908 -334 44473 84859 71810 11294
438 11294 -38867 -63286 -74345 -48674 17289 68277 72548 51541 14765 -42522 -82996 -68221
450 -68221 -21401 22104 60722 79978 50658 -10083 -54453 -69714 -62422 -22479 38074 74550
462 74550 66801 33960 -11123 -58741 -78857 -52221 -2011 43152 70075 67728 26961 -28428
474 -28428 -65342 -69713 -44098 4112 52731 73887 57299 14490 -34938 -68376 -67895 -33782 15882
487 15882 58192 72051 49915 3332 -42975 -69685 -63314 -23321 27758 62026 67447 42771
499 42771 -5957 -53464 -70474 -51941 -14073 32600 68343 66771 28007 -18337 -52931 -69419
511f9419J8129N1234M7304J6896q118k9771n1969m1574K329L2816L7322M0447
523D5626K7231j7587n0892m0932k0761n643K7454N7343L9613j300j9996l1980
535H176n0518l1574J9891M2903L3935L1168J6246l1287n7037l2279o160M724L4795
548a7017N8779K7234j9198k7062l1966m5968j8693L6496M7738K5767K1022O045
560F3177m3289n8906j9055Q381J2388L8952N5815J2309l4412l1717k7638l8562
572f2557m987M9457M7896J5119R834m653n0665n4515m737K1089J7815L9705M8136
585F6937k918m5602l2097k2098k8144Q436N7429M3162L865j053j3916n3661m6138
598f5798J0679L0832K0637L6874L7445j7909n3181k8752j3399j7448K0239O1344
$$ plain form
511 -69419 -51290 -56 47248 64144 56026 26255 -25714 -67288 -64959 -32143 5179 45626
523 45626 72857 55270 4378 -36554 -57315 -62958 -35504 21839 61452 60152 40156 8176
535 8176 -42342 -73916 -54025 -11122 22813 53981 70227 38940 -18097 -50376 -56536 -51812 -17017
548 -17017 41762 68996 49798 22736 -9230 -55198 -73891 -37395 10343 36110 57132 63177
560 63177 19888 -39018 -58073 -49692 -37304 1648 57463 69772 35360 3643 -23995 -62557
572 -62557 -67544 -18087 29809 44928 54762 50109 -556 -55071 -59808 -38719 -20904 18801 66937
585 66937 64019 18417 -13680 -35778 -63922 -55486 1943 45105 48970 47917 34001 -19660 -65798
598 -65798 -55119 -24287 -3650 33224 70669 52760 -421 -29173 -42572 -60020 -39781 21563
610B1563L4419q750j0549j9730n3318l4487K5049L7793K0075L1505K5061l0933
622C7698n6565k1960l725o597K9451O0317K3052k1192j7189k3792m8256k0175
634f8933L6798M0432J7166K3950J1541m1452n4339j2896N869L655L5346N4204
646E1341J0052l0761k3204k4171l9343n836M5539L9864J2553J3719j943m6980
658H30m7807l167J4378J3169L7427M4201l396l7472k5381k2454k7933P944M9511
671a50L5913O072L239j3069m8284l8537P075K2165J9074L5796L1934j5378m2204
684C646k4978j7387j5541K0061M9628K9216j457o585k1949m5573k6346J6266K7860
697a3139K2894L0523J7508k5206m2508k2801j0526k243K8316M6164K0346q868
$$ plain form
610 21563 55982 47232 36683 16953 -36365 -70852 -45803 -8010 12065 43570 68631 37698
622 37698 -18867 -40827 -44552 -51149 -21698 38619 61671 40479 23290 -502 -48758 -68933
634 -68933 -32135 8297 25463 49413 60954 19502 -34837 -47733 -41864 -38209 -2863 51341
646 51341 61393 30632 7428 -16743 -56086 -61922 -16383 23481 36034 49753 47810 830
658 830 -46977 -50144 -35766 -22597 14830 59031 55635 18163 -7218 -29672 -57605 -49661 -150
671 -150 35763 41835 45074 32005 -16279 -54816 -47741 -25576 -6502 29294 61228 45850 3646
684 3646 -21332 -38719 -54260 -34199 15429 44645 43188 36603 14654 -30919 -57265 -40999 -13139
697 -13139 9755 40278 57786 32580 -9928 -32729 -43255 -45498 -17182 28982 49328 40460
709D0460j5979k7554l7940j4498K4019L1431K4159K2068K906l1417l9957j8700
721d1002j954J0256L2662L8544J1294j5939k3665k9015k7852j795K8536L3051
733A3121K2123J1902j0081l4762l4553j2760O298K0746L3874K8429J769k1463
745B4643k8906k7806j5616R646L1014L1269J7850M61k0468l4111k7117n916J4876
758c0181K8025L0645J7030o636k5225l1739k2642k848J8262L0777K7996J2246
770D5710j1309k7951k9660j8567K47K1369L3324K4329M735j2985k7122l1588j5507
783d4975R222K4305K7267K3164N269k0672l2386k2776r421O534K7087L3743J5931
796D2292o477j7722k7196k9046o818K0530K6637K2283J7123k019k9389l2440j3849
$$ plain form
709 40460 24481 -3073 -41013 -55511 -31492 -61 24098 46166 49072 17655 -22302 -41002
721 -41002 -42956 -32700 -38 38506 49800 33861 10196 -18819 -46671 -48466 -19930 13121
733 13121 35244 47146 37065 2303 -32250 -45010 -38712 -17966 15908 44337 46106 24643
745 24643 -4263 -32069 -47685 -38039 -7025 24244 42094 42555 22087 -12024 -39141 -45057 -30181
758 -30181 -2156 28489 45519 38883 13658 -18081 -40723 -43571 -25309 5468 33464 45710
770 45710 34401 6450 -23210 -41777 -41530 -20161 13163 37492 42227 29242 2120 -29468 -44975
783 -44975 -35753 -11448 15819 38983 44252 23580 -8806 -31582 -41003 -34469 -7382 26361 42292
796 42292 35815 18093 -9103 -38149 -44967 -24437 2200 24483 41606 39587 10198 -22242 -36091
809c6091p77J1376L0153L2251N678j6980j9717k4518k4750K493K9485K6488J4884
822B9975J0410q718l4833k9868m053P442J4368L1639K7373n301k4255j9744k0396
835b5961j8375J1557L5103K3164O683L680j4503l7425k4266O500J3585J6138L0244
848B6124K0555j6130k9164j6285j5942j1320J9421L7910J7302j609k062j8761
860A0039l7544j6082J5945J8173J5466K6731J2834k4478l1673j2062r385m737
872c6773K5537L7642R872r086p541k0929l4134p708K4362J9912J3920K1559L844
885D0477l1087l0441o493l065K141K9540L4157J327j6024j0509k1643k8719J471
898c8868L0440J9701J0160J5316m113l5318k6946J42L524P583L0901K7755o809
$$ plain form
809 -36091 -36868 -25492 4661 36912 42590 25610 5893 -18625 -43375 -40882 -11397 15091 29975
822 29975 40385 31667 -3166 -33034 -37087 -29645 -15277 16362 43735 38434 14179 -5565 -25961
835 -25961 -44336 -32779 2324 25488 32171 35851 21348 -16077 -40343 -33843 -20258 -4120 26124
848 26124 46679 30549 1385 -14900 -30842 -42162 -22741 15169 32471 30862 28800 10039
860 10039 -27505 -43587 -27642 -9469 5997 32728 45562 21084 -10589 -22651 -32036 -36773
872 -36773 -11236 26406 36278 27192 19651 -1278 -35412 -43120 -18758 1154 15074 36633 40477
885 40477 9390 -21051 -27544 -30609 -28468 1072 35229 36556 20532 10023 -11620 -40339 -38868
898 -38868 -8428 11273 21433 36749 32636 -2682 -29628 -29486 -25962 -18379 12522 40277 33468
911C3468k1334j2873j9418k1302J0154L3232J8151O171P674j1779l5993k1226
923c5075O697Q550J2258K9378K0264j4791k4171j3002j6248j3420J8062L3689
935A2191J4169L95J461j7094l4594j3880J2698J3233J4401K5925J1235k0906k5643
948f409j1700j1132m545K2789L1840R554m973n472k0370k9409o858J7817J6544
961b324J4818J9946K508k5084k4661r342n182L813K5594K7613L261r675j0977
974A0308k1517k2531J004K1736J7625J3672J2664n679k6750k2615n172Q14J0813
987a5628K5625K1718k107j4023j5105j9713j5037P523K3417J8310J0815M559j2478
1000A7876k6441j8492j143P358J5718K3758J4161o914j7817j7133j6273o700J3457
$$ plain form
911 33468 12134 -739 -20157 -41459 -31305 1927 20078 26249 33923 22144 -13849 -35075
923 -35075 -28378 -19828 -7570 21808 42072 27281 3110 -9892 -26140 -39560 -21498 12191
935 12191 26360 26755 28216 11122 -23472 -37352 -24654 -11421 2980 28905 40140 19234 -6409
948 -6409 -18109 -29241 -33786 -10997 20843 30397 25424 19952 -418 -29827 -36685 -18868 -2324
961 -2324 12494 32440 34948 9864 -14797 -24139 -29321 -25508 86 27699 30960 21285 10308
974 10308 -11209 -33740 -32736 -11000 6625 20297 32961 27282 532 -22083 -27255 -26441 -15628
987 -15628 9997 31715 29608 15585 480 -19233 -34270 -26747 -3330 14980 25795 30354 17876
1000 17876 -8565 -27057 -28200 -20842 -5124 18634 32795 25881 8064 -9069 -25342 -32042 -18585
1013a8585K3533J6344O564l224j6811k4231j3016L177J2802J8661J9013P367j1727
1026A9867j9841j7101j1408J846J6800K2029J3951J756j0851j9721j9100p547
1038b9320O947J7218J9657J3256q05j4110k0370j6502m990R968J8561J8482J0444
1051B8436l501j6606k0151j3525j758J0484K0063J8733N963p343j5792j9509j3453
1064b7959K018J5541J7984J4285O760q865k0911j7912o872K933J3361K1548J5342
1077B7253j907j2566j4817j7880j0049Q943K0212J5524R353K351j2949k3898j4452
1090b4882J026O882J4265K1409J1081q789j6776j3138j4116o022J4883K2287J1636
1103A9746L845j711j6202k4020q954P329R782J4642J9634N605j6106j7079j0530
$$ plain form
1013 -18585 4948 21292 27856 24632 7821 -16410 -29426 -26249 -13447 5214 24227 31594 19867
1026 19867 26 -17075 -28483 -26637 -9837 12192 26143 27899 17048 -2673 -21773 -29320
1038 -29320 -22373 -5155 14502 27758 26953 12843 -7527 -24029 -29019 -19051 -490 17992 28436
1051 28436 24935 8329 -11822 -25347 -27105 -16621 3442 22175 28138 20795 5003 -14506 -27959
1064 -27959 -25941 -10400 7584 21869 28629 19764 -1147 -19059 -25931 -22998 -9637 11911 27253
1077 27253 25346 12780 -2037 -19917 -29966 -21023 -811 14713 24066 26417 13468 -10430 -24882
1090 -24882 -23856 -16974 -2709 18700 29781 20992 4216 -8922 -23038 -29060 -14177 8110 19746
1103 19746 23591 21880 5678 -18342 -27296 -19967 -10185 4457 24091 29696 13590 -3489 -14019
1116a4019j0755j117J9695K2605N957j260m946j8566k2335k580J3669J1027J3018
1129A0393J7030r36k0632j7243o560o201L756K2839K0373K57o694p021j8978j8925
1143b8542M081J7543J1421J1104J2275o178k4266j4768j980k044P794K4135J6308
1156B6883o010j0171q438j7988j4090J0275K0340J0005P549Q003j1762k5264j0926
1169b1594K765K320J0179K3629J1179j1042j3648q311j5477q912J5542K1285P755
1182A5670L953K878j5755k3935o737P535N620J2052K1121N326j5564j4620p865
1195a0321j2073k713J9370K0224M041j89j463j7905k1510j337J1549P894J2490
1208H057J6869n11j9308j4114n742p475K598K1391J7798K36m058n731j8172j7536
$$ plain form
1116 -14019 -24774 -25891 -6196 16409 22366 21106 16160 -2406 -24741 -27321 -13652 -2625 10393
1129 10393 27423 26487 5855 -11388 -17948 -24149 -20393 2446 22819 23076 16382 9361 -9617 -28542
1143 -28542 -24461 -6918 4503 15607 27882 21704 -2562 -17330 -19310 -21354 -13560 10575 26883
1156 26883 20873 10702 2264 -15724 -29814 -19539 801 10806 18355 26358 14596 -10668 -21594
1169 -21594 -18829 -16509 -6330 17299 28478 17436 3788 -4523 -20000 -28912 -13370 7915 15670
1182 15670 19623 22501 6746 -17189 -23926 -16391 -10771 1281 22402 27728 12164 -2456 -10321
1195 -10321 -22394 -25107 -5737 14487 18528 18339 16876 -1029 -22539 -23876 -12327 -4433 8057
1208 8057 24926 24415 5107 -9007 -14749 -22224 -19626 1765 19563 19799 15741 10010 -8162 -25698
1222b5698M032J4379R423J1633J1787o197k0359j3045l498k715P354K1638J3794
1235B2528l248p656q598j7353j1800Q581J5950R808R197O512j0966k0777j0113
1248a7935K14J410J0788K0077R332p560j0193j0325j4282n983J2048J6628R225
1261A3444N924K09j3546j8911p096K815O314J2801J6764L878r836j2329j0739
1274a0308j0098q0J4071J5808P354K403n109j5183j5833l709O641R327J3417J1856
1288B0557O2j2689j2892j0080n432N010J5190J3947N471k429r214j4977j1627
1301a9103j87Q728J2159J2270O810m786j3234j3131p885j09R298J4705J1200K411
1315A9146n980j2266j3366o829L094J0421J3319J0189J036q164j3348j1518n253
$$ plain form
1222 -25698 -21666 -7287 2136 13769 25556 19359 -1000 -14045 -17543 -20258 -12904 8734 22528
1235 22528 19280 11624 3026 -14327 -26127 -17546 -1596 8212 17409 23921 12955 -7822 -17935
1248 -17935 -17721 -16311 -5523 14554 23886 16326 6133 -4192 -18474 -24457 -12409 4219 13444
1261 13444 19368 19577 6031 -12880 -19976 -17161 -10847 1954 18718 22596 12760 431 -10308
1274 -10308 -20406 -20486 -6415 9393 16747 19150 14041 -1142 -16975 -20684 -14043 -4716 8701 20557
1288 20557 20619 7930 -4962 -15042 -20474 -15464 -274 13673 19144 16715 7501 -7476 -19103
1301 -19103 -19290 -10562 1597 13867 20677 15891 2657 -10474 -18359 -18468 -9170 5535 16735 19146
1315 19146 13166 900 -12466 -19295 -16201 -5780 7539 17728 18764 10600 -2748 -14266 -19519
1328a9519M775J1952J2881Q284p01r529j4021j0076k153N247J2103J3533O515
1341A9291m380r702j2041j0382j890R582J3097R768M490k510j2644j4393o075
1354a7789K415P290J2329J2474K094q625j0894r627q005J530J2779J3646N597
1367A5214J149m926j4115j3012j863O020Q361J1408J0873k267j2138j0205p410
1380a2911n404N166J5070J1939J587j881o522j5105j1101L642R135P842J0753
1393A2210P826o375j4842q724m031k429P482J6803Q871k658m609p499j4074q174
1407b0223P539J1680O807Q490M467r750j5649o248q19J88R742J6087N672o061
1421A1922o560p900j2659m256J1184J2007N452N812J485j2549j5341l280K532
$$ plain form
1328 -19519 -14744 -2792 10089 18373 17672 8143 -5878 -15954 -18107 -12860 -757 12776 19291
1341 19291 14911 5209 -6832 -17214 -19104 -9522 3575 13343 17833 15323 2679 -11714 -17789
1354 -17789 -15374 -8084 4245 16719 18813 10188 -706 -10333 -18338 -16808 -4029 9617 15214
1367 15214 16363 11437 -2678 -15690 -17553 -11533 -3172 8236 19109 16842 4704 -5501 -12911
1380 -12911 -18315 -13149 1921 13860 15447 13566 7044 -8061 -19162 -15520 -6385 1457 12210
1393 12210 20036 13661 -1181 -9905 -13936 -16365 -8883 7920 16791 14133 9524 2025 -12049 -20223
1407 -20223 -12684 -1004 5803 14293 18760 9010 -6639 -12887 -13706 -13518 -3776 12311 17983 11922
1421 11922 5362 -2538 -15197 -19453 -8269 3738 9190 15002 16487 3938 -11403 -14683 -12151
1434a2151K361J0867J5144J618r882p363o825j0449p64J3990J1858K967K995j749
1448A2617j4113j3725K34N504M117J1107J2424k267j1906p545n958p848L725J5291
1462A657J0024P51K06m098j4749j1253M029P420M953J0504R344n894j3474o798
1476g378l995m475O306J5821Q040k247k337o107j4108p604O900Q840N625Q542
1490A1823N611q904j3352n381k084q82Q655J5135M871m689m646p542j2207l881
1504a7473R584R685N419O647J626j1448j2802l697N80K198J0309J2933J895p027
1518H429o298p586r458j80J1193R470M522L427j638j2270j1429j344K861M847
1532e454J0577R854j161q593p289p086o193L462J1825Q889K747N40m822j1926
$$ plain form
1434 -12151 -9790 1077 16221 17839 7957 594 -6231 -16680 -17444 -3454 8404 11371 14366 12617
1448 12617 -1496 -15221 -14987 -9483 -5366 5741 18165 15898 3992 -3553 -9511 -17359 -13634 1657
1462 1657 11681 12432 12638 8540 -6209 -17462 -13433 -6013 -1060 9444 18788 12894 -580 -7378
1476 -7378 -11373 -15848 -9542 6279 14319 12072 9735 3628 -10480 -18084 -11184 -2344 3281 11823
1490 11823 17434 8530 -4822 -10203 -12287 -13169 -4514 10621 15492 10803 6157 -1385 -13592 -17473
1504 -17473 -7889 1796 7215 13862 15488 4040 -8762 -12459 -11879 -9681 628 13561 15456 8429
1518 8429 2131 -5455 -14913 -15093 -3900 5570 10092 13519 11881 -389 -11818 -13162 -10301 -5454
1532 -5454 5123 14977 13816 5223 -2066 -9152 -15345 -11883 -58 8831 11578 12118 7296 -4630
1546d630r118R62N175O739R561O693l825r696p445n623k951O285J1653P647O79
1561A2106k392p163j0915n826K742P143P687Q149K653n848r759p650l458Q73Q061
1576c597J0299O112p95n432q657q893l005M871Q287Q168N265n13p614r329o496
1591a1329j462M538R242Q551L568k817p815q575o251J88O211Q770P546K636m016
1606H985p903q541n143J110P575R052N767J344m295r162q325k687K557O722Q882
1621E938O603q80o564q127o589l162L917R356P769K993n71o019r869o668M59N076
1637f338O816Q327M506m093q151o883m687j389N899J0342N905M45k461o687r859
1652h308m664L560O351O337P461K284o724r235n253k361J40P708J0834L473k357
$$ plain form
1546 -4630 -13748 -12786 -7611 -872 8689 15382 11557 1861 -5584 -11207 -14158 -7873 3780 11427 12106
1561 12106 9714 2551 -8364 -14190 -11448 -4305 3382 11531 14184 8336 -1423 -9073 -12531 -11658 -3597
1576 -3597 6702 12814 12019 6587 -2070 -10963 -13968 -9097 -810 7358 12623 12110 4496 -4833 -11329
1591 -11329 -12791 -8253 989 9540 13108 10291 2476 -6099 -12350 -12162 -5951 2819 10365 13001 8985
1606 8985 1082 -7459 -12602 -11492 -3917 5135 10902 12246 7951 -1211 -9536 -12223 -9666 -2944 5938
1621 5938 12541 11661 5097 -3030 -9619 -12781 -8864 492 8261 11254 10683 4664 -5205 -11873 -11414 -6338
1637 -6338 478 8805 13311 9218 1067 -5816 -10503 -11892 -5993 4349 10254 10699 8238 1551 -8308
1652 -8308 -12972 -9412 -3061 3276 10737 13021 6297 -2938 -8191 -10552 -10412 -2704 8130 11603 9246
1667I246l829p190r222k067P050O756N032N585M82r051r444k528n22J767Q853
1682I18J0073N54m768m413o736q124P97Q696O979L598L756j815j0717p890m42
1697i534J461K908R679P961j791o883m670n979o030L143J0359N897J750K259l956
1712F574j1182o646K073L300L873Q696O981n135p982l831m996l907N536J0845
1726D199M490j46J83n514j0690m401M528M477M049Q009L737p170q394l403k943
1741h989j650P482J0381K752k226j773n839r884k030O447N142M204O391R01q640
1756B669q007j884j824O56Q669R182O40l724l127o558p948K69P840N580L652M585
1772A0670j537r365p435l59m7K634Q769P442j561n177l894n958o068L255Q628
$$ plain form
1667 9246 5417 -1773 -10995 -13062 -6012 744 5776 11361 11843 2792 -6652 -9180 -9702 -7935 918
1682 918 10991 11545 6777 2364 -4372 -12496 -11699 -3003 3976 7574 11330 9515 -1202 -9092 -9534
1697 -9534 -8073 -5165 4514 12475 10684 3801 -869 -6848 -12878 -9735 624 6521 8271 10530 6574
1712 6574 -4608 -11254 -9181 -5881 -2008 6688 13669 8534 552 -3279 -8275 -12182 -6646 4199
1726 4199 8689 8543 8726 3212 -7478 -11879 -7351 -2874 1175 9184 12921 5751 -2643 -6046 -8989
1741 -8989 -10639 -3157 7224 9976 7750 5977 138 -9746 -11776 -5329 -187 4017 10408 11309 2669
1756 2669 -5338 -7222 -9046 -8390 279 9461 10101 6377 3250 -3308 -11256 -10987 -3147 2433 6085 10670
1772 10670 9133 -232 -7667 -8026 -8073 -5439 3330 10772 9211 4034 140 -5818 -11886 -8631 -3
1787cN094K635K159l397r905n656Q91J936M019Q216N453l341o332m348n119l461
1803a1159M717Q832M745J105M3n029r230l777K123L504M908P083L158m814o828
1818f19m284l731r80O305Q218L138J85k377o017p605k356L535N065N349N252L29
1834I407o015o499l736k071J673O917P079K277j682m037o273o058j14M511N886
1849A265M624L319j524o359o265l285J17L395O996N867J148l591n129o423l498
1864i343J583N080O390M016J063l600o262n534k314J958N522O371L822n70m386
1879C796o096n182j306K830N768N985L089j462m871o154m305p14L744O503M794
1894F419K144j692n204o689l549R52L847N719N378J712l739n683m792l183M33
$$ plain form
1787 -3 5091 7726 9885 6488 -3417 -9073 -8182 -6246 -2227 5989 11442 8101 1769 -2579 -7698 -11159
1803 -11159 -6442 2390 7135 8240 8283 3254 -5976 -9753 -7630 -4126 782 7865 11023 6209 -619
1818 -619 -4903 -8634 -9614 -3309 4909 8047 8232 5855 -162 -7767 -10123 -6588 -1523 3826 9078 9407
1834 9407 3392 -3107 -6843 -8914 -7241 -324 6755 9032 7350 3313 -2960 -9018 -9132 -4621 1265
1849 1265 5889 9208 7684 1325 -4940 -8225 -8108 -4713 2283 8150 9298 5707 578 -5845 -9343
1864 -9343 -7760 -2680 3710 7726 8789 5189 -1073 -6607 -8921 -6963 -1441 4930 8752 8182 3796
1879 3796 -2300 -7482 -8788 -5958 -190 5795 8884 7422 2551 -3603 -7908 -8622 -4878 1625 6419
1894 6419 8563 6871 1667 -5022 -8571 -7619 -3772 1947 7325 9037 5298 -385 -5177 -8360 -7927
1909g927N292O852L298p5k131n772o508j970L315M457M949M756k7n498n751l736
1925f476j786J798O438O415J786j912l193o252n271K61M648M496M296L587j476
1940G359o940n496j856j03K385P326N560p15l176l410n868m471K377N908M226
1955C106L061K510l502p354m550j64J247K892P435M586k771m185l162n292l484
1970i627M269O792L658J452Q36m139p806l594J882K194L707O990K840m424n185
1985a55k928m015j768N625P009K436K24k73n197p688j592L203K794M101O175J076
2001I027n985m949k461k848m76O529P056O66q15j568n756o470K07M569K959L633
2017C318N297j059o762n111j197j332J473O894O083q62k128k400n753n705K487
$$ plain form
1909 -7927 -2635 4217 7515 7440 5309 -463 -6971 -8941 -5626 -1169 3780 8536 8509 3011 -2740 -6476
1925 -6476 -8262 -6464 -26 6389 8175 6263 3070 -3182 -8453 -8192 -3544 952 5248 8835 7359
1940 7359 419 -5077 -6933 -7036 -4651 2675 8235 7520 4344 934 -4934 -9405 -7028 -1120 3106
1955 3106 6167 8677 5175 -2179 -6729 -6893 -5646 -2754 4681 9267 6496 2311 -851 -6143 -9627
1970 -9627 -5358 1434 5092 6544 7380 3241 -4565 -8159 -6277 -4083 -376 6614 9454 5030 -155
1985 -155 -3083 -7098 -8866 -3241 3768 6204 6428 6155 958 -6730 -8322 -5119 -2325 1776 7951 9027
2001 9027 3042 -1907 -4368 -7216 -7692 -1163 5893 6559 5744 4176 -1580 -8050 -7843 -3274 -315 3318
2017 3318 8615 7556 794 -4317 -5514 -6846 -5373 1521 7604 6742 4614 2214 -3539 -9244 -6757
2032f757N464L099L025L502k525p317m114n77K9K749P157M385k082l262k929n264
2048e417l648L486O039L186K115J938l742p884k843R48J108L658O651L014l469
2063E140m091k956m678j676M524O529K203J497k22m808o949j757J737K453M169
2078A115N760J219m201m956k535l373j00N738N494J768J04j433n622n426q67L264
2094d051L255L853M574n26n299m614k626j295J463N921N203R14j554k520n826
2109c128m201M24M283L769L581K605j765n510m688j609j4L160N719L754K61k562
2125D079l980m701k745J530M536M423K937R38l524n110m036q88J417M211N297
2140D384K414q77l581m330l850j228L213M378M370J805j240l915m710l320q4L332
$$ plain form
2032 -6757 -1293 1806 4831 8333 5808 -1509 -5623 -6200 -6171 -3422 3735 8120 6038 2776 -153 -5417
2048 -5417 -9065 -5579 460 3646 5761 7699 3957 -3927 -6770 -5822 -4714 -1056 5595 8609 5140
2063 5140 1049 -1907 -6585 -8261 -3737 2792 4995 6492 6270 1462 -5487 -7244 -5507 -3054 1115
2078 1115 6875 8094 3893 -1063 -3598 -6971 -7071 -1333 4161 5929 6033 4600 -1022 -6448 -7315 -4051
2094 -4051 -796 3057 7631 7105 1806 -2808 -5434 -6729 -5266 655 5858 6772 5218 2698 -3128
2109 -3128 -7329 -6905 -2622 1147 4728 7333 5568 58 -4630 -6239 -6253 -3093 2626 6380 6641 4079
2125 4079 99 -4602 -7347 -5817 -1281 3142 6079 7017 3493 -1617 -5653 -6541 -5124 -913 4384
2140 4384 6798 5921 2340 -1990 -5840 -7068 -3855 523 4893 6698 5458 1543 -3167 -6487 -6571 -3239
2156c239M446M338J334k084m199m854k448R50L405M811L411O75k571m564l989
2171d578k036P30M717M575K674o9k272m970m532j000K516L469M374L421j050l990
2187A979m264k968j275K160M936M428J431j380l123m921l457L35L416L654L668
2202D619K515k244n056l735j869j77K930N745L306o40j758l325m461l025K263
2217d912M261L065K787J564l319n685k764n27Q99L332N968K231k015l327k950
2232a392m406j539L908M801K492J578Q25m039o418j753J103J328L938N074J652
2247G152l546l561k754l584n31M868M963J699O13k47n243n483m21K521J642M204
2263B292M438k50m772l413k142k273M28O051M659J74m13j354n273n103J036L324
$$ plain form
2156 -3239 1207 5545 6879 4795 596 -4258 -6706 -5756 -2351 2460 5871 6546 3975 -589 -4578
2171 -4578 -6614 -5884 -1167 3408 6082 6013 3741 -1229 -5761 -6761 -4245 -776 3598 7019 5969 1979
2187 1979 -2285 -5253 -6528 -4368 568 4996 6427 5047 1924 -2997 -6454 -6119 -2703 951 4619
2202 4619 7134 4890 -166 -3901 -5770 -5947 -3017 2728 6034 5394 3636 311 -4150 -7175 -4912
2217 -4912 -651 2414 5201 6765 3446 -2239 -5003 -5530 -4631 -1299 4669 6900 4885 1558 -1392
2232 -1392 -5798 -7337 -3429 1372 3864 5442 6267 2228 -4190 -5943 -4840 -3512 426 5500 7152
2247 7152 3606 45 -2709 -6293 -6824 -1956 3007 4706 5319 5072 -171 -5654 -6075 -3554 -1912 2292
2263 2292 6730 6480 1708 -1705 -3847 -6120 -5692 359 5018 5192 4779 3425 -1848 -6951 -5915 -2591
2279b591K391L400L999j632n391l184j592j514K206N891M017p98j220k267n461
2294c746l605K130M253K370L112K773l117n946k829%q03L121O080L005k365j907
2310B526k581m718k460L337M679J963K494J071l659n918j860J40P15L927N497
2325E153J610k956k967k770l812j138M689M475J625J329J31m814n325j029J515
2340d284J684L904M777J01l645l131k576l090M99N090M236J326K24j374m950m614
2356e823K07K287K594L411L767r13m396l673j888j590J609N282L935J43o58k121
2372B173m852l703P86L414K938L579K196k302m751k649k027m6K629N109L115k50
2388E359j806l393m370k309K380L483L170K871M90k803m965k712p50R57L659M482
$$ plain form
2279 -2591 -200 3200 7199 5567 176 -3008 -4600 -6114 -3908 1983 6000 5202 3982 1715 -3746
2294 -3746 -7351 -5221 -968 1402 4514 7287 4170 -1776 -4605 -4605 -5408 -2287 3793 6798 4433 2526
2310 2526 -55 -4773 -7233 -3896 783 2746 5240 6311 2652 -3266 -5126 -4986 -4271 -344 5153
2325 5153 6763 3807 840 -1930 -5742 -6880 -2191 2284 3909 5238 5369 555 -4770 -5799 -4284
2340 -4284 -2600 1304 6081 6182 2537 -594 -3170 -6260 -5761 -671 3565 4891 5115 3741 -1209 -5823
2356 -5823 -5616 -3329 -735 2676 6443 5530 1134 -2539 -4427 -6017 -4408 874 4809 4952 4294 2173
2372 2173 -2679 -6382 -5596 -2182 756 4335 6531 4229 -522 -3171 -5198 -5244 -2615 2494 5609 5359
2388 5359 3553 160 -4210 -6519 -4139 -656 2514 5385 5875 3072 -1893 -4605 -5355 -4398 -739 3743
2404C743K404j341k962l471l360r04K614M038L077J693p34l795l907k354j8K363
2420b914L794L802R45j342l639l771k462L62L596L888K551P01k137l552l880j752
2436e810J110L344M070K705m32k446l647l593r04J770L308L683K611p92k942l883
2452a848k789j023K152M011L719J395j382k723m220l087O73K583L417L669J425
2467E972k023l942l319j821M31K416M508L181o74j244l275m382k036K066L243
2482h99L268K540Q77l302m338k322r15P74L590M357J977j240k583l211l551r60
2498e938K998M154K123J894Nm076m630j625N70J355L505M788O61k569l031k890
2514b706k910O4M290M221J062R92r19m876m321l7J712J619L891M011p07l790k866
$$ plain form
2404 3743 6147 4806 1844 -1627 -4987 -5891 -3277 761 3838 5531 4797 1002 -2905 -5259 -5277 -2914
2420 -2914 880 4682 5627 4285 646 -3125 -5587 -5225 -1629 2259 4810 5511 3374 -178 -4058 -5810
2436 -5810 -4700 -1356 2714 5419 4987 2541 -1106 -4699 -5603 -3833 -525 3158 5769 4977 2035 -1848
2452 -1848 -4637 -5660 -3508 503 4222 5617 4235 1512 -2708 -5795 -5122 -2539 878 4547 5972
2467 5972 3949 7 -3312 -5133 -4702 -2286 2222 5403 4729 3485 210 -4172 -6208 -4142 -899
2482 -899 2369 4909 5786 2484 -1854 -4176 -5091 -4317 -727 3630 5607 4367 1784 -1427 -4978 -5938
2498 -5938 -2940 1214 3337 5231 5236 1160 -3470 -5095 -4525 -3170 335 5123 5784 3215 184 -2706
2514 -2706 -5616 -5552 -1262 2959 4021 5013 4094 -782 -5103 -5140 -3428 -1809 2082 6093 5386 1596 -1270
2531a270k294k355J333N029L344Q86l6j881m941l771J186K287K486L437L241k342
2547D339m135k777j725j109K012N793K794q03q36k289m919k561K273K891K296
2562A244L054K102l298m682j803j188m24L110N925J832k021j520k524m569j587
2577f349L619L281J959K692M41m242m611j261J34N84L765N354M29k427k293k720
2593a645m048J0M287L444J401J840l52n269m157m27R71J299M554M053p39l364
2609A858k471k243l083J227M714L344Q48O03j475n010l765Q41J529K174M051L177
2625F319j760m237k096k395j588K293N387K434J26j69k603n511k067J415K771
2640a681K413L878J737k749m206k809j384l97L288N192K084j062j653k865m559
$$ plain form
2531 -1270 -3564 -5919 -4586 443 3787 4673 4637 2756 -2185 -5956 -4770 -2483 3 3440 6681 4339
2547 4339 204 -2573 -4298 -5407 -3395 2398 5192 4389 3553 1264 -3655 -6216 -3943 -1052 1244
2562 1244 4298 6400 3102 -1580 -3383 -4571 -4995 -1885 4040 5872 3851 2331 -193 -4762 -6349
2577 -6349 -2730 551 2510 5202 5643 1401 -3210 -4471 -4337 -3753 12 5366 5795 3368 1075 -1645
2593 -1645 -5693 -5683 -1396 2048 3449 5289 4937 -332 -4489 -4916 -3945 -2646 1908 5961 5222 1858
2609 1858 -613 -2856 -5939 -4712 2 3346 4194 4797 3322 -1688 -5453 -4612 -3083 -909 3142 6319
2625 6319 4559 322 -1774 -4169 -5757 -3464 1923 4357 4483 4314 1711 -3800 -5867 -4452 -1681
2640 -1681 732 4610 6347 3598 -608 -3417 -4801 -5198 -1910 3282 5366 4304 2651 -214 -4773
2655d773j200K518K972L057K268P02l623m151j981j114J684L499M107J745j697
2670D013k590l368l305j10L117L381K610J587j018l935m003j173K43K094L866
2685A409L553K97k282k926l747j811P56L661L471K347K94k309m058l006q67J550
2701c668K938L581K248m64k815l660k801p78J919L830L394J568r95l047l538k712
2717e000Q0K281L740L133R02j220l684l219k131P60K501L488L321K42k151l533
2733d90l177j335M00L490L895K363m72j886l740l543j050K082L234L189K435n79
2749D816l207l477k651k37J064M085L906J197j940k174l531l123J25L437L169
2764A459K098J700j135m203l590j269M64K205M018L720m07k697k732k808k606
$$ plain form
2655 -4773 -5973 -3455 -483 2574 4842 5544 1921 -2230 -4211 -5325 -3641 -142 3965 5710 4013
2670 4013 1423 -1945 -5250 -5360 -2243 1138 3748 5335 4317 382 -3621 -4794 -4551 -2457 1409
2685 1409 4962 5259 2977 51 -3696 -5507 -4751 -1090 2381 4728 5022 2713 -1345 -4351 -5218 -3668
2701 -3668 -730 2851 5099 4635 1820 -1840 -4641 -5419 -3500 330 3724 5292 4297 1250 -2288 -5000
2717 -5000 -4920 -2639 1101 4234 5136 3916 232 -2987 -5118 -4358 -1857 1631 4952 5194 3043 -490
2733 -490 -3667 -5002 -4602 -1112 2783 5146 4674 2788 -952 -4495 -5545 -3463 -229 2960 5395 4816
2749 4816 1609 -1868 -4519 -4756 -3692 393 4299 5496 3556 1382 -2149 -5272 -5147 -1710 1459
2764 1459 3557 5257 4122 -81 -3671 -4940 -4476 -2271 1747 5467 5060 2363 -369 -3177 -5783
2779e783J558L801L260J410O37k003m613l133K69J453K468M007K212j360l247
2794I36k501k665j466K325M855K352K74K57k726m867k093J216J843K581L851J944
2810F116k906l710k272j672o27L263N037J473n16q27l278m594j266K509K712K294
2826A736L223R69m327l703j421j035N5M075M949L63j676j126l215m125k13L594
2842a877L067J394K695o44m498l776n88M2J000M643M152q82k196k098l452k748
2858e766J234M067K809J431J450j907m940k740n9J100J910M338K973j574l272
2873A054j999k928k103K202M940K138O63P31k558n068k199P96K073K059M023K161
2889E985k636l548k365j621j173L178M608J604L08p23l029m597j671K488J989
$$ plain form
2779 -5783 -4225 -424 2836 4246 4883 2880 -1733 -4866 -4597 -3144 -676 3331 5543 4183 936
2794 936 -1565 -4230 -5696 -3371 1484 3836 4110 4367 1641 -3226 -5319 -4103 -2260 321 4172 6116
2810 6116 3210 -500 -2772 -4444 -5071 -1808 3229 4702 4186 3359 81 -4513 -5779 -3270 -558 1736
2826 1736 4959 5928 1601 -2102 -3523 -4558 -4503 -428 4521 4884 3208 2082 -1133 -5258 -5471 -1877
2842 -1877 1190 2584 5279 4635 137 -3639 -4227 -4185 -3185 1458 5610 4728 2532 434 -3018 -5766
2858 -5766 -4532 -465 2344 3775 5225 3318 -1622 -4362 -4421 -3321 -1411 2927 5900 4326 1054
2873 1054 -945 -3873 -5976 -3774 1166 3304 3967 4698 2140 -2928 -5127 -4331 -2258 -199 3824 5985
2889 5985 3349 -199 -2564 -4185 -5358 -2180 2428 4032 4340 3617 588 -4009 -5680 -3192 -1203
2904a203K704L418M90l344l597j563j500K49L651M393P18o71j443l363l947o5
2920e073K722K631K737K011r0m254l260j637j58J144M227L632J51j777k186l231
2936b411k869Q38L555K509K333J174j800l854l568m15P60K131M200K775r55k270
2952B133k924l289j438J969L890K812J765k20k882m071k169j55J704K832L810
2967C767J708j654l167k840k523m57K937L624K558Q65j356l354l683j316R98K311
2983a582L270K653P40k372l201l084j479J055L134L481J866K42k744l206k836
2998d063j009J704L472L182J823j007k243l569k989n6K360L047L013J247j017
3013C895l426l210j570k99K551L451L171K07j695k823l563k029J276K745L341
$$ plain form
2904 -1203 1501 4919 5409 2065 -1532 -3095 -4595 -4346 -695 3698 4416 3745 2302 -1061 -5008 -5073
2920 -5073 -2351 280 3017 5028 4938 684 -2576 -4213 -4371 -3227 1000 4632 4783 3006 820 -2411
2936 -2411 -5280 -4442 -887 1622 3955 5129 3329 -525 -4093 -4508 -3748 -1617 2583 5358 4403 2133
2952 2133 -791 -4080 -5518 -3549 341 3153 4918 4698 1816 -2255 -4424 -4579 -2875 -43 3767
2967 3767 5475 3821 654 -2186 -4709 -5166 -2229 1395 3953 4818 3462 108 -3575 -4891 -3893 -1582
2983 -1582 1688 4341 5081 2709 -492 -3576 -5055 -4000 -866 2615 4481 4723 1979 -1227 -4063
2998 -4063 -5072 -3368 104 3286 5109 4102 1859 -1710 -4699 -4755 -2395 652 3665 4912 3895
3013 3895 469 -2741 -4311 -4610 -2059 1392 4563 4770 3075 252 -3311 -5340 -4064 -1319 2022
3028B022K138O34j960m081k745p23R90K691L853K565r95k945k258l125j601K300
3044c240L759K531J397k38k563m251k180N99J677K718L968J473k408k966k545
3059b269k449m67L452M044J794K17q76l208m404r94K088J990K714L431l6l153
3075A874l069j688j843N18M011L777P28q23r78m083l599L91K510K492K589K238
3091E045n56m331k799j286p74J445M566L508m25j583j864l635l075J829L181K288
3107A534K016K040k306m710k470j35J75K350M240K581j487k102j971l707j963
3122e915K648L904J853J479J049k865m946j852J161M41K519M704J436k879k574
3137A63j737k932j068L762M149J232N88q4l762m087r17J307J740K619L978N07
$$ plain form
3028 2022 4160 4794 2834 -1247 -3992 -4715 -3725 -1034 2819 5384 4389 1444 -814 -3939 -5540 -3240
3044 -3240 519 3050 4447 4209 1646 -2605 -4785 -4186 -2509 209 4177 5650 3242 276 -2269
3059 -2269 -4718 -5185 -1733 2311 4105 4322 3446 238 -4166 -5160 -3072 -1082 1632 5063 5027 1874
3075 1874 -1195 -2883 -4726 -4208 -197 3580 4308 3485 2507 -1576 -5175 -4784 -2274 218 2807 5045
3091 5045 4489 158 -2641 -3927 -4701 -3256 1310 4818 4393 2810 946 -2689 -5764 -3935 -754 1534
3107 1534 3550 5590 3284 -1426 -3896 -4031 -3856 -1506 2734 5315 3828 1726 -245 -3952 -5915
3122 -5915 -3267 637 2490 3969 5018 2153 -2793 -4645 -3484 -3043 -524 4180 5616 2737 163
3137 163 -1574 -4506 -5574 -1812 2337 3569 4157 4073 311 -3776 -4693 -3386 -1646 973 4951 5458
3153E458l738k646j844k161P10L839L850L42k78o76m002l894M61K144K106L056
3169B727K563q94l799l020j489p21J354M549K985j87r86j718l811l039J475K802
3185a209K437K237J684j681m406k828l28L41K155M156K409r41j860k596k948k114
3201e492K254L448K127J737N69k602m490j655j57J257L099L903J346j989k752
3216F03k389k993M5L013L189J919R88l78l478l795j268Q86J859L222L057K46k345
3233B381k717k630j948O86L751L139J611j01j687l663l043m41J492K818L199K100
3249D947p43k926l274k128o22J845L466L037R04q93k637l303k170M01J773L458
3265A135K705R90j690k882l294j834Q58K349L574K358L59k121l152l033r87J085
$$ plain form
3153 5458 1720 -926 -2770 -4931 -4221 -382 3468 3810 3532 2856 -1146 -5040 -4579 -2435 -329 2727
3169 2727 5290 4396 597 -2423 -3912 -4633 -3279 1270 4255 4068 3082 1364 -2447 -5486 -4011 -1209
3185 -1209 1228 3465 5149 3468 -938 -3766 -4094 -3753 -1598 2558 4967 4026 2166 -430 -3378 -5492
3201 -5492 -3238 210 2337 4074 4643 2041 -2449 -4104 -4261 -3004 95 3998 5344 3355 603
3216 603 -1786 -4779 -4734 -1721 1468 3387 4375 3997 519 -3276 -4544 -3658 -1799 1423 4480 4726 2381
3233 2381 -336 -2966 -4914 -4228 -477 2662 4273 4172 2485 -1178 -4221 -4662 -3170 -352 2847 4947
3249 4947 4204 1278 -1996 -4124 -4746 -2901 565 3602 4506 3613 976 -2327 -4497 -4096 -2323 1135
3265 1135 3840 4830 3140 258 -3036 -4870 -4012 -1663 1911 4269 4628 2507 -645 -3678 -4665 -3580
3281c580K964L283J742k60k071l379k682r39K025L087K792J721m97k889l622j856
3297d161j23J598L202K990J432j601k810k830k424K97K948L052K047Q01j424k926
3313F8l699p13R91J920L221K767j3k793k635k048j823Q82L620L171J125p0j445
3330B526m226k721j5J998J992L328K201r45l701k609j582r05J827M039K720qq93
3347C026j803l861k167J088K501K137K446J615j906m128k041m15m11K425L909
3362B415K152r52j511k256l737j383K353L101J860K093O92k993m350j166J24M88
3378c070K784M180Q69k085j696k400k864m67K871L429J344J469n12l743l391n24
3394c806P91R74L322L744o11k665k154k142k112M79M138K804N83R01j406l935
$$ plain form
3281 -3580 -616 2667 4409 4149 2078 -1301 -3983 -4922 -2897 190 2982 4703 4206 1317 -2305 -4161
3297 -4161 -4284 -2686 516 3506 4938 3337 527 -2303 -4727 -4430 -1482 1570 3617 4418 2994 68
3313 68 -3631 -4344 -3353 -1433 1788 4555 4542 1749 -886 -2934 -4757 -3875 -255 2916 4041 3971 2526
3330 2526 -1700 -4421 -4436 -2438 -446 2882 5083 4138 437 -2172 -3754 -4659 -2832 1207 3927 3919 3026
3347 3026 1223 -2638 -4805 -3717 -1216 921 3367 4982 3076 -1052 -3093 -3508 -3919 -1494 2415
3362 2415 4567 3615 2104 -152 -3889 -5272 -2919 182 2042 4135 4827 1834 -2516 -3682 -3558 -3070
3378 -3070 -286 3894 4763 2678 982 -1418 -4282 -4749 -1878 1551 2895 4364 3852 109 -3282 -3806
3394 -3806 -3015 -2041 1281 5025 4414 1749 -405 -2547 -4659 -4180 -42 2762 3345 4246 2840 -1095
3410a095l158K78J748J385K920L410j385l450k199j531j477J512M127K480J45
3425C710l58j929l931k624J688K167J734L146J409k164l445k082j049l84K585
3440a527M030J855n98j032k544l710j548K065L108J763K356O25k898l771j502
3455c328m03J87L002L944R76j401j675k558k760o48L095K711J480J755o67l326
3471C84l619n85J2J583L226L236K58k165k342k518j973M65L452L055Q00N28r27
3488B870l961k655j04J248J955L064K082p43k569k530k000j018J361L562K595
3503C157O30k29k365l483j899M33J915K644K287J355j695k457k666j542J60K418
3519a337L055J871M00j517k840k735j091R54K499K532K207L4k042l302j947q90
$$ plain form
3410 -1095 -4253 -3975 -2227 -842 2078 5488 4103 653 -1546 -3077 -4554 -3042 1085 3565 3710
3425 3710 3352 1423 -2508 -5132 -3444 -1277 457 3603 5012 2848 -597 -2679 -3728 -4112 -1527
3440 -1527 2503 4358 3760 2728 184 -3526 -5074 -3009 99 1862 4218 4843 1945 -1826 -3328
3455 -3328 -3731 -3544 -542 3402 4378 2977 1302 -1256 -4016 -4664 -1569 1142 2622 4377 3710 384
3471 384 -3235 -3820 -3808 -2225 1001 4237 4495 2330 -12 -2530 -4503 -4038 -586 2469 3269 3797 2870
3488 2870 -1091 -3746 -3850 -2602 -647 2417 4499 3756 1187 -1343 -3343 -4361 -3000 562 3157
3503 3157 3787 3558 1193 -2290 -4189 -3756 -1841 803 3090 4445 2750 293 -2373 -3915 -3755 -1337
3519 -1337 1718 3589 3989 2472 -368 -3103 -4194 -3240 -741 1791 3998 4032 1990 -1312 -3259 -4149
3535d149J123K695K835J466m12k101l183k217k45J781K727L027Q36q44k700l006
3551b367j636R8K004L007K509N70j583k734k622j352O23J812L365K219K40k116
3567B037k499k662j118Q41L019K600J523K36k337k987k150m15J411K298K999K037
3583D833j516k446k644j628j004J908L561K155O58p59k272l512j554Q64J811K493
3599I48K603R22j888l193k058j141J49K501L550J448k30j273k472l613m20J835
3615b332K074J956K502Q4l189k976j034o20L46L444L273O89j537j200k821k786
3631d127j2K640K627J509J679o71l478k870p11NJ110L917K699n21k021j795k647
3648b667j878J316L155K157R53Q02j524l769k302M27Q70J694L445J986j391k590
$$ plain form
3535 -4149 -3026 -331 2504 3970 3558 1457 -1726 -3943 -4188 -2407 320 3347 4183 3339 639 -2367
3551 -2367 -4003 -3905 -1901 1106 3615 4185 2602 -132 -2754 -4106 -3483 -1671 1694 3913 4153 2037
3567 2037 -462 -3124 -4242 -3401 -382 2218 3741 3977 1640 -1347 -3497 -3912 -2501 -203 2796 4833
3583 4833 3317 871 -1773 -3401 -4405 -2497 1064 3219 3877 3118 846 -2666 -4220 -3356 -1545 948
3599 948 3551 4473 2585 -608 -2666 -3807 -3658 -1157 2393 3841 3611 2338 -134 -3747 -4167 -2332
3615 -2332 -258 1698 4200 4284 1095 -1881 -2915 -3535 -3189 255 3528 4217 2680 1480 -1341 -4127
3631 -4127 -4139 -1499 1128 2637 4316 3645 167 -2703 -3414 -3409 -2299 1618 4317 3796 1775 -20 -2667
3648 -2667 -4545 -3229 -74 2083 3036 3838 2314 -1455 -3757 -3330 -2460 -766 2679 4665 3274 684
3664F84j916k026j238J724M214J506J42L93k451l730j673J540J278J794L137J157
3680D535k130k820j520j628q41L117L485J327l30n94k526l573o02J714J968J832
3696A414K604K08k908l269p03n99j72L272L548L13j246q53k686l205M30K215K360
3713G23J418K189q21l421k708p54Q0J057L561K701l49j714j621k665k313J149
3729c488L413J720J273J137j727l614k107M3N93J946L133K348j462k005k258j972
3745c027j512J920L645J493O24N09k139l573j692K30J697K259L050R96k191k490
3761b01j950j516l10K686L293J006M40q88k601l232p06J435J761K286K245L85
3777D133k760k606j691r63J072K784K884P52m46j637k777k399l70K082K426K253
$$ plain form
3664 684 -1232 -3258 -4496 -2772 1442 2948 3090 3483 1032 -2698 -4371 -2831 -1553 241 3378 4535
3680 4535 2405 -415 -1935 -3563 -4404 -1287 2198 3525 3195 2601 75 -3498 -4100 -2386 -418 1414
3696 1414 4018 4226 1318 -1951 -2654 -3253 -3425 -153 3395 3708 2462 1609 -1077 -4282 -3852 -1637 723
3713 723 2141 4330 3509 88 -2620 -3374 -3294 -2237 1324 4025 3676 1962 341 -2324 -4637 -3488
3729 -3488 -75 1645 2918 4055 2328 -1286 -3393 -3350 -2757 -811 2322 4670 3208 1203 -1055 -3027
3745 -3027 -4539 -2619 1026 2519 3143 3652 1513 -2060 -3752 -3522 -1825 434 3484 4480 2289 -201
3761 -201 -2151 -3667 -3977 -1291 2002 3008 3448 2560 -41 -3273 -3979 -2544 -783 1503 3748 4133
3777 4133 1373 -1233 -2924 -3887 -2815 -31 2853 3605 3159 1522 -1255 -3654 -4024 -1942 484 2737
3793B737J392p20l078k785r63J65J204K886K592J00j213k201k300j792P62K283
3809i31K284J942N55j662k744k613o09Q92K248K922J368k12k055k714j700o99
3825c728J476K393K476J327p27k425k392j972j62J956K590K088N41m80k555k805
3841b399j051J52J780K766K231M05j601k549k408j045K04K749K659J458L2j198
3857B185k812k659l35J258K283K259J631l53k404k805j261p27J132K856K644P11
3873C603o45j947l170j715M54K004K393J529J506j215l095k208q31o1J809L128
3889A539K292l27j427k065k463j428J395K276J943J375L72j532l137k000P3N46
3905b568K213K913J123r80k018j700k058r76K365K859J381O85R3k695l061r77
$$ plain form
3793 2737 4129 3409 331 -2454 -3417 -3252 -2048 838 3430 3530 2317 116 -2184 -3976 -3214 -931
3809 -931 1353 3295 3850 2188 -556 -3169 -3778 -2886 -638 2284 3652 3440 1385 -1329 -3029 -3728
3825 -3728 -2252 141 2617 3944 3217 792 -1600 -3572 -3734 -1778 812 2900 3441 2961 406 -2399
3841 -2399 -3450 -3298 -1518 1248 3479 3884 2283 -266 -2674 -3719 -3515 -766 1893 3351 3383 2185
3857 2185 -627 -3286 -3621 -2363 -80 2179 3810 3457 1053 -1752 -3013 -3740 -2608 248 2892 3603
3873 3603 2958 1011 -2159 -3874 -3420 -1416 977 2506 4012 2797 -298 -2506 -3337 -3398 -1589 1539
3889 1539 3831 3504 2077 12 -2451 -3879 -2484 -208 1735 3110 3482 1950 -1187 -3187 -3114 -2568
3905 -2568 -355 2558 3681 2701 683 -1017 -3075 -4051 -1686 1173 2554 3239 3332 637 -2424 -3401
3921c401R28O30K338K975L46k229j741j505j900m7K856K709R37L17q64k843k795
3938c289k10J167J448K551K269l38k731k072j122j177P98L107K762K08p01j365
3954A305k740k605R88J951J367K083K000j539l397j677n09o34J494L669J976o53
3970C079j236j349k907j614J478K368J687J145J396k177l268j449L38k88K172
3985f25L422J364j701j575j596k517o77J962L103J023O24M24k680l180q79J009
4001b499Q47K141K967K59k009j739j727j904p0L058K377J141J39m75l028k714
4017c236k69J416J529K332K081p07k167j975j454r23P71L285K058L37o42j398
4033A038k667k275O71K016J558J966J863j443l153j551q33k34J550K823J886k06
$$ plain form
3921 -3401 -2473 -1843 495 3470 3816 1587 -154 -1659 -3559 -3606 -750 1959 2896 3213 2349 -494 -3289
3938 -3289 -3499 -2332 -884 1667 3936 3598 867 -1205 -2327 -3504 -2706 401 3163 3371 2670 1305
3954 1305 -1435 -4040 -3052 -1101 266 2349 4349 2810 -587 -2264 -2773 -3407 -1913 1756 3732 3079
3970 3079 1843 494 -2413 -4027 -2549 -181 1506 2651 4047 1870 -1398 -2847 -2509 -2797 -625
3985 -625 2797 4161 2460 885 -711 -3228 -3905 -1943 1160 2183 2807 3231 551 -2629 -3508 -2499
4001 -2499 -1652 489 3456 3715 1706 -33 -1760 -3664 -3734 -676 1701 2842 2981 2506 -522 -3236
4017 -3236 -3505 -2089 -560 1772 3853 3146 979 -996 -2450 -3373 -2602 683 2741 3078 2436 1038
4033 1038 -1629 -3904 -3233 -1217 341 2307 4170 2727 -426 -1977 -2810 -3044 -1494 1329 3215 3009
4049C009j189j601k662j323J036K252K080J344Q24k070k586j699n05O95K021K839
4065B465J066n66j601k292k322l47J702K384J508J421n12k114k869r72L51J123
4081a575K258K426L81j476j913k258j180J63K179K372J739K4j139k481k233o52
4097c365Q70K211J834J693l63j445k502j894m41J198K348K130R04l09k013k233
4113a377j542o39J846K589J506J019j116j844k230j492O78J349K220J655P60j520
4129A862k203j781q65J43J590K914J647n23j200j901k482p19J112K291J787J389
4145C061J21k044k300j599k97R03K134K544Q95r13j637k196j956J8J977K242J549
4162B502P46m90k600k521q22N17J522J964K278j65j588j407k103j261N35K540
$$ plain form
4049 3009 1820 219 -2443 -3766 -2730 -478 1602 2946 3770 1700 -886 -2585 -3090 -2395 -374 2465
4065 2465 3531 2965 1364 -928 -3250 -3597 -1895 489 1997 3418 2906 792 -2077 -3049 -2698 -1575
4081 -1575 683 3109 3490 2014 101 -2157 -3337 -3174 -995 1377 3116 3140 2001 -480 -2713 -3365
4097 -3365 -2495 -284 1550 3243 2880 1435 -1067 -2961 -3402 -2204 144 2274 3178 2869 856 -1377
4113 -1377 -2919 -3558 -1712 877 2383 3402 2286 442 -1788 -3280 -2602 -1253 967 2622 3382 1862
4129 1862 -341 -2122 -2987 -2844 -1254 1660 3307 2784 1584 -317 -2799 -3518 -2406 -115 1672 3061
4145 3061 3182 1138 -1162 -2761 -3058 -2155 -21 2523 3418 2505 868 -1328 -3284 -3266 -1289 953 2502
4162 2502 3248 2758 158 -2363 -3185 -2668 -1146 818 3096 2931 1343 -64 -2167 -3428 -2893 -353
4178c53K285Q52J7j090k468k179j18J107J295K631J759r23k275j490j491p90J311
4195a920K691J659M80j94j778k463j919P32J700J673J819J118j427k399j572r03
4211b703l98K082K949J024o58o14j773k494j044J806K051J204J711J40k304k494
4227a515q68n29M13K435K893L96j311r88j908k454J45K404K087P24J095m37k308
$$ plain form
4178 -353 1932 2784 2801 1711 -757 -2936 -3054 -1947 -652 1979 3738 2815 540 -950 -2441 -3231 -1920
4195 -1920 771 2430 2910 2716 938 -1525 -3444 -2712 -1012 661 2480 3598 2171 -228 -1800 -2703
4211 -2703 -3101 -1019 1930 2954 2296 1682 -91 -2585 -3629 -1823 228 1432 3143 3283 979 -1515
4227 -1515 -2383 -2912 -2499 -64 2829 3225 1914 926 -982 -3436 -3291 -887 1200 1924 3019 2582 274
$$ [...]
8191B82
##END NTUPLES=NMR FID
##END=
