##TITLE=1H_PR182_SR
 D2O, 8 sc, 
 26.08.2021
##JCAMPDX= 6.0         $$ Bruker NMR JCAMP-DX V2.0
##DATA TYPE= NMR FID
##DATA CLASS= NTUPLES
##ORIGIN= UXNMR, Bruker Analytische Messtechnik GmbH
##OWNER= root
$$ XWIN-NMR		Version 3.5
$$ Thu Aug 26 12:22:51 2021 Russian Standard Time (UT+4h)  she@DPX200
##.OBSERVE FREQUENCY= 200.131506
##.OBSERVE NUCLEUS= ^1H
##.DELAY= (6, 6)
##.ACQUISITION MODE= SIMULTANEOUS
##.ACQUISITION SCHEME= undefined
##.AVERAGES= 8
##.DIGITISER RES= 18
##SPECTROMETER/DATA SYSTEM= spect
##.PULSE SEQUENCE= zg30
##.SOLVENT NAME= D2O
##.SHIFT REFERENCE= (INTERNAL, D2O, 0, 15.7039)
##AUDIT TRAIL= $$ (NUMBER, WHEN, WHO, WHERE, WHAT)
$$ ##TITLE= Audit trail, XWIN-NMR		Version 3.5
$$ ##JCAMPDX= 5.01
$$ ##ORIGIN= Bruker BioSpin GmbH
$$ ##OWNER= she
$$ F:/spectra/data/she/nmr/H-F/1/audita.txt
$$ ##AUDIT TRAIL=  $$ (NUMBER, WHEN, WHO, WHERE, WHAT)
(   1,<2021-08-26 12:21:15.48 +0400>,<she>,<DPX200>,
      <created by zg, POWCHK disabled, PULCHK disabled
       configuration hash MD5:
       00 E9 B6 7A A2 85 ED C7 34 08 36 98 17 FE 4E 26
       data hash MD5: 16K
       DE D8 73 15 67 69 7F 69 72 E8 FA 11 5C 81 AB 3B>)
$$ ##END=
$$ 
$$ hash MD5
$$ E7 76 E7 C5 EF 80 A5 E2 29 9B DC 24 34 57 2B B3
##$RELAX= 
##$RELAX= 
##$RELAX= 
##$RELAX= 
##$RELAX= 
##$RELAX= 
$$ Bruker specific parameters
$$ --------------------------
##$DU= <F:/spectra>
##$EXPNO= 1
##$NAME= <H-F>
##$PROCNO= 1
##$TYPE= <nmr>
##$USER= <she>
##$AMP= (0..31)
100 100 100 100 100 100 100 100 100 100 100 100 100 100 100 100 100 100 
100 100 100 100 100 100 100 100 100 100 100 100 100 100 
##$AQSEQ= 0
##$AQ_mod= 1
##$AUNM= <au_zg>
##$AUTOPOS= <>
##$BF1= 200.13
##$BF2= 200.13
##$BF3= 200.13
##$BF4= 200.13
##$BF5= 200.13
##$BF6= 200.13
##$BF7= 200.13
##$BF8= 200.13
##$BYTORDA= 1
##$CFDGTYP= 0
##$CFRGTYP= 5
##$CHEMSTR= <none>
##$CNST= (0..31)
1 1 145 1 1 1 1 1 1 1 1 1 1 1 1 1 1 1 1 1 1 1 1 1 1 1 1 1 1 1 1 1 
##$CPDPRG= <>
##$CPDPRG1= <>
##$CPDPRG2= <>
##$CPDPRG3= <>
##$CPDPRG4= <mlev>
##$CPDPRG5= <mlev>
##$CPDPRG6= <mlev>
##$CPDPRG7= <mlev>
##$CPDPRG8= <mlev>
##$CPDPRGB= <>
##$CPDPRGT= <>
##$D= (0..31)
0 1.2 0 0 0 0 0 0 0 0.06 0 0.03 0 0 0 0 0.0002 0 0 0 0 0 0 0 0 0 0 0 0 
0 0 0 
##$DATE= 1629966074
##$DBL= (0..7)
120 120 120 120 120 120 120 120 
##$DBP= (0..7)
150 150 150 150 150 150 150 150 
##$DBP07= 0
##$DBPNAM0= <>
##$DBPNAM1= <>
##$DBPNAM2= <>
##$DBPNAM3= <>
##$DBPNAM4= <>
##$DBPNAM5= <>
##$DBPNAM6= <>
##$DBPNAM7= <>
##$DBPOAL= (0..7)
0.5 0.5 0.5 0.5 0.5 0.5 0.5 0.5 
##$DBPOFFS= (0..7)
0 0 0 0 0 0 0 0 
##$DE= 6
##$DECBNUC= <off>
##$DECIM= 32
##$DECNUC= <off>
##$DECSTAT= 4
##$DIGMOD= 1
##$DIGTYP= 9
##$DL= (0..7)
0 120 120 120 120 120 120 120 
##$DP= (0..7)
150 150 150 150 150 150 150 150 
##$DP07= 0
##$DPNAME0= <>
##$DPNAME1= <>
##$DPNAME2= <>
##$DPNAME3= <>
##$DPNAME4= <>
##$DPNAME5= <>
##$DPNAME6= <>
##$DPNAME7= <>
##$DPOAL= (0..7)
0.5 0.5 0.5 0.5 0.5 0.5 0.5 0.5 
##$DPOFFS= (0..7)
0 0 0 0 0 0 0 0 
##$DQDMODE= 0
##$DR= 18
##$DS= 0
##$DSLIST= <SSSSSSSSSSSSSSS>
$$ [...]
##$SUBNAM2= <"">
##$SUBNAM3= <"">
##$SUBNAM4= <"">
##$SUBNAM5= <"">
##$SUBNAM6= <"">
##$SUBNAM7= <"">
##$SUBNAM8= <"">
##$SUBNAM9= <"">
##$SW= 20.0188882624521
##$SWIBOX= (0..15)
0 0 2 0 0 0 0 0 0 0 0 0 0 0 0 0 
##$SW_h= 4006.41025641026
##$TD= 16384
##$TD0= 1
##$TE= 0
##$TE2= 300
##$TE3= 300
##$TEG= 300
##$TL= (0..7)
0 120 120 120 120 120 120 120 
##$TP= (0..7)
150 150 150 150 150 150 150 150 
##$TP07= 0
##$TPNAME0= <>
##$TPNAME1= <>
##$TPNAME2= <>
##$TPNAME3= <>
##$TPNAME4= <>
##$TPNAME5= <>
##$TPNAME6= <>
##$TPNAME7= <>
##$TPOAL= (0..7)
0.5 0.5 0.5 0.5 0.5 0.5 0.5 0.5 
##$TPOFFS= (0..7)
0 0 0 0 0 0 0 0 
##$TUNHIN= 0
##$TUNHOUT= 0
##$TUNXOUT= 0
##$USERA1= <user>
##$USERA2= <user>
##$USERA3= <user>
##$USERA4= <user>
##$USERA5= <user>
##$V9= 5
##$VALIST= <valist>
##$VCLIST= <CCCCCCCCCCCCCCC>
##$VD= 0
##$VDLIST= <DDDDDDDDDDDDDDD>
##$VPLIST= <PPPPPPPPPPPPPPP>
##$VTLIST= <TTTTTTTTTTTTTTT>
##$WBST= 1024
##$WBSW= 4
##$XGAIN= (0..3)
0 0 0 0 
##$XL= 0
##$YL= 0
##$YMAX_a= 292355
##$YMIN_a= -306655
##$ZGOPTNS= <>
##$ZL1= 120
##$ZL2= 120
##$ZL3= 120
##$ZL4= 120
##$ABSF1= 10
##$ABSF2= 0
##$ABSG= 5
##$ABSL= 3
##$ALPHA= 0
##$AQORDER= 0
##$ASSFAC= 0
##$ASSFACI= 0
##$ASSFACX= 0
##$ASSWID= 0
##$AUNMP= <proc_1d>
##$AZFE= 0.1
##$AZFW= 0.1
##$BCFW= 1
##$BC_mod= 2
##$BYTORDP= 1
##$COROFFS= 0
##$CY= 11.3945322036743
##$DATMOD= 1
##$DC= 2
##$DFILT= <>
##$DTYPP= 0
##$F1P= 2.36226072786647
##$F2P= -0.459571619588291
##$FCOR= 0.5
##$FTSIZE= 0
##$FT_mod= 4
##$GAMMA= 1
##$GB= 0.15
##$INTBC= 1
##$INTSCL= 1
##$ISEN= 128
##$LB= 0.24
##$LEV0= 0
##$LPBIN= 0
##$MAXI= 10000
##$MC2= 0
##$MEAN= 0
##$ME_mod= 0
##$MI= 1.114404
##$NCOEF= 0
##$NC_proc= 0
##$NLEV= 6
##$NOISF1= 3.799351
##$NOISF2= 2.8
##$NSP= 1
##$NTH_PI= 0
##$NZP= 0
##$OFFSET= 15.70392
##$PC= 1
##$PHC0= -13519.23
##$PHC1= 12.80099
##$PH_mod= 1
##$PKNL= yes
##$PPARMOD= 0
##$PSCAL= 0
##$PSIGN= 0
##$REVERSE= no
##$SF= 200.130013532006
##$SI= 16384
##$SIGF1= 3
##$SIGF2= 2
##$SINO= 400
##$SIOLD= 16384
##$SREGLST= <1H.CDCl3>
##$SSB= 0
##$STSI= 0
##$STSR= 0
##$SW_p= 3612.71676300578
##$SYMM= 0
##$S_DEV= 0
##$TDeff= 0
##$TDoff= 0
##$TI= <>
##$TILT= no
##$TM1= 0
##$TM2= 0
##$TOPLEV= 0
##$USERP1= <user>
##$USERP2= <user>
##$USERP3= <user>
##$USERP4= <user>
##$USERP5= <user>
##$WDW= 1
##$XDIM= 8192
##$YMAX_p= 0
##$YMIN_p= 0
$$ End of Bruker specific parameters
$$ ---------------------------------
##NTUPLES= NMR FID
##VAR_NAME=  TIME,          FID/REAL,        FID/IMAG
##SYMBOL=    X,             R,               I
##VAR_TYPE=  INDEPENDENT,   DEPENDENT,       DEPENDENT
##VAR_FORM=  AFFN,          ASDF,            ASDF
##VAR_DIM=   8192,          8192,            8192
##UNITS=     SECONDS,       ARBITRARY UNITS, ARBITRARY UNITS
##FACTOR=    0.0002496,     1,               1
##FIRST=     0,             0,               0
##LAST=      2.0444736,     0,               0
##MIN=       0,             -306655,         0
##MAX=       2.0444736,     292355,          0
$$ Real data points
##PAGE= N=1
##DATA TABLE= (X++(R..R)), XYDATA
$$ [...]
2543iL619R72k382l944k657N70L361L704J360k016l885k873J98L037L792J670
2559D517j569l738l150k56K780L852K027j213l599l300o28K474L767K376q15l458
2575F7l445r19K097L744K547l91l073l561j433J739L720K880p4k857l644j709
2591d312J454L491L110L45k554l773j963J080L289L278P08k223l706k300O34L162
2607b80L363J097j889l658k553K60K994L441J378j593l517k766m1K635L553J664
2623D088j265l307k932m86K394L497K031q85l144l149q31K041L497K309n27k986
2639C45l205j118J747L415K487j68k725l231j547J446L287K742J98k395l403j778
2655c903J116L136K827N99k196l347k017O84L008L000Q58j769l336k247K52K761
$$ y = [-9, 3610, 4582, 2200, -1744, -4401, -3831, -470, 3234, 4594, 2578, -1307, -4180, -3982, -945, 2847, 4517, 2948, -790, -3940, -4196, -1416, 2436, 4463, 3250, -349, -3649, -4277, -1803, 1964, 4340, 3525, 67, -3378, -4297, -2200, 1544, 4091, 3700, 627, -2934, -4367, -2628, 1092, 3972, 3898, 1041, -2603, -4312, -2858, 633, 3743, 4088, 1534, -2239, -4202, -3122, 167, 3445, 4153, 1930, -1776, -4076, -3442, -280, 3083, 4180, 2291, -1367, -3920, -3660, -666, 2775, 4153, 2560, -957, -3723, -3764, -1129, 2424, 4088, 2823, -484, -3416, -3902, -1508, 1989, 4020, 3135, -9, -3158, -3989, -1948, 1549, 3858, 3331, 345, -2860, -3978, -2231, 1184, 3671, 3503, 778, -2453, -4000, -2554, 733, 3475, 3673, 1278, -2125, -3903, -2787, 349, 3176, 3775, 1579, -1768, -3785, -3101, -93, 2907, 3765, 1996, -1340, -3587, -3335, -574]
2671e74L181J175j511l243k458K2K567L083J522j249l075k630l21K235L170J746
2687C640q67k919k752p01J915L234J970n96k736k861r20J650L054K268k35k509
2703F35k945j310J389K930K489P2k257l044j475J028K886K520M07j966k973j816
2719c430P55K716K632P43j854k855k042M50K515K821R49j523k831k145O9K366
2735f64K768J214j186k785k266k07K075K888J430r18k611k475m57J904K729J701
2751C140n21k558k487p77J557K801J865l32k284k619j007J335K759J982Pk130
2767G31k655j215J099K564K125K92j870k711j469Q26K467K294M77j656k647j614
2783b962N07K322K441O57j341k629j865K97K141K475R31j187k511j980O5J897
$$ y = [-574, 2607, 3782, 2271, -972, -3430, -3408, -841, 2242, 3764, 2515, -560, -3190, -3511, -1276, 1894, 3640, 2773, -146, -2898, -3599, -1684, 1550, 3520, 2924, 188, -2673, -3593, -1943, 1111, 3379, 3144, 635, -2310, -3620, -2231, 699, 3188, 3260, 1003, -2041, -3516, -2488, 398, 2918, 3325, 1359, -1614, -3430, -2675, 41, 2673, 3416, 1562, -1293, -3335, -2885, -370, 2451, 3400, 1877, -954, -3099, -3030, -664, 2104, 3318, 2132, -653, -2919, -3126, -1051, 1837, 3267, 2349, -262, -2737, -3194, -1290, 1439, 3140, 2619, 61, -2426, -3203, -1646, 1155, 3020, 2688, 404, -2215, -3222, -1887, 872, 2854, 2861, 731, -1924, -3139, -2040, 524, 2649, 2941, 1071, -1640, -3109, -2283, 184, 2478, 2955, 1299, -1348, -2962, -2455, -133, 2308, 2965, 1624, -1005, -2870, -2573, -432, 2043, 2974, 1787, -724, -2704, -2639, -742]
2799g42K470J230r72k354k157k72J718K577J369o58k319k260m66J522K450J613
2815B749l80k159k287p33J255K444J805k33j987k289j015J034K380J929J00j808
2831H05k342j249Q14K280J983L63j569k353j456O39K102K074N39j326k359j564
2847b619L72J950K239P47j159k291j705J22J762K239J045j003k206j757j95J644
2863h15K212J197p39k112j868m37J504K267J294n03j966k006n57J253K189J481
2879B394k90j787k093o86J034K100J593Oj654k147r57Q62J957J758K27j454k125
2896a262j180O44J923J874L71j272k121j263L54J773J911N86j106j981j483J77
2912b055J686J860Q63r25j905j630jJ420K068R57q18j816j701k33J344K035J044
$$ y = [-742, 1728, 2958, 1986, -368, -2525, -2797, -1079, 1498, 2867, 2209, -110, -2370, -2836, -1314, 1136, 2749, 2369, 210, -2077, -2810, -1555, 889, 2694, 2461, 474, -1815, -2830, -1796, 584, 2513, 2613, 805, -1537, -2786, -1972, 308, 2291, 2654, 1085, -1268, -2724, -2085, 17, 2091, 2630, 1304, -1055, -2619, -2247, -297, 1942, 2689, 1530, -761, -2466, -2344, -582, 1657, 2702, 1699, -507, -2264, -2459, -815, 1397, 2594, 1855, -257, -2125, -2562, -1058, 1209, 2503, 2000, 34, -1972, -2529, -1276, 913, 2394, 2104, 317, -1776, -2462, -1428, 672, 2265, 2271, 617, -1530, -2487, -1625, 332, 2090, 2317, 863, -1262, -2442, -1798, 125, 1999, 2370, 1098, -1023, -2286, -1932, -159, 1752, 2338, 1232, -749, -2232, -2055, -369, 1491, 2354, 1429, -476, -2106, -2107, -687, 1381, 2338, 1520, -296, -1997, -2230, -886, 1149, 2193]
2929B193m31j787j777m29J173J951J244k62j727j719o09R74J855J407j00j558
2945C98j821p35P23J905J469L4j326j823r69N69J807J599K36j225j832j066L94
2962a663J650J643M32j024j841j173K21J466J761O32q55j818j300QJ400J697Q92
2979B128p70j694j425r1J155J731R11m81j542j493l63J090J722J061l97j386j652
2996a496m44R23J650J233j69j381j551p20P90J594J306mj245j597p96O16J434
3013A43J423K10j075j641r82M13J481J485L81r68j577j111K82J329J535N52q13
3030A067j630j123Q2J187J573O37n98j541j287n2J119J598P90n16j432j363k74
3047a763R93J629R32l66j474j318m07R19J530J077k95j242j468n14P40J496J181
$$ y = [2193, 1762, -25, -1802, -2231, -1058, 893, 2137, 1875, 148, -1571, -2180, -1206, 649, 2056, 1956, 398, -1423, -2158, -1435, 470, 1939, 1973, 647, -1176, -2145, -1576, 231, 1830, 2066, 841, -991, -2057, -1663, -13, 1630, 2062, 1038, -803, -1976, -1755, -289, 1472, 2104, 1249, -569, -1869, -1861, -461, 1236, 2128, 1358, -336, -1761, -1852, -697, 1034, 1945, 1464, -78, -1571, -1934, -844, 878, 1939, 1542, 156, -1496, -1940, -1017, 633, 1866, 1697, 316, -1235, -1955, -1165, 429, 1735, 1731, 486, -1111, -1907, -1291, 143, 1566, 1776, 701, -940, -1922, -1509, -28, 1457, 1838, 870, -707, -1818, -1536, -207, 1328, 1880, 1067, -563, -1686, -1604, -417, 1156, 1793, 1195, -346, -1633, -1685, -566, 1032, 1822, 1306, -126, -1489, -1763, -770, 859, 1791, 1425, -49, -1367, -1774, -855, 675, 1752, 1457, 215, -1253, -1767, -1027, 469, 1650]
3064A650q6j151j499o59O07J453J198N2j079j464p39M99J314J319K67j002j446
3081g66r05L18J218J378M68q70j459j012J61J274J345N12o23j513r97p5J143J400
3099I97P19n81j364j272o8R54J483P60l64j342j272k34Q20J466Q90k69j193j357
3117a227l90P76J366J005j50j175j283n12O16J372J066J3j043j390o61N08J358
3134B49J137J13r37j353q08M31J225J243K80r23j358p80K09J164J268L76p08j328
3152e00r74R7J122J223N77n53j352j042K9R27J369N58m04j246j142j29R13J311
3170G84P00k75j244j190l14Q36J283R07k47j151j191l98P61J218R09m9j088j189
3188i38n46N84J206R93K3r08j200o84M26J211J058Q4p58j209p72L52J075J069
$$ y = [1650, 1564, 413, -1086, -1745, -1138, 315, 1513, 1565, 486, -978, -1717, -1218, 96, 1415, 1682, 680, -766, -1671, -1353, -135, 1243, 1711, 841, -618, -1630, -1469, -195, 1150, 1662, 1039, -474, -1471, -1546, -403, 997, 1716, 1135, -229, -1501, -1569, -615, 868, 1628, 1264, -78, -1350, -1584, -764, 702, 1592, 1323, 130, -1227, -1617, -841, 525, 1530, 1380, 205, -1078, -1590, -974, 398, 1464, 1477, 434, -956, -1617, -1109, 249, 1386, 1499, 562, -791, -1599, -1168, 57, 1300, 1580, 657, -701, -1481, -1272, -108, 1160, 1536, 828, -500, -1474, -1377, -255, 968, 1545, 992, -360, -1402, -1373, -446, 923, 1481, 1077, -169, -1311, -1440, -527, 784, 1484, 1209, -35, -1225, -1539, -703, 580, 1487, 1240, 89, -1102, -1500, -739, 479, 1388, 1339, 251, -938, -1484, -900, 306, 1299, 1322, 414, -786, -1470, -1044, 167, 1225, 1309, 551, -658, -1430, -1078, -3, 1066]
3206A066L00o88j226q20J42J095J140L90n72j210r58J16R34J182N71n16j212r58
3224a224j28Q75J215O52l77j215r43j66P29J263O72k64j027j115l21O60J195Q07
3242A288r2j029j076m77O18J171Q36l3q25j219m82M02J138R69Q2q73j083o11K97
3261i99J059J050K14p55j104p53K29R75J118K35n76j120q27J59R61J032M48n57
3279G89j104q67J3Q81J062N60m49j090r19p6Q27J024O15k88j056r72k19P35J086
3298E52P76k69j057r75k83N79J105Q12j79q24j076m31N25J048Q51nq34j022m75
3317a182K85J090R36O9p98j016o32L11R61R86J30o41j050o52J81R97R83K87n72
3336F73j057p75Q9R06R37N00n46j054p74L0P48J014N05l49r99q84j21O86J024
$$ y = [1066, 1366, 678, -548, -1368, -1226, -131, 1009, 1399, 827, -383, -1341, -1225, -291, 891, 1462, 946, -266, -1224, -1352, -477, 738, 1390, 1013, -202, -1145, -1311, -582, 681, 1353, 1089, 62, -1053, -1374, -714, 481, 1288, 1196, 167, -909, -1386, -768, 403, 1239, 1206, 381, -838, -1320, -918, 220, 1189, 1271, 398, -685, -1296, -999, 60, 1110, 1324, 569, -535, -1288, -1059, -84, 1034, 1269, 693, -427, -1254, -1095, -134, 898, 1346, 789, -315, -1182, -1169, -288, 774, 1334, 885, -205, -1124, -1200, -373, 651, 1266, 978, -78, -1050, -1269, -534, 552, 1328, 1059, 2, -973, -1256, -677, 428, 1240, 1061, 237, -839, -1270, -745, 303, 1154, 1149, 315, -707, -1182, -897, 193, 1129, 1198, 400, -616, -1248, -937, 24, 1010, 1140, 499, -551, -1203, -1022, -25, 958, 1245, 673, -384, -1159, -1070, -164, 773, 1273, 727, -327, -1101, -1071, -323, 691, 1196, 847, -152, -1036, -1157, -471, 553]
3355E53O58l20r60q81k03O27R97O50j36r43q90l11N44R57P03J7r07q57m37M58
3375f81R44P80j0p24q92n88L78R54Q10J34o81r56n91K68Q67Q71K12n59r81o24
3395a069J28Q72Q70L41n57r29o84L0P83R18L57l86r49o79n7O58J010M46l32q57
3415h6q21j32O09R19N85k23q25q22k53N13R43O13q1q08r21k31M84Q22O90n6o80
3436B39q64m50L97Q44P82N7o69r37m72M20P34P93J15n20r20n70K44P18Q23K59
3456A023n00q63n97J21O66Q67K81l89q67o58L9O50Q44L30l58p79o41r4O17Q22
3476E14M88k57q12p36j60N37Q02O36k47p34p18k60M58P86O27j05o74q16l22M39
3496e54Q05N63Q5n89q28m29L13P88O18R3n68p10m94K56O89P15J18m39q01n04J13
$$ y = [553, 1211, 891, -69, -950, -1153, -526, 471, 1121, 985, 42, -848, -1159, -615, 342, 1045, 1062, 155, -702, -1139, -681, 263, 1043, 1033, 309, -583, -1171, -793, 161, 971, 1105, 424, -532, -1123, -855, 12, 883, 1095, 536, -445, -1069, -941, -69, 801, 1142, 585, -344, -1028, -998, -215, 703, 1060, 674, -275, -954, -1011, -353, 657, 1103, 771, -86, -907, -1039, -430, 489, 1074, 851, 26, -796, -1049, -536, 407, 1020, 939, 131, -790, -1021, -537, 285, 975, 919, 239, -625, -1075, -678, 166, 948, 1005, 336, -601, -1073, -653, 81, 874, 989, 469, -451, -1021, -777, -59, 764, 1023, 523, -340, -937, -816, -150, 717, 998, 609, -258, -916, -877, -227, 617, 947, 589, -190, -831, -925, -308, 514, 1002, 745, -67, -803, -963, -426, 376, 1012, 765, 31, -687, -947, -489, 297, 924, 819, 145, -671, -993, -554, 251, 814, 899, 310, -518, -947, -634, 154, 772, 865, 297, -413, -907, -651, 38, 753, 871, 432, -369, -873, -760]
3517g60P26P07K45m57q04m97M6O02P49L89l61q50n89m8O16Q11L77l20o64o89r3
3538h64N61P22M35j47p42o78j99M98P21N44j14o65p18k50M36P48N59p0o13p29
3558e65k79L19O51O48j6m99p33m08L02O75O56Q0n06p73m19K00O90P00R3m43p12
3579c39m65J14O08O72J91l38o95m80J9O02O80K15l56o00n31r3N93O95L41k77o89
3600a33n16o2M47O39L86k28n42o43j45M68O81M17j05o43n77k20L87O27M93j01
3620F30n15o28k94L33O35N84k5n67o42k87K76O04N50K0m50o21l08J81N59N22J38
3641F95l88o22l68J26N55N63J82m16o09m18J37M82N84K45m11n23m82N0M75N49
3661D06K92k26o18n19N4M43N41K94j84n60m77o6L15O14L36j19n23m98j26K83N99
$$ y = [-760, -34, 673, 918, 461, -343, -840, -794, -192, 557, 946, 585, -265, -854, -902, -286, 525, 902, 582, -82, -771, -864, -303, 419, 854, 707, -35, -713, -912, -414, 307, 851, 737, 72, -646, -896, -460, 288, 847, 777, 164, -565, -844, -525, 126, 774, 758, 259, -474, -882, -580, 95, 751, 831, 325, -448, -867, -667, 23, 723, 816, 373, -339, -804, -690, -82, 590, 781, 443, -252, -732, -713, -111, 569, 784, 428, -172, -703, -796, -203, 492, 833, 556, -133, -649, -711, -264, 375, 761, 533, -9, -652, -797, -329, 352, 769, 664, 21, -556, -776, -389, 238, 731, 630, 115, -513, -807, -474, 161, 745, 720, 153, -489, -776, -500, 104, 654, 674, 224, -397, -705, -524, 35, 557, 695, 307, -315, -683, -557, -2, 561, 743, 327, -282, -700, -563, -81, 503, 748, 337, -186, -668, -618, -143, 406, 698, 472, -146, -665, -611, -168, 373, 667, 483, -77, -554, -620, -305, 309, 645, 526, 3, -495, -621, -338, 261]
3682B61L83q9m81n66j91L42N35M26m9n10n41k20L45N16L97Ol91n44k48J94N38
3703A13L79R0l49n64k68J48M95M49J70l77o01l19J32N41M52J35k63o08l18K1M37
3724a05N34J81k41n37m49L2M43N43J99k16m85m24o2L94N35K89j46n33m71o6L72
3745b13N26K71j12m48m77r7K25N83K54lm09n32j44K91N16L21lm42n22r0J72M63
3767A30M12k7m34m18k57J92M81L48Q6m02m19k54J85M41M21j0k29m68l93K01M61
3788D7M02J09l20m82k74lN08L90K08k54m83l57L7L71M36K53k48m29n07R1L60M87
3810C42K49k32m55m12m1L36M60L35k14m24l90q9L43M59K53j02m19m52j18L32M59
3831B20K77j27l30l77k28K60M69L29j9l66m46k04J70N01L52j7l46m56j95J67M39
$$ y = [261, 644, 555, 74, -492, -683, -341, 194, 620, 571, 61, -480, -700, -355, 161, 558, 564, 173, -371, -619, -425, 113, 492, 582, 233, -331, -599, -451, 44, 493, 663, 286, -315, -634, -502, 39, 491, 626, 363, -245, -563, -542, -105, 429, 610, 369, -168, -617, -585, -142, 401, 600, 384, -101, -525, -587, -193, 342, 631, 485, -48, -519, -585, -213, 313, 584, 472, 24, -453, -550, -325, 258, 512, 509, 100, -432, -576, -285, 231, 552, 549, 107, -415, -505, -333, 130, 542, 515, 81, -337, -594, -402, 79, 427, 513, 111, -308, -562, -377, 64, 485, 475, 246, -222, -615, -414, 47, 449, 558, 238, -244, -518, -521, -13, 377, 585, 331, -152, -509, -472, -101, 335, 588, 340, -89, -596, -505, -145, 342, 591, 359, -96, -508, -549, -213, 247, 582, 368, -56, -446, -535, -192, 267, 520, 418, -1, -453, -571, -239, 220, 497, 370, 40, -337, -565, -305, 164, 493, 474, 108, -338, -542, -372, 129, 481, 464, 118, -338, -533, -366, 73]
3852G3M09K9l50n60j88J96L89M62R3l89m92k64J26M78M36P1k57m90l21J03M24
3873b2M19J64k45m62l52k1M22M87K02k74m29l50k7L56N25K05k48m56l97m5L82
3894a66M72L05k05l81n04r4L61M76K94j71m22l62j69L15M12L78n2m83m50j40K84
3915c02M39L38M3m10n03j71K26M40M06L8l60m96k59J48N01M10M9l28m84l03J11
3936d67N17M50O1l41m64k83J8M52M72J85k66n68l27O5M18M78K16k47n10m15K2
3957e34L76M98K55j55n22m66K8L29M90L47j50n21m62j27L89M82L12n8m33n71q7
3978e80L17M63L89n2m18n15j93K45M77M16K0l65o12j73J67M56M75P5l82n67k29
3999e86J02M13N47J22k82n55l57N3N51M32J68k44o12l37O9M85M53K64k80n34m50
$$ y = [73, 482, 511, 161, -399, -587, -391, -2, 460, 553, 164, -328, -592, -466, 12, 448, 519, 262, -228, -549, -446, -22, 397, 561, 316, -146, -498, -519, -97, 390, 592, 318, -111, -461, -488, -132, 393, 598, 350, -106, -503, -548, -166, 306, 611, 406, 25, -479, -573, -212, 264, 558, 387, -35, -397, -566, -251, 161, 539, 487, 4, -446, -586, -302, 137, 475, 518, 108, -395, -566, -340, 100, 506, 544, 184, -312, -571, -423, 78, 488, 537, 209, -275, -578, -467, 50, 500, 561, 220, -244, -527, -509, -57, 415, 600, 334, -234, -561, -496, -78, 400, 616, 369, -141, -556, -534, -158, 340, 595, 440, -82, -548, -520, -191, 299, 646, 496, -25, -487, -614, -225, 257, 569, 511, 78, -493, -580, -263, 200, 589, 537, 119, -396, -589, -344, 133, 549, 569, 204, -408, -581, -414, 42, 517, 592, 210, -357, -586, -484, -71, 476, 598, 316, -239, -596, -543, 8, 440, 608, 364, -248, -585, -516, -31, 422, 686, 406, -128, -578]
4020e78k4M26N63K75k73m53m72j30L88N43L85j22n01o06p8L51N39L91p6n36n11
4041d99j72K90N63M71m7m68n96k07K79N39M64L0m89n19k90J69N19N62N9m15n15
4062b72l98J23N39N43J56l46o21m03R7M45O42K20l87n27m39rN20N65K39k31n98
4083a42m61l9M29O08L40k31n61n49r6L96O61L33j59o05m66j62L72O20M37j72m78
4104G5n64k61L38O69M34p6m78o18l20L13O58M23M9l70o79l61K37N33O20J11m43
4125B90o33l66J07O05N53J78l46o44m74P3N60O48J66l10o20n20k0N97O34K41k16
4146E03n64n49n6M27O26M29k70n93n81j21M39O42M28j61n69o36j40L76O46M34
4166G10k8n73o22k80L49O58N12k6n06o64k62K38O56M80Q9n01o27l65J81O25N30
$$ y = [-578, -602, -176, 387, 662, 389, -64, -536, -666, -278, 265, 650, 528, 27, -579, -657, -306, 233, 624, 548, 12, -499, -671, -381, 182, 653, 606, 138, -458, -665, -386, 153, 617, 647, 158, -361, -651, -482, 37, 599, 658, 243, -272, -670, -547, -8, 535, 691, 345, -276, -679, -582, -137, 505, 725, 338, -189, -628, -637, -117, 448, 687, 456, -142, -603, -642, -213, 395, 735, 504, -57, -606, -702, -306, 355, 688, 529, -76, -542, -704, -332, 288, 725, 553, 75, -489, -750, -412, 257, 691, 615, 137, -481, -801, -488, 170, 593, 642, 272, -407, -768, -531, 2, 622, 733, 290, -343, -709, -602, 3, 556, 734, 388, -256, -730, -657, -97, 551, 717, 407, -213, -733, -753, -156, 478, 719, 503, -61, -610, -666, -239, 387, 816, 546, -47, -628, -749, -310, 332, 760, 599, 30, -606, -746, -370, 276, 710, 682, 109, -513, -793, -444, 214, 726, 700, 194, -470, -732, -494, 162, 642, 731, 230, -397, -762, -581, 44, 574]
4187E74J78m20o19m99J89N33N98K38l47o65m52M0N12O87K36k78o85n34m1N24O66
4208D35L75k53o72n04j12M42O88L27q9o61o06j18M36O05M89j76n46o48k59L84
4228d63O75N65q6n80n95l23L53N96N57P0n55o41l56K08O56N63J32m27p26m33J27
4249f83O50O74J92m42o30n26L7P00N72K70l35o63o46R8N49P40K76k80o85o52j2
4270g96N00P82L83k46o04o65j77N09O20N34j71o34o38k34L81P22N23o4n60o72
4290e07l25L60O77N43P3n78p06l75K74O61N99J04n02p20l70J31O52O79J49l96
4310D23p35n24J14N74P05L30m08p34n08J0N80P60L28l52o91o17n3N19P14L89k21
4331F03o47o62j46N37P14M07r2o82o64j85M03P25M78p0n94o92k54K81O90O27K4
$$ y = [574, 752, 332, -287, -786, -597, -64, 534, 772, 425, -240, -692, -652, -140, 547, 783, 505, -180, -714, -755, -231, 435, 810, 557, -115, -619, -731, -289, 399, 726, 637, -24, -630, -748, -312, 293, 782, 606, 60, -588, -847, -463, 212, 777, 691, 111, -484, -807, -454, 142, 699, 769, 214, -427, -783, -575, 81, 644, 776, 349, -377, -810, -683, -33, 641, 833, 391, -239, -765, -728, -28, 544, 814, 479, -184, -830, -732, -183, 557, 833, 553, -132, -784, -796, -296, 486, 869, 623, 19, -646, -823, -314, 306, 840, 669, 35, -603, -837, -456, 266, 789, 725, 165, -507, -832, -472, 205, 748, 821, 243, -463, -838, -564, 97, 696, 800, 298, -422, -792, -661, -9, 670, 819, 423, -312, -836, -722, -148, 557, 887, 479, -255, -763, -753, -173, 587, 915, 563, -128, -745, -798, -279, 435, 824, 603, -44, -706, -852, -315, 399, 806, 714, 32, -632, -817, -414, 311, 789, 719, 125, -567, -821, -540, 150, 777, 801]
4352H01n29p80l89L14O54O35J29n54p22l33J35O10O93J80m24p75m61J26N90P49
4372F49J67l52p21n06nO04P17L31l07p01n76LM49O76L75j69p30o38j37M79Q01
4393D09M36j79o12p02j99M23P21N12q0n74q21k03L51P85O02j51m99p20l21K80
4413e42O44O40O8n13o66m67J68P04O31J64l95q09m57J51N76P14J95l11p56n14
4433g75L4N94O76K82k50p28n76J9N10P03K89j66p12n55j23M50P12M49j90o87n78
4454f22j73L93P22M65k5o15p28k86L81O88N25L0o16o54k86K43O42O37Q8n66o48
4475d05l99J63O57O18J85m10p73m84J88O00O85K35m23o52n14pO10P04K33l05o67
4496a61n91k3N29P00L92k76o95n95o0M38P24M78j80o75o34j68L96P44M67j35o40
$$ y = [801, 272, -508, -897, -583, 71, 706, 835, 281, -441, -774, -639, -29, 664, 844, 420, -355, -816, -690, -100, 649, 816, 464, -257, -763, -768, -164, 553, 884, 577, -124, -700, -697, -248, 428, 803, 634, -96, -734, -871, -392, 409, 845, 666, 54, -648, -847, -424, 297, 809, 729, 155, -666, -869, -518, 267, 869, 718, 219, -501, -822, -542, 102, 742, 810, 297, -369, -836, -668, 36, 667, 831, 436, -373, -830, -679, -103, 611, 806, 495, -261, -775, -741, -147, 529, 811, 561, -167, -743, -724, -214, 489, 778, 612, -100, -655, -778, -328, 384, 833, 643, -44, -622, -795, -402, 320, 785, 760, 145, -583, -869, -488, 200, 725, 755, 139, -515, -801, -558, 84, 721, 809, 243, -405, -804, -641, 16, 634, 819, 409, -364, -848, -660, -60, 625, 860, 437, -215, -729, -736, -126, 578, 811, 506, -161, -752, -775, -246, 454, 846, 570, -125, -720, -780, -342, 382, 860, 680, 5, -629, -797, -401, 343, 810, 675, 35]
4517C5n94k30L11P55N14p4n70o75k52K28P17N61O5m76p76m16L40O10O32N6l97
4538C64p54m20K14N77O65J73m12p03m60m0O69O89K90l64p08n32M4M60P47L41k60
4559E80p49o20M6N05O96L30j89o55o09j11M61O78M10j26n62p01j86L75O98N27
4579G98q5n71o98k48K91P50N00m7m94o57l53K84O50O22K6m76p15m77L17O03O04
4600F24J33l86o82n15J26O14O52K08l21p33n35Q2O16O44L12l22o75n35p5N72O38
4621D42L66k19o13o28j01M68O84M41k21o00o41j40L42P76M49p9o35o61j92L29
4641d33O30N59o3n44o68l76L63O67N36J19n81o65l64L09N54O14R1m56o02m99J86
4662f23O35N88K02m44o68m29p1P24O59J82k89o70n81J03N25O63L14k98o11n96
$$ y = [35, -559, -789, -478, 277, 791, 717, 147, -528, -780, -552, 165, 726, 791, 315, -461, -877, -537, 73, 705, 761, 364, -390, -810, -596, -19, 646, 819, 407, -296, -756, -796, -127, 562, 852, 488, -220, -752, -708, -248, 499, 840, 580, -169, -789, -743, -238, 458, 788, 599, -56, -665, -776, -315, 363, 773, 647, 85, -616, -802, -427, 271, 798, 713, 142, -556, -804, -513, 237, 737, 690, 196, -461, -814, -530, 120, 742, 768, 292, -423, -900, -583, 20, 624, 757, 371, -311, -826, -700, -86, 566, 774, 453, -280, -815, -733, -117, 527, 839, 517, -158, -693, -768, -196, 442, 808, 589, -24, -652, -753, -285, 399, 840, 619, 19, -622, -762, -420, 356, 805, 726, 91, -570, -762, -433, 197, 756, 693, 149, -519, -895, -532, 135, 671, 790, 209, -456, -820, -511, 43, 657, 748, 292, -310, -809, -623, 12, 600, 802, 358, -310, -739, -810, -86, 573, 755, 466, -204, -785, -682, -157, 506, 820, 522, -89, -685]
4682f85k4M38O88L69j95o25o45p9M18P15L97j34o20o18j53K94P03N07p0n48o58
4703e25k13K02P35N13j6m65p39l14K52O52O64J8m32p20l86J63O26O53J24m66o84
4724c58m05J18N94O49K27l98o76n16N9N90N90L43k88o51o24K2M48P52L48k94o30
4745a00n71l3M29O20L83j02o41n96j60M36O01M87j12n15p02j86L74N81N50p4n22
4766A47o58k66K57P07M73O3m63p00l43K30N90N92J32m22p61k98J25N85O15J55
4786G60l86o37m77P1N47O45K33k86o42n90O4M88P02K72k68o15o18l2M61P39L68
4807G99k35o05n77j26L83O98M12r6n65p01j98M45O13N15o0o32n66k32L05O15N19
4828G11m1m97o81k91K74O38N74M0m62o66m12K33O03N55J17k86p47m31J51O01O34
$$ y = [-685, -709, -271, 417, 786, 591, -34, -679, -758, -340, 375, 772, 638, 18, -600, -753, -459, 244, 751, 681, 133, -525, -738, -536, 199, 712, 696, 231, -508, -822, -570, 82, 746, 764, 332, -388, -774, -611, 15, 668, 792, 326, -358, -763, -645, -51, 598, 825, 427, -249, -765, -706, -116, 474, 817, 529, -122, -746, -724, -276, 476, 824, 530, -100, -671, -704, -275, 345, 728, 626, -15, -611, -771, -335, 266, 753, 641, 126, -576, -762, -388, 193, 743, 669, 147, -511, -777, -520, 187, 660, 723, 260, -440, -783, -553, 37, 629, 761, 339, -422, -720, -595, -10, 605, 760, 374, -263, -740, -669, -122, 523, 756, 470, -172, -762, -698, -210, 492, 764, 496, -119, -737, -769, -308, 431, 799, 564, -41, -618, -744, -361, 337, 749, 653, 88, -613, -811, -366, 247, 762, 702, 70, -496, -728, -423, 192, 711, 670, 173, -508, -799, -525, 113, 687, 727, 265, -401, -813, -580, 23, 578, 695, 409, -338, -769, -618, -17, 617]
4849F17J41l48o30m59J8N34O57K30l51n58n53j2N14O64K79k20n85o14n7M35O72
4870C74M03j79n97n87j86M36O85L32m4n76o02j53K54O74N05j12n00o59k27L22
4890d37N84N21J0m63o21l59K32O02N74K9l60p09l31J59N61O02J66m63o18l78K6
4911f73O11O43J92l63o43m72R3M94N52L03k70o23m97p1N11O13L12j95o11n08r9
4932g01M20N97M25j54n83n62j76M24N83M24r0n97n20k55L01O46M55J3n11n31l53
4953g45L00N41N10J04m48o65l27K09O09N57Q0m19o58l65J31N36O10J79l65o88
4973c14l71M3N10O67J57l11n33n03k7N16O63K33l27n32n39l9N09N97L07j71n47
4994a2n63j69M24O66L92j45n66n72j68L13O16M98q5n56n57k74L31N81N11n7m16
$$ y = [617, 758, 410, -220, -679, -661, -127, 530, 760, 409, -149, -702, -714, -200, 464, 743, 523, -62, -676, -733, -298, 374, 777, 598, 1, -586, -772, -336, 349, 681, 637, 61, -541, -694, -440, 234, 739, 627, 127, -532, -759, -437, 147, 668, 678, 215, -406, -765, -533, 69, 643, 672, 312, -397, -728, -569, -8, 594, 760, 297, -321, -699, -673, -62, 581, 773, 410, -233, -705, -612, -118, 434, 737, 467, -156, -653, -724, -213, 400, 712, 517, -94, -602, -701, -281, 316, 741, 587, 4, -558, -734, -310, 273, 697, 607, 10, -510, -765, -464, 182, 637, 650, 139, -392, -745, -445, 96, 606, 710, 262, -403, -730, -521, 88, 645, 725, 306, -352, -717, -586, -50, 560, 739, 374, -314, -685, -642, -132, 535, 692, 381, -152, -655, -682, -166, 497, 730, 403, -129, -668, -707, -198, 399, 706, 535, -12, -575, -744, -320, 346, 738, 593, 27, -545, -713, -400, 216, 714, 629, 73, -484, -758, -427, 154, 665, 608, 192]
5015A92n74l39K75N35N19J09n16n95l64J70N90N70Q9l77o35l53J19O40M55K20
5035G30l72o10m15M6N06N48K92l39n44m32o3M42O25K75k06n75n11l6M23N91L10
5056F85k06n37n23k1K86O25L87j18n34n41k33L79N64M73j29m36n95k51L22N61
5076A58M24J9m13o39k71K26O25M63L5l78n82l43J86M96N42J37l46o81l24J18N38
5097a0N18J81l14n98m04L5M82N41K80l07n51m32n3M00O10K86k59n43m48k9L54
5118b61O08K87p3n40n78q9L69N54L61r3m96n98o1K67N05M56l6m53n68k11J97N99
5140A46M55K7m39o13k30J75N37M93M2m17m97l07P7N85M70Q8l23n61l64J30M21
5161a05M97K71l50n21l92%M75N33K07j61n68m71m3M50N36K92k49m78m42j07L41
$$ y = [192, -382, -721, -446, 89, 608, 717, 201, -394, -758, -588, 2, 572, 661, 284, -351, -704, -585, 55, 510, 730, 358, -252, -667, -621, -115, 433, 725, 386, -158, -590, -653, -211, 414, 689, 483, -92, -603, -639, -216, 375, 685, 479, -58, -581, -602, -316, 309, 696, 578, 44, -497, -730, -351, 213, 686, 557, 121, -474, -725, -403, 158, 582, 601, 188, -451, -722, -496, 129, 592, 627, 249, -333, -676, -490, 6, 548, 685, 339, -342, -666, -548, -10, 508, 689, 375, -223, -627, -592, -110, 431, 711, 404, -147, -579, -632, -232, 378, 664, 405, -138, -586, -615, -261, 347, 634, 561, 21, -557, -646, -277, 277, 638, 545, 49, -549, -610, -343, 162, 618, 582, 129, -439, -650, -453, 146, 601, 628, 189, -424, -654, -479, 58, 551, 593, 176, -321, -628, -551, 34, 504, 592, 269, -292, -656, -526, -105, 392, 663, 313, -208, -600, -600, -125, 408, 615, 454, -114, -585, -628, -178, 358, 650, 401, -77, -519, -626, -285]
5182b85N28L78p1n19n82k1K64N60M15j04m65n25k39K63N57M51n6l46n91k26J64
5203d50N33M57J19m21n77k64J41M20N24J50l51m76m41J18M95M59K04k77n24m16
5223e77J7M35M97L11k75n49m01k8L56N63K70j67m81n20mK58N98K78o5m47n67j57
5245f55L39N45L72l1m39n32k15K43N58M10m2m81m54k27J78N47M41L8l69o27k25
5266f26J62N85L43J25l21n27l46J02M58N87J00l49n15m21Q6M51N70J26k39n38
5286a87l49j2L42O15J88j83n29m64l5L81N29L22j49n15m63j04L14N16L57k5m87
5307F2n20k05L18N53L94m2m42m35k98K64M68M49n1k58o37k30J29M84N74N7m34
5328B00n25l30J85M58M84K08l72n29m09J00M07N62K07k39n90m10k7N02M80K59
$$ y = [-285, 243, 621, 550, 31, -551, -572, -308, 252, 667, 563, 98, -427, -666, -403, 154, 605, 549, 203, -388, -614, -450, 83, 540, 659, 238, -339, -603, -462, -42, 482, 632, 281, -195, -636, -518, -23, 436, 640, 363, -161, -577, -560, -125, 372, 683, 408, -141, -542, -570, -214, 349, 619, 452, -29, -549, -553, -295, 303, 581, 516, 69, -498, -655, -316, 229, 601, 570, 131, -401, -616, -373, 185, 595, 553, 72, -382, -609, -431, 116, 557, 595, 226, -401, -626, -464, 121, 464, 589, 268, -259, -605, -503, -45, 542, 642, 293, -222, -643, -557, -106, 464, 590, 351, -187, -536, -548, -206, 409, 597, 414, -115, -579, -614, -233, 296, 618, 469, -46, -509, -613, -299, 217, 574, 549, 62, -458, -663, -345, 208, 602, 560, 118, -317, -615, -351, 117, 566, 515, 257, -380, -610, -481, 3, 577, 634, 200, -325, -655, -470, -12, 472, 680, 308, -221, -630, -530, -123, 439, 646, 407, -183, -593, -620, -118, 362, 621]
5348F21k11m72m46o1L96M78L30j42n93m36j32L59N72L64j15n23m31k24L26M92
5368A52M38M5n75m90k16K31N16M54Ql89n32k76J91N26M76J2l24n25l66J59M88
5389CM85J32l46n21l68J18M24N29K06l11n67l71L9M20N53K27k27n21m69l5L92
5410b08N10L18j53m94m89j15L88M97M02j61m59n26j37K92N73M05j24m12n65k39
5430f97K94N31M20L7l91n28l06K10M62N08P5l62n85l51K04M18O24M5l29n67l58
5451f46J03M43N68K01k97n36m48L2M18O36J91k52n29m26n4L83N51L13j82n36m27
5472d94j86L82O16L28j26n25m49j61K83N38L84n5m36n32k30K69N36M41nm19n66
5493d07k25J59N51M39J16l92n37l57J59N45M80J19l68n40l80J62L86M95K57k66
$$ y = [621, 410, -62, -508, -569, -173, 305, 635, 493, -100, -536, -668, -309, 263, 627, 512, -11, -442, -666, -340, 152, 590, 635, 60, -430, -646, -415, 101, 555, 563, 174, -358, -634, -443, 83, 559, 571, 247, -278, -644, -485, 3, 488, 620, 274, -247, -615, -497, -73, 456, 662, 351, -216, -587, -548, -128, 425, 652, 425, -96, -565, -600, -208, 302, 620, 467, -27, -516, -631, -243, 254, 656, 495, 36, -490, -627, -335, 238, 643, 519, 107, -458, -697, -403, 128, 548, 585, 194, -334, -640, -430, 32, 540, 615, 253, -332, -683, -479, -61, 563, 608, 279, -288, -646, -543, -100, 468, 669, 372, -164, -612, -580, -162, 474, 665, 413, -116, -542, -596, -213, 338, 651, 469, -67, -494, -680, -298, 318, 646, 520, -5, -454, -615, -332, 206, 590, 535, 99, -433, -663, -394, 142, 583, 578, 159, -407, -632, -473, 78, 517, 633, 241, -296, -653, -494, 51, 531, 650, 282, -258, -638, -476, -90, 405, 662, 396]
5513C96n78m25P2L87O04J91k44n74m06j1M15N20L01j74n25n28q1M27N39L32j09
5534E29n22n04j73L16N77L53l7m75n17k21L40M84M55n6m22n25k73K42N94L90O8
5555F23l55o02k95R5N58M99P7l35n42l54J32M90M86J26k31n76m14L6M76N08K32
5576F34j90n86m19j6M55M61K99j60n86m46j1L36N51L53j14n44n24j12L28M93M29
5597F31j00m67m99k24L35M96L78l4l77n37k15J85N87M20m3l22n40k56J91M49M61
5618E19P2l48n25l12J21M33N25J74l39o21l18J02M27M30K24j86n17l77l5M41M53
5639C43K58j96m21n35o4L86N18K80n4n51m29j49L88N08L25j24m12n29j69L08M44
5660A25M33j4m77m69k26K55M89M03O8l96n73k49J76N35M07R7l65n47l06J12M75
$$ y = [396, -182, -607, -535, -148, 456, 647, 403, -171, -577, -588, -173, 347, 648, 474, -51, -579, -660, -233, 306, 638, 529, 7, -497, -670, -354, 223, 576, 539, 64, -453, -674, -334, 150, 605, 549, 127, -398, -671, -429, 165, 555, 623, 268, -334, -629, -534, 24, 523, 600, 265, -277, -631, -499, -9, 477, 603, 372, -204, -618, -582, -106, 402, 634, 444, -142, -561, -577, -122, 339, 638, 478, -108, -554, -565, -229, 322, 675, 561, 17, -507, -619, -291, 202, 631, 531, 64, -435, -659, -324, 172, 550, 516, 139, -398, -613, -428, 159, 579, 536, 214, -326, -582, -391, 58, 519, 591, 243, -282, -594, -473, -40, 485, 659, 320, -301, -619, -517, -90, 340, 564, 378, -139, -516, -551, -110, 343, 601, 405, -16, -551, -615, -229, 289, 569, 515, -36, -465, -614, -226, 282, 607, 483, 71, -458, -627, -319, 125, 558, 544, 67, -402, -628, -373, 116, 519, 587, 191, -382, -631, -455, 80, 487, 584, 219, -328, -634, -522, -47]
5681d7N16J77l57m96l82O5M99M54J58k38m55l95q2M63M76K33k23m50m99lM55N18
5703C87K35j46n24m65q4L76M57L57r4n07m54j65L02N00M04j2m70n59j73K99M48
5724A12L88K2l75n03k79K49M43M61P7m20n41k38J55M43N33Q3l64n11l39P6M55
5745g3M75J69j99n85l79M3M28N48J93k02n34m53lL89M98L15j90n20l85j32L45
5766b52N41L02j32m98l26j89K18N93L17r8l68n57j99K81N31L93L4m29n04k98K38
5787d02N05M14J02m42m83l00J61N25L89O9k77n30k99P6N55M62R0k70n42l31lL94
5809a37N00K01j69n07m27k4M31N20K07j98n04l86o1L17N35L17j32m98m47j54L71
5830b45N33K86q3n19m14j63K76N03L68l5m37m82j86K06N33M42p8l52n09k98J82
$$ y = [-47, 469, 646, 289, -207, -589, -524, -25, 429, 587, 349, -106, -501, -583, -120, 356, 589, 366, -84, -583, -586, -131, 387, 622, 476, -48, -513, -597, -221, 236, 593, 499, -8, -462, -627, -325, 175, 579, 567, 97, -462, -635, -336, 112, 500, 522, 147, -356, -635, -386, 57, 518, 595, 175, -366, -604, -449, -6, 527, 610, 246, -265, -604, -528, -73, 402, 571, 372, -213, -592, -549, -121, 427, 620, 418, -116, -569, -572, -183, 315, 630, 440, -80, -465, -597, -252, 289, 591, 459, -39, -365, -554, -336, 257, 574, 476, 108, -449, -648, -367, 164, 557, 591, 162, -342, -640, -402, 103, 517, 619, 177, -306, -606, -445, 80, 469, 538, 261, -269, -568, -492, 63, 525, 615, 345, -197, -528, -531, -137, 363, 564, 395, -112, -539, -563, -132, 388, 595, 397, -107, -493, -554, -237, 298, 615, 483, -15, -462, -616, -245, 288, 574, 491, -28, -442, -605, -329, 174, 542, 507, 70, -412, -598, -392, 141, 583, 505, 153, -356, -654, -472]
5851d72N36M50L0l22m84l08J05N12M15K00l95m55l55J7M95M58J70k49m70m02j4
5872e38M61M80K28k53m61m58k8L91M95K77j84m56m52j05L03O07L14j29m76m45
5892d29j16K90M93L68j36m02m86k26K76N61L73pm00n05k22J61M90M23P9m19n13
5913c47k42J39M53M82J19l46n29k96M1M88M85J71l22n21l73N5M55M85K05k79m89
5934a66m31M9L91N65K25k01n25m25r4M48M83L14j66n47m37l9K67N98L07o1n16
5955C9n00j57K30N82L72l6l99m80k45J87N51L80kl76n14k46K25M77M25J16m09
5976B20n16k87J38M77M54J29l31n53l58J06M88M97J54k84n11m58J22L69N09K72
5996F37k61m71m13o7M44M91K59j92m97m15o9L50N15K44j05m89m70q8L08N17K97
$$ y = [-472, 64, 514, 544, 222, -262, -570, -465, 47, 462, 662, 267, -188, -543, -526, -31, 427, 597, 348, -122, -524, -538, -77, 403, 631, 378, -83, -541, -569, -178, 317, 594, 410, -46, -498, -603, -300, 307, 621, 492, 16, -429, -545, -255, 238, 606, 470, 68, -418, -644, -368, 193, 566, 559, 159, -346, -568, -407, 83, 506, 585, 166, -347, -589, -450, 3, 485, 604, 258, -271, -567, -526, -38, 447, 618, 296, -225, -598, -543, -88, 397, 602, 323, -166, -597, -548, -157, 408, 633, 432, -93, -518, -612, -164, 319, 633, 467, -80, -517, -556, -289, 309, 616, 555, 39, -461, -618, -388, 194, 566, 530, 131, -349, -594, -407, 144, 524, 522, 146, -368, -614, -389, 88, 513, 629, 220, -296, -583, -445, 32, 486, 615, 284, -269, -627, -521, -33, 464, 618, 334, -177, -635, -513, -144, 365, 637, 376, -95, -508, -575, -131, 360, 619, 427, -70, -485, -554, -204, 311, 555, 450, -39, -509, -597, -289, 228, 525]
6017E25k0m63m86j22K20N56L73n3l78n28k29K22N13M59j6l80n11k83J66N17L76
6038D58J34l85m49l28J33M75M28J08k68m73l81M2M59M85J81k47n44l84J4M25N00
6059C83K13k16m84m71k8M09N09L20j99m70m50j03L73M53L21r4m20n12j04K87M79
6080A96L50l3m28m72k40K67N05L91Nm25m37l08K37M90M75J7l54n84k59J54N35
6101H2M05R4l65n36k17K6N45M61R9k97n36k80J2M03N15K01k04n89l56l0M04N44
6123C81K58k31m38m94j1K97N70L08j53n17m90p3L43N48K96j24m45m57j49K78N05
6144B02M08m1n16m21j97J88M86M62ql90m99k68J29N22M98k1k74n73l52K11M54
6165@M98Q5l09n22l48J13M74M74J30k41n54l70N4M10N10K14k22m52n08%L86N66
$$ y = [525, 505, 42, -444, -566, -346, 210, 583, 530, 152, -376, -605, -383, 130, 589, 573, 193, -318, -601, -435, 82, 458, 592, 207, -242, -570, -437, 38, 466, 574, 306, -167, -548, -506, -47, 438, 619, 372, -172, -556, -542, -117, 383, 596, 380, -104, -575, -603, -194, 315, 635, 436, -34, -484, -587, -214, 239, 560, 466, 46, -466, -570, -283, 196, 546, 513, 85, -387, -627, -360, 145, 536, 541, 116, -321, -629, -392, 98, 573, 590, 236, -348, -607, -453, 82, 487, 581, 216, -320, -537, -511, 34, 495, 594, 297, -239, -519, -507, -104, 411, 612, 408, -181, -537, -567, -163, 381, 639, 408, -30, -524, -535, -238, 332, 640, 487, -30, -520, -593, -250, 298, 594, 470, 25, -432, -581, -303, 202, 610, 569, 53, -368, -565, -377, 109, 571, 563, 173, -326, -594, -465, 57, 555, 534, 260, -313, -665, -454, 0, 498, 583, 274, -248, -596, -483, -9, 465, 595, 354, -200, -570, -516, -106, 404, 618, 396, -56, -564, -564, -178, 388]
6187C88K22j61m62m97j41M42N27K83j36m74m35j77L46M72L73j1n00m75k20L28
6207c08N29L28K8m27n29k69K56N07M48N1m23n21l13J93M77M35J45l53n00l09P1
6228d84M57N05J40l43n31l89J34M40N24J43k54n12m02L8L81N82K00k33n40m34
6248e78j9L67N82K72j65m71m66j11L00N03L92j25m93m57j75L50M91L89k6n02m71
6269d13k26L03N41L15L1l93n54k49K11N30M87ql29n57l05J20N53M81M8l13m95
6290b22l63N8N24M81J01k55n46l85Q3L94N72J88k08n18n14M7L75N82K35j99n09
6311g9m36j00L54N29L32r9m51n26j10L05N36L27m1n45m16k13K98N71M00j31l93
6332A12n18j98J67M89N11J9m28n32k61J90N20L96J34l59m73m21J41M64N42J36
$$ y = [388, 610, 449, -13, -510, -651, -209, 318, 601, 465, -9, -444, -621, -275, 197, 570, 559, 59, -416, -636, -308, 221, 549, 577, 150, -379, -648, -392, 115, 563, 614, 191, -330, -643, -450, 27, 462, 607, 254, -246, -555, -484, -27, 478, 618, 275, -256, -645, -511, -71, 453, 596, 342, -170, -572, -534, -153, 429, 629, 396, -144, -578, -597, -230, 352, 624, 459, -12, -478, -589, -289, 214, 606, 481, -12, -469, -644, -294, 197, 586, 560, 58, -413, -639, -336, 205, 520, 551, 158, -396, -645, -434, 96, 583, 575, 246, -311, -616, -496, 57, 538, 586, 273, -222, -585, -527, -3, 478, 579, 324, -222, -607, -524, -130, 442, 630, 422, -96, -610, -563, -188, 394, 629, 430, -79, -515, -615, -261, 268, 600, 501, 50, -476, -586, -281, 255, 582, 541, -4, -420, -633, -335, 236, 636, 505, 112, -406, -604, -437, 52, 563, 582, 154, -378, -639, -449, 71, 467, 601, 242, -231, -652, -511, -47, 495, 631]
6352F31l07n36l33k2M73N34J76k58n65l53j4L86O02K15k02m53n72KL70N39L06
6373F19j60m55m84j20K53O32L35j11m70n05j93L09N79L31n3l61n47k59K23O27
6393A90L70K8l73o09k52K51N02M83J6l52o12k47J33M25N63J32l60n26l39J7M80
6414h0N36K22l65m61m18r5N13N54K55k26n33m58l3L77N79K94k10m79n23q0L22
6435c09O21L64j94m21n27k18L40N17L66Qm80n29k04K70M65N24Kl93n89k36J66
6456d57N29M85K0l50n44l66J37N39N18P4l15n31l27P2M36N56K24l88n75l51M4
6477e70M49N51J84k21m95n07O4L42N66L10j64n77m59n7L28N65K83j28m53m95j43
6498f27L26N84L55j23l91n77j75K53N40M68r1m22n35k19K01N61L72Q0l81n26k83
$$ y = [631, 324, -212, -545, -567, -94, 440, 616, 358, -207, -560, -574, -188, 414, 629, 427, -26, -598, -596, -226, 313, 619, 459, 4, -480, -600, -347, 285, 620, 509, 39, -466, -659, -350, 229, 560, 507, 146, -401, -660, -437, 190, 560, 588, 215, -394, -646, -395, 107, 590, 606, 254, -358, -605, -472, -47, 516, 648, 288, -238, -577, -560, -80, 456, 678, 313, -148, -566, -661, -148, 406, 661, 435, -98, -556, -589, -212, 367, 661, 451, -28, -551, -631, -309, 312, 676, 482, 61, -466, -684, -344, 173, 539, 547, 67, -462, -666, -396, 69, 593, 595, 202, -387, -623, -457, 72, 557, 577, 227, -317, -683, -546, -7, 511, 585, 270, -261, -588, -516, -80, 476, 700, 312, -263, -614, -570, -121, 430, 614, 393, -102, -609, -545, -203, 363, 673, 509, -68, -527, -584, -256, 309, 592, 464, 11, -484, -627, -301, 283, 638, 515, 124, -453, -628, -375, 165, 633, 542, 120, -415, -634, -433, 128, 500, 580, 199, -327, -610]
6519f10J60M64N21P0l24n57l53J32M41N13J40k49n16l78k7M84M80K21k31n26m10
6540e55l4M26M82K97j65n39m48rK63N37L27j23m14n22j04K72N13L36r3l75m90
6561d18j51K20M44M56Km04n22k59K52M46M17J11l92m75l32J13M34N58O2l11m74
6582b23l97J47M13M94J61k43n07m45O1M63M59K16k78m75l81m4M04N47K22j30n28
6603f4m16p8L04N55K75o9n23m54j59L07N61L14n7l97n26j52K23N14L52k1k55n86
6625c52k16Q7N75M17M2l27n88k35J25M77N07O0k11n83l25P1M54N01J03k46n21
6646a85l88R6L47N04K14k44m64l78k7M01M84K04j04n42m20kL28M42L03j40m36
6667gn00o5L14M69L68o1m24n44j56K85M75M17j5m26m96j95K02M61L90P1l55n06
$$ y = [-610, -450, 14, 535, 605, 281, -276, -629, -497, -56, 457, 597, 348, -168, -546, -573, -89, 391, 612, 381, -145, -555, -589, -163, 319, 616, 451, -88, -536, -545, -282, 255, 582, 459, 45, -477, -581, -309, 204, 540, 447, 72, -418, -569, -349, 95, 551, 553, 149, -373, -632, -380, 66, 483, 594, 202, -273, -605, -492, -58, 500, 562, 251, -223, -620, -473, -60, 434, 595, 352, -155, -600, -539, -76, 383, 599, 321, -154, -535, -579, -175, 372, 594, 464, -64, -480, -558, -254, 301, 576, 507, -16, -470, -629, -322, 239, 553, 496, 99, -427, -579, -356, 158, 510, 489, 234, -352, -568, -481, 94, 511, 553, 226, -362, -597, -472, 5, 512, 572, 361, -222, -547, -476, -22, 479, 582, 336, -185, -573, -477, -130, 374, 588, 344, -120, -498, -525, -124, 360, 564, 460, -82, -502, -504, -176, 266, 569, 429, -7, -507, -572, -258, 211, 579, 518, 94, -450, -606, -321, 154, 571, 556, 130, -366, -561, -359, 102, 492, 563, 208, -298]
6689b98l00J99M45M26J18m01m82k82J25M04M81J51l32m71l38O9M21M86J40k28
6709C33m63l99pM14M72K65k13n44l59rL29M75L11k05m41m80J8K43N12L28p5m75
6731C0m40j74K54N09L54k7l41m86k51K26M93L84ml83m95k79K24N07L74L5l25m74
6753b89k85J46M02M55J57l54m74k69jM95L81K04k14n59l14QM01N03J41j62m62
6774i0m20JL16N20L02k00m35m64j13L23N30K84j17l67m57j79K77N22L03m1l95
6795A00m71k07K10N11L64Jl33n24k12J97M11M93K9l37n45k04J53L57M53J56l24
6816B78m81l41J02L88M31J81k40m52m25M7M43L51K55j17m98m35LL33M83K94j81
6837D19m82l54p1K87M52K47m6m18m14j04J86M76L70p5m08m45j11J80M40M11m7
$$ y = [-298, -598, -399, 46, 472, 590, 189, -293, -575, -450, -46, 435, 586, 254, -217, -555, -486, -65, 421, 561, 333, -130, -529, -536, -122, 350, 615, 402, -142, -501, -510, -181, 294, 605, 400, -41, -521, -503, -260, 252, 580, 505, 30, -410, -584, -330, 179, 533, 506, 165, -321, -572, -346, 147, 531, 527, 144, -351, -630, -406, 101, 475, 510, 185, -289, -574, -428, -26, 429, 586, 232, -242, -511, -512, -17, 364, 568, 354, -205, -519, -511, -110, 393, 534, 372, -90, -510, -509, -193, 327, 629, 429, -6, -470, -583, -260, 270, 554, 437, 70, -387, -566, -289, 233, 536, 495, 100, -371, -578, -368, 143, 507, 508, 175, -349, -561, -364, 47, 540, 569, 232, -313, -517, -364, -7, 446, 602, 278, -203, -544, -442, -54, 377, 558, 318, -134, -559, -512, -69, 282, 537, 420, -78, -513, -510, -177, 306, 600, 419, -63, -417, -488, -201, 251, 498, 452, 34, -380, -484, -298, 178, 548, 473, 65, -380, -491, -311, 129, 540, 493]
6858D93l31m76k20J43M79M05J5l20m91k33J00M76M44N0k29n77j44J0L42M16K03
6879E55k14m93m01O2L96N04J32k31m61l42j1L46M46K98j84m54m37m6L31M70K49
6900E15j05m00l90j32K92M03L74r7l83m47j69K23N13L30k5l82m26j96J22M88L97
6921E05Jl83l92k60J51L94M06J22l42m17l49J26M10M26J77l01m44l62J3M31M19
6942C31K50k40m69l40L6L43L62K84j87m18m44lL94L88K55j36l72m49j06K35M65
6963A79L37j09l42m50j17J34N01L47Ql79m14j72K21L70L57n7k77l83k83J46M53
6984G0L64R6k93n05k38J11L84L86J16k17m49l50P0L72M22J84k22m51k91n0L95
7005i6M08K02j64m35l35j00M07L25L48j54m25l69q0K15M50L38r9l93m10j62K26
$$ y = [493, 162, -314, -534, -391, 88, 493, 508, 188, -303, -536, -436, 40, 484, 534, 305, -272, -416, -406, -64, 352, 555, 341, -152, -553, -491, -95, 409, 541, 310, -151, -493, -504, -158, 288, 586, 402, -52, -489, -535, -204, 266, 515, 410, 10, -380, -512, -220, 183, 557, 460, 77, -370, -539, -316, 197, 527, 502, 120, -306, -502, -380, 108, 505, 506, 123, -269, -529, -378, 16, 422, 544, 202, -215, -564, -438, -28, 398, 575, 274, -170, -532, -519, -88, 331, 581, 341, -128, -468, -432, -89, 273, 557, 370, -48, -492, -495, -101, 287, 542, 406, 34, -415, -521, -286, 179, 516, 407, 65, -385, -502, -368, 133, 480, 488, 109, -305, -477, -256, 114, 471, 414, 137, -246, -529, -383, 70, 434, 530, 237, -268, -506, -395, -11, 375, 491, 274, -175, -525, -455, -83, 339, 523, 301, -150, -441, -491, -96, 312, 514, 350, -85, -420, -520, -113, 212, 560, 406, -19, -388, -468, -253, 197, 535, 436, 43, -367, -529, -303]
7026c03M86K65K2l91l93k08K27L63L67N9l46l94k75J66L92L71J16l17m63k43P5
7047d24M14M34J63l57m23k56NM30K83J86j34m75k87q6L95M25K62k56l88k91p0
7068d50K98M47K24p0n18l27j07L11L94K53m1m24l96n2J96L88L99o8l75l79j54
7089d51J46M78K91O3l84l90k51J17M63L97l5k44m24k41P2M27K98J47k23m60k67
7110d71O4L93L80J24j47m75l48O3L16L79K19j35m40l57j2K83M53J96j57l46l95
7131d13r0K86M36K38p6l98l19j51J81M38L28K2m62l34j95K12M37L45l6l36m60
7152c47j21J61L90L39Jk54m04k58J54L55L46J20k80l77l31J25L77M05R1k68l53
7173a29l17K2L90L56J64k29l92k84m7L25M27J93j85m06k83l1K39M68K31j94k93
$$ y = [-303, 183, 448, 470, 79, -314, -522, -295, 68, 435, 494, 148, -246, -521, -355, 37, 408, 524, 207, -256, -499, -424, -10, 424, 587, 230, -193, -449, -444, -14, 269, 455, 321, -154, -441, -527, -132, 293, 555, 299, -89, -380, -450, -152, 295, 519, 449, -69, -396, -503, -192, 202, 455, 414, -10, -406, -458, -262, 126, 525, 457, 82, -297, -451, -305, 173, 464, 527, 143, -247, -498, -381, 82, 479, 444, 200, -224, -465, -393, 34, 332, 479, 256, -204, -471, -407, -14, 366, 490, 343, -132, -480, -417, -101, 278, 497, 362, -78, -435, -447, -164, 289, 485, 328, -18, -413, -503, -217, 219, 457, 381, -17, -336, -487, -306, 132, 460, 482, 20, -314, -509, -297, 140, 485, 449, 113, -347, -468, -307, 83, 422, 423, 169, -235, -493, -339, 16, 362, 482, 202, -175, -506, -381, -4, 401, 492, 224, -129, -446, -424, -34, 322, 486, 257, -135, -419, -466, -141, 286, 479, 294, -112, -395, -426, -187, 281, 512, 318, 25]
7194B5m14o3K63L76L27j31l40m15j00K25M45K53jl78l42k05J79L93L23O8l40l88
7216b40k57J50L76L87J5j96m80j97J8M53L26N9k05l80k75LM51K91J49j90m07k68
7238d17K3K87L52K65k65k88l65pK69L38K49j23l98l20m7J90M51K53q0l57l65j10
7260d65K33L77K79l1l30l13j92J83L29L15M2l22l25k41J59L32L60P7l15l63k71
7281d82J26M18L29N0k58l27l29P9L64L64J13j61m95k13N1L37L38J55j47l84k95
7302c67n5K60L96J68m3l81l03p5K42L32L23j62l47l31j26K72M14K21n8l28l65
7323c13j19J88L51K79j2k73l67j83K07L14K34P5k16m05j94J16L32L72J1k16l93
7344b12k42J29K77L80J08k10l98k18P9K61L42J32k05l25k97K2K60M03J49j71l06
$$ y = [25, -389, -452, -189, 187, 514, 383, 43, -372, -472, -247, 198, 451, 450, 72, -270, -475, -296, 97, 420, 488, 148, -240, -497, -347, 29, 416, 431, 235, -245, -442, -424, 29, 355, 414, 209, -171, -446, -443, 8, 299, 448, 258, -149, -417, -394, -107, 245, 510, 245, -43, -408, -415, -146, 192, 441, 318, -80, -400, -447, -257, 194, 447, 367, 10, -355, -465, -232, 145, 424, 393, 63, -250, -442, -259, 70, 385, 427, 105, -220, -461, -302, 30, 390, 467, 152, -211, -482, -356, 62, 391, 441, 183, -144, -473, -394, -30, 334, 447, 286, -209, -422, -371, -34, 304, 459, 312, -72, -367, -422, -162, 234, 402, 359, -22, -325, -400, -158, 174, 497, 335, -12, -343, -469, -197, 217, 438, 380, 52, -313, -432, -244, 107, 386, 374, 101, -266, -449, -242, 72, 306, 381, 165, -240, -434, -318, 14, 386, 397, 181, -212, -454, -325, -48, 332, 440, 230, -168, -386, -307, -46, 296, 428, 223, -102, -399, -377, -117, 286, 435, 264, -42]
7365d2l03n0J74M74K43j52l97k60m7J97L83J54rl50l51j17K13L45K47P1l08m00
7387b85j45J65L61K05Q8k57l80k17J74L32K64P8k60k69k83J04L28L12P3j91l57
7408a60k15J7L44L35Q4j67l84k57oL66L07J56j41l77k56mK16L91J30o8k89l35
7430c13q7K57L60J66m0k94l51j07K65L34J81K0l02l57j34J31L83K13L8k36l38
7451b11j91J14L38L15%k38k82j79M5K72K88P8p8m88j33L8K67K72J72j57l55k31
7473c44N2J75L23K32j88k45m02K2K39L36J95j14l65k30o6J57L91J94l6k96l02
7494b72r9J39L06L01n6k83k92q3J51K70K89J9k75l09j55J00L23K25M2k09k93k18
7516c79R1K59L26M9j82k63k44RK99K84Q9j26k59k63K4K16L50J15j35l00k75NJ79
$$ y = [-42, -345, -395, -221, 253, 496, 344, -53, -313, -360, -163, 220, 374, 365, 15, -336, -453, -240, 105, 352, 423, 115, -285, -430, -265, 96, 301, 389, 132, -248, -465, -291, 41, 305, 383, 123, -146, -429, -325, 3, 315, 388, 197, -160, -375, -358, -14, 321, 405, 238, -146, -403, -409, -43, 264, 420, 279, -98, -354, -358, -142, 249, 379, 311, 22, -313, -400, -143, 217, 383, 343, 49, -302, -409, -144, 190, 371, 391, 89, -268, -402, -271, 112, 325, 363, 127, -211, -402, -288, 50, 365, 365, 127, -155, -334, -289, -17, 271, 349, 271, -217, -350, -312, -45, 227, 399, 242, -113, -344, -292, -117, 206, 438, 250, 5, -397, -375, -136, 200, 395, 281, -84, -314, -380, -223, 168, 362, 326, 30, -272, -371, -232, 74, 375, 319, 36, -256, -339, -188, 82, 371, 390, 115, -194, -349, -249, 74, 299, 341, 132, -161, -379, -288, -29, 297, 346, 164, -99, -343, -334, -35, 249, 338, 212, -47, -310, -286, -70, 280, 395, 260, -40, -315, -310, -131]
7539a31K89K09j14k59k78o8J71L20K27q6k92k11j42J78L48J39L3k37k86j44Q8
7560b46L09K89j4k74k46r3l8L10L33L9k23l22j96J27K83K33P1j72k85k47O9K30
7582f3L02J32j29l17k06mJ82L26J33j19k55k95m3K52K79J76r7k50k94p1K13K71
7604A23K34j12k48k55j04J49K58K89mk76l04p9J57K56J92N3k07k69j84P2K84K35
7626B60R4k23k65j59N0K02K97J12k59k42k00M0K63K46R5j30l18j93J5K35K17K43
7648C80j69k62k36o8K55K89J35j21k00k52j13K49K40K14q5k36k79m5J60K49J93
7669B98q5j87k60n0O5L24J66L4k15l20q5L7K69K65j4j53k47j22NK54K17R8j23
7692A71k64j97K2K01L13J12k25k12j96K1J61L68O8j33k82k09jJ67L05R1n6k70
$$ y = [-131, 158, 367, 253, -6, -284, -352, -181, 139, 366, 280, -12, -223, -365, -187, 161, 300, 333, 96, -190, -334, -246, 63, 352, 338, 64, -182, -275, -313, -3, 330, 369, 146, -176, -372, -245, 38, 271, 342, 170, -115, -362, -293, -63, 239, 371, 242, -75, -281, -285, -103, 223, 356, 237, -18, -313, -356, -104, 175, 351, 254, 4, -290, -361, -148, 123, 357, 245, -3, -258, -362, -213, 45, 334, 330, 54, -250, -329, -172, 84, 276, 329, 122, -147, -331, -259, 25, 260, 354, 131, -134, -293, -243, -41, 256, 368, 109, -133, -333, -293, -30, 216, 311, 181, -137, -330, -315, -80, 137, 380, 211, -51, -287, -355, -100, 189, 324, 203, 3, -249, -362, -113, 127, 341, 256, 20, -259, -304, -144, 105, 298, 213, 26, -234, -284, -219, 105, 271, 305, 90, -230, -315, -278, -9, 256, 242, 89, -158, -280, -275, -21, 196, 294, 171, -93, -290, -268, -67, 246, 358, 133, -79, -275, -254, -93, 275, 343, 210, -72, -281, -282, -115, 190, 281, 225, -45]
7714d5k48l0J92K52J56m0k33j86j59J48L18J72j3k39k66j59K59K16J46L9j65k45
7736a30j88Q1L01J98L3k08k07j32J4J92L33M3j88k58j39J9J57L04J09k09k43j41
7758b59kJ54K27K50j77j64k11j25K33K87R0m1k23k90p5K19K28J46q2j34k40r2
7780b81J36K45K43j01j96k45j00Q4K49K50n7j62k31j04N3K07K72N4k12k39j15
7801b50O5K04K29L5j61k08k10OK90J74J09j42k16j90K4J46K29J86j38k59j96j3
7823b86J50K83J31o8k40j64r0J73K11J88q9k01k09p3J02K48J36O7k06k46o3J4
7845b32K44K45lj52k49j18K6K99J49O2j96j78j65N9K01J90M9r6k87j13L6J68K29
7868A68N3j6k65k33OK45J95J28r3j95j96n3J48K24J49q2k02j88rN4L11J21o6j86
$$ y = [-45, -293, -323, -131, 121, 277, 237, 4, -182, -341, -193, 125, 297, 284, 45, -221, -380, -121, 95, 241, 280, 115, -130, -318, -237, 64, 262, 295, 87, -120, -252, -238, -46, 287, 330, 142, -116, -255, -236, -79, 225, 334, 125, -118, -259, -261, -107, 120, 370, 193, 29, -182, -307, -74, 213, 303, 262, 39, -251, -326, -107, 121, 267, 185, 51, -189, -281, -145, 100, 343, 242, 46, -199, -299, -215, 34, 284, 227, 65, -166, -270, -217, -10, 262, 316, 104, -135, -250, -185, 19, 248, 283, 122, -86, -296, -290, 0, 174, 283, 141, -75, -265, -241, -95, 134, 320, 182, -77, -273, -286, -136, 147, 278, 210, -30, -194, -284, -111, 100, 288, 199, -2, -211, -284, -182, 66, 202, 269, 63, -183, -246, -232, 12, 257, 254, 102, -147, -265, -239, 60, 209, 271, 75, -103, -268, -209, -8, 182, 231, 135, -152, -265, -229, -61, 168, 221, 205, -60, -293, -287, -42, 153, 281, 188, -7, -203, -256, -108, 116, 265, 183, -19, -207, -216, -162, 149, 270, 204, 18]
7892A8k15m2J35J51J87L6k35k01o7J36J37K77q3j85k02m8K2K93R8P7j37k80q5
7915b13k6K33K09N4j15k22j63L6J91J87Q1j17k08j49k4J89K02J55j43j77j76n1
7937b47J39K00J31k3j50k24n1P9K21K12n3k47j43r1J39J78J84k8j87j76o4L7K08
7960D4K09l1q9k71j75J30K03J75N2j39k36j33j8K81J97O8j38k65p0j2K22J89O6
7983B59j05k69j27J2J70J93J15k6k42j57q9J48K49Q2kj50k38o6J37J88K27j27
8005A82j57k20qM7K11J48N6j74k78m0O9K59J13J8j63j69j02O1J68K01J2j32j79
8028g7j88P5J76K26Q7j34k54j07j1J14J95J27m9j83k07J9J44J68J08l2k00k03
8050b06o4J64K59R1o6k09j36o6J03K27J41Pj39l01r3K11J78J55m0j59j90j58J26
$$ y = [18, -197, -239, -104, 47, 234, 270, 35, -166, -233, -97, 40, 317, 234, 49, -153, -201, -179, 114, 212, 289, 152, -128, -213, -239, -6, 203, 257, 142, -80, -243, -207, -16, 171, 252, 135, -73, -222, -246, -57, 145, 300, 157, -20, -196, -247, -108, 92, 223, 200, 50, -174, -225, -146, 75, 287, 234, -13, -156, -247, -108, 70, 254, 226, 39, -137, -201, -164, 44, 253, 222, 133, -138, -313, -183, 20, 195, 247, 108, -128, -261, -279, 2, 199, 267, 129, -136, -206, -218, 4, 193, 259, 154, -115, -242, -230, -60, 133, 248, 222, -20, -177, -266, -118, 131, 213, 211, 61, -177, -243, -106, 82, 309, 182, 25, -195, -203, -156, 55, 203, 259, 85, -193, -233, -164, 95, 208, 226, 63, -106, -208, -147, 21, 222, 234, 102, -77, -265, -190, -14, 212, 299, 165, -89, -196, -207, -93, 102, 229, 180, -3, -210, -191, -47, 121, 229, 197, -3, -206, -270, -106, 153, 244, 178, -31, -167, -233, -130, 97, 238, 245, 106, -195, -288, -77, 101, 256, 216, 57, -133, -291, -165]
8073a65K04J44N7k12j28j42P2K01J76k3j05j34k38J24J05K11J37j34j65k46P1
8094a90J51J90J04q6j72k18J2J40J60J46kk65j55J1P0J79J70p0j99j45o7J14J70
8117D8J91j6k89j47o8J16K29J47L0j74k21m9K4J68K10K0j08j69j95O1J84K01j
8140A92r7j36j94M7J71J93PQk19j35o4J82K09N2j01j63j18l5J41J87J55o9k50
8163c7j08j01J29J76J67n7j70j70q5J69J42J63pj55k15Jl3J93J78J4j32j90p3
8186b01NK35J05R4j68
$$ y = [-165, 39, 183, 240, 28, -100, -242, -170, 31, 207, 184, 79, -55, -293, -169, -64, 147, 284, 150, -15, -261, -190, -39, 151, 255, 169, -3, -221, -209, -69, 91, 237, 235, -30, -185, -174, -104, 75, 245, 175, -24, -169, -236, -122, 48, 239, 223, -66, -213, -281, -165, 64, 211, 241, 67, -154, -203, -179, -11, 199, 219, 111, -58, -253, -192, -8, 193, 192, 95, -41, -235, -188, -17, 176, 183, 191, -28, -163, -227, -45, 164, 216, 115, -48, -166, -201, -60, 127, 282, 213, -37, -145, -246, -117, 59, 226, 169, -1, -171, -256, -87, 55, 218, 211, 56, -159, -158, -191, 2, 180, 194, 62, -128, -201, -196, 39, 144, 238, 70]
8191G0
$$ Imaginary data points
##PAGE= N=2
##DATA TABLE= (X++(I..I)), XYDATA
0@%%%%%%%%%%%%%%%%%KkPj5J6j6J6j6K1k7L0l3L6m2N0n6O3p1P8q8J00j10J22j37
41g2J51j68J85k05K28k48K73l03L33l66M04m46M94n46O03o71P49q40R51j083J249
62F72j465J751k154K758l774N791j1280N5066K16585K4744j78981k58079j47040
75b95406O8346K38915K26912N3588j56918k51854j66672M4427K18535K30972P6510
86B87355j30279k44768j78253J7982J97440K30625R9534j04668k31777j87650
96b44459p296J73908K29178J18241p9053k16632j93623l2442J50564K23996J33658
107B56040n4168j99138j98198n5193J27354K16376J45986k9382j80384k00154
117a70861p5237J04729K06323J56138n348j61088j99873r2443Q1968J93785J64117
$$ y = [0, 0, 0, 0, 0, 0, 0, 0, 0, 0, 0, 0, 0, 0, 0, 0, 0, 0, 2, 0, 7, -8, 8, -8, 8, -8, 13, -14, 16, -17, 19, -23, 27, -29, 34, -37, 41, -47, 53, -57, 65, -72, 79, -89, 96, -109, 119, -129, 144, -159, 174, -192, 212, -234, 260, -286, 317, -354, 395, -445, 506, -577, 672, -793, 958, -1196, 1562, -2212, 3579, -7701, 47365, 263950, 288694, 109713, -148366, -295406, -227060, 11855, 238767, 292355, 135437, -116417, -283089, -238662, -20127, 210845, 287355, 157076, -87692, -265945, -247963, -50523, 180102, 279636, 174968, -56809, -244459, -251755, -77847, 151331, 269572, 190519, -26113, -219736, -252178, -101614, 122382, 256040, 201872, 2734, -195464, -250657, -123303, 93073, 239059, 209677, 29293, -170861, -246098, -141369, 64954, 221092, 215744, 54656, -145217, -237660, -155692, 38093, 202210]
128B02210J7187j41894j97075j07533N8754J79558J70042L7559j22601j91788
138i5581j20436L6298J64870J73801N5733j02437j83723j31027J5065J49739J75178
149A37480P2273q1748j74090j39890m790J33787J73874Q6842o1454j63446j46867
160a68029k3372J16637J70053R9525m1732j51953j51592m0497R9013J64526J10631
171A83210k2641j39202j53681n6038Q0932J57810J20183m354j25357j53630p0248
182a83016O3063J49629J27444J2454j10522j51952q2993M5402J39975J32456K8351
193A70291r5298j48687r4034K8470J29425J35484M3186p9501j43688j03166J2159
204a45359J17727J36991N6939o3904j37375j10387l589J05134J36678O8790m8559
$$ y = [202210, 219397, 77503, -119572, -227105, -168351, 11207, 181249, 218808, 96207, -95581, -216017, -179719, -14849, 158952, 214685, 112248, -71475, -202502, -187437, -37698, 137480, 209753, 128005, -46085, -185975, -190765, -56978, 116896, 203738, 142284, -21162, -168029, -191401, -74764, 95289, 194814, 153082, 1129, -150463, -190960, -91947, 72579, 183210, 160569, 21367, -132314, -188352, -107420, 50390, 170573, 166219, 40862, -112768, -183016, -119953, 29676, 157120, 169574, 59052, -92900, -175893, -130491, 9484, 141940, 170291, 74993, -73694, -167728, -139258, -9833, 125651, 168837, 89336, -54352, -157518, -145359, -27632, 109359, 166298, 102394, -34981, -145368, -148957, -43823, 92855, 161645, 113086]
215A13086j29697j16201j8545R1940J34758P9072l3381j20956j20342l2357P8641
226g3982J31309Q8230j8519j11190j22698m4684O5294J26655R5940m011j00705
237C1639j23453n5996N1477J20738J02221R633q9800j22817o6355L7579J13627
248H493J07027K2239p8291j20594p5611K3877J05917J10235L3989o5934j17055
259d5708q3667J0594R7133J11988M5233n3207j12683r0399j890Q7507J12020N5524
271A32445m0556j07453r5604j3767P6950J10826O4928k8246j01041r9176k5216
282a25910O5802J08886P3260j6316r3435j01240l6099N4519J05933P9956m723
293A10633q4673j02243m6447M3146J01672Q5151O794p5365j02331n5875L1889
$$ y = [113086, -16611, -132812, -151357, -59417, 75341, 154413, 121032, 76, -120266, -152623, -73982, 57327, 145557, 127038, 15848, -106850, -151534, -86240, 40415, 136355, 132344, 31639, -91814, -147810, -96333, 24405, 126626, 136259, 46459, -76358, -142713, -105134, 8493, 115520, 137759, 59468, -61126, -136737, -112860, -6943, 103292, 137281, 71347, -45708, -129375, -118781, -21648, 90340, 135573, 82366, -30317, -120716, -122606, -35099, 76921, 132445, 91889, -15564, -111168, -124935, -47985, 62841, 127769, 99523, -1518, -100694, -125910, -60108, 48778, 122038, 105722, 12287, -88953, -125052, -70533, 35400, 115356, 110633, 25960, -76283, -122730, -79584, 22088, 107239, 114033, 38668, -63663, -119538, -87649]
304h7649R6136Q9045J7836o5406j01487o3858K0913Q9470R1847K8621n5265r9510
316c9307p0369J0111Q1844R3848L8512m5295r5963p5684q47P3580R4787M7362
328A12579l5269r1324q0048j1594O4929R4662N4942k5055q5482q3560k1858N6119
340e0959R3195O1577j4561p8784q6248l1221M7157R0460O7130m051p1779q7749
352f5833l9609L7925Q6363P1959O093o4586q8093m6904K8329Q1529P5907J5487
364I8567n6840q7144n3359J8418P6179P9070K4235m8714q4891n9160Q652P0362
376a4625Q1095L1981l9970q1659o4443p84O3875Q1731L9316l0703p7927o9008
388h1121r692N7022Q0995M6206k1490p3528p2350j7933M9150P9613N2414j2264
$$ y = [-87649, 8487, 97532, 115368, 49962, -51525, -115383, -94470, -5000, 86847, 115468, 60203, -39307, -109676, -99565, -17721, 76127, 114639, 69344, -26619, -102303, -103150, -29570, 65217, 112579, 77310, -14014, -94062, -105656, -40727, 53935, 108877, 83822, -1660, -85220, -107078, -50959, 42236, 103813, 89252, 10468, -75780, -107001, -59844, 30616, 97746, 93695, 21916, -65833, -105442, -67517, 18846, 90805, 96898, 32312, -55781, -102685, -74356, 7173, 83080, 98567, 41727, -45417, -98776, -80358, -4179, 74891, 99126, 50412, -34479, -93639, -84987, -14625, 66470, 98451, 58481, -23178, -87621, -88405, -24530, 57201, 96517, 65814, -12113, -81121, -90813, -33791, 47204, 93410, 71920, -1608, -73958, -91891, -42741, 36872, 89286, 77022]
400G7022o8521p4494k5742M0904P7355N8041l593o2795p5461l3233L2431P4450
412A6364O2572M788n6299p5531m0223K3926P0819O5998J2707m9079p4803m6563
424h5324J5660O6460O8357K0417m1525p3365n1956P499O1307O9787K7900l4061
436E1156p1129n6465k88N5423P0480L4606k6414o8190n9996q056M9105P0272M0782
449H1286j8695o4376o2593j5636M2429O9575M6021j1223n9706o4542k2662L5642
461d4480O7865N0584l655n4644o5716k9172K8667O5430N4216L747m9155o6222
473d2535l4933K1584O2184N7234J0871m3354o5794m0253J4620N8374N9585J7385
485G4968l7151o4599m4821P496N4048O1185K3682l0887o2702m8735N38M9392O1850
$$ y = [77022, 8501, -65993, -91735, -50831, 26524, 84565, 80972, 18177, -57284, -90517, -58086, 16364, 78936, 83724, 27425, -48106, -88329, -64403, 6416, 72414, 85121, 36042, -38761, -85324, -69664, -3204, 65153, 85570, 44045, -29320, -81276, -73777, -12470, 57317, 85217, 51156, -19973, -76438, -76726, -21303, 49177, 83783, 57369, -10821, -70817, -78873, -29768, 40504, 81286, 62591, -1785, -64378, -80014, -37585, 31990, 78011, 66788, 7082, -57460, -80122, -44480, 23385, 73969, 70314, 15670, -50046, -79218, -50551, 14879, 69095, 72842, 23687, -42535, -77468, -55884, 6300, 63534, 74405, 31051, -34743, -74996, -60376, -2002, 57583, 74968, 37817, -26782, -71603, -64107, -10059, 51126, 74808, 43921, -18781, -67516, -66978, -17586, 44264]
498D4264K9438k4283o0143n2126o133M4122O1937L4787j7694n7032n4713j2611
510g0187L8604O1326L9510j1108n3404n6598j8586L2672O0058M3683m586m9248
522A2136n7652k4411K6533N8159M7254J794m4531n8277k9778K0419N5691M9977
534E7314P971l9408n8067l4678J4381N2507N2011J4163l4163n7392l8771Q226
546e5906M8794N3589J9825k8667n6091m2262K188M4542N4561K5097k3082n3943
558a1355m5308l980M0088N5063K9734j7385n1198m7741r934L5348N4782L3922
570F2036j1534m7823m9763j5572L0449N3777L7530n435m4280n1193k0644K5307
582c7145N1957M0799N12m0463n1973k5076J9809M9565M3784O093l6272n1888k9316
$$ y = [44264, 73702, 49419, -10724, -62850, -68983, -24861, 37076, 71863, 54169, -2863, -57576, -70187, -31583, 29743, 69253, 58145, 4741, -51857, -70443, -37771, 22287, 65970, 61384, 12136, -45516, -69927, -43394, 14765, 62019, 63813, 19282, -38995, -68773, -48354, 7337, 57314, 65285, 25877, -32190, -66868, -52487, 20, 52031, 66194, 32031, -25361, -64132, -55906, -7112, 46477, 66302, 37635, -18456, -60718, -58530, -13988, 40573, 65670, 42588, -11355, -56663, -60643, -20555, 34508, 64242, 46857, -4341, -52082, -62016, -26668, 28114, 62036, 50502, 2679, -47084, -62656, -32207, 21570, 59100, 53665, 9385, -41808, -62452, -37145, 14812, 55611, 56123, 15660, -36313, -61389, -41580, 7985, 51769, 57862, 21590, -30298, -59614]
595e9614J3987M6932M6067J1381l1643n1154l3222Q276M3798M7809J6330k6762
607C2185m9671l6936K651M0492M8599K1045k1446m7924l9999k811L6668M8822
619C1675K5421j5998m5753m2493p859L2330M8350K9647j0548m3306m4209j2737
631e5480K7589M7521L3320n323m0140m5266j7570K2648M6234L6514k24l6718m5699
644c2594k1980J7591M4652L8992M608l2620m5816k6142J2688M2453M0808R453
656E2093k8260m5492k9853P984L9831M1897J4153k3857m4696l2809L176L6483
668i350M2897J8584j9400m3406l5333j510L2805M3402K2585j4976m1431l7280
680d2413o388K9001M3447K6173j0373l9043l8964j0937K5087M2826K9328n743
$$ y = [-59614, -45627, 1305, 47372, 58753, 27110, -24044, -57266, -48990, -5192, 42617, 58947, 32185, -17486, -54422, -51771, -11279, 37320, 58365, 36919, -11005, -51004, -53815, -17147, 31675, 57096, 41098, -4655, -47148, -55007, -22677, 25673, 55320, 44772, 1466, -42743, -55480, -27891, 19630, 52950, 47627, 7487, -37779, -55349, -32701, 13533, 50047, 49823, 13105, -32594, -54574, -36983, 7669, 46661, 51269, 18649, -27167, -53309, -40621, 1832, 42640, 52093, 23833, -21659, -51512, -43528, -3697, 38200, 52353, 28496, -16200, -49009, -45833, -9350, 33547, 52131, 32731, -10675, -46008, -47518, -14713, 28689, 51274, 36298, -5133, -42413, -48801, -19800, 23647, 49820, 39447, 404, -38560, -49497, -24410, 18416, 47744, 42001]
692D2001l6082m0211j5374K0933M1895L1936r53l2913m0983j9357J6643M0288
704G823L4171L675k9427m1341k2849J2223L8141L6103Q200k5930m1047k6037P776
717c8519L5616L7686J2332k2148m0173k8944L293L2867L8728J6195j8203l8779
729a0049l1438j232K9943L9147J9820j3964l7247l3455n455K6641L9071K3038
741D4820r620l5172l5097r536K3080L8607K6032n364l2852l6273j3303J9277L7653
754A2252K8619j171l0157l6922j6959J5436L6348L0819K907k7142l7213k0200
766d3383J1393L4696L2579O837k3945l7029k3179P485L2555L3928J0582k0452
778B2067l6436k5861L557L0108L4911J4144j6859l5499k8159l91K7549L5426J7422
$$ y = [42001, 5919, -34292, -49666, -28733, 13162, 45098, 44145, 11232, -29751, -49108, -32465, 7823, 41994, 45669, 16242, -25099, -47948, -35725, 2416, 38519, 46719, 20789, -20258, -46295, -38519, -2903, 34783, 47115, 24967, -15206, -44150, -40857, -7990, 30738, 46933, 28730, -10049, -41487, -42719, -12776, 26371, 46191, 32227, -5020, -38475, -43930, -17289, 21782, 44820, 35200, 28, -35069, -44605, -21525, 17082, 43114, 37750, 4898, -31375, -44678, -25401, 12252, 40871, 39700, 9543, -27379, -44338, -28902, 7446, 38265, 41172, 14030, -23183, -43383, -31990, 2706, 35285, 42122, 18177, -18852, -42031, -34546, -1991, 31937, 42519, 22067, -14369, -40230, -36673, -6565, 28346, 42490, 25631, -9868, -38027, -38418, -10869, 24557, 41979]
791D1979j3242l4037l0011m356K4574L5579K0430r378l2256l1626q112K1570L5124
804A6238K3138n464l0127l2881j1650J8277L4337K5590j528k7817l3595j4921
816d0403J4604L3140K7845K185k5127l3990j7925J0899L1696K9642N795k2262
828A6099l3763k0823P083K9988L1019R236j9098l3230k3411L390K7852L1961J2516
841C8819j5640l2394k5779j55K5561L2330J5685j2225l1181k7700l649K2886L2343
854A8901J8684q753k9724k9110p050J9971L2116K1273n149k8034l0108j0349J6763
867b0569L1600K3695j797k5840l0750j3499J3456L0734K5676J630k3414l1026
879b0104j6530J0107K9619K7183M987k0579l1108j9319O941K7956K8299Q276j7528
$$ y = [41979, 28737, -5300, -35311, -39667, -15093, 20486, 40916, 31538, -718, -32344, -40456, -18886, 16238, 39376, 33912, 3785, -29096, -40746, -22469, 11868, 37458, 35930, 8113, -25482, -40403, -25799, 7341, 35186, 37371, 12244, -21746, -39671, -28772, 2924, 32566, 38361, 16099, -17664, -38487, -31404, -1416, 29603, 38839, 19741, -13489, -36900, -33510, -5658, 26303, 38819, 23179, -9215, -34994, -35149, -9588, 22742, 38427, 26202, -4979, -32679, -36328, -13442, 18901, 37585, 28832, -892, -30002, -37052, -17081, 15035, 36308, 31159, 3125, -26983, -37332, -20569, 11031, 34726, 32929, 7089, -23661, -37160, -23704, 7030, 32706, 34336, 10922, -20104, -36634, -26527, 3092, 30275, 35262, 14683, -16425, -35744, -28803, -847, 27452, 35728, 18200]
892A8200l0981k1547L583K5943K9172J1581j4639l0264k3592K01K3702K9809J4557
905C5725j1699k9142k5224l082K1067L0153J7191q503k7718k6583o482J8553L0030
918A4286J9580n352k5832k7793r646J5862K9585K1617k006k3854k8633j2520J3012
931b1694K8703K3299J388k1607k9167j5057R895K7360K5061M596j9350k9138j7549
944c3260O782K5827K6317P743j6910k8757j9712L516K4209K7316J0460j4197k8010
957h676k1682L94K2261K7906J2955j1218k7038k3336k683K0139K8105J5424q219
970B4332k5865k4771n579J7842K7865J7693n135k4373k5901q335J5230K7320J9903
983C0226k140k2757k6463j1052J2471K6721K1619Q03k0847k6838j3514R620K5675
$$ y = [18200, -12781, -34328, -30745, -4802, 24370, 35951, 21312, -8952, -32544, -32343, -8641, 21168, 35725, 24026, -5116, -30340, -33422, -12355, 17798, 34989, 26486, -1232, -27815, -34297, -15744, 14286, 33866, 28514, 2682, -25111, -34757, -18895, 10690, 32307, 30301, 6447, -22186, -34706, -21694, 7009, 30308, 31696, 10089, -19078, -34135, -24240, 3120, 28181, 32777, 13427, -15711, -33260, -26478, -651, 25666, 33409, 16499, -12258, -31970, -28454, -4245, 23071, 33531, 19334, -8676, -30358, -29964, -7703, 20203, 33158, 21940, -5098, -28434, -31117, -10978, 17127, 32551, 24332, -1533, -26304, -31883, -14041, 13824, 31517, 26382, 2009, -23892, -32227, -16997, 10323, 30226, 28086, 5329, -21134, -32186, -19715, 7006, 28625, 29428, 8581, -18257, -31771, -22151, 3524]
996C524K3208L597j8572k6878j5909O696K4463K4379O346j6137k6667j8047L844
1009b6153K2981K5157R080j3603k6259j9829J078K1190K5697J1589j0963k5457
1021e492k1447j696J9098K6027J3979q376k4366k2693m474J6980K5990J6097n608
1034B4019k3062k3663p114J4603K5666J8034k816k1482k4418r713J2182K5103
1046G339J9647j6j9677k4948j2020R583K4212K1094K734j7671k5082j4193O930
1059b2068K3041K2239N291j5494k4913j6202M302K1667K3174P769j3258k4469
1071h921j7937J595K0109K3743J0185j0829k3806j9562r12J8324K4005J2352q348
1084A9998k2826k0785l483J6364K3979J4434n756k1823k1755n932J4105K3890
$$ y = [3524, 26732, 30329, 11757, -15121, -31030, -24334, 129, 24508, 30854, 14717, -11950, -29997, -26153, -3172, 21985, 31065, 17462, -8797, -28626, -27548, -6358, 19339, 30928, 19965, -5492, -26939, -28635, -9537, 16490, 30469, 22093, -2273, -24966, -29440, -12460, 13530, 29627, 24019, 957, -22706, -29820, -15217, 10449, 28483, 25667, 4185, -20233, -29946, -17764, 7339, 26986, 26970, 7293, -17655, -29675, -20092, 4120, 25214, 27948, 10277, -14805, -28998, -22068, 973, 23212, 28503, 13009, -11904, -28106, -23804, -2137, 21037, 28806, 15548, -8921, -26858, -25263, -5154, 18589, 28774, 17945, -5861, -25423, -26335, -8011, 15994, 28346, 19998, -2828, -23613, -27096, -10732, 13247, 27681, 21925, 102, -21653, -27585, -13480, 10410]
1096A0410J6317l286k0368k2437q370J1888K3376J7890p29j8711k2921j0680R485
1109a8136K2781J9256J768j6908k3145j2763P154K1749K0310M254j4855k3186
1121a1721j4713M798K0392K1232O770j2831k2989j6247K240J9016K1826R039j0720
1134A6092k2377j7729j17J7280K2346J1064q428k1482j9012k680J5497K2497J2987
1147B5938o149k0314j9942n156J3686K2321J4635l602j9143k0791p366J1688K1959
1160G764J6111j095j7820k1320r398R596K1116J7548J184j6174k1637j1214P266
1173a8073K0230J8838L434j4528k1523j3013M879J9289J9656N561j2597k1235
1185i082j4657K621J7995K0393P609j0561k0741j6173K73J6736K0663R588q390
$$ y = [10410, 26727, 23441, 3073, -19364, -27734, -15846, 7530, 25420, 24691, 5980, -16941, -27621, -18136, 4645, 23901, 25669, 8761, -14384, -27147, -19993, 1756, 22066, 26320, 11465, -11721, -26434, -21636, -1244, 19988, 26758, 13927, -9062, -25309, -23069, -4053, 17773, 26812, 16092, -6285, -24014, -24131, -6851, 15495, 26559, 18131, -3351, -22363, -25043, -9546, 12951, 25938, 19789, -525, -20467, -25623, -11937, 10384, 25019, 21417, 2274, -18517, -25883, -14195, 7764, 23875, 22780, 4960, -16360, -25758, -16162, 4954, 22502, 23686, 7512, -14125, -25339, -18073, 2157, 20995, 24429, 9901, -11622, -24635, -19756, -467, 19189, 24750, 12153, -9082, -23739, -21118, -3123, 17270, 24879, 14318, -6423, -22596, -22323, -5587, 15076, 24664, 16274]
1198A6274k0138j7441j844J5042K0842J1456o142j9274j8433l935J3245K0613
1210A0265J3259l844j8327j9171o093J1320K0352J4786j723j6978j9595q202R274
1223a4677J9914J6142M60j5428j9968j0084P101J9234J7136K667j3742j9990j1973
1236b3208N109J8251J8052M713j1923j9905j3510L011J7124J8609O694r961j9613
1249f557j4722Q29J5729J9082Q603q043j9080j5818j267J4188J9262J0434o175
1262A6465j8157j6785l370J2633J9252J2032m239j7160j7554n331J0956J9091
1274G833J3345k171j5999j8050p232R152J8641J4513n7j4649j8490q909P306J8018
1288C251J5529J928j3186j8691j0431N337J7141J6525L734j1637j8551j1900L448
$$ y = [16274, -3864, -21305, -23149, -8107, 12735, 24191, 18049, -1225, -19658, -23593, -10348, 10265, 23524, 19680, 1353, -17818, -23911, -12591, 7761, 22547, 20824, 3846, -15749, -23951, -14677, 5237, 21379, 21839, 6411, -13557, -23641, -16540, 2694, 19830, 22497, 8755, -11235, -23208, -18099, 152, 18204, 22917, 10994, -8911, -22421, -19410, -2286, 16323, 23017, 13056, -6557, -21279, -20450, -4721, 14361, 22964, 14921, -4159, -19977, -21244, -7056, 12206, 22640, 16465, -1692, -18477, -21847, -9214, 10038, 22070, 17831, 671, -16883, -22214, -11258, 7833, 21178, 19007, 3008, -15042, -22274, -13122, 5519, 20032, 19975, 5326, -13164, -22073, -14767, 3251, 18780, 20708, 7522, -11169, -21600, -16263, 878, 17403, 21137, 9500, -9051, -20951, -17503]
1301a7503J6128J7169N609r950j8267j3283J525J4900J7572P499q311j7623j4356
1314a8891o35J3632J7909R105o360j6999j5356k519J2187J7845J0680m369j6257
1327b8j6092m410J0599J7797J2006k540j5072j6673o180Q871J7403J3197n81j3879
1341D418j7076p845P165J6819J4261J286j2524j7241r416N286J6178J5019L261
1354A9591j1099j7292j0706L405J5128J5772N077r664j6928j2072J696J4077J6287
1367A3272O563p961j6579j3020k34J2892J6599Q075o196j5934j4030k073J1644
1380f982J6611R588m463j5192j4835l715J0179J6559J0792k690j4244j5429n288
1393a9109Q629J6240J1990r20j3214j5866o815P062J5725J3050P74j2043j5991
$$ y = [-17503, -1375, 15794, 21403, 11453, -6814, -20097, -18572, -3672, 13900, 21399, 13088, -4535, -18891, -19526, -5894, 12015, 21120, 14760, -2239, -17595, -20114, -7927, 9918, 20598, 16229, -28, -16120, -20530, -9931, 7866, 19872, 17332, 2260, -14413, -20593, -11722, 5681, 18878, 18297, 4418, -12658, -20503, -13338, 3481, 17742, 19028, 6504, -10737, -20153, -14867, 1311, 16330, 19591, 8492, -8800, -19506, -16101, -973, 14799, 19876, 10212, -6716, -18788, -17092, -3015, 13272, 19835, 11874, -4705, -17725, -17959, -5067, 11532, 19607, 13411, -2523, -16553, -18626, -6982, 9629, 19217, 14754, -438, -15273, -18988, -8809, 7750, 18542, 15852, 1608, -13821, -19109, -10480, 5760, 17750, 16830, 3616, -12250, -19065, -12003, 3722, 16772, 17546, 5503, -10488]
1406a0488q313N333J5133J3896K502j0726j5970r717L669J4378J4607M040r293
1419I051j5764j0972K006J3436J5018N667p790j5478j1983K82J2391J5238P208
1432A8310o131j5044j2916j362J1175J5362Q608m592j4278j3719k952R791J5334
1445G586R898k964j3548j4196m510Q396J5066J1060j320j2597j4566o085O900
1458a0880J4842J1902K73j1413j4797p556N353J4329J2673J889j0160j4893q744
1471a7182L817J3565J3325L455q920j4788r883K286J2735J3789M983p557j4611
1484d986j0865P41J1722J4101O378o228j4095j1659q53J0601J4379P562m717j3457
1498a376j2468k401R521J4344Q791l256j2697j3071l887Q239J4193R787j668j1926
$$ y = [-10488, -18801, -13468, 1665, 15561, 18063, 7337, -8633, -18350, -14681, -303, 14304, 18344, 9051, -6713, -17685, -15679, -2243, 12775, 18442, 10652, -4826, -16809, -16527, -4136, 11102, 18310, 12179, -2865, -15781, -17143, -5968, 9394, 18002, 13410, -868, -14587, -17539, -7748, 7586, 17484, 14520, 972, -13224, -17734, -9338, 5728, 16788, 15468, 2871, -11695, -17780, -10880, 3962, 15864, 16137, 4724, -10073, -17629, -12276, 2053, 14726, 16615, 6455, -8438, -17182, -13365, 200, 13525, 16980, 8060, -6728, -16611, -14325, -1590, 12199, 17182, 9625, -4986, -15851, -15110, -3388, 10713, 17091, 10863, -3232, -14891, -15744, -5143, 9236, 16798, 12081, -1376, -13844, -16245, -6724, 7620, 16411, 13155, 458, -12613, -16500, -8261, 5932, 15719, 14051, 2125]
1512B125j3404n205O811J3870J0694j01j0919j3778o421N465J3246J1651J356
1525A5390r865j3894p698M006J2768J2207K832q718j3715q843K438J2011J2692
1538A1611M222p301j3529r860R74J1064J3068N604n975j3086j0812m82J0036J3348
1552H882O714m520j2643j1457j989Q983J3322P975l136j2042j1932l410P812J3172
1566E731Q945j687j1245j2385m636O465J2889R919k96j0325j2687n916N113J2581
1580B466J0658J020r257j2786p071L873J1921J1321K435q210j2805q100K542J1196
1594g97J1782L789p072j2618r055J211J0467J2105M948n797j2271r838k70R528
1608c888J2348O102m453j1860j0538j580Q597J2331P243l217j1272j1180k790
$$ y = [2125, -11279, -16484, -9673, 4197, 14891, 14790, 3871, -9907, -16328, -10863, 2383, 14034, 15390, 5525, -8369, -16067, -12061, 707, 12914, 15746, 7028, -6687, -15530, -13092, -1081, 11611, 15833, 8532, -4997, -14857, -13883, -2819, 10249, 15853, 9878, -3208, -14020, -14502, -4466, 8882, 15596, 11076, -1567, -13024, -15013, -6030, 7292, 15267, 12131, 89, -11843, -15253, -7441, 5731, 14676, 12989, 1744, -10641, -15277, -8812, 4077, 13996, 13700, 3375, -9312, -15228, -10115, 2466, 13124, 14144, 4887, -7899, -14970, -11097, 824, 12145, 14580, 6370, -6435, -14535, -11993, -797, 10985, 14774, 7702, -4916, -13971, -12760, -2293, 9812, 14760, 8963, -3308, -13146, -13416, -3888, 8460, 14562, 10109, -1751, -12289, -13869, -5272, 7059, 14302, 11085, -187, -11367, -14157]
1621a4157P529J2249Q227j920j0607j1515m088O351J2070R107o83r708j1822n327
1635a4294N143J1757R794P49q863j1945o352L789J1287J0471K001p880j1874p402
1649a3619K528J0639J0913L299o749j1817q362J324R884J1288M541n668j1562
1662c361r057o7R101J1445N644m406j1146r765j317Q118J1624O607l119j0639
1676c38j0350k513P056J1585P531j903j0011j0707l685N987J1402Q384p38r189
1690B511j1064m795M942J1083R004N78q378j1231n781L763J0577R663J764p484
1704E152j1216o791K635J0044J0138K871o497j1125p608J450R383J0486M014n529
1718G407j0829q388K83Q633J0744N056m449j0521q959r99P804J0859N968l240
$$ y = [-14157, -6628, 5621, 13848, 11928, 1321, -10194, -14282, -7931, 4139, 13246, 12563, 2855, -8967, -14294, -9151, 2606, 12400, 13149, 4286, -7659, -14011, -10222, 1065, 11536, 13537, 5657, -6217, -13619, -11091, -452, 10461, 13760, 7011, -4806, -13168, -11844, -1960, 9328, 13869, 8201, -3361, -12418, -12485, -3384, 8061, 13705, 9299, -1847, -11612, -12929, -4811, 6813, 13420, 10301, -338, -10688, -13201, -6145, 5440, 12971, 11068, 1057, -9650, -13335, -7348, 4054, 12438, 11700, 2511, -8553, -13348, -8406, 2677, 11681, 12259, 3881, -7350, -13131, -9368, 1209, 10872, 12636, 5152, -6064, -12855, -10220, -176, 9962, 12833, 6336, -4789, -12397, -10947, -1564, 8922, 12936, 7407, -3422, -11810, -11527, -2894, 7850, 12906, 8457, -2064, -11023, -12022, -4218, 6641, 12609, 9369]
1732I369r991r528k162O914J0803O809k068r443r889l257N870J0619P662q45q751
1747B112j0311m317M901J0310Q368K92q057j0375n163L686R886Q944J458p195
1761D539j0367o188K593R442R397K504o154j0312p038J460Q813R747L595n264
1775F767j0047p751L25Q127R927M594m159r784q320p82P301J0057N451l060r391
1790g45q788j824O416J0006O285j964q867r213k853N607R834P052r46q215r515
1805g730l860M592R627P682J74p499r626m835L627R343Q208J095o730r612n620
1820a1164K561Q853Q608K114n844r628o294J544Q273Q990L153n030r452p021N61
1835i776P674R151M020m060r158p587m32O906R319M894l133q770q063j512O167
$$ y = [9369, -622, -10150, -12312, -5398, 5405, 12214, 10146, 703, -9186, -12443, -6573, 4046, 11708, 10863, 2112, -8199, -12516, -7615, 2695, 11063, 11355, 3298, -7077, -12240, -8554, 1332, 10276, 11734, 4539, -5828, -12016, -9423, 19, 9416, 11920, 5766, -4546, -11584, -10124, -1311, 8436, 12031, 6767, -3280, -11031, -10706, -2579, 7348, 11942, 7783, -2001, -10321, -11103, -3802, 6255, 11706, 8646, -745, -9533, -11357, -4941, 5065, 11350, 9386, 519, -8694, -11547, -5940, 3894, 10946, 10000, 1785, -7730, -11590, -6998, 2629, 10311, 10485, 2986, -6640, -11475, -7848, 1495, 9703, 10798, 4068, -5544, -11164, -8603, 250, 8858, 10972, 5128, -4500, -10794, -9250, -977, 8013, 11166, 6136, -3316, -10337, -9776, -2102, 7049, 11069, 7009, -2149, -9736, -10168, -3262, 6057, 10951, 7818, -952, -9015, -10527, -4360]
1850d360R311N709k150q326q391k522N398R168O375j054p807q688l455M513R008
1865B729P000j04p179q881m224L540Q710P546Q35o344q976n112K630Q215Q019
1880H404J834n615q931n800J608P802Q297K768m807q850o410O67P189Q539L668
1895A0363l940q585p009k87O548Q707M370k974q332p374j261N925Q586N183k082
1910G838p758p870k125N089Q610N858j258p241q182k981M328Q486O379k33o839
1925B101q246l843L493Q210O916O37o184q327m554K634P861P256J526n410q420
1940d350n224J799P391P646K362m660q313n769P96O896P913L170l870q060o398
1955h671k1O265Q071L966l168p661o875r49N632Q114M698k223p412p204j827M945
$$ y = [-4360, 4951, 10660, 8510, 184, -8207, -10729, -5331, 3837, 10212, 9158, 1351, -7337, -10792, -6279, 2729, 9729, 9625, 2446, -6435, -10659, -7119, 1591, 9137, 9972, 3628, -5348, -10460, -7830, 385, 8404, 10238, 4623, -4308, -10108, -8500, -698, 7599, 10367, 5560, -3290, -9700, -9033, -1844, 6695, 10363, 6423, -2162, -9171, -9458, -2910, 5797, 10167, 7193, -1139, -8513, -9774, -3849, 4737, 9920, 7838, 80, -7790, -9915, -4826, 3784, 9642, 8384, 1143, -7039, -10020, -5692, 2794, 9173, 8940, 2101, -6145, -9988, -6495, 1715, 8631, 9268, 3084, -5243, -9797, -7163, 698, 7954, 9480, 4070, -4350, -9574, -7775, -384, 7262, 9624, 4964, -3349, -9118, -8322, -1426, 6487, 9657, 5787, -2273, -8671, -8692, -2427, 5644, 9610, 6442, -1219, -8094, -9043, -3411, 4703, 9401, 7178, -234, -7438, -9265, -4320]
1971d320Q041N333j340o877p538k631M187P863N943m86o406p652l359L337P658
1986A753O417M47n847p832m063K528P320O794J263n140p798m738J706O931P092
2001F833K089m378p699n442Q27O540P360K829l655p560n868Q6N932P481L602k983
2017E994p274o364p60N382P491M306k126p009o684j513M679P494M907j349o604
2032E70o875k366L990P375N500o01o083p101l131L358P150N872K93n505p378l660
2048h592K495O963O294J055m960p367m285J795O523O638J779m216p316m951J006
2063g139O196O885K496l618p153n433K85N691O996L229k856o937n934n62N146
2078b708P121L828k148o615o204j352M518P122M425j360o211o530k043L840P062
$$ y = [-4320, 3721, 9054, 7714, 837, -6701, -9332, -5145, 2718, 8661, 8175, 1769, -5883, -9242, -5905, 1753, 8170, 8617, 2770, -5062, -9125, -6597, 723, 7517, 8780, 3640, -4158, -8896, -7190, -259, 6833, 8922, 4544, -3155, -8597, -7770, -1230, 6130, 8959, 5304, -2256, -8124, -8038, -2106, 5375, 8977, 5994, -1280, -7644, -8404, -3022, 4469, 8775, 6649, -360, -7044, -8557, -3878, 3616, 8523, 7174, 570, -6305, -8671, -4681, 2694, 8194, 7593, 1510, -5591, -8722, -5364, 1786, 7658, 7951, 2446, -4932, -8592, -6097, 866, 7160, 8215, 3255, -4112, -8397, -6602, -79, 6559, 8338, 4122, -3194, -8145, -7139, -943, 5942, 8438, 4820, -2333, -7766, -7481, -1790, 5206, 8435, 5579, -1358, -7292, -7854, -2708, 4413, 8241, 6093, -522, -6726, -8078, -3560, 3562, 7987, 6627, 416, -6114, -8157, -4317, 2745]
2093B745M969o54n752o713k810L306O796N487J12n321o882l372K446O651N895
2108F903Q08m791o871m023J821O276O156J657m202o874m558J046N874O459K281
2123G962l504o758n070K98N499O584K908k831o578n503l23M893O735L527k147
2138E692o325n826j120M373O808M053j470n983o172j746L832O699M543p31n618
2153A009o271k485L174O555N032l4n164o504l002K496O396N437N76m638o569l559
2169g551J798O084N764J280m024o531m230J244N656O042J978l483o443m587M66
2184f537N193O191K649k856o221n059k60M865O320L101k192o045n347q64M297
2199b765O343L725j580n789n622j500L764O232M203r46n288n917k090L073O193
$$ y = [2745, 7714, 7060, 1308, -5405, -8215, -4909, 1887, 7374, 7486, 2165, -4717, -8089, -5643, 1008, 6903, 7711, 2920, -3951, -7974, -6153, 123, 6279, 7936, 3734, -3140, -7698, -6652, -778, 5681, 7962, 4458, -2300, -7370, -7072, -1573, 5011, 7919, 5088, -1490, -6993, -7316, -2423, 4312, 7839, 5692, -633, -6459, -7579, -3206, 3602, 7655, 6185, 202, -5970, -7716, -3884, 2815, 7358, 6627, 1009, -5262, -7747, -4573, 1982, 7014, 6980, 1816, -4688, -7690, -5194, 1202, 6639, 7215, 2577, -3992, -7551, -5753, 331, 6095, 7375, 3351, -3180, -7410, -6166, -510, 5532, 7510, 4027, -2416, -7003, -6537, -1344, 4847, 7496, 4640, -1581, -6640, -6900, -2035, 4285, 7386, 5194, -851, -6198, -7062, -2765, 3578, 7303, 5723, -66, -5688, -7188, -3424, 2808, 7011, 6065, 777, -5140, -7230, -4157, 2036]
2214B036M674k71m982n997k679K550N927N106K87m440o080l271J984N688N320
2229E852J046l976o085l811J257N498N558J639l358o094m213P28M974N711K327
2244G053k896n872m618rM576N946K774k225n676m945p00M219N840L402j680n444
2260b55n234j216L650N842L874j036n143n489j750L079N792M242m37m714n583
2275d378k379K477N645M599K57m272n719k963J944N421M904Q53l767n762l406
2290f546J384N101N149J452l374n633l819P36M801N370J880k758n527m164O2M422
2306a464N520K429k203n449m481m34L996N521K928j631n147m799j016L518N502
2321B790L442j073m907n037j470K925N492L831n40m549n157k069K520N265M248
$$ y = [2036, 6710, 6439, 1457, -4540, -7219, -4669, 1258, 6364, 6651, 2211, -3869, -7140, -5156, 532, 5852, 6898, 2922, -3163, -6974, -5717, -219, 5339, 6978, 3620, -2474, -6687, -5959, -985, 4726, 7053, 4157, -1715, -6333, -6342, -1766, 4180, 6954, 4729, -947, -5892, -6592, -2373, 3467, 6869, 5189, -255, -5489, -6705, -3055, 2787, 6661, 5625, 482, -5007, -6757, -3678, 2114, 6356, 5919, 1205, -4378, -6757, -4280, 1365, 5964, 6221, 1949, -3770, -6733, -4789, 632, 5536, 6389, 2622, -3140, -6546, -5162, -61, 5088, 6540, 3166, -2467, -6286, -5550, -749, 4621, 6501, 3743, -1784, -5948, -5886, -1464, 4056, 6485, 4282, -1167, -5648, -6082, -2086, 3435, 6363, 4732, -415, -5214, -6230, -2712, 2790, 6232, 5159, 252, -4785, -6255, -3330, 2162, 5993, 5453, 904, -4253, -6322, -3802, 1463, 5711]
2336E711J3m181n268k516J936N139M521N84l782n269l015J507M872M620J164l280
2352B756n262l398Q61M547M967J632k796n199l820L79M211M992K172k207n100
2367a265m100j98L838N083K568j710m787m423p34L379N132L040j207m536m667
2382d587j228L001N045L379o52m287m743j776K458M974L758j46l898m885k282
2397e869K065M754M047L87l548m856k663J451M593M285R46l185m939k986R56M371
2413a91M434J341k696m816l361M91L923M665J800k231m703l666p6L701M625K292
2429E532j759m552l910m92L287M633K620j204m243m293q74K791M700K968p02m061
2445D41m368j418K464M523L335k29l760m429j874J987M391L621K26l371m526k270
$$ y = [5711, 5724, 1543, -3725, -6241, -4305, 834, 5355, 5939, 2157, -3112, -6127, -4620, 252, 4872, 6036, 2756, -2506, -5904, -5043, -496, 4471, 6103, 3307, -1892, -5712, -5333, -1122, 3870, 6042, 3835, -1265, -5365, -5563, -1725, 3358, 5926, 4216, -571, -4994, -5728, -2349, 2783, 5823, 4616, 80, -4587, -5815, -2814, 2231, 5610, 4958, 671, -4072, -5848, -3390, 1584, 5342, 5196, 1298, -3587, -5869, -3804, 950, 4997, 5384, 1836, -3020, -5683, -4232, 361, 4646, 5592, 2407, -2532, -5518, -4562, -191, 4243, 5584, 2888, -1928, -5289, -4798, -875, 3790, 5590, 3359, -1344, -5010, -5086, -1385, 3240, 5532, 3773, -779, -4689, -5181, -1894, 2739, 5359, 4155, -88, -4381, -5255, -2464, 2236, 5204, 4502, 441, -3927, -5345, -2881, 1642, 4977, 4748, 988, -3441, -5315, -3328, 1063, 4684, 4910, 1539, -2987, -5257]
2461e257J501M303L810N78k850m538k628J010M018M055J053k524m412k996N91
2476d286L692M148J600k234m312l271J25L358M375J872j725m173l551l63L120
2491a625M261K300j231m011l694p87K694M281K656r13l694l919j141K348M085
2506A610K986m03l522l994j534J955M012L225Q4l207m023k030J544L875L552M13
2522D543k868m001k366J063L709L669Q96k444m143k594O46L494L773J218k022
2537B573l992k927K35L201L894J633j616l906l199k00K936L929K033j328l672
2552d06l422n31K528L897K391r14l478l514r92K183L904K678n42l196l692j346
2568d452J875L783K880r2k951l777j680J481L641L129L09k723l704k080J135L484
$$ y = [-5257, -3756, 547, 4357, 4935, 2085, -2453, -5081, -4071, -53, 4002, 5055, 2531, -1881, -4877, -4286, -594, 3554, 5154, 2920, -1392, -4663, -4538, -1180, 3195, 5067, 3342, -831, -4382, -4745, -1625, 2636, 4936, 3705, -306, -4000, -4787, -2093, 2188, 4844, 3931, 237, -3682, -4823, -2475, 1610, 4596, 4193, 671, -3323, -4857, -2902, 1110, 4335, 4419, 1212, -2811, -4841, -3297, 578, 4130, 4543, 1675, -2326, -4692, -3629, 80, 3749, 4645, 2201, -1942, -4536, -3890, -396, 3377, 4595, 2573, -1419, -4346, -4111, -910, 2984, 4617, 3001, -905, -4104, -4304, -1368, 2561, 4594, 3266, -406, -3828, -4359, -1831, 2066, 4457, 3543, 65, -3449, -4441, -2258, 1646, 4324, 3782, 586, -3106, -4452, -2577, 1206, 4086, 3994, 1043, -2734, -4414, -2933, 708, 3837, 4146, 1423, -2281, -4361, -3226, 258]
2584B58L292O57k336l765k310P00L316L346J122k024l724k607L42L098L468J450
2600D283j682l553k877n9K847L576J711j329l490k935n06K493L644K011r35l320
2616a21l136p87K168L528K397o39l078l314j049J783L508K552j81k823l363j455
2632d010J426L375K760J92k548l458j741J181L189K907N80k292l430k025P80L046
2648f8L141P52j923l403k292M97K800L197J141j621l191k576N1K611L255J482
2664C853j375l093k733k27K407L221J716j012l045k746n78K036L239J978o88k814
2680A39k941r31J791L197K215k68k622l055j162J385L136K404O3k462l037j504
2696c652J135L018K573L69k153l057j760Q17K791K714O78j845l083j945M98K606
$$ y = [258, 3550, 4207, 1871, -1894, -4204, -3504, -188, 3158, 4280, 2256, -1468, -4075, -3733, -635, 2833, 4283, 2601, -952, -3829, -3888, -1041, 2535, 4246, 2917, -573, -3508, -4014, -1521, 2123, 4134, 3199, -121, -3257, -4044, -1876, 1652, 4049, 3410, 332, -2982, -4031, -2248, 1260, 3812, 3631, 808, -2555, -4010, -2584, 791, 3551, 3743, 1195, -2263, -4004, -2823, 366, 3273, 3853, 1561, -1869, -3894, -3114, -68, 3073, 3825, 1902, -1501, -3793, -3296, -496, 2701, 3842, 2221, -970, -3546, -3495, -884, 2371, 3853, 2478, -615, -3348, -3575, -1168, 2053, 3769, 2757, -288, -3034, -3612, -1576, 1663, 3641, 2953, 139, -2802, -3733, -1942, 1255, 3470, 3202, 580, -2475, -3637, -2252, 884, 3288, 3351, 889, -2148, -3652, -2517, 501, 3074, 3443, 1290, -1767, -3527, -2710, 81, 2795, 3473, 1628, -1455, -3400, -2902, -296]
2712b96K845R57j614k958k176K04K408K847J257j268k938k310j07K192K841J512
2728C396r84k705k542m04J930K867J699o35k627k526p76J707K849J908m06k383
2744C68k649r98J373K814K085j08k200k686j265J191K608K227K53k042k660j546
2760c235R62K555K375M69j878k677j682O47K357K477O86j475k664j941L27K239
2776d58K513J040j294k529k080M7J943K637J195r95k513k099k37J815K596J431
2792C012p76k374k227n80J667K552J601m45k258k386o82J337K511J735j35k064
2808D88k418r54J086K452J926J09j917k413j210Q15K380K064L21j671k396j467
2824b805N67K248K208N51j488k364j601L80K041K261P01j146k365j719Q2J927
$$ y = [-296, 2549, 3506, 1892, -1066, -3242, -3038, -630, 2217, 3474, 2206, -732, -3042, -3149, -957, 1884, 3396, 2412, -293, -2835, -3239, -1309, 1558, 3257, 2622, -5, -2531, -3307, -1600, 1249, 3157, 2751, 368, -2281, -3279, -1906, 908, 2993, 2885, 685, -2001, -3266, -2075, 533, 2760, 3013, 971, -1689, -3235, -2273, 282, 2657, 3126, 1248, -1429, -3111, -2464, -107, 2370, 3056, 1581, -1083, -3024, -2697, -458, 2055, 3095, 1801, -728, -2808, -2761, -818, 1819, 3014, 2019, -494, -2593, -2830, -1015, 1581, 3012, 2236, -138, -2365, -2945, -1278, 1274, 2875, 2430, 172, -2214, -2896, -1559, 952, 2687, 2552, 488, -1930, -2884, -1798, 654, 2580, 2689, 772, -1641, -2851, -2036, 344, 2408, 2729, 1058, -1338, -2805, -2238, 10, 2218, 2769, 1281, -1083, -2684, -2304, -263, 1998, 2699, 1553, -812, -2531, -2449, -522]
2840e22K313R25r57k307j822j24J696K333J106p09k156j978l21J408K329J422
2856B636n61k086k024n61J284K295J564l85j916k050p92J094K189J695o3j725
2872E94k152j014R24K080J794J37j567k157j165P00K005J854L50j336k166j335
2888b454M47J933J966N01j114k124j498K55J752J949P60r24k043j616J9J595K081
2905A485R03q05j930j691j88J363K038J184n72j908j769m44J312K010J254k84
2921A958j821j787o45J047J954J431j20j616j937p55P96K009J504M9j437j906
2937a276r45P08J743J672K34j311j869j138M82J690J693N05j155j864j212K28
2953a815J572J751O39q74j850j389L9J489J810P21p07j759j452j58J347J753R73
$$ y = [-522, 1791, 2716, 1759, -548, -2370, -2494, -798, 1535, 2641, 1932, -224, -2202, -2523, -1115, 1214, 2636, 2075, -11, -2035, -2596, -1312, 983, 2547, 2162, 246, -1804, -2596, -1502, 687, 2382, 2319, 594, -1558, -2572, -1648, 432, 2226, 2363, 796, -1361, -2526, -1826, 179, 2033, 2383, 1047, -1119, -2454, -2007, -74, 1892, 2393, 1279, -845, -2343, -2088, -336, 1613, 2373, 1449, -594, -2210, -2191, -596, 1485, 2388, 1583, -347, -2038, -2226, -863, 1175, 2359, 1787, -121, -1890, -2334, -1022, 988, 2242, 1958, 137, -1650, -2295, -1248, 706, 2137, 2017, 401, -1536, -2291, -1495, 514, 2018, 2067, 630, -1276, -2221, -1513, 230, 1902, 2136, 825, -1044, -2182, -1700, -10, 1683, 2188, 1033, -831, -2043, -1815, -243, 1508, 2147, 1273, -577, -1966, -1927, -438, 1372, 2093, 1386, -373, -1825, -1983, -636, 1117, 2090]
2970B090n77j681j510l82J196J754J119l32j602j603m26R34J762J175j25j546
2986B46j614o43Q47J648J319K8j370j662p90O52J595J388J53j121j688r21M25
3003a508J593J440L32r94j626j070J98J527J515N03q77j590j285J41J293J612
3019A204O93o62j569j357j11J312J530Q63n45j597j371j76J110J581Q97l59j395
3036D8j531l53R63J599R84j49j400j412n65P63J531J203q4j220j454o93O21J484
3054C35J220N0r86j603p82M82J446J284K75j026j519q66K99J328J383M34q97j466
3072f09j065K50J206J385N96p28j460j070o1J164J471N78n18j446j175r3J073
3089e02J419P68m21j353j228l11R33J416Q42j82j303j336m36Q27J419J041j29
$$ y = [2090, 1513, -168, -1678, -2060, -864, 890, 2009, 1677, 75, -1528, -1954, -1020, 742, 1917, 1792, 246, -1368, -2011, -1164, 484, 1803, 1831, 461, -1201, -1991, -1339, 256, 1644, 1797, 676, -1012, -1933, -1508, 85, 1525, 1857, 863, -763, -1833, -1635, -108, 1407, 1910, 1033, -557, -1842, -1701, -408, 1204, 1897, 1235, -334, -1691, -1802, -490, 1040, 1903, 1358, -239, -1610, -1786, -676, 905, 1802, 1443, 48, -1483, -1836, -873, 726, 1710, 1561, 161, -1251, -1816, -1053, 478, 1681, 1597, 377, -1077, -1770, -1149, 335, 1555, 1605, 619, -984, -1766, -1284, 162, 1446, 1721, 695, -824, -1690, -1391, -63, 1320, 1754, 857, -609, -1674, -1424, -218, 1167, 1763, 1035, -425, -1495, -1556, -392, 1079, 1657, 1139, -307, -1482, -1575, -502, 917, 1685, 1264, -89, -1317, -1628, -695, 721, 1563, 1381, 78, -1258, -1694, -867, 552, 1593, 1464]
3106A464j173j439n27O29J465J033L0j058j460o11N26J352J153J17r55j372p89
3123a615L53J354J159L60r60j361r08K95J210J185N19p41j380j000J43J120J351
3140A084M77o45j296j006p2J023J336O69n34j266j140j17Q84J358P05k65j259
3157f4j188l08R13J301P75j64j161j221l85O43J320R50j09r96j284n43O16J178
3175B73J106K7j024j224o67N08J230R91J84q69j289p37L74J136J157K68p62j224
3193e42q42J21J140J141M41o60j210r73J08R71J250N13n80j161j023m3R78J173
3211H02O67m56j134j073j92Q32J239O82k54j121j074l13P23J226Q09k20r89j111
3229i57l92N86J132Q85j2r57j149n25M76J191R18O2q24j107o94M16J042J005J83
$$ y = [1464, 291, -1148, -1675, -1046, 419, 1452, 1482, 424, -1036, -1647, -1121, 231, 1384, 1501, 546, -826, -1615, -1262, 92, 1251, 1611, 651, -710, -1618, -1323, -113, 1072, 1591, 850, -530, -1530, -1387, -267, 1084, 1561, 916, -380, -1386, -1458, -435, 901, 1570, 1036, -230, -1370, -1487, -603, 755, 1460, 1195, -64, -1252, -1560, -647, 654, 1429, 1265, 104, -1117, -1502, -859, 461, 1411, 1302, 306, -978, -1521, -905, 273, 1379, 1406, 382, -842, -1509, -1001, 229, 1220, 1404, 535, -754, -1491, -1117, 19, 1176, 1444, 682, -542, -1384, -1263, -123, 1018, 1459, 799, -411, -1384, -1276, -305, 945, 1458, 878, -283, -1306, -1349, -371, 802, 1469, 1013, -121, -1194, -1386, -554, 685, 1367, 1113, -8, -1082, -1395, -672, 554, 1363, 1143, 154, -957, -1349, -763, 369, 1254, 1242, 285, -864, -1389, -913, 278, 1196, 1258, 434, -673, -1367, -951, 91, 1096, 1279]
3248A279p41j145q09L50J039J107K31o67j132p37J27R30J058M73n79j144q36r1
3266a287R50J145N57m53j136r61m1P62J188N75m03r82r67k05P05J113P72l05r49
3285G8j035l56N90J185P29o9q91j108m49N28J081P93O1q74j050m82L97J046R08
3304A082R8p58j027o22L13R96R40J90o31j183o43K10R73R96L46o16j093p88J75
3323a042Q44J026M27n22j012q17n5Q14J024N35l65j027r14n5P23J026O36l34r93
3342h1q56k60O73J062O82k59r28r41k83N27J050P44r5q59r64l91M64R97P68R1
3362A141p84j043n29L55R88Q89R4o17j083n71K77Q88R57J85n57j018o58J37Q40
3381a09R60L27n62r73p52Q5Q38Q94M07m17r34p71j7O77R79M73l11r18q23j30O09
$$ y = [1279, 538, -607, -1416, -1066, -27, 1080, 1311, 644, -488, -1225, -1098, -168, 890, 1363, 784, -360, -1196, -1287, -337, 808, 1365, 912, -224, -1185, -1226, -464, 724, 1299, 896, -86, -1053, -1258, -553, 560, 1332, 1027, 78, -957, -1313, -723, 462, 1191, 1122, 231, -877, -1326, -798, 283, 1076, 1137, 263, -787, -1269, -872, 174, 1082, 1180, 422, -605, -1227, -914, 82, 1022, 1212, 581, -602, -1245, -1035, -62, 934, 1280, 664, -429, -1217, -1042, -198, 828, 1255, 733, -279, -1096, -1151, -337, 687, 1222, 857, -170, -1084, -1139, -416, 610, 1246, 912, -81, -937, -1197, -524, 538, 1220, 961, 33, -908, -1191, -664, 386, 1130, 1035, 176, -788, -1179, -715, 282, 1050, 1141, 357, -686, -1215, -860, 128, 1017, 1111, 494, -589, -1160, -883, 5, 962, 1147, 590, -428, -1086, -949, -109, 851, 1178, 616, -357, -1109, -1024, -186, 708, 1115, 698, -236, -1007, -1024, -347, 632, 1105, 794, -124, -947, -1077, -468]
3402d68R66N98k43q41q90j63N43R26O11j51p97q19l16M62R39O87n1p90q44m38
3422a079L84Q89P40P2p18q43n43L37Q57P94J05o08q36n74J95P79Q16K36m84r45
3442d26n77J57P03Q09L63m50q35o36m6P23Q80L10l47q14p12o9O04Q90M83k50q45
3463h5p16j56N54Q43N13k27o74p84k50M86Q38O03j11p09q38k42M03Q56N62po10
3484B49q53l35K57Q49O28J08n54q56m09J56Q04O97J59n16p58n20R4O95Q50J90
3504I35m14q28n57P4O53P44L25l82p60o51M5N50Q16M10l13p82o54n9N07Q49L49
3525H57j42p78o51k13M97Q05N25j95o25p66k32M80P50N18j14m54q66k73L21P13
3545A57O34mn44o92m12K65P75N57%m11p88l77J88O97O28K05m74p72m72J03P01
$$ y = [-468, 498, 1096, 853, 12, -878, -1041, -498, 428, 1039, 888, 91, -728, -1044, -582, 357, 1044, 993, 203, -641, -1079, -695, 194, 934, 1006, 288, -555, -1098, -761, 96, 890, 995, 387, -449, -1023, -828, -49, 767, 1003, 519, -426, -1003, -846, -143, 666, 1029, 579, -256, -892, -938, -215, 665, 975, 628, -186, -898, -967, -363, 527, 1010, 760, -85, -801, -957, -403, 440, 953, 726, 52, -732, -982, -496, 342, 945, 834, 125, -713, -955, -552, 304, 866, 859, 249, -604, -939, -682, 167, 795, 903, 349, -507, -916, -760, 44, 741, 900, 384, -374, -894, -800, -105, 745, 935, 521, -307, -864, -790, -137, 607, 932, 550, -210, -861, -816, -266, 550, 960, 647, -135, -789, -848, -341, 508, 857, 715, -63, -714, -927, -430, 375, 900, 705, 80, -686, -918, -438, 312, 830, 716, 262, -604, -877, -556, 157, 791, 787, 243, -449, -861, -596, 179, 736, 736, 325, -463, -840, -652, 45, 673, 878, 404, -368, -840, -737, -36]
3566c6O85K00m16o55n35K6O08O67K78k85p00n93k7N22P61L48l18o41n64j57N34
3587b98P36M09k05o36o74j01M47O31M54j08n76o59k05L66O44N02l5n50p05k00
3607g63K64O49N68k3n56n72l24K44O92N20Q7n37o76l27J96N94N57J78m92o26m06
3628g53J45N90N64J84l11o28n04J10M46O32K34k63o17m54j5M98O05K65k60n94
3648a26m84n2M85N11L83k04n99n15o6L74N70M34j31m94o29j51L85N77L93o2n81
3669A8n12j85L09N81L99k8m33n55k71K06N98M91J8n09m75l61K71N45M75K4l46
3690B60o38k78K24M34N69Q1l57o10k75N9N26N22J49k87n67m40P5M54N09K26k60
3711C76n04m49J2M81M34K83j83n09m69j05M51N07L10j93m92m82m5L35N04L64j34
$$ y = [-36, 649, 849, 433, -222, -757, -731, -123, 544, 822, 537, -163, -756, -783, -261, 500, 848, 530, -111, -675, -832, -298, 438, 847, 642, 6, -668, -769, -322, 309, 763, 655, 79, -580, -785, -419, 225, 727, 692, 142, -563, -763, -499, 150, 718, 695, 139, -433, -757, -513, 179, 699, 786, 249, -427, -754, -558, 36, 593, 771, 279, -347, -753, -608, -18, 546, 730, 419, -209, -713, -603, -157, 475, 709, 446, -171, -625, -640, -142, 463, 728, 468, -126, -610, -662, -177, 334, 717, 513, -86, -601, -667, -293, 277, 711, 580, 86, -543, -694, -309, 268, 661, 599, 18, -494, -679, -370, 211, 610, 582, 149, -406, -677, -471, 127, 618, 636, 127, -348, -709, -438, 107, 582, 606, 260, -378, -656, -432, 2, 571, 652, 295, -315, -590, -531, -5, 517, 666, 379, -188, -628, -553, -99, 410, 636, 376, -128, -577, -565, -84, 350, 633, 450, -59, -528, -633, -182, 325, 635, 442, -50, -532, -577, -242, 262, 626, 492]
3732D92m80m79j56K80N65L94j06l95m97k46K90N08L60N8n00m58k59K47N11L38
3752D67Q9m12n17k06J39M80N24nl04m77l32Q7M83M27J35l61n12k82J21M12M89
3773D45J45l42m45l35K4M23M94J63k49m70l17n8L68N11K02j85m56l96o4L17N18
3794B93K54j52m40m38l2K87N41J86n4m40m89j10L67M40L27q6m21m60j09K53N25
3815B42L20p6m28m61j04J47N35L21k1l63m38k23K50M42L61l1l45m26k54J81M21
3836E0L81Q8k92n24k72J84M26L63J68l06n54k44O1M03M93Q9j89m98m09J26L55
3857a01M77J72k41m72l48j0L81M80J95j05n67l81k6M07M54K00j63m13m50j6L03
3878b24N74J84j28m30m41r2L35N05K80j26l98m72j20K38N59K80m7m04n09j16K28
$$ y = [492, 12, -467, -623, -343, 222, 616, 510, 115, -382, -628, -338, 170, 530, 588, 88, -370, -629, -382, 129, 467, 556, 144, -373, -579, -440, 40, 564, 559, 255, -222, -554, -467, 16, 443, 578, 217, -295, -577, -456, -44, 445, 590, 248, -197, -532, -508, -85, 409, 572, 323, -147, -464, -522, -154, 357, 559, 374, -82, -478, -542, -225, 293, 547, 395, -45, -483, -515, -228, 313, 499, 445, 5, -484, -594, -227, 213, 540, 454, 33, -427, -536, -283, 242, 562, 486, 58, -403, -507, -360, 175, 496, 475, 112, -326, -549, -299, 143, 504, 473, 128, -298, -552, -371, 50, 431, 519, 227, -297, -569, -385, 41, 404, 572, 266, -288, -532, -471, -68, 425, 514, 325, -173, -582, -456, -101, 376, 548, 307, -165, -513, -523, -142, 338, 533, 428, -139, -520, -546, -139, 315, 515, 352, -61, -511, -527, -224, 350, 534, 406, -24, -465, -557, -222, 283, 563, 437, 39, -433, -553, -315, 244, 524, 477, 73, -436, -552, -324]
3899c24M82L57n7l53m61k12J80N37L14M9l05n03l16J40N20M36P9l74m78l25K43
3920c71L42M13J62k93m61l35N7M41N10K00l82m39m56J55L31N09K12k70m19m41
3940e35l5M29N08K07j94m76m26l8L52N89K14j41m37m94j04K78N74K94q3m58m49
3961d25j81L20M67L94o0m38m83j33J62N08M20J2l53n59k84K01M86M31J21m19m65
3982b78l87K08N18M88J18l82n68l18J03M47M75J83k84n10l94L2M24N16K28k43
4002C76n16m52MM66M58L12j79n56n19K3L43N15L88j80m53n43j57L66N46L70j38
4023D74m40m78k23K64N97M01j3l96o27k36K31N72M36L8l97n82k93K34M92M45J24
4044F23l70n80l55K23M51N20J92l82n45m27J16M74N39K09l18n71m17K8M59N48
$$ y = [-324, 158, 515, 458, 105, -356, -568, -388, 149, 463, 512, 207, -296, -612, -472, 48, 484, 563, 189, -289, -614, -371, -29, 384, 546, 253, -208, -543, -486, -45, 465, 665, 283, -156, -612, -457, -126, 383, 595, 325, -94, -535, -570, -141, 367, 574, 380, -96, -522, -560, -208, 381, 595, 454, 17, -477, -581, -303, 271, 565, 482, 24, -425, -606, -286, 181, 575, 515, 77, -406, -539, -377, 131, 551, 563, 210, -349, -633, -432, 54, 485, 606, 187, -278, -665, -457, 61, 549, 667, 285, -283, -601, -498, -51, 424, 607, 323, -187, -581, -549, -125, 391, 619, 376, -140, -592, -588, -122, 336, 648, 469, -87, -606, -583, -240, 275, 663, 483, 30, -513, -670, -304, 242, 612, 474, 34, -444, -667, -403, 194, 595, 582, 186, -441, -677, -446, 126, 562, 600, 203, -379, -672, -438, 54, 499, 623, 253, -327, -682, -459, -8, 512, 704, 322, -223, -650, -534, -60, 479, 688, 370, -201, -618, -590, -131, 417]
4064D17L25k72o55m50l7M70N72K97j77n24n32n9L58N92M01j73n46n84j14L51O34
4085B94M10o8n24o93q0K44O12M34om98n77k52K19O72M83lm34o70k42J58O12N18
4107F09M9l85o93k80J36N20O23J39l82n66n03Q5N72N69K32k74o63m86L6N14O69
4128E21J69k14o38m44p6M39O69K55j14o22n08j82L97O20N09j96o01n32j31K93
4148c86O61M74j11n64o39j37K43O25N44q6m87o03l29L05O21N17P4m98o32l49J77
4169e80O33N47J60m02o71l96J07N72O33J95m19o43m24M0N47O59J94k41o95n48
4189g32M6N17N98L51k14o78n85m9N10O41L75k23o15n90j41L97P04M59j55n12o61
4210e57k11L30P05M76m7n25p14k76L09P18N21M0n70o37m08K70O40O12J43n40o61
$$ y = [417, 742, 470, -185, -635, -672, -202, 370, 667, 490, -34, -566, -625, -267, 325, 726, 553, 7, -577, -691, -340, 294, 704, 636, 112, -581, -661, -417, 195, 629, 623, 125, -452, -704, -485, 187, 670, 667, 233, -437, -679, -521, 91, 609, 658, 273, -420, -700, -564, -44, 579, 718, 336, -230, -733, -648, -76, 493, 725, 451, -212, -698, -662, -148, 521, 690, 476, -162, -606, -682, -243, 426, 681, 567, -55, -563, -745, -348, 272, 781, 585, -16, -548, -679, -386, 275, 749, 638, 74, -565, -702, -459, 166, 710, 624, 137, -466, -795, -490, 131, 648, 722, 224, -408, -757, -580, 53, 600, 760, 358, -313, -709, -602, -30, 603, 798, 379, -264, -688, -648, -101, 558, 752, 511, -184, -732, -686, -169, 429, 780, 566, -112, -697, -746, -236, 405, 780, 557, -58, -648, -789, -392, 312, 771, 616, 104, -557, -768, -438, 267, 743, 696, 171, -543, -819, -510, 208, 729, 769, 199, -438, -846, -576, 64, 676, 819, 279, -382]
4231c82m05J73O42N96J78m52o74m05O0N65P03K20l28p60n31J06M92P26K82k73
4251E33o74n65p4N37O98L42k09o05o64j17M48P30L96j27o85n70j87L94P13M45
4271G59Ro24p05l04L41P50N09K1n86o80l53K42P49N68Q0m71o92m62K12O37O71
4292F71J62m89o80n02J89N56P19K64m09p54n08K2O47O45L32k70q19m86j61N84
4312b87P30L38j60p04o33j31M75P79M11j05o99o24k45L68Q15M28j4o64o71k58
4332h51L07P52N66Pn80o86l84L48O67O13R8o27o65m64K27P55N59K10m25p97n07
4353h77J50O97O34J80l21o84n67L2O24O52K83k61p42n05l2N26O67L58j91p37n28
4374f42j66M05P72M83k44n79p19j53M32O26N95j06o58p04j78L62P06N35l7n92
$$ y = [-382, -787, -614, 28, 624, 802, 350, -324, -729, -669, -104, 599, 819, 491, -269, -800, -694, -202, 524, 806, 533, -141, -706, -780, -243, 455, 797, 588, -17, -681, -798, -350, 380, 776, 649, -36, -606, -793, -399, 314, 759, 768, 144, -561, -865, -524, 226, 735, 756, 170, -510, -863, -621, 128, 696, 776, 305, -387, -849, -637, 0, 671, 833, 344, -336, -838, -649, -93, 626, 890, 481, -273, -781, -759, -112, 533, 865, 595, -224, -710, -871, -287, 443, 781, 621, -83, -716, -847, -372, 407, 818, 713, 14, -610, -855, -487, 328, 756, 742, 78, -593, -851, -544, 208, 774, 781, 201, -485, -869, -521, 146, 759, 857, 230, -435, -899, -672, 83, 642, 852, 427, -370, -877, -727, -30, 604, 784, 463, -221, -788, -756, -132, 520, 803, 542, -200, -705, -737, -211, 456, 814, 623, -114, -642, -808, -403, 369, 852, 608, 29, -690, -843, -411, 215, 810, 704, 46, -658, -836, -474, 232, 767, 730, 138]
4394A38o47k97K62O66O42N5n31p29l80J73O91O26J68m95p17n06K01O84O29J88
4414H21l57p47n12J2O02O91L33l15p13n73j3N83O51L90k75o32n60j77N35O02M37
$$ y = [138, -509, -806, -544, 122, 764, 819, 288, -441, -821, -648, 43, 669, 837, 342, -375, -881, -680, 4, 633, 821, 464, -283, -795, -783, -181, 510, 843, 528, -185, -758, -771, -188, 463, 853, 578, -54, -614, -791, -256, 346, 783]
$$ [...]
8191a89
##END NTUPLES=NMR FID
##END=
