##TITLE=1H_PR182-17
 D2O
 8 sc, 
 17.11.2021
##JCAMPDX= 6.0         $$ Bruker NMR JCAMP-DX V2.0
##DATA TYPE= NMR FID
##DATA CLASS= NTUPLES
##ORIGIN= UXNMR, Bruker Analytische Messtechnik GmbH
##OWNER= root
$$ XWIN-NMR		Version 3.5
$$ Thu Nov 18 11:13:25 2021 Russian Standard Time (UT+4h)  she@DPX200
##.OBSERVE FREQUENCY= 200.131346
##.OBSERVE NUCLEUS= ^1H
##.DELAY= (6, 6)
##.ACQUISITION MODE= SIMULTANEOUS
##.ACQUISITION SCHEME= undefined
##.AVERAGES= 8
##.DIGITISER RES= 18
##SPECTROMETER/DATA SYSTEM= spect
##.PULSE SEQUENCE= zg30
##.SOLVENT NAME= CDCl3
##.SHIFT REFERENCE= (INTERNAL, CDCl3, 0, 15.7039)
##AUDIT TRAIL= $$ (NUMBER, WHEN, WHO, WHERE, WHAT)
$$ ##TITLE= Audit trail, XWIN-NMR		Version 3.5
$$ ##JCAMPDX= 5.01
$$ ##ORIGIN= Bruker BioSpin GmbH
$$ ##OWNER= she
$$ F:/spectra/data/she/nmr/H-F/1/audita.txt
$$ ##AUDIT TRAIL=  $$ (NUMBER, WHEN, WHO, WHERE, WHAT)
(   1,<2021-11-18 11:12:10.06 +0400>,<she>,<DPX200>,
      <created by zg, POWCHK disabled, PULCHK disabled
       configuration hash MD5:
       00 E9 B6 7A A2 85 ED C7 34 08 36 98 17 FE 4E 26
       data hash MD5: 16K
       F9 CA 9B 1C FF 76 28 2C 28 0D 3F 7F 5D F5 C8 41>)
$$ ##END=
$$ 
$$ hash MD5
$$ 5C ED 75 71 1B 61 8B 59 6E AB 44 14 D7 B8 E1 D8
##$RELAX= 
##$RELAX= 
##$RELAX= 
##$RELAX= 
##$RELAX= 
##$RELAX= 
$$ Bruker specific parameters
$$ --------------------------
##$DU= <F:/spectra>
##$EXPNO= 1
##$NAME= <H-F>
##$PROCNO= 1
##$TYPE= <nmr>
##$USER= <she>
##$AMP= (0..31)
100 100 100 100 100 100 100 100 100 100 100 100 100 100 100 100 100 100 
100 100 100 100 100 100 100 100 100 100 100 100 100 100 
##$AQSEQ= 0
##$AQ_mod= 1
##$AUNM= <au_zg>
##$AUTOPOS= <>
##$BF1= 200.13
##$BF2= 200.13
##$BF3= 200.13
##$BF4= 200.13
##$BF5= 200.13
##$BF6= 200.13
##$BF7= 200.13
##$BF8= 200.13
##$BYTORDA= 1
##$CFDGTYP= 0
##$CFRGTYP= 5
##$CHEMSTR= <none>
##$CNST= (0..31)
1 1 145 1 1 1 1 1 1 1 1 1 1 1 1 1 1 1 1 1 1 1 1 1 1 1 1 1 1 1 1 1 
##$CPDPRG= <>
##$CPDPRG1= <>
##$CPDPRG2= <>
##$CPDPRG3= <>
##$CPDPRG4= <mlev>
##$CPDPRG5= <mlev>
##$CPDPRG6= <mlev>
##$CPDPRG7= <mlev>
##$CPDPRG8= <mlev>
##$CPDPRGB= <>
##$CPDPRGT= <>
##$D= (0..31)
0 1.2 0 0 0 0 0 0 0 0.06 0 0.03 0 0 0 0 0.0002 0 0 0 0 0 0 0 0 0 0 0 0 
0 0 0 
##$DATE= 1637219529
##$DBL= (0..7)
120 120 120 120 120 120 120 120 
##$DBP= (0..7)
150 150 150 150 150 150 150 150 
##$DBP07= 0
##$DBPNAM0= <>
##$DBPNAM1= <>
##$DBPNAM2= <>
##$DBPNAM3= <>
##$DBPNAM4= <>
##$DBPNAM5= <>
##$DBPNAM6= <>
##$DBPNAM7= <>
##$DBPOAL= (0..7)
0.5 0.5 0.5 0.5 0.5 0.5 0.5 0.5 
##$DBPOFFS= (0..7)
0 0 0 0 0 0 0 0 
##$DE= 6
##$DECBNUC= <off>
##$DECIM= 32
##$DECNUC= <off>
##$DECSTAT= 4
##$DIGMOD= 1
##$DIGTYP= 9
##$DL= (0..7)
0 120 120 120 120 120 120 120 
##$DP= (0..7)
150 150 150 150 150 150 150 150 
##$DP07= 0
##$DPNAME0= <>
##$DPNAME1= <>
##$DPNAME2= <>
##$DPNAME3= <>
##$DPNAME4= <>
##$DPNAME5= <>
##$DPNAME6= <>
##$DPNAME7= <>
##$DPOAL= (0..7)
0.5 0.5 0.5 0.5 0.5 0.5 0.5 0.5 
##$DPOFFS= (0..7)
0 0 0 0 0 0 0 0 
##$DQDMODE= 0
##$DR= 18
##$DS= 0
##$DSLIST= <SSSSSSSSSSSSSSS>
$$ [...]
##$SUBNAM2= <"">
##$SUBNAM3= <"">
##$SUBNAM4= <"">
##$SUBNAM5= <"">
##$SUBNAM6= <"">
##$SUBNAM7= <"">
##$SUBNAM8= <"">
##$SUBNAM9= <"">
##$SW= 18.0517287032376
##$SWIBOX= (0..15)
0 0 2 0 0 0 0 0 0 0 0 0 0 0 0 0 
##$SW_h= 3612.71676300578
##$TD= 16384
##$TD0= 1
##$TE= 0
##$TE2= 300
##$TE3= 300
##$TEG= 300
##$TL= (0..7)
0 120 120 120 120 120 120 120 
##$TP= (0..7)
150 150 150 150 150 150 150 150 
##$TP07= 0
##$TPNAME0= <>
##$TPNAME1= <>
##$TPNAME2= <>
##$TPNAME3= <>
##$TPNAME4= <>
##$TPNAME5= <>
##$TPNAME6= <>
##$TPNAME7= <>
##$TPOAL= (0..7)
0.5 0.5 0.5 0.5 0.5 0.5 0.5 0.5 
##$TPOFFS= (0..7)
0 0 0 0 0 0 0 0 
##$TUNHIN= 0
##$TUNHOUT= 0
##$TUNXOUT= 0
##$USERA1= <user>
##$USERA2= <user>
##$USERA3= <user>
##$USERA4= <user>
##$USERA5= <user>
##$V9= 5
##$VALIST= <valist>
##$VCLIST= <CCCCCCCCCCCCCCC>
##$VD= 0
##$VDLIST= <DDDDDDDDDDDDDDD>
##$VPLIST= <PPPPPPPPPPPPPPP>
##$VTLIST= <TTTTTTTTTTTTTTT>
##$WBST= 1024
##$WBSW= 4
##$XGAIN= (0..3)
0 0 0 0 
##$XL= 0
##$YL= 0
##$YMAX_a= 395839
##$YMIN_a= -393716
##$ZGOPTNS= <>
##$ZL1= 120
##$ZL2= 120
##$ZL3= 120
##$ZL4= 120
##$ABSF1= 10
##$ABSF2= 0
##$ABSG= 5
##$ABSL= 3
##$ALPHA= 0
##$AQORDER= 0
##$ASSFAC= 0
##$ASSFACI= 0
##$ASSFACX= 0
##$ASSWID= 0
##$AUNMP= <proc_1d>
##$AZFE= 0.1
##$AZFW= 0.1
##$BCFW= 1
##$BC_mod= 2
##$BYTORDP= 1
##$COROFFS= 0
##$CY= 11.3945322036743
##$DATMOD= 1
##$DC= 2
##$DFILT= <>
##$DTYPP= 0
##$F1P= 2.36226072786647
##$F2P= -0.459571619588291
##$FCOR= 0.5
##$FTSIZE= 0
##$FT_mod= 4
##$GAMMA= 1
##$GB= 0.15
##$INTBC= 1
##$INTSCL= 1
##$ISEN= 128
##$LB= 0.24
##$LEV0= 0
##$LPBIN= 0
##$MAXI= 10000
##$MC2= 0
##$MEAN= 0
##$ME_mod= 0
##$MI= 1.114404
##$NCOEF= 0
##$NC_proc= 0
##$NLEV= 6
##$NOISF1= 3.799351
##$NOISF2= 2.8
##$NSP= 1
##$NTH_PI= 0
##$NZP= 0
##$OFFSET= 15.70392
##$PC= 1
##$PHC0= -15513.92
##$PHC1= 5.600809
##$PH_mod= 1
##$PKNL= yes
##$PPARMOD= 0
##$PSCAL= 0
##$PSIGN= 0
##$REVERSE= no
##$SF= 200.130013532006
##$SI= 16384
##$SIGF1= 3
##$SIGF2= 2
##$SINO= 400
##$SIOLD= 16384
##$SREGLST= <1H.CDCl3>
##$SSB= 0
##$STSI= 0
##$STSR= 0
##$SW_p= 3612.71676300578
##$SYMM= 0
##$S_DEV= 0
##$TDeff= 0
##$TDoff= 0
##$TI= <>
##$TILT= no
##$TM1= 0
##$TM2= 0
##$TOPLEV= 0
##$USERP1= <user>
##$USERP2= <user>
##$USERP3= <user>
##$USERP4= <user>
##$USERP5= <user>
##$WDW= 1
##$XDIM= 8192
##$YMAX_p= 0
##$YMIN_p= 0
$$ End of Bruker specific parameters
$$ ---------------------------------
##NTUPLES= NMR FID
##VAR_NAME=  TIME,          FID/REAL,        FID/IMAG
##SYMBOL=    X,             R,               I
##VAR_TYPE=  INDEPENDENT,   DEPENDENT,       DEPENDENT
##VAR_FORM=  AFFN,          ASDF,            ASDF
##VAR_DIM=   8192,          8192,            8192
##UNITS=     SECONDS,       ARBITRARY UNITS, ARBITRARY UNITS
##FACTOR=    0.0002768,     1,               1
##FIRST=     0,             0,               0
##LAST=      2.2672688,     0,               0
##MIN=       0,             -393716,         0
##MAX=       2.2672688,     395839,          0
$$ Real data points
##PAGE= N=1
##DATA TABLE= (X++(R..R)), XYDATA
0@%%%%%%%%%%%Qj6J6j6J6k4L3m1N4o2P2q8J04j20J37j61J92k18K49k88L28l75
33b00M24m79N42o07O80p60Q48r48J053j169J298j435J587j755J936k133K349k588
51a357K850l141L468l828M234m696N220n828O539p387Q421r704J1354j3568J6712
66I289k1571L0150m9865J83725L2439l21840j66195q9848J29302K42107K65137
77B42830J18521j9206j89384k64392k16237l7943J12039K29993K48572J46046
87C70839m8833j83460k41058k01947o3616J27299K28341K23646J33357k1959j88626
98A33983k43708j79654n1507R9178K26154K29001J15661l2081j60276k35339j88729
109b87317m0655J07801J99137K17523J27795l6167j67519k11162j75661n5790
$$ y = [0, 0, 0, 0, 0, 0, 0, 0, 0, 0, 0, 0, 8, -8, 8, -8, 8, -16, 17, -24, 30, -32, 40, -48, 56, -64, 73, -88, 104, -114, 135, -153, 175, -200, 224, -255, 287, -320, 360, -400, 448, -500, 553, -616, 682, -753, 834, -921, 1015, -1118, 1231, -1357, 1493, -1648, 1820, -2008, 2226, -2470, 2750, -3078, 3461, -3926, 4495, -5209, 6145, -7423, 9289, -12282, 17868, -31997, 151728, 184167, -137673, -303868, -393716, -264414, -22307, 242830, 361351, 342145, 152761, -111631, -327868, -365811, -253772, -23779, 224793, 370839, 322006, 138546, -102512, -304459, -368075, -240776, -12435, 211211, 344568, 322609, 133983, -109725, -289379, -340886, -241708, -15554, 213447, 329108, 297027, 136751, -98588, -287317, -327972, -220171, -21034, 196489, 324284, 288117, 120598, -90564, -266225, -322015]
119c22015J05521K05497J97735J14819j8717j60019k17978j60754m4494Q7684
129b12721J93764K04777J06555k8503j42713k03832j68575m2167R5308J78496
139a9611J90013J15121k5587j48152j91272j55181n0725Q7822J82178J80783J03463
150B68852j6703j37415j93521j49963m1457P8910J69682J82939J01784k2791j29473
161A10844j81382j51208m3772Q2669J62422J71490J03753j8147j30095j75944
171f9370j41589m6067P5741J61120J67601R6697j4943j22405j73119j39702m1580
182b47616P1797J53922J64293R6167j6231j18870j65877j36771m2847P0450J49967
193b1616J58844R4262j4548j15416j61907j33495m1788O8546J45063J54995R2871
$$ y = [-322015, -216494, -10997, 186738, 301557, 282840, 122821, -95157, -255911, -300405, -212721, -18957, 185820, 292375, 263872, 121159, -82673, -251248, -293415, -198107, -19611, 170402, 285523, 259936, 111784, -79488, -234669, -285394, -197572, -15394, 165389, 268852, 252149, 114734, -78787, -228750, -270207, -191297, -21615, 161324, 263108, 240317, 110844, -70538, -221746, -265518, -182849, -20427, 151063, 254816, 236669, 106574, -69370, -210959, -257026, -181285, -20165, 147436, 244133, 229190, 106785, -66334, -206036, -247616, -175819, -21897, 142396, 238563, 222332, 103462, -62415, -199186, -242033, -171583, -21616, 137228, 231490, 216942, 101526, -60381, -193876, -235664, -167118, -22055, 132940, 225811]
204B25811j3649j12874j57489j29198m3197O6412J42818J50538Q9174j0690j08907
215I8749j55752j26227l9724O1811J37543J50508Q7785j3983j03899j49228j27225
226a79642m0605O4726J33038J42612R0090j0344j06654j45456j19247m3465N8617
237a56330J35174J40575Q2285o845r8593j47865j19031l6377N5156J25622J42528
248A16299Q5236j3683r5972j36695j21295m1744O0969J24163J31570Q6437n597
259A89688j00315j37478j10437m1938N0703J27358J34085P6166n913q8398j38791
270d5270j15462l3839N2332J14550J33687Q3965j2470r0814j26400j13690m3233
281a96644N6585J18500J22089Q0802j147r3357j31643j03204l9074M4223J18764
$$ y = [225811, 212162, 99288, -58201, -187399, -230596, -164184, -21366, 129172, 218346, 207656, 98749, -57003, -183230, -222954, -161143, -23600, 126908, 214693, 200710, 96811, -52417, -179642, -220247, -155521, -22483, 120129, 210219, 199875, 93221, -52235, -171482, -214947, -156330, -21156, 119419, 201704, 194859, 96266, -51599, -170630, -207007, -151851, -26229, 116299, 201535, 187852, 91880, -44815, -166110, -207854, -146885, -22722, 108848, 195285, 189688, 89373, -48105, -158542, -200480, -149777, -22419, 111666, 187832, 181919, 93521, -45270, -160732, -194571, -142239, -27689, 105998, 189963, 177493, 86679, -39721, -153411, -196644, -140059, -21559, 100530, 181332, 180185, 86828, -44815, -148019, -187093, -142870, -24106]
292b4106J29239P2056o951q0658j29042j12115l2529N0635J06013J25051Q1978
303A79571j0534q7669j17900j05492m3851N1289J13944J15228P4362J055q5299
314H4704j26098r8704l5292M0261J08929J23978P0521p864p4640j19557j08004
325a41766l3687M8883J00121J15304P9119n597q3968j12064r7815m3098M4214
336a30354J08575J10626O9331K400p6562j20726r5777l2486L6828R9199J18219
347H9273P0201o758p1132j09988j02649l6479M5331R5348J07544P5985r13p8326
359G7437j08102r2078m0907L7478J01362J07426O6443K655o9251j12752r4362
370a24651l2592L5388R1845J10836P0356m915o8216j02905r6425l7863M0899R2055
$$ y = [-24106, 105133, 177189, 170238, 89580, -39462, -151577, -184106, -133471, -27458, 97593, 179571, 169037, 81368, -36532, -142024, -185875, -134586, -20642, 94586, 168948, 170003, 84704, -41394, -140098, -175390, -135129, -26200, 97778, 168299, 160435, 85795, -33762, -141766, -175453, -126570, -26449, 88855, 167974, 162377, 78409, -33655, -131470, -174568, -130354, -21779, 88847, 158178, 160578, 84016, -36710, -132487, -164973, -128145, -28946, 89273, 159474, 152716, 81584, -28404, -131053, -167532, -122201, -26853, 80691, 156676, 155763, 77437, -30665, -122743, -163650, -126172, -24810, 82616, 149059, 151714, 82463, -30289, -124651, -157243, -121855, -30010, 80826, 151182, 146267, 78051, -24854, -121279, -159142, -118243, -26188]
382b6188J01763P1289J736p2199j04513q7936l8109L3512R4250J04171O4284J156
394A43216o4302j05030r1495l2651L4464Q6727J03421O8413j985o5666r8849q9477
406a13214l7599L6319Q8463R7763O6560K430o5746r9970q5730l5242L1428Q7265
418b7273R9836O3259R83o1890r7882q7156l3911L2811Q3265R7342O5228N24o2143
431G2993r4996q4907l5361L2003Q3503R4585O3232J992o0253r4526q3371l4431
443a39537L0735Q1778R3400O2702J944n9046r2508q2276l4239K9879P9827R2682
455F5341O1187K291n7348r1360q1738l2845K9091P7492R1460O1457J295n6633
467F9690q8008q0553l4582K9792P7362Q7727O0401M109n6924q8387p7113l3145
$$ y = [-26188, 75575, 146864, 148600, 76401, -28112, -116048, -154157, -120645, -26395, 77776, 142060, 143216, 78914, -26116, -117611, -150262, -115798, -29071, 74350, 142763, 140778, 75112, -23737, -113214, -150813, -114494, -26031, 71732, 138292, 140722, 74976, -24994, -110724, -145966, -114538, -27273, 72563, 135822, 136805, 74915, -22967, -110123, -144034, -111223, -27958, 69384, 134612, 135136, 72993, -22003, -106910, -142271, -110268, -26765, 67820, 131052, 133044, 72791, -21735, -105106, -139537, -108802, -27024, 66376, 129078, 131022, 71976, -20532, -102808, -137047, -107168, -27341, 65341, 126528, 128819, 71471, -19889, -101627, -134472, -105381, -27889, 63571, 125028, 126323, 69690, -18318, -98871, -133453, -103661, -26299, 61428, 121829, 125938, 69014, -19373, -96486, -129631]
479a29631K5934P6648Q9140N7108K642n2536q7303p8682l0971K8211P1883Q6796
491E9239N9846J612n5133q2120p5876l4955K8330P4585Q2373N6563N760n3062
503F7162q5854p2682l0503K2794P1835Q6175N4258J727m8320q1648p6843k9845
515a21744K7846O6874Q1251N8882K445n3032p7495p0965l5086K4777P2364P8349
527E4466N2622P073m8728q2442p0001k7838K0922O5824Q3192N3309N03m5446p5368
540a1912p4396l0152K6905O3440P5607N7137M697n0896p4576o6183l3716K1129
552i2916O8993P6177M8878O606m3801p8626o8265k6148K0088O0828P9185N2610
564A03609R7m4151o9951p0330l1131K5857O2118P0421N3614O259m7946p2733o2167
$$ y = [-129631, -103697, -27049, 62091, 119199, 121841, 69305, -17998, -96680, -127651, -99440, -27557, 59239, 119085, 120697, 65564, -16556, -92432, -127387, -99057, -24472, 57901, 114464, 120224, 67162, -18692, -91374, -121877, -99083, -27248, 58927, 113185, 114912, 66592, -15056, -91899, -121744, -93898, -27024, 54227, 113109, 115554, 62522, -14973, -85938, -121024, -96247, -23883, 54466, 107088, 114161, 65433, -17009, -87010, -114848, -93926, -28102, 55090, 108399, 108902, 63456, -11912, -86308, -116460, -89555, -26115, 49492, 106629, 111326, 60430, -14146, -80329, -114045, -92916, -23923, 52254, 101132, 107738, 63937, -14689, -82954, -109102, -89014, -28186, 50999, 103609, 103706, 59555, -10396, -80726, -111857, -86000, -23882, 46539, 100153, 106412, 58466, -14267, -76434]
577g6434l1057J8845O4790P3806M6694N330m1137p3679o6794k4831K0876N7015
589b6576P3790N1823N16m3545o6112o5540l0742K3548O0585O7310M9121P273m5110
602E6341p0346n9374k8035J7080O0469P1537M5070L419l8481o8732o4512k4691
614a00255K0649N4817O8923M9968J843m2594o3431o1238k9703K0865N8686O4663
626D3193M6070O914m1058o7474n8339k5507J6415N5987O8448M4471K425l6858
638E4687o4193o1552k5290K0222N2551O4941M7148L522m0213o1921n7174k8180
650i5452J8364N5410O3327M3616N587l7777o4061n6516k4784J6575N2568O4633
662D1490M3553L149l6653o0662n7566k5536J8538N1574O1857M4012M460l7728
$$ y = [-76434, -107491, -88646, -23856, 49950, 96644, 101974, 60837, -12842, -79636, -104467, -83591, -26576, 47214, 99037, 99553, 56008, -10104, -75644, -106386, -82838, -22253, 45057, 94178, 101451, 56341, -14005, -73379, -101414, -84334, -23865, 47672, 92742, 96161, 57680, -11052, -75564, -100255, -79606, -24789, 44134, 94102, 95945, 53351, -10080, -71318, -101021, -80156, -21470, 43193, 89263, 96177, 55119, -12355, -70694, -96201, -79786, -23799, 44649, 89120, 91545, 54687, -9506, -71058, -96348, -76126, -23575, 41366, 88514, 92036, 51823, -10098, -67272, -95452, -77088, -21678, 41649, 85265, 90852, 53075, -10986, -67502, -92286, -75711, -23143, 41490, 85043, 88192, 51539, -9123, -66689, -92225, -73687, -22113, 39744, 83756, 88216, 50488]
674E0488o0032n5125k5941J6782N2337O0959M2286M686l5944o0173n4460k4663
686h8800J6684N0056O0867M2202L745l5401n7983n4622k4261J6261M9781N9474
698C8003M1678M153l4838n7377n3856k4055J6107M8814N8485M1574L994l4354
710D8328n6677n2148k4718J5810M8741N7182M0178N010l3435n6549n1774k3334
722h3386J4447M6934N8138L9867L597l1975n4244n2592k3784J6036M5720N5491
734C4249M0866N009l4050n3512m9260k4891J3816M7247N5204L7555O214l0934
746D7513n4981n0228k1474J3209M3557N6295L9379K936l0500n0775n0888k4192
758h0149J6031M3799N1903L9760N705l1975n2099m6605k3654J1795M5447N3597
$$ y = [50488, -9544, -64669, -90610, -73828, -21491, 39468, 81754, 86440, 50496, -9677, -64137, -88800, -72116, -22060, 38807, 81009, 84754, 49353, -8630, -63252, -87513, -71252, -21471, 38003, 79681, 83834, 48996, -8381, -62237, -86292, -70185, -21371, 37114, 78688, 82682, 48328, -8349, -60497, -85215, -69405, -20664, 36518, 76696, 81706, 48271, -8278, -60052, -83386, -68939, -22005, 36133, 76000, 79597, 47622, -6622, -59214, -82998, -66962, -21242, 34249, 75115, 80124, 46074, -7438, -56698, -81589, -67773, -20526, 34678, 72233, 78447, 47513, -7468, -57696, -79170, -65961, -22404, 33891, 73270, 76206, 45706, -5069, -55957, -80149, -64118, -20319, 31584, 71344, 77049, 45074, -7025, -53630, -77284, -65489, -20042, 33555]
770C3555L5117N750k8098n2604m8976k0477J3481M0045N4077L8708K577k9961
782D3194m7733m8144k4215J4788M3095M9081L6825P492l0795n0663m4435k1894
794g3404J0123M3050N2430L3941M358k6052m9429m8065j9643J3316L8129N0567
806B9321L8003L100k9407m5406m4961k4121J3412M2005M6906L4464P453k8159
818D2610m9437m2598k0049R203L9989N0485L3686L035k4819m5845m6685j9752
830g0177J3863L6731M6906L6834L852k8974m3677m2157k2908J1561M0827M5539
842B8220L2276O856k6207m7499m1605j8159R512L6986M8610L2465K730k4558m3453
855c826m4142j9323J3148L5939M4011L4659N228k8209m2821l9260k1415J0460
$$ y = [33555, 68672, 74422, 46324, -6280, -55256, -75733, -62252, -22207, 31870, 70578, 73155, 43194, -4539, -52683, -76898, -62110, -19015, 30066, 66891, 74383, 43588, -7075, -51510, -73404, -63281, -20231, 32199, 66140, 70498, 44446, -4983, -53048, -72691, -59375, -21246, 29321, 67324, 70424, 41017, -4389, -49350, -73471, -60059, -18054, 28852, 63316, 70769, 42610, -6827, -49425, -69474, -60271, -20282, 30203, 63889, 66924, 42105, -3740, -50425, -70177, -56314, -19583, 27323, 64157, 68009, 39035, -4642, -46799, -69707, -58146, -17319, 28220, 60496, 67352, 41145, -6354, -47959, -66118, -56606, -19620, 28990, 61455, 64185, 39627, -3826, -47968, -67291, -54143, -18204, 25807, 60466, 65694, 37485, -5336, -44596, -66011, -55551]
867e5551L8579M4465L0477N515k4481m4650m0476j7496J0154L5129M5631L1824
879E9120K387k4477m1001m1182j9482J2425L5657M2089L2177M862k6351m2050
891e826l7844j8872R903L6166M3219K9305M220k3424m1980l9305j7163J0860L3747
904a6994M2851L0853K873k4354l9693l8555j8743J1405L4804M0790K9515M518
916E9270k4080m0436l7060j7527R718L3954M1713K8400L820k2924l9884l7249
928d2285j7122J0867L2842M0448K8926L536k3074l8968l6412j7558J0413L2963
940a5424L9933K8339L673k2919l8489l5940j6783J0008L2366L9408K7850L632
952E5654k2641l7667l5678j6662R842L2056L9232K7189L695k2222l7587l5463
$$ y = [-55551, -16972, 27493, 57970, 63485, 39004, -5646, -46122, -63618, -53464, -18335, 27296, 59120, 61507, 37030, -3971, -45153, -64635, -52210, -16553, 25536, 57713, 62575, 36224, -5826, -43670, -62542, -52639, -16473, 26746, 56051, 60271, 36847, -5133, -44438, -61601, -50741, -16994, 25857, 56710, 59583, 35229, -4464, -43019, -61762, -50357, -15553, 25237, 54752, 59270, 35190, -5246, -42306, -59833, -50115, -16161, 25552, 53952, 57772, 34848, -5036, -42285, -59407, -48540, -15698, 24750, 53676, 57212, 34138, -4830, -41242, -58800, -48387, -15424, 24509, 52848, 56521, 33602, -4887, -40827, -57610, -47602, -15236, 24172, 52022, 55654, 33013, -4654, -40332, -56994, -47152, -15096, 24136, 51325, 55020, 32798, -4789, -40252]
964d0252j5772R843L1164L8657K7653K493k1786l6372l4867j6820J0532L1586
976a3941L6994K6925M045k2537l6817l3240j6061Q989L1608L7831K5583L004k0786
989C1597l6235l4717j4825J0242K9493L6981K6901K567k1979l4582l2836j6780
1001e4173J0368L1170L4956K5314M434k1614l6168l1711j4449Q325K9694L7128
1013B3274K4408K256j9490l4462l3800j4363J0500K8112L4794K6524K541k1810
1025B8484l3108l1300j6191R458L0617L3862K3628M495j9982l5561l0613j3528
1037d9739Q024K8133L6166K3656J434j9173l2013l3133j3962J0810K7151L2669
1049B0023K6010K966k1914l1939k9375j5278Q533K9272L3232K2230L768j8461
$$ y = [-40252, -56024, -46181, -15017, 23640, 51293, 53786, 32000, -4372, -39239, -56059, -45527, -13941, 23053, 49978, 54023, 31486, -5331, -38571, -54632, -45643, -14035, 23796, 49379, 52383, 31597, -4638, -39355, -54180, -43938, -14445, 22536, 49437, 52004, 30025, -4557, -37393, -54173, -43805, -12635, 22321, 47635, 52069, 30455, -5713, -37424, -51873, -43548, -13854, 23274, 47682, 49938, 30448, -4014, -37814, -52177, -41677, -13565, 21229, 47753, 50294, 28484, -4624, -35924, -52115, -42657, -12040, 21822, 45450, 49945, 29963, -5598, -36211, -49739, -41715, -13582, 22584, 46240, 47674, 28501, -3512, -36645, -50607, -39797, -12646, 20023, 46033, 48999, 27085, -4854, -34229, -49507, -40974, -11702, 21530, 43760, 47528, 29067]
1061B9067l4466l0238j2170Q124K6417L4715K3550P05j8309l0725l1321j4566
1073d9217J0705K7071L0836K4465L306k0638l1962k7275j4800P608K8573L2563
1085B1235K0904L237j7222l3042k9784j1677Q505K5149L3082K3489N62j8833k9167
1098c562k9330j4528R997K6794K9917K2457L629j9336l1540k6893j2709O863K7280
1111a0961L1578K0504K111j6543l1101k8940j1459Q763K4205L0756K2926J613
1123D3452j8929k8461k7523j4069R288K6061K9129K0934L511j8261l0053k6333
1135c1254j2220P048K5241L0972K0380J463j6453k9284k7948j1754Q928K3909
1147a0972K9589K1585J604j7948k8250k6109j2983Q268K5234K8697J9950K784
$$ y = [29067, -5399, -35637, -47807, -39683, -13266, 21449, 44999, 45704, 27395, -3330, -34651, -49217, -38512, -11441, 19395, 43860, 47166, 26528, -5434, -32709, -47509, -39901, -11328, 21235, 42139, 45376, 28154, -4888, -34672, -46349, -37844, -12695, 20387, 43876, 44438, 25605, -3562, -32892, -47420, -37423, -10629, 19288, 41745, 45374, 26038, -5502, -32395, -45104, -38241, -10961, 20617, 41121, 43232, 26689, -4412, -33352, -44811, -36048, -11843, 18913, 41839, 43452, 24523, -3938, -31461, -45530, -36242, -10181, 18948, 39882, 43393, 25132, -4921, -31254, -43474, -36426, -11185, 19787, 40167, 41630, 25177, -4107, -32055, -43809, -34881, -10972, 18617, 40202, 41806, 23858, -4392, -30501, -43484, -35216, -9982, 18715, 38665, 41449]
1159D1449j7167k9061k5979j1374P710K3850K9541J9957J084j6542k7784k6311
1171c0627j1517Q724K3407K8228K0181J877j7367k7642k5088j1763Q247K3799
1183i541K8022J9359J690j7016k7261k5233j0909P837K3767K7659J8649J996j6929
1196B2090k6758k4984j0753P871K3201K7597J8752J242j6414k6648k4526j0601
1208c9931P962K2798K6776J9235J201j6711k6133k3986j0726P983K2954K6215
1220A7637J8309J872j6252k6691k3338j0257P294K2398K6762J7785R44j5392k5434
1233d363k4046j0194Q447K1783K5585J8226J353j6440k5256k2566j0807P710K2605
1246g963K5460J6890J645j5014k6345k2501r098P169K1007K6280J7749k45j5238
$$ y = [41449, 24282, -4779, -30758, -42132, -34422, -10572, 18969, 38926, 40010, 23468, -4316, -30627, -42144, -33420, -10013, 18215, 38396, 40273, 22906, -4736, -29824, -41587, -33340, -9541, 18481, 37840, 39530, 22514, -4747, -29980, -40889, -33052, -9285, 18374, 37023, 39019, 22090, -4668, -29652, -40405, -32534, -9333, 18264, 37016, 38258, 21844, -4804, -29330, -39931, -31969, -9171, 17605, 36840, 38041, 21330, -4803, -28789, -39515, -31532, -8578, 17637, 35946, 37818, 21566, -5125, -28463, -38720, -31426, -9028, 17734, 35519, 36463, 21071, -4363, -28409, -38603, -30156, -8373, 17212, 35438, 36791, 20351, -4905, -27471, -38278, -30568, -7963, 17497, 34387, 36032, 21018, -5327, -27828, -36926, -29757, -8750, 17530, 35279, 35034, 19796]
1259A9796k4146k3254j0136Q708K0997K4242J8170J504j6551k4875k1014r932
1271c6491O786K2094K5413J5269J377j4430k5354k2490p807P473J9533K5569J7204
1284C4146l54j5103k2872k2460r824Q473K1298K2672J6804J913j6069k4530j9949
1297b5855r230O718K1224K4465J5197K96j3212k4649k2095p738P748J9490K4127
1310A6486J6994o23j5468k1851k1228r575Q194K0976K1982J5609K003j5521k3754
1323e776j9737q191O120K0306K4503J4623n1j3414k2882k1722p684Q054J8934
1336f917K2573J6634j23j5456k1589j9534r909P623K0901K2094J4247J266j4235
1349A7575k3405j9284p477O301J9134K3987J4132m52j3419k1467k1038p771Q435
$$ y = [19796, -4350, -27604, -37740, -29032, -8035, 16207, 34377, 35881, 19330, -5545, -26559, -36491, -29705, -7611, 17802, 33071, 34448, 20018, -5336, -27826, -35633, -28160, -8627, 16942, 34146, 33792, 18689, -4183, -26643, -36467, -27994, -6696, 15976, 32780, 34693, 18624, -5906, -25855, -35085, -28367, -7143, 17322, 32519, 32815, 19603, -5046, -27141, -34879, -27131, -7641, 16486, 33480, 32857, 17389, -4462, -25690, -35265, -27071, -6095, 15887, 31496, 33499, 17978, -5776, -25513, -33704, -27584, -7278, 17225, 31848, 31797, 18383, -4499, -26221, -33905, -25851, -6917, 15656, 32290, 32167, 16711, -4878, -24412, -34321, -26698, -5797, 16297, 30544, 31810, 17575, -5830, -25114, -32591, -26290, -7156, 16831, 30963, 30511, 17092, -4375, -25413, -33184, -24749]
1362b4749J8584K1531J5436M12j5188k1376j8747q515P259J9933K1241J3740P62
1375C0323j3481k2559j8864p047O953J8229K2474J4356p51j3561k0681j9834p800
1388c2243Q469J8165K0681J4513L71j4440k0950j7955q039O945J9203K1038J2923
1401B8681O43j3379k1219j8554o938P100J7762K1115J4097n10j3500k0161j8331
1414b3194p842P350J8493K0001J3816L00j3634k0478j7903p164O914J8213K0445
1427A5317J2953j55j2998k0218j8034o766P117J7874J9957J2864R4j3337j9841
1440e173j7593o877P095J7538J9985J2935k88j3104j9754j7401o733P183J7384
1453d803J9493J2701k07j2746j9786j6842o700O954J7144J9714J2119J50j2959
$$ y = [-24749, -6165, 15366, 30802, 31214, 16026, -5350, -24097, -32612, -25353, -5420, 15821, 29561, 30323, 16842, -5717, -24581, -31628, -24675, -6446, 16028, 30384, 29633, 16072, -4609, -24443, -32243, -23774, -5609, 15072, 29585, 29956, 15516, -5434, -23389, -31428, -24483, -5280, 15758, 28681, 29324, 15945, -5274, -23828, -30766, -23666, -5904, 15211, 29308, 28798, 15298, -4863, -23194, -31036, -23686, -5193, 14808, 28624, 28924, 15290, -5188, -23091, -30255, -23341, -5128, 15317, 28270, 28115, 15117, -5101, -23135, -29901, -22784, -4910, 15047, 27911, 28005, 14668, -5173, -22766, -29643, -22548, -5010, 14975, 27910, 27622, 14518, -5236, -22637, -29370, -22187, -4803, 14690, 27391, 27184, 14438, -5348, -22190, -28890, -21936, -4792, 14922, 27041, 27191, 14232]
1466A4232j9572j6783o335O741J6785J9544J2780p19j3051j8669j7099o478P192
1479b1432J7211J8500J2149M00j3260j9273j5927o401O485J6894J9299J1468k67
1492B5846j1931j9264j6471n812O955J6004J8813J2501q20j2839j7863j6190p058
1505b8129P258J6948J7820J1987l1j2489j9029j5185n892O004J6144J9336J0805
1518B5547r20j1108j8534j6601n013P144J5283J7872J2366j132j2654j7112j5430
1531b0292p040P233J6975J6828J1266rj2109j9013j4889m681N740J6012J8662
1544A4683J0244j344j1011j7742j5840n485P581J5455J7052J1721q15j2942j6880
1557e323j4739o132O705J6755J6697J0026p8j1675j8151j4580m256N947J4870
$$ y = [14232, -5340, -22123, -28458, -21717, -4932, 14612, 27392, 26673, 13622, -5047, -22146, -28624, -21432, -4221, 14279, 26428, 26828, 13568, -5705, -21632, -28033, -21548, -4654, 14645, 26113, 25846, 13915, -5349, -21820, -27632, -20677, -4673, 14140, 26641, 25821, 12982, -4881, -21071, -28129, -20871, -3923, 13897, 25884, 25853, 13364, -5665, -20850, -26742, -20738, -4594, 14742, 25547, 24627, 13519, -5015, -21616, -26629, -19485, -4202, 13670, 26036, 24904, 12250, -4862, -20292, -27332, -20099, -3124, 13704, 24970, 24961, 12852, -6161, -21050, -25731, -19991, -3979, 14683, 24927, 23583, 12572, -5170, -21010, -26495, -18914, -3459, 13593, 25314, 24499, 11557, -5323, -20062, -26194, -19489, -2734, 13963, 23989, 23911, 12236, -5915, -20495, -24751, -18804, -3934]
1570c934J7899J0797k030j0976j6638j5526n507P780J5188J6041J1182o31j2411
1583A1234j7059j3543n532N727J6321J6776R291k10j1025j7590j4523m457O625
1596a7965J4188J7280J0743j858j1120j6220j4584n555P571J4583J5812J0497
1608B3372n39j1724j6705j3438m994N695J5353J6667R191p27j0658j6837j4240
1621a9584m190O525J3788J6474J0495j616j1342j5354j4044n620P164J4861J5248
1634A2805R649k77j1555j6345j3088m664N825J4725J6334R150j224j0273j6486
1647e424j3560m271O438J3791J5733R694j235j0917j5502j3149n061O543J4283
1660b637J5365R404r63j0679j5959j3139m279O459J3757J5416R197j093j0294
$$ y = [-3934, 13965, 24762, 22732, 11756, -4882, -20408, -25915, -18135, -2947, 13094, 24276, 23645, 11234, -5825, -19368, -24900, -19173, -2852, 13924, 23215, 23005, 11980, -5610, -20133, -24590, -17965, -3777, 13503, 24246, 22388, 11268, -4952, -19536, -25091, -17520, -2937, 12875, 23372, 22833, 11109, -5596, -19034, -24028, -18333, -2980, 13687, 22878, 22151, 11493, -5344, -19584, -23774, -17249, -3461, 13013, 23508, 21892, 10550, -4804, -18848, -24468, -17304, -2443, 12805, 22454, 22177, 10622, -5723, -18811, -23475, -17650, -2925, 13409, 22559, 21335, 11062, -5424, -18984, -23255, -16817, -3026, 12707, 22401, 21166, 10249, -5253, -18402, -23463, -16920, -2637, 12728, 22132, 21169, 10490, -5469, -18608, -22887, -16428, -2671, 12745, 21942, 20849, 10555]
1673A0555j5654j3217m584O544J3992J4741R445r77j0967j5129j3010m301O128
1686a6434J3899J4957R145r08j0548j5498j2467m338O154J3527J4806R167j022
1699B0440j0503j5242j2419m536O190J3680J4884Q660q85j0543j4736j2884l962
1712b1856O084J3218J4370R036p85j0661j4441j2300m537O220J3707J3965Q565
1725B0585q01j0368j4799j2149l733N757J3131J4903Q065j376r840j4446j2642
1738a7713l598O437J2911J3375R286j285j0483j4197j1313m616N967J3608J3631
1751A2010P730m03r877j4728j1878l317N619J2469J4331Q277j825r553j3689j2053
1765a6887l881O487J2163J3205Q738q13j0518j3882j0719m252N501J3139J3317
$$ y = [10555, -5099, -18316, -22900, -16356, -2364, 12377, 21822, 20845, 9878, -5251, -18261, -22562, -16434, -2535, 12422, 21567, 20659, 10111, -5387, -17854, -22192, -16038, -2511, 12295, 21462, 20440, 9937, -5305, -17724, -22260, -16070, -2390, 12494, 21154, 20269, 9726, -5010, -17894, -21856, -15772, -2554, 11816, 20852, 20067, 9406, -5035, -17335, -21872, -15652, -1945, 12020, 20585, 19784, 9416, -5383, -17532, -21265, -15508, -2377, 12526, 20591, 19215, 9375, -5071, -17713, -21311, -14874, -1963, 11412, 20698, 19413, 8930, -5267, -16580, -21196, -15229, -1621, 12010, 19740, 19337, 9460, -5268, -17146, -20463, -14844, -2375, 11956, 20233, 18408, 8855, -4834, -16887, -20768, -14281, -2118, 11087, 19825, 19012, 8494, -5388, -16107, -20359, -14858, -1719, 11598]
1778A1598P487o10r267j4376j1617k906N468J1925J3722Q412j971r481j3225j1440
1792a6281m237O701J2277J2308Q467o44j0115j3768j0378l935M928J3049J3264
1805A1636P103j249q778j3704j1375k949N866J1216J3455P727j598r560j2397
1818d607j1213l877O259J2235J1940P604m40r908j3524j0129l107M893J1828J3657
1832A1611O562j358q551j3153j0858k995N880J0873J2602Q197j680r622j2316
1845d808j0310m024O041J1938J1942O947o58q927j3267j0346k451M375J1756J3023
1859A1231O812j680q796j2249j0773k808N526J1208J1734P813j298r608j1976
1872d864j0016l505N386J2071J1678O381q38q580j2872j0055k554M885J1114J2454
$$ y = [11598, 19085, 18475, 9208, -5168, -16785, -19691, -14223, -2298, 11424, 19836, 17865, 8384, -4841, -16281, -20518, -13817, -1540, 10768, 19235, 18591, 8476, -5292, -15670, -19605, -14677, -1628, 11636, 18739, 17490, 8712, -4992, -16367, -19316, -13450, -2234, 11221, 18948, 17350, 7790, -4607, -15820, -19697, -13438, -1203, 10737, 18341, 17901, 7993, -5531, -15660, -18767, -13874, -2046, 11611, 18173, 16815, 8264, -4889, -15747, -18742, -12862, -1989, 10613, 18810, 17130, 7508, -4808, -15118, -19142, -13101, -1163, 10779, 17726, 17068, 8141, -5126, -15472, -17923, -13548, -1792, 11231, 18043, 16363, 7567, -4682, -15455, -18263, -12737, -1529, 10205, 18018, 16720, 7112, -4864, -14880, -18385, -12999, -928, 10750, 17131, 16293, 7713, -5159, -15214, -17768, -12883, -1769, 10685]
1886A0685P169k083q535j2028j0191k983N435J1351J1271P269j079r275j1996
1899d990r476l123N060J1501J1490O407p66q711j2461r403k950N143J0813J1648
1913A0182O940j508q586j1538r794k974N254J0991J1056O931j072q899j1773r635
1927a4425k827N219J0479J1560O477j194q272j1848r263l031N154J0817J1015
1940I861O797j414q141j1580r563k740M981J0554J1357O032j048q214j1481r389
1954a3988k531N151J0282J0591O752j350q221j1186r417k485M721J0524J0876
1967I719O388j351p801j1619r038k458M881J0167J0766O325j300q352j0707r074
1981a3454l016N408J0071J0349O438j009q402j1080q671k585M849J0026J0948
$$ y = [10685, 17854, 15771, 7236, -4792, -14983, -17966, -12531, -1180, 10091, 17360, 16281, 7006, -4990, -14466, -17589, -12529, -1028, 10462, 16869, 16103, 7392, -5069, -14472, -17422, -12279, -1466, 10182, 17122, 15614, 7028, -4510, -14304, -17278, -12024, -1033, 10023, 16954, 15882, 6983, -4790, -14425, -17252, -12033, -1554, 10006, 16483, 15289, 7017, -4831, -14094, -17125, -11971, -1154, 9861, 16658, 15244, 7103, -4477, -14040, -16780, -11799, -1245, 10112, 16144, 15096, 6882, -4599, -13988, -16519, -11368, -1086, 9505, 16257, 14907, 6686, -4500, -13917, -16402, -11681, -1157, 9719, 16107, 14756, 6955, -4664, -13702, -16160, -11279, -1112, 9654, 15979, 14679, 6327, -4380, -13454, -16470, -11062, -991, 9358, 15796, 14787, 6385, -4695, -13366, -15951, -11102, -1076, 9872]
1994I872N462j059p714j0895r079k225M846R554J0477O377j326q261j0225q930
2008a3126k761M932J0353R464O129o36p930j1103q034k568M415R855J0362N649
2022A5001j261p354j0897q519k088M671R270R939O278j332p827r909q280l260
2036a5568M704J0403R435N380n55p604j0819p926k232M040R707R903N941j543
2050A3266p285r801r053k012M885R303R287O119j245p953r715p884l003M495J0024
2065e72R355N545j033p220j0685p697j860M069R132J0068N312j804o656j0041
2079d087q303k291N096Q802R241N743j210p742r551p267k700L939R475R558M887
2094A3590q79o540j0398p856j739M248Q271R872N490j597p260q745q150k547M865
$$ y = [9872, 15334, 14275, 6561, -4334, -13413, -15638, -10792, -1238, 9239, 15616, 14290, 6029, -4196, -13126, -15887, -10955, -602, 8862, 14991, 14355, 6425, -4678, -12712, -15280, -10865, -1010, 9352, 15001, 13740, 6386, -4511, -13030, -15118, -10447, -1177, 8762, 15040, 13708, 5881, -4028, -12308, -15568, -10864, -461, 8974, 14354, 13799, 6195, -4624, -12550, -14782, -10742, -1035, 8868, 14809, 13266, 5981, -3820, -12873, -14885, -10000, -697, 8590, 14709, 13464, 5511, -4204, -12088, -15091, -10596, -572, 8783, 14328, 13295, 6075, -4610, -12307, -14167, -10098, -966, 9102, 14414, 12610, 5954, -4087, -12390, -14681, -9585, -783, 8458, 14201, 12991, 5249, -4302, -11569, -14269, -10330, -855, 8703, 13590, 12711, 6171, -4227, -12083, -13822, -9574, -1303, 8569, 14059, 12462, 5202, -3543, -11693, -14240, -9375]
2109i375Q806Q765N293n74p255r832p402k241M095R098R083M524p31o605r598
2124c949p763j898M421Q114R105N414j425o802r050p633k226M450Q934Q232N135
2139A3059q95o992r351p016j866L606Q715R129M508j269o463q937p694j752M368
2154h850Q236Q455N149r82p379q374p147k269M372Q319Q374M506r35o349r103
2169c977o879j892L967Q177Q539M441j155o296q665p010k064M018Q309Q476M475
2184A2464j249o366q804o609j999L790Q235P990M922j116o369q399p033j929M066
2199h406P730Q416M493j188o298q617o391k172L930Q027Q240M294q51o552q427
2214c772o784j533L698P829Q083M554j159o182q278o653k165M088P800P878M371
$$ y = [-9375, -569, 8196, 13489, 12915, 5660, -4172, -11574, -13815, -9720, -622, 8461, 12985, 12254, 5649, -3949, -11712, -13610, -9189, -1075, 8030, 13444, 12019, 5217, -3833, -11466, -13692, -9242, -308, 7924, 13059, 12164, 5172, -4179, -11195, -13061, -9455, -740, 8389, 12897, 11628, 5165, -3772, -11466, -13218, -8850, -614, 7841, 12990, 12008, 4629, -3745, -10892, -13161, -8789, -470, 7904, 12410, 11475, 5126, -3977, -10856, -12748, -8781, -604, 7935, 12376, 11221, 4925, -3740, -10750, -12814, -8796, -487, 7989, 12464, 11215, 4849, -3955, -10564, -12563, -8773, -538, 7452, 12374, 11258, 4889, -3510, -10543, -12472, -8406, -676, 7740, 12233, 11045, 4747, -3870, -10261, -12433, -8503, -476, 7764, 12058, 11207, 4655, -3772, -10556, -12089, -8391, -562, 7521, 12075, 10916, 4734, -3544, -10197, -12362, -8274, -474, 7404, 11775]
2229A1775q88o253q659o014j754L668P608Q080M309j418o078p880o959j545L920
2244h088P759P441M847j378o173q092o317j952L937P866P383M211p55o173q355
2259c839o264j307L648P190P986M209j628n760p556o845j348M098P247P296M345
2274A1472j069o317p620o064k063L964P492P686L534j036n496q320o315j159L787
2289g524O965P951M112j800n987p130o444j825M489P126O959M263r41o469p624
2304c879n701j588L611P457P376L754j367n590p855o066r58L800O553P455M383
2319A1385j653n914p200o164j599M034P270O674L615n68o188p501n508j169K926
2334g560P448P492L026j078n381p395o124j033L824O498O936M249j571n814p040
$$ y = [11775, 10887, 4634, -4025, -10039, -11793, -8125, -517, 7563, 11872, 10454, 4376, -3504, -10463, -12008, -8088, -329, 7112, 11959, 10581, 4408, -3684, -10001, -11953, -8016, -150, 7233, 11444, 10689, 4516, -3839, -10103, -11410, -7762, -572, 7414, 11623, 9995, 4235, -3321, -10166, -11514, -7416, -169, 7127, 11472, 10403, 4086, -3534, -9598, -11661, -7697, -205, 7481, 11015, 9979, 4483, -3837, -10152, -11311, -7524, -559, 7392, 11504, 9704, 3717, -3413, -9857, -11682, -7193, -67, 6892, 11155, 10214, 3745, -3879, -9580, -11168, -7557, -100, 7276, 11030, 9663, 4073, -3782, -9848, -10806, -7006, -453, 7002, 11385, 9732, 3818, -3382, -9546, -11145, -7111, 159, 6833, 10448, 9880, 3692, -3809, -9317, -10486, -7560, -112, 7380, 10406, 9328, 3947, -3448, -9572, -10605, -6781, -283, 6653, 10902, 9331, 3517, -3523]
2349c523n336j645L451P146O451L815q50n842p607n220j316L462O706P273L336
2364A0301j519m978p284n815j079L945O262O507M384j666n713o882n380j418L391
2379f944O957O495L437r34n095p297n467j384L780O248O860L455j329n288o737
2394c243n791r69L713O187O559L507j113n575o641n409j218L219O801O539L321
2409I887j215m990o975n439j037L443O073O610L173j020n230o815n159q99L485
2424f108O013O359L447j073n319o885n185r10L311O420O638L076j668m869o479
2439c232n313j078L385N984O640L081j016n358o458m960r85L354N925O204L289
2454I462j199n193o215n130r23L220N920O147L275j230n068o260m880j306L341
$$ y = [-3523, -8859, -10504, -7053, 93, 6544, 10359, 9509, 3667, -3940, -9160, -10476, -7014, -308, 6965, 10301, 8782, 3804, -3480, -9295, -10374, -6429, -167, 6340, 10724, 9058, 3345, -3537, -8917, -10335, -6944, 13, 6508, 9945, 9011, 3916, -3381, -8848, -10232, -6452, -204, 6656, 10111, 8782, 3494, -3243, -9034, -10003, -6290, -103, 6456, 9963, 8850, 3275, -3366, -8775, -9993, -6774, 27, 6566, 9887, 8672, 3682, -3293, -8732, -9769, -6326, -253, 6357, 9530, 8510, 3280, -3535, -8694, -9593, -6108, -95, 6264, 9711, 8638, 3319, -3566, -8751, -9661, -6350, 70, 6708, 9784, 8116, 3247, -3232, -8545, -9623, -6238, -254, 6386, 9467, 8451, 3093, -3365, -8325, -9310, -5956, -31, 6173, 9462, 8263, 3070, -3145, -8275, -9198, -5978, -58, 6089, 9364, 8134, 3066, -3194, -8074, -9380, -6039]
2469f039O051N924L015p62n195o473m505j356L536N909N766L184j292m691o411
2484c339m772j069L364O210N427L257q50n575n871m461j089K830N986N960L060
2499I068j442m756n883n137p19L538N583N543L300j601m662n832m798j202L573
2514e427N819N548K684p73n110o166m164j204L118N840N987K489j325m505o014
2529c203m599o81L308N462N462L246j807m789n494m502j104L293N936N334K420
2544H282q58m497o348l936o82K578N554N640K571j165m211n923m597o84L390N078
2560A92N491K789j301m774n256m362j382L228N682N238K759j048m596n845m187
2575g372p72K953N312N497K617j474m155n655m259p56L111N126N084L018j135
$$ y = [-6039, 12, 5936, 8951, 8189, 2994, -3479, -7984, -9340, -5804, 105, 5871, 9055, 7763, 3072, -3339, -8111, -9180, -5816, 394, 5821, 9078, 8228, 2653, -3218, -7679, -8768, -5938, 48, 6008, 9068, 7626, 2870, -3013, -8150, -8869, -5331, 252, 5795, 9095, 7494, 2832, -3000, -7798, -9000, -5427, 392, 5940, 8624, 7851, 2741, -3425, -7589, -8793, -5675, 165, 6152, 8641, 7316, 2811, -3203, -7802, -8483, -5175, 287, 5749, 8995, 7188, 2399, -3095, -7597, -8701, -5408, 528, 5862, 8282, 7424, 2927, -3421, -7357, -8039, -5461, 93, 5733, 8304, 7139, 2928, -2995, -7592, -8276, -4886, 192, 5683, 8472, 7171, 2397, -2859, -7221, -8603, -5375, 307, 5545, 8304, 7256, 2660, -3185, -7372, -8144, -5191, 121, 5618, 8235, 6761, 2606, -3049, -7308, -8064, -4953, 173, 5257, 8275, 7140]
2590G140m721n329l903j328K958N631N199K190p73m455n804l989n17K728M637
2605c36N755K685j606l984n409m184r53L410M775N030K778j052m621n381l903
2620f996p96L034M829N167K322p56m138n586m207l40K467N122N235K557j503l948
2636B463n167m043j038L013N088M791K560j018m251n299l945o05K812M890N176
2651E427K402j536l795n470l819m77K633M719N210K440j289m366m871l913j026
2666g731L148N066M557K387j003m091n169l606q68K763M977M530K740j214l956
2681B530n532l710m91K774M791M480K475r64m159n161l447p95K614M993M505K374
2697G277j055l814n069m012m62K847M717M566K105q90m091m980l480q40K708M782
$$ y = [7140, 2419, -2910, -6813, -8141, -5183, 448, 5647, 7837, 7064, 2609, -3195, -7184, -7701, -4973, -336, 5419, 8104, 6498, 2514, -2895, -7079, -8032, -4622, 153, 5183, 7961, 6909, 2288, -3093, -6996, -7792, -4758, 71, 5238, 7560, 6804, 2666, -2920, -7127, -7467, -5000, 122, 5357, 7914, 6411, 2463, -2704, -6747, -7785, -4772, 316, 5107, 7667, 6649, 2398, -2901, -6846, -7451, -4639, 251, 5427, 7829, 6293, 2498, -2972, -6791, -7268, -4635, 84, 5294, 7734, 6445, 2079, -2792, -6705, -7731, -4583, 483, 5040, 7427, 6424, 2333, -2836, -6442, -7310, -4547, 430, 4960, 7700, 6486, 2530, -3002, -6712, -7203, -4429, 362, 4842, 7317, 6353, 2194, -2967, -6414, -7209, -4595, 398, 4903, 7277, 6222, 2408, -2661, -6673, -7135, -4288, 429, 4995, 7100, 6210, 2119, -2861, -6341, -7181, -4473, 309]
2713C09M800K051j072m074m667l654o44K562M587M788K351j139m112m753l496
2728f163r61K897M610M184K302o15m002n055l476p30K589M386M828J941p31l894
2744B110m739l591q51K925M415M378K325r84m094m765l109j010K811M632M298
2759D751J937q67l488n321l124l37K155M444M344K283q24l933m247l858k82K249
2775d118M421L897K627r23m071m555l004r37K352M671M316J553n11l547m800l405
2791f034m27K305M217M413K285j294l599m273l556o48K576M742L606K180q60l667
2807A966m540k958q55K338M440L952J879p53l558m271l636j71K385L963M133K059
2823F373r56l514m242l161q18K527M402L741J828p79l484m360k890o40K041M164
$$ y = [309, 5109, 7160, 6088, 2014, -2653, -6307, -6951, -4389, 198, 4986, 7337, 6198, 2086, -2667, -6163, -7124, -4227, 383, 4567, 6869, 6254, 2252, -2803, -6279, -7009, -4420, -34, 4794, 6735, 6004, 2110, -2629, -6220, -7071, -4146, 269, 4647, 6972, 5988, 1894, -2871, -5980, -6990, -4179, 453, 4751, 6688, 5821, 2333, -2988, -6112, -6449, -4294, 150, 4494, 6777, 5953, 2020, -2227, -6085, -6367, -4118, 303, 4200, 6827, 5904, 1833, -2722, -5726, -6663, -4311, 360, 4676, 6229, 5718, 2171, -2629, -6034, -6461, -4156, 61, 4474, 6759, 5465, 1866, -2407, -5963, -6611, -4035, 707, 4313, 6493, 5633, 1966, -2574, -5532, -6387, -4049, 391, 4343, 6222, 5469, 1911, -2360, -5996, -6167, -3782, 181, 4314, 6373, 5417, 1903, -2339, -5500, -6318, -3791, 611, 4352, 6180, 5401, 1917, -2443, -5333, -5973, -3932, 232]
2839B32M119K082j177l131m515l354o07K728M003L608K156j222l201m020l122
2854e421p24K413M287L615J733o30l525m154k924m68J836M246L809K069j055l358
2870A749l916l284m01K292L844L560K237j082l438m116k618r38K280M333L495
2885C997J808p75l470l757l191q8J858L913L552K034j196l223l593l211n15K385
2901c472L739L180K410j026k954m262k608p75K195L794L605J944j115k970m081
2916b396k714l43K230L563L766J525r84l074l852k849j37K125L487L466J715j058
2932D470k731l804l041j76J862L791L247J932r31l286l320l094m36K283L544L419
2948C729J633o46k863m090k860k23J977L754L318J685q62k829l583k823o82K068
$$ y = [232, 4351, 6433, 5256, 2125, -2390, -5744, -6351, -3623, 380, 3988, 6144, 4922, 1721, -2299, -5421, -6145, -3732, 555, 4170, 5903, 5273, 1748, -2406, -5330, -5798, -3962, 284, 4093, 6162, 5107, 1749, -2167, -5451, -5852, -3560, 284, 3844, 6081, 4999, 1561, -2555, -5173, -6111, -3831, 502, 3997, 5805, 5030, 1560, -2197, -5388, -5476, -3618, 295, 3847, 5881, 4685, 1462, -2131, -5342, -5857, -3472, 267, 3447, 5857, 4831, 1877, -2385, -4993, -5768, -3573, 221, 3826, 5770, 4655, 1685, -2396, -5110, -5453, -3223, 340, 4106, 5631, 4647, 1573, -2279, -5128, -5265, -3140, 347, 3813, 5528, 4470, 1739, -2065, -5106, -5282, -3420, 371, 3618, 5550, 4619, 1333, -1987, -5081, -5517, -3234, 310, 3729, 5362, 4716, 1853, -2237, -5097, -5320, -3343, 411, 3729, 5414, 4552, 1723, -1860, -4683, -5365, -3297]
2964c297L439L373K005r77l069l677k731m42K136L393L604J522r64k819l538k800
2980d842j71J759L598L486J451r95k657l435k864k04J624L604K857J930p68l072
2996A301l434k527m24K032L335L301J487o12k892l682k263o25J891L250L252J497
3012D887n23l009l326k741k82J948L655K434J907o30k856l648k264q1J331L751
3028E53K945J413o63k806l596k330k37J816L022L294J638q43k910k861k809o78
3044e052J998L434K957J266n52k469l529k248m22J660L236L277J239q07k250l691
3060a953k367l59J953K677L122J909r46k733l077k188p24J797L320K742J224l48
3076D049k465l292k419k86J625K966K986J671j120k164l064k801l44J872K856
$$ y = [-3297, 142, 3515, 5520, 4543, 1474, -2203, -4934, -5376, -3240, 153, 3757, 5279, 4315, 1496, -2042, -4842, -5013, -3254, 344, 3830, 5281, 4286, 1629, -1806, -4670, -4874, -3250, 354, 3211, 5141, 4373, 1301, -2133, -4660, -5084, -3052, 283, 3584, 5071, 4459, 1567, -2115, -4378, -5003, -3112, 138, 3390, 4887, 4364, 1355, -1971, -4712, -4994, -3046, 609, 3043, 4950, 4320, 1464, -2184, -4448, -4529, -3198, 553, 3498, 4911, 4248, 1442, -2154, -4484, -4721, -2905, 117, 3411, 5049, 4206, 1296, -1565, -4374, -5052, -3054, 380, 3337, 4603, 4051, 1582, -1947, -4195, -4617, -2957, 279, 3556, 4795, 3988, 1738, -1953, -4320, -4679, -2726, -49, 3073, 4982, 4036, 1303, -1774, -3962, -4686, -2889, 431, 3173, 4397, 4049, 1584, -1708, -4127, -4413, -2788, 178, 3164, 4835, 3715, 1551, -1513, -4314, -4658, -2786, 70]
3091G0K807J998q95l035k737j929r13J741L116K923J188o27k319l063k577K16
3107d036J255K682L406J185o64k575k867k416m70J755L041K650J194l25k824k944
3123a953j872l62J376K985L040R89k82k459l052k425j99J445K764K893J771j108
3139C551k328k766k250m18J749K744K655J431n48k583l184j847l28J541K569K944
3155B932J304o48k374k819k201k75J516K778K823J363j116j926l064j939l62J424
3171b584K968K295J523n52k414l082j586o88J382K956K616J221n61k239k889k145
3187c779j54J453K845K468J184n24k377k768k122j87J470K721K501J390p03k397
3203A021k643j852n75J664K563K736R64m24k330k913j570o38J430K842K807Q01
$$ y = [70, 2877, 4875, 3980, 945, -1792, -3721, -4634, -2893, 223, 3146, 4334, 3707, 1388, -1675, -4252, -4036, -2781, -99, 3307, 4492, 3828, 1253, -1614, -4030, -4500, -2745, 296, 2946, 4140, 3815, 991, -1953, -3825, -4187, -2811, 174, 3214, 4203, 3921, 1462, -1590, -4015, -4214, -2769, -5, 2888, 4659, 3551, 1223, -1543, -3793, -4211, -2462, 282, 2937, 4368, 3820, 1237, -1947, -3794, -4122, -2581, -12, 2932, 4236, 3588, 1214, -1605, -3806, -4081, -2565, 213, 3036, 4399, 3283, 1357, -1707, -3646, -4008, -2584, 384, 2679, 4202, 3650, 1236, -1846, -3432, -4120, -2738, 218, 2834, 4055, 3494, 1255, -1634, -3779, -3933, -2480, 365, 2833, 4017, 3493, 1116, -1652, -3774, -3961, -2491, 230, 2731, 4121, 3418, 1021, -1622, -3474, -4049, -2385, 178, 2914, 3878, 3454, 1124, -1789, -3359, -3997, -2567, 275, 3082, 3883]
3219C883m66k310k578j955m42J782K253K440J333m75k397k805j652o89J758K776
3235D56K314Q62m99j935k728j770m26J303K687K294J089l90k122k859j791k88
3251c803J549K543K378J055m39k261k291j917n84J335K817K308J238p07k304k604
3267a687j756o3J272K455K577R48p50j827k537j870l33J358K440K076J450o39
3283C114j978k660j280q94J400K565K278J082n96k044k479j795J9J224K134K596
3299B686P99m06k028k420j860l00J553K230J846J390o91j593k829j269p82J619
3315b055K060K294J128k23k102k499j765QJ273K059K136J161m84k203k297j476
3331b985m59J117K252K138J248l13k005k491j589k63J176K216K458Q85n63j635
$$ y = [3883, 3417, 1107, -1471, -3426, -3868, -2086, 167, 2607, 3940, 3465, 1068, -1737, -3389, -4078, -2320, 456, 2770, 3632, 3133, 1198, -1530, -3300, -3726, -2423, 264, 2558, 3647, 3257, 1135, -1724, -3515, -3803, -2254, 289, 2667, 3722, 3283, 1022, -1269, -3186, -3770, -2435, 382, 2690, 3928, 3221, 917, -1687, -3443, -3506, -2234, 221, 2798, 3746, 2996, 1169, -1368, -3238, -3571, -2213, 227, 2303, 3753, 3114, 1136, -1524, -2804, -3698, -2298, 267, 2545, 3627, 3031, 987, -1492, -3287, -3268, -2044, 90, 2686, 3485, 3079, 1051, -1369, -3229, -3529, -1976, 254, 2100, 3490, 2799, 1206, -1623, -2892, -3674, -2055, 5, 2299, 3427, 3204, 1102, -1397, -3162, -3154, -1881, 178, 2314, 3475, 2991, 788, -1509, -2985, -3444, -2327, -75, 2063, 3311, 2998, 993, -1498, -3087, -3350, -2174, 42, 2500, 3385, 2822, 1187]
3347A187k427j739k34J110K298K018J185n88j624k247k010k92J377K338J894R22
3363C168l27j755k638j362k94J103K741J656Q84o99j444k347j822j02J272K075
3379A09J965J144n21j630k319j381o56J363K057K358P34m42j856k073j786n4R47
3396b041K027K405Q06l95j761k100j832m98J623J871K073P58k42j897k089j418
3412b710k77J070K051K065Q19l88j641k327j494j60J058K073K063P48n13j614
3428H23j894j889n4J215J871J821R86n13j427k046j608n14J340K256J756R99n16
3445B606j832k249j226k34J194J666K058Q38m89j607j774j801L7R59J956J845
3461A947J094o15j615j891j555j70J138J775K046P24o23j534j878j486K1R18J792
$$ y = [1187, -1240, -2979, -3213, -2103, 195, 2213, 3398, 2810, 1186, -1061, -3071, -3363, -1986, 352, 2246, 3168, 2841, 1086, -1552, -2914, -3208, -2105, 636, 2292, 3176, 2477, 1033, -1314, -3136, -3238, -1966, 109, 2074, 3218, 2697, 1067, -1252, -2633, -3289, -1926, 131, 2489, 3223, 2781, 925, -1148, -2934, -2988, -2041, -14, 2391, 3197, 2802, 1041, -1059, -2891, -3389, -1766, 105, 2178, 2936, 2694, 797, -1292, -2710, -2987, -1917, 134, 2199, 3018, 2630, 989, -1338, -2832, -2992, -1934, 139, 2202, 2950, 2437, 823, -1071, -2960, -3014, -1799, 72, 1893, 2879, 2366, 939, -1107, -2715, -3229, -1889, 367, 2123, 3122, 2606, 774, -1475, -2701, -2935, -1741, -75, 1983, 2821, 2332, 725, -1049, -2850, -2813, -1854, 102, 1947, 3041, 2426, 811, -1080, -2635, -2805, -1667, 108, 2154, 2878, 2255, 721, -1157, -2643, -2622, -1704, 88]
3478H8K018O59m13j619j978j419j13R47K100J886O47n70j539j673j625l00J098
3495a806K049J497J247p46j381k014j469j2Q46J785K158P11p28j154k165j377
3511b559R7R81J507J683J333p84j442j840j209o47J520J488J702Q87m69j484k209
3528a445j091q9Q93J610J987R02o65j326j842j620K61Q09J780J780R03o59j546
3545F42j550j448l02J089J992J323J031n71j414j870j136r3N29K045J526Q14o72
3562A935j205j724j305j34R11J651J599J124p47j291j661j288m73O25K288J452
3578A757O55m20j159j948j298N6R18J595J544Q93n51j290j675j525j37J251J536
3595B02J491P99r0j981j581j046k4N08K143J311N94j64j410j701j362J38P53J347
$$ y = [88, 2106, 2765, 2352, 733, -1245, -2664, -2777, -1830, 270, 2156, 2803, 2233, 694, -979, -2604, -2904, -1806, 243, 1740, 2987, 2241, 860, -1154, -2623, -2635, -1789, -4, 2154, 2865, 2137, 983, -1182, -2559, -2462, -1481, 26, 1709, 3042, 2258, 816, -1024, -2233, -2880, -1360, 128, 1830, 2717, 2248, 764, -1445, -2536, -2625, -1732, -122, 1865, 2767, 2102, 776, -1066, -2686, -2425, -1616, 164, 1944, 2847, 2188, 642, -908, -2356, -2658, -1569, 423, 1746, 2777, 2206, 792, -1078, -2214, -2307, -1778, 267, 1793, 2607, 1935, 730, -994, -2299, -2433, -1522, 129, 1728, 2852, 2105, 814, -847, -2135, -2608, -1983, 305, 1757, 2412, 1992, 833, -1115, -2413, -2357, -1439, 156, 1700, 2593, 2042, 752, -923, -2448, -2585, -1334, 202, 1693, 2492, 2402, 421, -1160, -2206, -2230, -1722, 421, 1732, 2326, 2162, 752, -949, -2311, -2173, -1420, -73]
3613g3J774O34l07j441j598p14o30R06J677J375P21k53j286j988q82j51Q31J678
3631B73J555M92l66j248j654j176l35R71J819J212O46j99j424j304j430l17J142
3648a343J608J323N54k04j287j525r86k19O90J569J429J078p35j203j690j124
3664b065j2Q41J308J600P06n65j219j344j223k88P21J832J360L80mj454j530j360
3682b316J60Q11J598J143R21k17j180j941j140J54P47J450J312Q86l62j072j774
3699h20j347R2Q69J435J381N84l39j198j409j387J4P11J838J311N58n17j348j252
3717h24j139J4O08J404J397P93l15j266j485q49n75J014J449J547O08o36j308
3734D37j246r87m04P98J431J287R92m55j446j153r55m37R29J490R83Q11l92r57
$$ y = [-73, 1701, 2335, 2028, 587, -1011, -1725, -2355, -1449, 228, 1603, 2324, 2071, 785, -1203, -2085, -2236, -1405, 273, 1828, 2320, 1954, 706, -948, -2124, -2459, -1488, 331, 1543, 2189, 1990, 566, -738, -2168, -2485, -1343, 265, 1588, 2142, 1938, 651, -874, -1860, -2079, -1389, 180, 1609, 2687, 1952, 749, -941, -2065, -2077, -1236, 72, 1672, 2378, 1813, 594, -750, -1973, -2261, -1540, 292, 1652, 2032, 2028, 574, -956, -2316, -2156, -1345, 253, 1396, 2317, 2100, 920, -1021, -2161, -2007, -1260, 190, 1502, 2388, 2026, 954, -820, -2167, -2075, -1206, 229, 1610, 2194, 1855, 657, -752, -2139, -2125, -1414, 424, 1735, 2293, 1776, 428, -824, -1963, -1949, -1341, 63, 1460, 2253, 1938, 672, -813, -1662, -2237, -1223, 226, 1773, 2381, 1745, 437, -809, -1796, -2200, -1402, 29, 1316, 2308, 1853, 407, -746, -1701, -2138, -1209, 281, 1264, 2075, 1683, 726]
3752G26j504j207p4Q48J285J349P21m29q51j593j095l06J065J183J358L52Q5j177
3770G36j910r63l8R76J331J493J17M7j034j530r77j85Q94J162J420L48k58j205
3788D24j239o79n26O80J477J416K99j86q26j916q43K5O20J363J067O61k4j189
3806F04j185j423J77N30J471J302M13j66r36j555q09r3M98J275J337L10k08p57
3824G85j451r70m6L21J636R52N85J2j430j190q24m23Q60J140J071R35m30j150
3842C83r74r03k26N84J079J201P86l64r31j480r33k33P91J135J168R74m28j157
3860D72j204q39k41O19J094J421O16m70q96j211q93j43M48J052J639L19k45p52
3878G86j372p22n32P54J042J295L18j6j132j050q89r6N70J105R88O13j23j019
$$ y = [726, -778, -1985, -2059, -1211, 74, 1423, 2144, 1715, 864, -729, -1824, -2130, -1065, 118, 1476, 1828, 1913, 736, -1174, -2137, -2175, -1199, 132, 1625, 1742, 1789, 755, -775, -1752, -1937, -1043, 119, 1539, 1887, 1629, 424, -815, -1494, -2020, -1340, 137, 1553, 1852, 1666, 840, -1076, -1919, -1894, -1274, 89, 1156, 1817, 1793, 604, -581, -2004, -1827, -1297, 174, 1476, 1889, 1723, 787, -768, -1577, -1670, -1172, 103, 1440, 1750, 1542, 785, -666, -1636, -1682, -1361, 275, 1227, 1812, 1824, 394, -796, -1620, -2043, -1183, -43, 1028, 1963, 1533, 383, -591, -1494, -1720, -1136, -57, 1144, 1930, 1566, 635, -845, -1778, -2011, -1220, -85, 1083, 2057, 1629, 472, -732, -1571, -1812, -1193, -99, 1322, 1938, 1468, 572, -639, -1532, -1675, -1227, -175, 1464, 1783, 1538, 786, -586, -1308, -1840, -1086, -44, 1251, 1569, 1553, 421, -629, -1518, -1614, -1044, 61, 1049, 1662, 1539, 520]
3896E20j213r57k9N84J279Q38N77k13r04r91j055n8M69J110J191O10k46j002j263
3915g53q21j40P66J083J060M75m06q01j232q28l41P41J366R28N41j06q70j365
3933g03q26p9N35J080Q63P96r6j235j083n21m09P46R75J112L82r8j066j118o07
3952a352n87R87R33J049M55r4j044q47r05k75Q68R79Q83O44j68j039r86j098o
3971a603O98J044R19M30k98o67j181n93k58K44J265J010O67m93p74j084o84l33
3989a691L06J360J137M91l75o92j045r49j14O10O47J075N63J24r62j167n83j84
4007a449M73Q83J218K64l5q81r32j046P9M37J131Q04N24j46r18q51r44j89O36
4026i42J025O69P16j05q47j197o87J7M55Q83J061K82j24n70j329o88p6M77R81
$$ y = [520, -693, -1650, -1679, -1095, 184, 1022, 1599, 1386, 482, -509, -1564, -1622, -1153, -43, 1148, 1758, 1512, 510, -753, -1574, -1714, -948, 135, 1195, 1670, 1264, 463, -769, -1597, -1938, -1197, 169, 1097, 1638, 1532, 662, -703, -1529, -1608, -1073, 7, 870, 1666, 1570, 335, -748, -1269, -1678, -932, 43, 1155, 1537, 1439, 373, -745, -1352, -1939, -952, -19, 1030, 1485, 1391, 347, -500, -1405, -1680, -812, 167, 1050, 1694, 1526, 487, -499, -1597, -1603, -905, 139, 1058, 1488, 1190, 523, -658, -1251, -1509, -1265, 0, 1010, 1677, 1184, 410, -674, -1358, -1691, -1385, -25, 1112, 1603, 1228, 536, -509, -1458, -1572, -962, -315, 760, 1323, 1447, 485, -682, -1265, -1449, -976, -93, 1125, 1389, 1354, 473, -459, -1505, -1426, -989, 142, 946, 1470, 1324, 406, -445, -1389, -1578, -942, 83, 752, 1468, 1363, 516, -681, -1368, -1351, -896, -13, 1048, 1330, 1206, 636, -693, -1381, -1457, -980, 1]
4045AJ163L49k50q14q21q20k44L70Q64R47N03O9o77j366n00k16L76J047J147M61
4065A589k24p54j026p74k95N11J095Q33M84R9j124q95q43MM46R11N88O22M8p84
4085E11j327l12m44N81O10J391J35P0o44q33r17l58R68M59J195L05j36o03j082
4104d31p31n1M13O43R09P41l09p78p90q07k25N55Q13Q14N58j28p56q76n41l17
4124a294M45R42O61N79k03o93q27o65l46N92O34R72M66j15p46q57o76l53Q41M04
4144b39J007N01j14n75p83p76l97L38P32J020M48Q9o94j156m46j24K08P09R74
4163G22N25No86q74o53j94L76O49J015M19j56n07r06p77k27J93J088P15M51k90
4183H88l85q67m38k19N9Q39R58J20K04o02r15n91k16L00N23R10J96L57n98q01
$$ y = [1, 1164, 1513, 1263, 449, -372, -1192, -1436, -1066, -202, 745, 1248, 1317, 640, -726, -1226, -1442, -1066, -19, 1128, 1589, 1365, 611, -415, -1189, -1484, -973, 122, 955, 1439, 1538, 414, -481, -1324, -1320, -874, 37, 625, 1247, 1295, 511, -816, -1128, -1572, -991, -381, 1010, 1145, 1215, 571, -262, -1179, -1537, -569, -110, 1085, 1390, 1254, 651, -431, -1162, -1213, -800, -157, 752, 1493, 1184, 406, -384, -1191, -1416, -861, -48, 766, 1324, 1196, 440, -436, -977, -1294, -849, 93, 754, 1333, 1130, 437, -390, -1055, -1401, -809, -175, 797, 1263, 1148, 402, -455, -1131, -1484, -643, -239, 768, 1269, 1155, 580, -203, -979, -1376, -1038, -306, 714, 1162, 1251, 557, -599, -1045, -1169, -961, -252, 722, 1247, 1252, 566, -308, -961, -1155, -779, -130, 885, 1304, 1148, 641, -265, -1042, -1269, -1076, 12, 727, 1178, 888, 503, -364, -802, -1021, -962, -123, 835, 955, 1159, 557, -358, -949, -1165, -865, -342, 568, 764, 1121, 523, -278]
4203b78q14M7J15Q39O75O28l23k52j067p67M0M16O14O63O22j68n30n84n16m14
4223a054K69Q26N09M72J66m86r52n26m84N83K74J085O62m12m17n45q46m02M75
4242h03Q42N11N58q3n21p48p86l0K37N82R83L44j77l76p63n33k35J60O88R07M13
4263A170k9p30k86j036o22P88M21P69P22j10n05q94m88l35L94O39P12M64r2l92
4283E60p64q13j97M44N95O74P08M5p66p02p77l2J44L85J135L03J3n10o74p91J08
4304i12J7O81P04O46j71m47o66o08m28J90P36P10N95Q9k64j126n26k47J15O69
4324b43R28J39J28k86p53o38l76M25K13R39O07l09m33l61o49m73M37O35M84N76
4344I90j8j57j091l92j46L39K99M21O22q0j44o85q25k27L26O28L91N55K64o04
$$ y = [-278, -1092, -1045, -930, -91, 584, 1212, 889, 637, -430, -1197, -1157, -741, -127, 536, 1158, 990, 460, -124, -640, -1054, -785, 41, 550, 1022, 1188, 702, -250, -776, -1260, -677, -403, 682, 1344, 932, 515, -30, -876, -1278, -803, 39, 550, 1108, 1025, 504, -244, -1030, -1060, -823, -241, 742, 1086, 909, 533, -230, -763, -998, -838, -150, 757, 1170, 1141, 411, 125, -911, -1533, -745, -324, 445, 1167, 1057, 552, -342, -830, -1165, -771, -132, 580, 1044, 952, 560, -204, -1017, -1214, -770, -175, 499, 1207, 1252, 486, -216, -993, -1025, -881, -496, 639, 942, 955, 445, -229, -1020, -912, -895, -214, 490, 1136, 965, 518, -148, -756, -1184, -994, -258, 452, 1047, 1136, 872, -254, -780, -1027, -912, -243, 685, 824, 952, 666, -87, -725, -1101, -676, -463, 476, 1083, 774, 341, -20, -669, -1142, -705, -70, 414, 990, 972, 815, -276, -668, -814, -475, -176, 245, 867, 787, 643, -42, -867, -1094, -768, -140, 251, 806, 1070, 466]
4364D66o10o07k58K70M74Q12L81p5l70m57n98m88L46M04N75M37L38n66m46o03
4384e75k57L4M44P46N81m42R7p68q83K44L9O34O19L76J53m47o17k37p49L99N57
4405e2P94J37m5m49m58p71N1n1N31O77N17k2k35o40r54L9J64M73L45P55K60m37
4427F29o67m45k99J6M17P20M45j20j11r23l87k09M22L94N73J93L06n36n16n57
4447f55j33j0M91M77Q53k64k43m82n53k94J97L96M85L21J63j87m77o20l04K04
4467f35K37Q19K69J50k78o11k18n73L26J75N67M87q6k44k38o28l32K41L80N13
4487C21K75K15k20n63n19k08M9K30Q98J45l6m5m06p55l12L93K35N74M47Q7j96
4508F09n29m79k23l4L37O50K81J01k86m62m48k62J7M37N19L87J62k94l91m28m76
$$ y = [466, -144, -751, -1009, -739, -265, 547, 928, 853, 483, 26, -572, -1060, -714, -310, 265, 702, 1040, 474, 28, -575, -832, -798, -354, 392, 973, 531, 628, -140, -1023, -779, -740, -106, 513, 889, 1042, 595, -22, -259, -1008, -609, -52, 742, 879, 834, 385, -73, -844, -793, -844, -313, 364, 881, 859, 624, -16, -970, -931, -767, -294, 51, 806, 1066, 629, -38, -483, -782, -766, -349, 371, 816, 696, 585, -338, -725, -934, -512, -118, 455, 648, 954, 418, -98, -655, -788, -798, -307, 170, 1023, 759, 516, 34, -519, -813, -616, -220, 265, 586, 749, 562, 85, -535, -839, -635, -398, 421, 690, 840, 562, -49, -267, -840, -514, -339, 228, 715, 629, 385, 147, -481, -813, -572, -192, 321, 596, 811, 591, 28, -491, -699, -650, -420, 478, 623, 587, 542, 136, -619, -931, -538, -303, 271, 718, 805, 609, 80, -399, -622, -656, -319, 331, 612, 713, 427, -35, -483, -745, -728, -291, 228, 615, 777, 483, 92, -336, -812]
4529h12J75L04N54M48K96n34l43n23j10j49J63M73O00L30l46o46k66k99N7L64
4549b64M28M05K31k02n52n90p9k17O57K49N93M8J9n89n37k37MK68K54R54n4l36
4571D53k65k21q28J2N80L43L00L76l27l11k94o60N9N56L22O06o9j92k31r09Q3
4592f17K48J51L85J10N49k32l53o07l01M9J74N19N08j20j1k03n53n39L09L41L09
4613A16L27oj77j65j40q20L35P5N99K72N2J28o27l77r7K30n7N85N3L35J23p58
4635Fj95n77J11M24M10M78R7k60k08n01l17q4M80K68J64K38p8m14k49j92j60O7
4657d92O57K56K2R1n01k53l57O5L49K59J18L54l95J08m50k40r3J0O80L74L3k53
4679C42j31o10j18p1K84L52L50K29k16o28K2j55j65K71L86L80m8J24p22J1n93
$$ y = [-812, -637, -333, 221, 669, 965, 431, 88, -435, -545, -694, -531, -58, 542, 872, 526, -120, -386, -685, -628, -264, 164, 569, 800, 598, 46, -544, -623, -840, -183, 66, 659, 707, 726, 137, -400, -637, -633, -365, -111, 843, 789, 453, 188, -33, -861, -849, -269, 74, 374, 750, 423, 112, -182, -842, -783, -227, 95, 701, 632, 440, 209, -700, -617, -369, -218, 167, 277, 826, 594, 241, -366, -667, -618, -444, 75, 583, 463, 452, 249, -304, -843, -534, -193, 116, 443, 437, 260, 95, -45, -865, -530, -455, 144, 416, 468, 596, -31, -408, -505, -275, -332, 253, 306, 641, 764, 6, -189, -766, -655, -231, 179, 657, 754, 494, 286, -215, -532, -616, -136, 132, 296, 534, 456, 42, -207, -399, -559, -492, 165, 421, 443, 534, 33, -220, -577, -512, -163, 96, 214, 568, 173, 281, -169, -409, -502, -492, 188, 562, 595, 342, 211, -399, -517, -588, -304, 48, 398, 627, 411, -217, -195, -350, -515, -244, 142, 522, 474, 598, -124, -113, -706]
4700g06J11L20J90L22K70j09l49j11m95l9K42R2O84N5qk33m83m29n8M42L82K96
4722C86p9J3j50o03PRK5L68K55J28J08l28l12m00mJ84L99L60K09j27k64l81om58
4746f61K00L86M30L08n0k58o58j25m3R6M83K70M9J46o01j03k96O1m8M06N80J32
4768G04k24m92j38j35j91N0K69L70K34K19n14l38k55o8J7M75K32L71K5m42k44
4789g5j51k84L18J49L19L21r6l32j86k24j94K9L06N01p8o1l55K8m94J73N3M4P03
4812D14j34K83m87r0m06J09k29N38J91m4O66o39n74J8k67J75M03L79p8L25j85
4833C68m99l86K52n5L35J91K82j23k74j43k35k56L29P5K74J52J16l6n59k2j84
4854c98O1J34N62K29r3l27m22J02k89n0K95N43k7n9L7k07m28R3j76J48M74K02
$$ y = [-706, -595, -275, -85, 237, 507, 398, 49, -62, -557, -596, -354, -262, 422, 477, 469, 236, -247, -676, -734, -292, 90, 386, 307, 320, 170, -433, -426, -417, -392, -24, 231, 359, 467, 139, -173, -573, -577, -393, 6, 366, 575, 448, 184, -197, -203, -661, -461, -75, 355, 663, 613, 355, -303, -428, -471, -375, 108, 378, 427, 573, -28, -131, -427, -366, -414, -8, 572, 704, 480, -12, -150, -285, -476, -426, -157, 213, 447, 666, 152, -186, -441, -509, -492, -17, 215, 586, 611, 169, -75, -226, -510, -192, -43, 276, 597, 501, 169, -17, -241, -435, -406, -100, 401, 323, 262, -93, -65, -559, -386, -333, -289, 414, 280, 563, 76, -14, -420, -311, -540, -2, 189, 145, 811, 172, -402, -384, -651, -476, -73, 306, 228, 553, 368, -131, -517, -265, -320, 15, 206, 488, 365, 91, -52, -287, -543, -214, -139, 135, 287, 403, 367, -192, -214, -398, -337, -203, 359, 588, 495, 168, -254, -152, -441, -491, -196, 347, 320, 261, 298, 91, -337, -244, -420, -272, 202, 404]
4876D04Q8m78l4l04j74L3L26K51j24K93Q1l91l58N8l8J16K61J91J32j2m23j58
4898b60k66J93J80L64R4M5K65n04m55J56k67L29K91K13Q0l26oo78O8m0K65M15
4920A56M25j19k97j03m55j45R1Q1N43K80j10P4k23m97n4J56k5L60J91l6k9j08
4942A56k36k73j51L30N04p7L06k17l43k79J16m88O47R7Q0M59l72k58l68M1O5L8
4964b23L34L23j67O1m16l73J58q8Q8M41K60L8k05k31k06m11L50J50K67L36k69
4985B17J40k73k35m03L15K80j8M47lk2j96n51m9l7J60J68J92P2%Ol08l57L0P9
5009c46N20K92j94j08J26m99k81J87q5N35L97j57j85o0o08J95KN0K38K29j31J20
5031B37j25k94j52r3L66N0K84J67k31j00j19p1l85M02J1M12j37J01k25m53j7J6
$$ y = [404, 492, 14, -20, -324, -498, -465, -139, 112, -12, 281, 362, -29, -387, -329, -367, -251, 10, 201, 333, 321, -102, -260, -526, -333, -153, 211, 305, 350, 615, 111, -344, -188, -455, -126, 165, 378, 458, 132, 126, -552, -484, -524, -259, 156, 581, 462, 165, 62, -393, -538, -447, -366, 177, 457, 347, 421, 198, -299, -353, -197, -222, 138, 329, 293, 264, 156, -80, -353, -504, -174, 330, 253, 559, 342, -1, -280, -164, -652, -5, 92, 172, 631, 259, 1, -367, -326, -261, -223, 111, 434, 267, 328, -88, -461, -303, -391, -303, 138, 398, 436, 231, 0, -206, -617, -267, -117, 150, 486, 217, 357, 84, -151, -554, -239, 41, 23, 470, 467, 445, 249, -302, -351, -388, -228, -60, 132, 204, 204, 210, -98, -455, -425, -346, 174, 466, 272, 164, 290, -209, -490, -303, -388, 147, 544, 387, 202, 142, -466, -271, -269, -219, 19, 248, 117, 237, 112, -182, -334, -427, -61, -11, 273, 440, 209, 109, -10, -81, -466, -64, -53, 359, 222, 323, 98, -355, -372, -356]
5053c56jM38J8L37J35l76l91r5j74L60j02N46j51Q9n4n38m4J10J24J46K47J99
5075D67Pm07p2l66%k8L48K85J02q3J87o75q4o8M7M36J80N5q3M6m52Kj59P0K61
5100A6M60q1L5m43j30R9k13J18K67q1K98o8o4l24l5k84J58K29M38l23L08j87l69
5123a76k3m8L6K42K99mM2m51j51J17k03M1P2L40L93j10j13m57l11J69j35M56K18
5146B43J95k63J87m41k26q3J50K05K67k75M88k82k90j87k8M9J61N49k02n8J86
5167C45m35j21k71J34L26K55J11Ko6j97k00j31P1K03P8K16N6k09j31m65K52qK40
5190E5J63J35J97j01l46m40O3L24j95K01L1K97k63k98p3K6o2J49M59j49J70j70
5212A73l94k3J33k32L62R0L2K36j4p48O6K0J41J31J66J4L1lk27j58k76J68L70
$$ y = [-356, -357, 81, 99, 436, 571, 195, -196, -291, -465, -105, -207, 339, 188, 277, 223, -315, -359, -249, -125, 21, 268, 467, 474, 67, -5, -371, -371, -399, -51, 234, 336, 253, 440, -235, -319, -387, -340, 96, 276, 331, 248, 294, -158, -156, -315, -245, 16, 476, 395, 430, -13, -143, -44, -257, -139, 128, 47, 345, 277, 213, -111, -146, -430, -272, -43, 395, 72, 380, 193, -176, -199, -247, -211, 31, 330, 326, 368, -83, -234, -117, -320, -279, -207, 133, 526, 416, 303, -154, -465, -296, -431, 25, 243, 438, 175, 362, -79, -305, -388, -238, -33, 234, -41, 447, 165, -125, -312, -340, -291, -130, 419, 217, 159, 345, -90, -211, -482, -348, -22, 233, 344, 346, 280, 83, -117, -248, -177, 26, 104, 320, 376, 167, 36, -429, -177, -185, 55, 218, 353, 550, 449, 103, -337, -274, 50, -145, 56, 87, 384, 121, -177, -250, -224, -286, -137, 322, 173, 343, 173, -221, -244, -111, -343, 19, 109, 141, 377, 363, -385, -319, -299, -158, -27, 139, 153, 184, 181, -46, -204, -480, -312, 58]
5235E8R9J28L91n20j57j54j98M6K42J60J67R9lk60j69j06l07N26k0L33k08j43
5257Dm6j18o3n2J34L14K28j31k3q7l49j21m4L38J57j9K21j69N8l09j59j14M70
5280A20p4P8K82j43k69j67J0p7J9M26J10m6j31j99j65J19k55J09K26N1J85o1o6
5303H2j24k72OM28Q2KJ88on11K8Qj17jL72J10K70m70j33J34m19O5K43MK34K44
5328D47l43N6m28J14N0M1J66M5K92l11O1k73k12k11M18N11R6k03n5l25J31j58
5350i1j62L63j03J29M04l50j11k88k47L19r0K06L50J11k6l06k86l3k28L48J23
5371C2K37o6J66l54l16K25l7j10K34K08L17N7n57oj32k52J50K26K60K11l02n6
5393A35k57k08K5P4L99k07M74kk05l57k60J22P9K97r7L04L6k37l79k82N83k16
$$ y = [58, 157, 285, 676, 156, -1, -155, -353, -307, -65, 95, 262, 361, 358, 98, -71, -177, -484, 42, 22, 355, 147, 4, -42, -160, -223, -275, -141, 173, 401, 270, 247, 160, -189, -310, -354, -16, 141, 122, 343, 174, 232, -77, -236, -350, 120, 46, 124, 406, 263, -6, -173, -163, -240, -221, 205, 315, 269, 138, -61, -226, -107, -362, -253, -27, 24, 209, 148, 82, -42, -314, -308, 120, 202, 204, 392, 386, -125, -97, -89, -206, -207, 165, 275, 545, 75, -58, 76, -343, -278, -35, -31, 203, 447, 104, 160, -268, -154, -104, -63, 103, 148, 440, 129, 190, -83, -295, -506, -88, 423, 519, 316, 261, -64, 67, -91, -253, 110, 7, 136, 540, 190, 79, -209, -456, -137, -227, -21, 329, 440, 414, 108, -178, -211, -439, -91, 32, 269, 203, 369, 15, -301, -76, -113, -223, 11, 219, 536, 593, 36, 30, -102, -354, -204, 22, 282, 493, 191, 135, -122, -330, -305, -231, 168, -39, 435, 433, 228, -129, -389, -267, -188, 109, 12, 316, 352, 115, -264, -546, 37, -179]
5415a79K27K29m9P0j47l69J6l29M03K17L4J36P4j04k56q8j57o1K58J40L05J72
5437E42m75k56k04K36K8J67K84m9K8m96J57l40K6J41J89K8M2J96k05j57m4l6M1
5460a57J28J02L18j60Pl05j03j97k1L65M93k76J24j86l27L1j59J71l8M10O8o1
5482B27k10k63j65m1M37j06L50K84l25M0m77K3k53K66L96K54j02j80K8k44l01
5503c62q1K78r5L78J36O8q6n30L0j26k57O88L37j78K22l93pj79l58M53K75k30
5525a7L10P9k46l17j05j36L32J22J90K88k09q0n28j7j7k0J74L84kJ55j32j99l00
5548b91j97L18j39K29L02J78j13l29k00n5J31K33j27L70R5q3m62k76J94J22J10
5569A0n0L66J53j07m29j58J2q4L13J66M21j91n4l10m05k26M85N2J00L27j57j62
$$ y = [-179, 48, 277, 228, 298, 151, -218, -202, -531, -128, 89, 123, 259, 333, 229, -27, -115, -272, -333, -75, 65, 370, 542, 67, -189, -393, -157, -129, 38, 322, 273, 301, -195, -38, -378, -352, -211, -22, 6, 48, 244, 39, -118, -162, -198, -157, -29, 73, 391, 231, 238, -67, -170, -367, -388, -23, 470, 194, 318, 132, -195, -164, -323, -152, -190, 220, 288, 227, 17, -246, -411, -452, -15, -121, 229, 513, 188, 228, -249, -226, -479, -213, 183, 437, 335, 155, 183, -61, -362, -443, -165, -260, 118, 254, 322, 236, -294, -264, -390, -647, 41, 378, 200, 422, 29, 22, -157, -515, -62, 213, -17, 293, 372, 126, -191, -296, -432, -100, 22, 212, 500, 291, 211, -317, -334, -351, -371, -197, 187, 185, 340, 208, 9, -291, -488, -170, -309, -80, 222, 400, 287, -42, -242, -297, -166, 67, -60, 310, 405, 322, -140, -416, -222, -100, 10, -40, 326, 479, 372, -57, -215, -203, -287, 26, 192, 613, 422, 368, 58, -347, -573, -88, -36, 64, 391, 234, 72]
5591G2k44L4LR1k26M96O6k70K0%k68l9l7K38K40M9J5k30J14n47J00J22M3N24n9
5616C07J08j59l56j55Oj03L30J90P6J3L0j99n79J01j0L02J26L24k8l89J31l46
5638b80j46K24M7J18N52r0j79l08j56n8J3R2J30L93j25L85p09j23j40P9J11L74
5660B04J76j32K5l37l05J01o2L04K01K30o1k78j54j72K0j59j9L50L97J36P8o93
5682a50j27k93N16k35M91L31j10j65l3m54k26J9M35J4J22L01j10m15k04J30j01
5703b64K49K18K47j90L1l98j92J56k00J14K75K55m3r7k52j20p9j3P3K42M24o4
5725C72l14j0k28k40L04J49N3P9L18l35n0k31j11j29M8K90O40K4k66o76J83l08
5747d38m3K85J09K58j5K16l43j83j54o6J65K78M07k07O7m67r6j53N2M50K52j07
$$ y = [72, -172, -138, -135, -44, -270, 226, 292, 22, 42, 42, -226, -265, -302, -64, 176, 225, 240, 10, 124, -423, -323, -201, -158, 366, 307, 415, 256, -100, -255, -249, -352, -22, 168, 244, 257, 287, 88, -491, -390, -400, -98, 28, 352, 324, -65, 66, -280, -426, -202, -155, -37, 515, 425, 246, -62, -218, -276, -263, -171, -41, 352, 227, 612, -97, -220, -360, -281, -170, 204, 380, 248, 273, -64, -369, -268, -330, -26, 175, 405, 344, 66, -88, -260, -240, -399, -418, -68, 329, 465, 543, -150, -277, -570, -54, -289, 202, 533, 423, 258, 225, -229, -455, -436, -1, 13, 135, 436, 326, -89, -293, -163, -264, -15, 203, 450, 260, 291, -107, -299, -143, -343, -229, 46, 301, 258, 161, -91, -211, -290, -303, -230, 12, 436, 372, 58, 48, -180, -420, -116, 33, 86, 165, 483, 148, 98, -133, -244, -373, -325, -35, 605, 629, 363, -313, -130, -438, -481, -196, -87, 171, 156, 372, 29, -154, -308, -374, -209, 69, 476, 269, 336, -131, -227, -380, -328, 122, 374, 267]
5769B67K15m41J37l83l24J19L06J83L59J28m25k48r7j82K24L8K96N9j6J52l74
5790gp1l19K7L52o4O68q9j78l55l71j1jL07L15L6K35k57l18j84j90K66M1K00J74
5814B06J69k45n5k01m89K32J56L46J88k1l6q3k35l21L33J07J1K47n7R4m28l22
5836d04j37K55J02M36J13r4K16n13k6m63L52O0L24K13l0j69l02k23n3n1J90M02
5858A98l0J45o9j46n55O5mM18K46JJ11p4m80M6l70j62N20L87J72j80K2m22P4l02
5882c89m0J58M02J98j62j19p0l56O4n4K22L73J22J57l72k60l5m55K57O2O62K4
5904C89J7l8n36k20j18J95J52J46L82j65O5j94l17O1j3k2Q3L92R5O8n17j17k13
5927d25O6Q4N40j24L95k57n14P9m42J97R1L78K96j02P4n08j15j70J22K47K75K70
$$ y = [267, 482, 41, 178, -205, -529, -410, -104, 79, 438, 566, 141, -107, -204, -386, -162, -124, 172, 231, 215, 367, -7, -78, -397, -370, -18, -82, 586, 497, 319, -36, -407, -418, -419, -112, 203, 239, 474, 217, -101, -285, -475, -209, -168, 32, 206, 375, 130, 75, -126, -615, -383, -227, 119, 307, 286, 250, 167, -68, -389, -56, 51, 62, 309, 252, 346, -82, -404, -541, -286, -184, 252, 365, 271, 487, -26, -52, -515, -163, -103, 221, 434, 404, 235, -67, -290, -343, -394, -204, 198, 168, 313, 244, 98, -457, -392, -396, 22, 268, 269, 380, 306, -174, -128, -498, -660, -140, 247, 419, 239, 261, -161, -87, -389, -429, -271, 131, 329, 167, 48, -22, -378, -314, -368, -146, 227, 349, 506, 134, -126, -161, -616, -359, -297, 365, 389, 406, 368, -168, -388, -506, -311, -159, -13, 369, 204, 269, 75, -242, -181, -194, -216, -133, 259, 354, 422, -95, -212, -425, -359, -275, 265, 141, 536, 279, -235, -156, -598, -401, -310, 68, 364, 262, 336, -172, -287, -457, -335, -88, 187, 457]
5949D57p0jk67n52j32J96K99K73K82K4j97l35l89J98qO4L9M02J77k58n8l69n9
5972b84K7O8J98K97j1n7m49L9j58J68M54J2O4J54l3o81j01j22j03K62J50N88N3
5995E35k07k99k56j70K0J90M43L22k96Lj31k79k55O1M5J87L47N58o21j17m75k2
6017d17O3K12K28J75L14j32m09k1o11R5J14M51J74K74k15k77l02k17Q0L10M0O64
6039E93k62M5l25l80j63R7o5Q42M6o6m3k88j59j31m1o1O32J40l5j07k02k01k58
6062c92l70Q36j3M72m6k44Nn59q0k3K15M24O1J44mj10p89K97k19K16K21K53J20
6085D15m1k76l85j52j41O63j16K79L64k13k59k65m10K60O7N29j56J81qk23l85
6106b72l43J56K76J50J56L03l16p1m69K6k2K84K40K54K37j91l35j79m80K99L06
$$ y = [457, 387, 386, 119, -433, -565, -369, -70, 203, 485, 509, 312, -23, -412, -214, -222, -158, -119, 283, 460, 202, 144, -225, -284, -257, -189, 9, 306, 295, 238, -211, -172, -330, -162, 292, 304, 368, 522, 489, -192, -293, -415, -518, -256, -106, 482, 535, 328, 29, -227, -397, -377, -187, 256, 578, 282, 285, 154, -125, -380, -319, -274, -87, 260, 818, 197, 80, -395, -417, -354, -142, 86, 261, 575, 443, 34, 13, -598, -503, -389, 62, 236, 510, 295, 18, -284, -501, -421, -111, -71, 593, 331, 376, 51, -329, -492, -395, -460, 382, 428, 362, 319, 31, -128, -259, -300, -361, 271, 411, 376, 269, 67, -134, -392, -762, 74, 61, 533, 487, 243, 248, -311, -391, -414, -199, 225, 286, 430, 426, 316, -473, -176, -395, -179, 42, 295, 415, 374, 98, -287, -439, -580, 83, -33, 246, 610, 397, 138, -127, -537, -277, -210, 319, 163, 344, 336, 113, -272, -615, -459, -183, -33, 123, 426, 110, 39, -430, -404, -426, -142, 98, 352, 589, 398, 63, -116, -596, -297, 9]
6127IJ68L01j33K0p5o17m0p2L28P8L42J55l3n84r5j53Q4K01K85K68L1k02J04o70
6151c00j71O8J77M92N7Rj31j41l4m14p1K73K42K24P2l10j5k27l14J53Q9K30K85
6174B43P8K02n21l03m3j23M04N1N18J23k78k16l59k05N3J39K76L71K67n17n6l69
6196b65j96j63L22J90N18J27j00m55k08k55J20J59J56N77K11k64m32p34K29N7
6216d06j11N40M43j15r5m00j19j71j05K92L47K66LP3k94k67n52L12M2L24L95J13
6238E15l24j13l83j94K2L56j16N22J88m2l78k99j25k14J21M63K87K0N8k18m64
6259c18P6j57OJ93O78l2j02j72m27k29L1K4L23L77K61k21r5j66k21k26L9M67J09
6282B18L50l83j09l27j33k04K73M71K43PN5j90m82k45J99M5K53N86j69j61m9m45
$$ y = [9, 177, 478, 345, 365, 290, -327, -367, -439, -111, -33, 309, 464, 431, -153, -248, -401, -317, -116, 169, 437, 468, 266, 370, -300, -471, -403, -226, 266, 323, 332, 201, 60, 26, -388, -459, -186, 56, 280, 352, 42, 27, -200, -514, -361, -272, -42, 243, 321, 523, 2, -301, -344, -467, -63, -12, 506, 629, 351, 135, -224, -429, -376, -237, 39, 410, 677, 160, 104, -265, -461, -624, -302, -112, 406, 533, 433, -22, -230, -485, -365, -206, -50, 527, 738, 474, 42, -692, -463, -406, -517, 23, 466, 351, 256, -144, -263, -434, -539, -247, 100, 366, 369, 442, 148, -119, -671, -359, -317, 7, 402, 515, 191, 78, -305, -499, -477, -121, -237, 285, 473, 431, 53, -246, -371, -585, -464, -1, 286, 306, 364, 146, -318, -242, -399, -393, -200, 478, 446, 344, 172, -255, -484, -453, -429, -106, 271, 532, 311, 216, 50, -171, -397, -358, 109, 218, 568, 185, 76, -251, -384, -588, -315, 156, 399, 406, 461, 271, -211, -456, -257, -212, 41, 627, 458, 297, 248, -197]
6304a97j57JJ52J99K48rJ92n34k17J6j55K37M32R4K1R5k34l45l33J11K46J26K98
6327B87P3Nl85k07k74J47n3N46K12K17k28j51m72l03J38q8N53L62j10pk65m18
6349d21N2r1M22n1N72L8k38r1k04o95J43L73J91J92M77k67m14K3n47j45L90L34
6371D3M21L1k81j8l46k70n7R2M28M87o7J00l98m29k65j2L13L58K45O2k19p8k90
6394a50k27j13L03K69J27K5J34m91j70q1kj17M54N14M8k41l26j47j10j44K36M07
6416A98K91k9m29j74N9k62l01N28K67N0K91j24j46j50n02rJ45L87J90L53k35l16
6438H2l60r1l85L75L83O4M47j9j41o45j21Q4J22J44K23J24k39k36k79K82p0J63
6460i3L11M9M7J30j34j91n39K60L2J70J7M75n6m86k81O5l55K34K07M01OL7q8m56
$$ y = [-197, -354, -353, -201, -2, 246, 237, 429, -105, -322, -306, -461, -224, 208, 302, 323, 418, 184, -161, -494, -383, -137, -11, 287, 360, 365, -20, -227, -501, -354, -407, 139, 351, 568, 340, 189, -283, -586, -448, -536, 17, 379, 269, 262, -3, -421, -369, -460, -38, -89, 483, 521, 283, 192, -12, -707, -564, -191, 0, 192, 669, 402, -12, 11, -536, -681, -291, 43, 464, 495, 214, 196, -150, -420, -477, -385, 43, 530, 463, 563, 165, -264, -529, -541, -228, 130, 375, 437, 218, 140, -150, -377, -490, -187, 82, 209, 234, 368, -123, -293, -374, -376, -493, -39, 475, 523, 282, -44, -191, -301, -445, -209, 198, 489, 460, 31, -143, -84, -346, -647, -119, 148, 198, 489, 365, 219, 69, -433, -442, -297, 90, 280, 633, 398, 82, -278, -369, -754, -379, 4, 68, 515, 496, 355, -290, -411, -327, -205, -61, 162, 286, 47, -189, -468, -186, -256, -93, 218, 267, 314, 444, 310, 119, -420, -160, -128, 42, 59, 534, 478, -8, -289, -224, -579, -345, -138, 263, 269, 306, 218, -238]
6484b38j32J25l0J52M82K34k04k87l63j13k33L29L58K50L07l55j96l53k36N8J97
6505b48L94M14rm06J15m66l52K38J52J93K53J15R0l48l02l80mL88O8N31J05l18
6527B23j59k99n0n2p8L39L63Q5J68m33j83j81k61J62N57o4R3k9k36j00j82m0m8
6550d05O20r1M88l9n54m12o6k60M71L36K66L42m16j82l51j76L1J11J76M08J84
6571D81j84j22k46k57Oj9J17O13N7j61O4n69m39K10R8M52L61j53M8j31n10j87
6593d71l03N86K31K47J28R2n24k60k92K3M36J80J81L29l15j45k22l88J7N7M87
6614G4L31p0k34J32m27j03j84j59O88L61j98J26l32k48O8l06J77J92L86L06k5
6635E55l20n13j5k83M16J51K65L63j47k67m59k14o9J85L16L85R2K02m66o15J64
$$ y = [-238, -370, -245, -275, -123, 359, 593, 389, 102, -261, -374, -607, -278, 80, 330, 637, 282, 86, -267, -503, -445, -248, 146, 560, 551, 145, 260, -206, -558, -320, -168, 25, 278, 393, 483, 135, -167, -547, -551, -163, -95, 436, 541, 223, 64, -235, -285, -337, -415, -76, 287, 372, 540, 107, -76, -257, -518, -356, 201, 137, 230, 201, -35, -135, -317, -357, -405, 215, 124, 612, 573, 19, -393, -459, -719, -248, 88, 354, 696, 280, 98, -253, -429, -398, -287, -111, 297, 481, 297, 175, -71, -328, -322, -341, -224, 389, 446, 285, 349, -220, -659, -449, -351, 101, 462, 309, 357, 226, -284, -471, -774, -188, 43, 290, 418, 510, -14, -274, -566, -543, -107, 73, 254, 583, 268, 123, -99, -487, -470, -413, 74, 405, 335, 101, 233, -194, -297, -481, -640, 48, 409, 211, 337, 5, -243, -175, -481, -304, -112, 274, 580, 555, 235, -278, -293, -576, -160, -9, 256, 619, 472, 205, -254, -468, -537, -352, -36, 349, 441, 643, 177, -438, -274]
6656b74j65R7K35L99K90k95M8n47o7k42M7M61K19L5J19j57l78j80j38K84K29J85
6678B05Q7K62m71j48l33j06K39J03M75J96k07j36l48l26l3J44M30J64J79J55m06
6699A25k48l63n0M29M3L45J55J2k84j93k64m60L67M26J14M55l58r1m82q7q6p1
6721e66N23L33J70Pl28j98l71k16N15J59K39L04n1m97j32l46o5M7L83J71J99l6
6743B44k78M6n92p0L75K86L01J79j39l98k37j06j91L27K90K36O5p0j63m35o0l5
6765d25K98K01R1J48L23m12m80k51l1K06K24M16Q7O4j29k50o40J55K31L76J20
6786C22J05J92p11J6l46p1J68J90L06M26n62J59n15j25K02J8M47m8M84j74m78
6807Ej21m05J1Q3M73P9K92l06o7j97r7k54k5O05K39J3M08n93j08m15J02N7K41
$$ y = [-274, -439, -342, -107, 292, 582, 287, 335, -212, -279, -521, -474, -13, 206, 241, 360, 203, -175, -355, -493, -209, 20, 205, 292, 554, 83, -65, -398, -504, -265, -162, 313, 509, 302, 166, -182, -508, -541, -397, 33, 197, 376, 531, 125, -123, -486, -536, -107, -64, 281, 436, 448, 164, -29, -293, -753, -386, 40, 154, 609, 251, 160, -322, -409, -495, -566, -43, 290, 460, 467, 139, -59, -430, -646, -131, 28, 267, 571, 520, 23, -109, -455, -520, -473, -90, 81, 280, 244, -34, 12, -580, -650, -275, 11, 312, 491, 352, -46, -283, -389, -580, -253, 37, 273, 338, 268, 105, -330, -390, -425, -127, 74, 165, 313, 636, 224, -256, -507, -538, -332, -108, 308, 395, 459, 330, 80, -560, -405, -174, 202, 322, 427, 619, -92, -76, -422, -493, -325, -135, 171, 597, 35, 194, -321, -446, -244, -226, 221, 173, 657, 483, 5, -116, -521, -510, -427, 46, 125, 417, 111, 44, -153, -250, -504, -529, 76, 315, 328, 736, 143, 35, -380, -278, -221, 20]
6830B0M43J45k72k66k55l02J7Q0M93K00K21l03pj41m38q9P7L05M78R3j7m14j11
6853d3l85p8J72K77K81L34j36k74j77m37m7L79L25J3M90l71pn20j92j01oN89J61
6876B47P4m3j64l74k15O3J92L07K11J01J31m31k67j69qO8K60L73k36M64l41m80
6898b37k63O8Q4L30M58K7L3m41k28k16l7K33K84J89J44p4k26n88K67l30K51K33
6920c9N24j74J77k93m22j23l1K06L37K5M80k41j34n85j12K0R0L89J89J05L2j54
6942B66m83k53J38L21j07N13K74m25r5m63m6j77L10K73K55J32n3k62l83j51j54
6963e70J80M36J61L99l61l39J11k59l91Q3N79J55K88j45k12l69p6J0j13P75p8
6984B64J47M3k7o86r2j65K18L30N33m4k99j93p1n85J42K35K32J39N30l33Rl27
$$ y = [20, 463, 608, 336, 70, -185, -487, -470, -390, 103, 303, 524, 221, 214, 73, -365, -454, -377, -72, 406, 499, 482, 68, -43, -428, -506, -334, -57, 224, 558, 422, 148, -29, -466, -513, -134, 191, 204, 694, 323, 316, -204, -396, -497, -503, 86, 247, 321, 278, 114, -260, -475, -412, -220, 87, 298, 399, 530, 99, -168, -337, -345, -277, -17, 356, 120, 584, 243, -237, -500, -432, -348, -18, 440, 467, 500, 59, -169, -385, -422, -189, 95, 284, 428, 354, 128, -460, -193, -523, -272, -39, 485, 311, 488, 195, -227, -350, -381, -175, 162, 187, 667, 426, 292, -293, -405, -385, -295, 94, 283, 388, 420, 266, -217, -470, -332, -11, -118, 395, 669, 244, 149, -314, -360, -537, -227, 46, 301, 433, 380, 118, -265, -416, -570, -390, 46, 207, 606, 245, -94, 17, -242, -633, -550, 29, 184, 472, 327, 115, -254, -330, -320, -433, 342, 264, 411, 454, 427, -259, -351, -516, -298, 32, 565, 521, 222, 29, -42, -627, -485, -250, -18, 121, 651, 318, 327, 0]
7006@j93j91Q3K37O18l26J54on18k2m23L87j44O44J40rl80m60M2r2K0N56R6K62
7030D75J78n83l07k60N4K13Q9N03J69k16j63m24J16m36L29K33J99K64j27k41k83
7051b18o3k11K44K42J70J49j73J60m70k86r0J21N16K35l0K12l58k87j33k39J34
7072c75J22M69K54j22j64m43l25J81J98J13N17K08j84l76k44k46J1O7M54P6J51
7093C42j18k36k41j71K0K98L98l6L12k07r9n64K1q9P2L35K71K1K03k98n21k80
7115e67K49P3M48J30K8L24m43m62j89j61J82N89J86l1rR0q08O6l19M25K11K88
7137C00K76k08l62k81l75K63J05K20K37L62j92l76j24p2k85K37M15JL07k02m9
7158A97m46k73J84J55K72J96l9P9J06p59o0r1J15M26N34j0j08n96j71k83K52p7
$$ y = [0, -193, -384, -301, -64, 554, 228, 382, 376, -142, -164, -587, -200, -344, 300, 440, 431, 51, -409, -367, -459, -439, 117, 213, 475, 653, 70, -237, -497, -443, -230, -141, 362, 531, 315, 152, -272, -156, -592, -263, -30, 169, 433, 306, 65, -218, -281, -492, -248, -6, 164, 313, 140, 300, -170, -456, -546, -425, 91, 326, 296, 508, 150, -137, -270, -509, -375, -253, 216, 470, 348, 184, -259, -584, -403, -205, -92, 425, 633, 449, 73, -171, -417, -406, -339, 115, 191, 342, 224, -12, -253, -424, -404, -106, 292, 256, 568, 361, 262, -302, -281, -370, -298, 37, 308, 329, 532, 234, -287, -567, -318, -245, 203, 333, 361, 685, 242, -220, -409, -570, -388, 201, 387, 356, 347, 437, -371, -305, -624, -199, 12, 300, 576, 368, 6, -275, -650, -387, -282, -62, 175, 537, 345, -31, -155, -227, -512, -275, 140, 141, 448, 246, 197, -249, -522, -338, -183, 89, 285, 246, 325, 431, -328, -388, -479, -364, 62, 596, 586, 478, -118, -289, -572, -320, -397]
7180c97K87K00N48j05j80o59k69j2J03O91N29l17j66l04o9m29K64j36P37J40k13
7201B43K86l49j93n91K8K65R0P82J6l25r4l81m16J50k3O41l6M78l7m63k20n05
7223f54J21L54L32m6J98R3k94m76K7p9K82J88M93l7J12m44m63k36k07O27M9M75
7245D15L00l65j38l89j52k58L45K69K09K30J3j48n93j90J43O4L22RK83N3k75l67
7267b20k33l9J7M80J80L16r4k26m83J02j71N9L65L29k2L52o24l87q2k25M94K97
7289A85M1J22j75K75p35j35Q0L7M91j79L97Rl37j35n73K30K21K03K81R3pk44j83
7312c8j59l04j8Q03q0K6L46l44k96n00J07J57M24N86r2o6l73o66P2r9M0N61L91
7335D78j8k2k62l18n85K14M14Q9L70l19N35o52J79n54J09J09J96L61j1N4j98m52
$$ y = [-397, -110, 90, 638, 533, 353, -306, -575, -587, -484, 207, 736, 419, 253, -51, -120, -549, -285, -421, 316, 456, 243, 529, 180, -13, -604, -576, -311, -221, 561, 577, 252, 158, -223, -639, -489, -512, 129, 93, 571, 534, 71, -149, -654, -533, -179, 153, 107, 305, 398, 104, -372, -345, -424, -142, 46, 539, 502, 614, 170, -293, -529, -736, -109, -60, 415, 715, 350, 212, -177, -329, -587, -242, 27, 236, 466, 479, 331, -262, -452, -309, -245, 77, 86, 369, 422, 147, -220, -453, -492, -475, 5, 185, 501, 407, 181, -302, -200, -371, -312, 53, 382, 360, 712, 88, -299, -381, -606, -112, 185, 226, 348, 173, 448, -287, -422, -342, -305, 186, 7, 404, 413, 76, -59, -632, -402, -181, 22, 303, 396, 389, 145, -38, -197, -501, -519, 284, 204, 230, 576, 232, -64, -564, -457, -300, 124, 710, 618, 552, 179, -487, -415, -514, -474, 87, 478, 460, 438, 176, -142, -727, -513, -99, -10, 360, 41, 576, -76, 103, -451, -342, -233, -37, 324, 313, 367, 169, -283]
7357b83K33l61o9M32L37J29m7l37o12lmJ92L78L59J63j35l69l97Pp5K2M46K30
7380B36ML86l96m47k06k11L21K72L95j21K11m35j77j52k62L86K36L00m1K72k86
7401B85m06k57l3n8K59L14K47K73o49j60k42k58N33K28M69k51J90m27j58k55j74
7422e30M39k3N51l1pk57k92j10j96k21N56M05K22k18m28j03j46n0K9N82O9kL13
7445E52k15n84k03jR9M80K74P5N2k36l29j61m18N07M7L76M2K39j87m03l91n7J36
7468c06J0P99p4p7j43k83k99k48J91O47J34J51j63j68l60k91o5J14L66L57J14
7489D06Pm42K1k62jk96P02J51J09j26k73p4j90j74k4M27M69rJ86k16o76l03o2
7512f50K90L13L69%Mj85m84N6j96KM96K6N31k17m6m12j34K3j54L22K98J66k82
$$ y = [-283, -50, -411, -480, -48, 289, 418, 371, 34, -578, -581, -585, -393, -15, 344, 507, 372, 3, -394, -387, -462, -440, 6, 236, 240, 626, 230, -217, -423, -634, -313, -41, 354, 233, 444, 9, -168, -320, -582, -196, 40, 340, 299, 571, 285, -121, -378, -411, -469, -210, 104, 351, 624, -25, -185, -427, -685, -152, 76, 545, 294, 484, 57, -101, -356, -530, -91, -114, 437, 406, 399, 142, -150, -260, -456, -677, -121, 284, 506, 288, -140, -243, -389, -439, -410, 172, 241, 239, 552, 337, -247, -450, -451, -352, 128, 402, 477, 529, 293, -36, -197, -615, -108, -61, 315, 357, 596, 409, 6, -385, -442, -306, -296, 503, 429, 352, 209, -74, -373, -621, -430, 217, 351, 502, 339, 171, -189, -480, -545, -431, -65, 292, 406, 413, -29, -8, -270, -271, -567, 135, 286, 395, 269, -4, -78, -268, -442, -466, -39, 430, 421, 607, 391, -285, -588, -650, -360, -47, 322, 322, 326, 141, -343, -287, -483, -481, 15, 41, 572, 355, 309, -103, -237, -214, -368, -46, 252, 418, 136]
7535A36J63l62k41j71R4L91L00K61j15l51n32K19m90M14J07O46J65k22m00j25
7555a13l26J0R2K75M30j27K47m66r4l84N9M0M87K59Pj96j13l12j91q9J01M89J69
7578B54K26j49n8k94k22j51l7Q55k06K03K46p12o5l37R5o6L73J27K68N6l71j20
7600h5k85j17L05K33J06L43j69j9m56n31K08J38J91O96n9k13l7k88l79J61L2K10
7622a5K38J51r7j42j84j14m86L28N47N3J78l0l00P2m67k15M6L67J98L33j41j75
7644A45l06j51l54J77M96J94M7K03k40k14m11k9P6N39j7L43r3k11k22m21o3K15
7666b97M49K50K13j45j63m07l73j65L56J69L20K02K0m34J49n50l07M49K19M15
7686C70j1J03m27k2l30j22J73K17L06J11R2m78k40kl20L09K10M84K1m9k96l24
$$ y = [136, 299, -63, -304, -475, -381, 10, 310, 571, 456, 105, -427, -208, -698, -284, -177, 469, 634, 412, 12, -113, -439, -429, -337, -62, 368, 241, 488, 22, -72, -456, -397, -357, 130, 389, 396, 200, 87, -225, -416, -505, -404, 85, 254, 480, 331, 273, -21, -243, -394, -431, 424, 218, 421, 667, -45, -110, -447, -352, -418, -45, 82, 350, 406, 35, -85, -370, -487, -182, 51, 157, 500, 331, 312, -144, -675, -467, -329, -138, 558, 499, 286, 249, -39, -418, -257, -225, -15, 223, 374, 277, 135, -49, -163, -649, -321, 226, 279, 457, 427, 127, 199, -268, -483, -437, -70, 128, 461, 320, 145, -161, -312, -666, -489, 7, 201, 248, 451, 211, -3, -414, -443, -367, 172, 155, 498, 405, 194, -28, -449, -512, -297, 152, 402, 615, 470, 307, -100, -473, -638, -282, -113, 207, 409, 429, -5, 144, -406, -713, -264, -45, 370, 359, 462, 35, 13, -317, -439, -266, -49, 257, 368, 460, -18, -258, -260, -580, -271, -61, 423, 444, 395, 99, -225]
7708b25o6l32M37l3N51J6L04l21n30j62o5L28j25K87J91K5k86p4k82k6K54k9J74
7731A1K65J00m26p8l58J61p5P21J5L6Q5j77o66J56k99K16J85K87K44J65l81l36
7753a49l10JJ24K27M00J95Q9l88m09o9j53k9L68K17K72j59k2l61k05j74P1K97
7775a67O19P3k76j72k15l20N8J08K90M10k07K55m73k42k23j11L45L74R2L07k35
7796B90j09k87m73K2J16L68N47J01k70l44k30m6j43J08L69K85J00Nj78l78j55
7817c02k83K68M30J00J53k80J6j95l10q8K72J78L88J70l34k9m7p81K96J52N7N25
7839C56j02m2J68j70k90m23K16K68J15L48k77j06j62j71q3J94J75M71j4L6l46
7860A61k39k20j62K83J44K63K25m3k54l79k03q2K91K97L48j3oL4j005P2L5J72
$$ y = [-225, -291, -623, -186, -219, 332, 348, 652, 331, -199, -361, -426, -98, -223, 64, 255, 280, -6, -80, -362, -388, -134, -163, 11, 276, 376, -50, -128, -486, -325, -400, 321, 336, 372, 457, 280, -386, -230, -529, -313, -128, 159, 403, 568, 187, -149, -459, -458, -334, -107, 293, 488, 577, 189, -220, -289, -442, -471, -103, 114, 386, 227, 205, -156, -361, -535, -464, -167, 452, 525, 249, 77, -138, -458, -400, -292, -2, 408, 201, 456, -17, -259, -482, -593, -248, 126, 218, 525, 290, 181, -106, -579, -557, -441, -73, 474, 575, 305, -39, -269, -315, -458, -350, 19, 304, 404, 409, 231, -147, -302, -585, -317, 113, 213, 366, 86, 102, -93, -403, -491, -219, -41, 347, 517, 183, 154, 107, -674, -378, -226, -169, 356, 254, 212, 380, 210, -80, -503, -287, -19, 96, 444, 167, 61, -101, -272, -355, -161, 14, 485, 471, 507, 161, -78, -298, -460, -177, -33, 230, 455, 412, 158, -221, -424, -506, -215, 82, 430, 417, 411, 445, -560, -488, -453, -281]
7882b81J20J69N96j88l47l88K13k28Q0J23O89p0r8j94l17j19p1oJ88M75J20j85
7904B81j92k5m04k54M91J19M54J3l03k05k88j67J26J08K28K15L06n2k21k85k03
7925b58l33J39L05J46L07k47J17m68k20J93P9N63j38n8J12j35j28k65J58o1K05
7946A3L93o6Ok42k70j06J3j8L16K91n3j06j29L4o96M20j84N78K2J68Q3m89l21
7969c43j89J27K99J89L59j12O2k24l97l7l53J71K46N85l4n8m1l76l8l61J4M30
7991h1N23k31J15Jm05k52J26J13P1K25J22Ol28j80l57K85k19N03J52K53n34L01
8013B09k31l59J73m6L16K37K44m37M1k04k57j16K80J13K64K21k14J20o29r1p2
8034d38K70N4M60J94k94j41l95j58K12J37K32J0o5J40K74n33l91J59K11J26J08
$$ y = [-281, -161, 8, 604, 416, 69, -319, -106, -334, -254, -131, 558, 488, 390, 196, -121, -240, -311, -317, -129, 346, 466, 281, 89, 64, -340, -594, -103, 16, 470, 483, 180, -25, -313, -480, -354, -246, -18, 197, 503, 451, 230, -55, -258, -591, -452, -147, -1, 306, 59, 176, -292, -512, -319, -240, 323, 185, 127, 239, 104, -24, -289, -131, -192, 13, 406, 340, 346, 104, -166, -272, -259, -277, 39, 330, 277, 171, 42, 76, -620, -200, -384, 194, 216, 384, 467, -22, -343, -532, -405, -106, 83, 442, 330, 392, 168, -229, -266, -619, -448, -202, 383, 349, 291, 250, -126, -164, -525, -511, -81, 442, 211, 326, 327, -78, -330, -204, -91, -20, 205, 327, 333, 5, -175, -532, -247, -466, 37, 189, 442, -92, 209, -22, -381, -208, -254, 62, 299, 543, 106, 147, -57, -314, -430, -150, -37, 227, 448, 234, 354, -275, -366, -438, -168, -114, 346, 540, 246, 105, -290, -448, -236, -99, 133, 143, 78, 218, 492, -41, -432, -273, -62, 64, 172]
8055A72j12M28m00j90O2l93P5L39L16J09k17n8k66n2j35J13K47L24J33j73k0m86
8077a84Qj95L5N54r2L55r5k00l67N8l03j6L08P36Qk91k76k62k0J3j81M55L4O7
8101A49K56k53m40J04p0K05J62J52L0l8o9m69l9K4O5K56O1L10j12l59k45rK37
8124i2k29M36O9K58k33j30l43l7k21K04L80J52K37j93q5l79r4j8k7K82L48L04
8146E89k58l80m04q4J74R1K78J06K74q4q2l21m51K28K4K88J96J69k82n7L8l82
8168c30Q4j94J93N24J83l43J65n48o9j41L14q1L16K89j74j0l47l35K02J4J31M86
8190C29l4
$$ y = [172, 60, 488, 88, -102, -40, -433, -358, -19, 297, 406, 189, 131, -135, -187, -322, -209, 38, 362, 495, 322, 302, -184, -176, -371, -336, 218, 126, 481, 386, 186, -181, -123, -426, -442, -134, 602, 610, 319, 43, -219, -239, -226, -407, 48, 82, 149, 405, 152, -288, -184, -254, -49, 113, 265, 295, 257, 188, -281, -320, -296, -231, 25, 86, 396, 284, -75, -320, -329, -92, -321, 115, 184, 442, 209, 79, -264, -301, -522, -318, 62, 214, 451, 258, 173, -206, -300, -318, -345, -63, 285, 589, 331, -49, -453, -537, -363, -272, 6, 112, 386, 302, 220, -101, -552, -324, -300, -12, 184, 353, 71, 14, 52, -330, -246, -440, -247, 277, 460, 117, 282, -266, -335, -476, -162, -243, 73, 362, 188, 178, -169, -504, -302, -288, -157, 329, 295]
8191B95
$$ Imaginary data points
##PAGE= N=2
##DATA TABLE= (X++(I..I)), XYDATA
0@%%%%%%%%%%%%%qJ6j6J6j6K4l2L2m0M8n6P0p8Q8j04J20j37J56j79K06k32K61
35A39k94L30l72M14m62N17n71O34p04P77q60R49j045J152j271J400j540J700j877
54i84K071k293K544k834L171l565M039m619N348o298P593r474J2468j8005L1720
69B0882j32585k71505K5755J42336K58040K37942J14974r7316k14458k51763j81941
80c49639k2770J73424K50476K18153J01546o5986k27575k52783j58401j2299J40664
91b05190K53208K23628Q3000p4000j95077k48445j69060J41J47934K21716K14854
102B52709R7833p9821k01081k19769j58490j8469J46943K27738J91760Q6640n8648
113B67345j94470k27283j40721q541J24538K17063K00178P6228o7689j72122k13284
$$ y = [0, 0, 0, 0, 0, 0, 0, 0, 0, 0, 0, 0, 0, 0, -8, 8, -8, 8, -8, 16, -16, 16, -24, 24, -32, 38, -40, 48, -56, 64, -73, 83, -96, 110, -122, 139, -155, 175, -197, 217, -245, 272, -299, 335, -369, 408, -452, 497, -548, 604, -667, 733, -807, 893, -984, 1087, -1206, 1338, -1496, 1675, -1890, 2149, -2470, 2878, -3420, 4173, -5301, 7167, -10838, 20882, -111703, -383208, -357453, -215117, 42923, 280865, 395839, 298523, 84065, -167698, -349639, -372409, -198985, 51491, 269644, 371190, 305204, 77629, -175154, -333555, -345854, -205190, 48018, 271646, 354646, 280646, 85569, -162876, -331936, -331795, -183861, 37855, 252709, 350542, 270721, 69640, -150129, -308619, -327088, -180145, 47593, 239353, 325993, 267345, 72875, -154408, -295129, -303670, -179132, 37931, 238109, 314337, 246648, 74526, -138758]
124a38758j52167m511J31919J97036J85812Q8799o5032j78875j97067j38049j7754
135b88647J24236K02201J74495P6285n1314j66858k02372j31494q121J11386J88855
146B8652J79229P4569n8902j55345j88392j36213j0686J15706J79216J66101P9766
157B73701n2054j57722j81134j25212j5954J06843J79582J61643P1202m6478j47584
168F6833j80393j23901j0674J01364J69487J60668P2070m8760j42128j71010j22873
179b29317j3984J00817J64906J53088P2040m4504j39357j67843j17259j4463R5613
190a40263J61193J49931O9444m2837j34498j63379j15284j4323R3070J56736J45802
201A65592O8213m0716j30812j59771j12468j3616Q9182J51952J44278O6429m0746
$$ y = [-138758, -290925, -295436, -163517, 33519, 219331, 308130, 243098, 64223, -132844, -270893, -288647, -164411, 37790, 212285, 288570, 237256, 70398, -131974, -263468, -271589, -160203, 28652, 207881, 282450, 223548, 68203, -120189, -256402, -267088, -151382, 27834, 193935, 273701, 221647, 63925, -117209, -242421, -258375, -151532, 28050, 189693, 260895, 214417, 66833, -113560, -237461, -248135, -146771, 22716, 183384, 255454, 206694, 64566, -106444, -229317, -243301, -142484, 22422, 175510, 247550, 203046, 63689, -104154, -221413, -235876, -140263, 20930, 170861, 240305, 197468, 62970, -100409, -215693, -230016, -136946, 19790, 165592, 233805, 193089, 62277, -97494, -209962, -223578, -134396, 17556, 161834, 228263, 187517]
212A87517j26316j54362j12180j4115Q9450J46663J38820O8105l8420j26133j50084
223i1055j06350j7416Q4416J47601J35619O2578l4197j19292j51780j05572j1902
234b07350Q0332J39425J37360O3984l8946j15445j41855j08092j6397Q4100J36912
245A4028J27937O6203l1831j19235j41012r8308j8874P5324J39261J29230N7927
256B00650l0717j08126j43177j02079j0665P4395J27575J30036O3837l6526j09176
267E6027j30724j01954j9776P9096J29989J18149O3064k5800j11439j34975r1975
278a70318j7422O7045J30309J24559N4298k9188r8674j34117r9492j0858P1408
289a12450J17904J21424O3899l3285j04543j22010r5091k1787P2917J24807J10860
$$ y = [187517, 61201, -93161, -205341, -219456, -130006, 16657, 155477, 223582, 185162, 59029, -91055, -197405, -214821, -130405, 17196, 152815, 215393, 181196, 61904, -89876, -195448, -207350, -127018, 12407, 149767, 213751, 174805, 59360, -82495, -190587, -206984, -122884, 14028, 141965, 208168, 176337, 57102, -83910, -182218, -201092, -125768, 13493, 142723, 200650, 169933, 61807, -81370, -183449, -194114, -119719, 7856, 137892, 201729, 165203, 56027, -74697, -176651, -196427, -117331, 12658, 130807, 193871, 168071, 56632, -78343, -170318, -187740, -120695, 9614, 134173, 188471, 159283, 60609, -73508, -173000, -183858, -112450, 5454, 126878, 190777, 157492, 52949, -69061, -164152, -185939, -113022, 11785, 122645]
300A22645N8213k1476j03105j30058q7026j5033O0971J21040J19981N2586k8994
311A49744r1781j23896r6709j2706O8997J10615J12525O3006k8309j00473j15706
322f4693q7763k2754O5217J19446J06671N3263j8682r3987j24200q4716j3227
333a65425N6572J10735J14964N3300k8040q6500j14367r2928j6049O5296J05607
344C165J04165O0919k2707r4284j11169q2260k2582N7362J12629J03294N0970
355A59502j6809q4994j17589q4177j3200N3197J02254J08737N4666k4739q3001
366E3847j06854q7595j9524O0125J01550R8530N7244j7223q8061j07732p8699
377a34392k0887N1664J04536J01433M9373j7050p8707j09743q2278j4916N1848
$$ y = [122645, 180858, 159382, 56277, -73781, -160807, -175840, -114869, 6171, 126152, 178738, 149744, 57963, -65933, -162642, -175348, -106351, 4264, 116789, 179795, 151486, 51013, -64693, -152456, -175210, -109993, 9453, 116124, 169387, 150705, 56718, -67482, -152198, -165425, -108853, 1882, 116846, 170146, 142106, 55606, -58761, -151689, -167738, -102442, 3165, 107330, 168249, 145542, 51258, -59911, -142171, -164753, -107391, 5238, 108532, 159502, 142693, 57699, -59890, -144067, -157267, -104070, -1816, 106921, 161587, 136848, 53847, -53007, -140602, -160126, -100001, 1549, 100079, 157323, 140100, 52039, -55693, -134392, -155279, -103615, 921, 102354, 151727, 134677, 55970, -53773, -136051, -150967, -99119]
388i9119R6415J01530N4335k1222q0048j01872q1632k0579N4495R8158R4512N3455
400A48428j5360q1091j03468p6691j8894M8221R7596R7093M9403j6835p5097j02125
412d8820p9164j6902N0035R2058R5024N2646j7750p6460r7904p6957j9792M9416
424i4570R3286R1761N0264j4625p4857r8441p4866j8445M6896R1015R2089M9139
436A38646j5467p2286r6051p5187j8181M6703Q8745Q9938M9230j4251p1494r4724
448d4379p3579j8138M5374Q7068Q9008M9149j4464p0025r2555p2986j9090M5192
460h9425Q5999Q6411M8423j2573o9287r2045p0223j8728M1903Q5431Q6876M6082
472A28844j3322o5441r0986p1480j6658M2686Q1159Q4827M8812j4288o7018q6243
$$ y = [-99119, -2704, 98826, 153161, 131939, 51891, -49981, -131613, -152192, -97697, 461, 94973, 148428, 133068, 51977, -51491, -128182, -147076, -98855, -1259, 95834, 145237, 128402, 53305, -48820, -127984, -144886, -94851, -2793, 92231, 144877, 127127, 50667, -47237, -124194, -143986, -94570, -1284, 90477, 140741, 126116, 51259, -47182, -122048, -140493, -93597, -2582, 89507, 138646, 123179, 50893, -45158, -120345, -138526, -91823, -3078, 86860, 136090, 121839, 50345, -44379, -117958, -136096, -90722, -3654, 85354, 134503, 120039, 50014, -42541, -115527, -134617, -89425, -3426, 82985, 131408, 118835, 49548, -42497, -112720, -131448, -89545, -4114, 82762, 128844, 115522, 50081, -40905, -112385, -129043, -86357, -5198, 79629, 128441, 114153, 47135, -39108]
484c9108o9597k0047M2977Q2826Q0670M5949r953o5857q8908o5569j7095L8304
496h5408Q0281Q3950M3561j3143o0941q5524o9918j5936M1764P5588P9990M7861
508A22125j2743o4538q1219o5293k0706L9564P9645P6802M2506p579o1095q5587
520c8118o3455j5296L4877P5033Q1251M2391j3463n7134p9004o8142j7111M0334
532g7837P2003P4535M6770r799o2671p7716o0526k0800L5666P6325P3976L9571
544A09497o975n5450q2039o1903j3598L2782O9106P8049M2386j3346n4653p3875
556c0019o4743j8361L8575O9043O9804M4379p316n9212p5204n6637j9656L1405
568g7942P3058P2424L6633p094n1505p7425o0731j3357L2737O4441P3266M2365
$$ y = [-39108, -108705, -128752, -85775, -2949, 77721, 123670, 113717, 47860, -41048, -106617, -123712, -85408, -5127, 78823, 122384, 109241, 48300, -37224, -107142, -123078, -81314, -5726, 74264, 122125, 109382, 44844, -36375, -101668, -122374, -82810, -3165, 73637, 116143, 108564, 47469, -38118, -101573, -116869, -81992, -6959, 74292, 116683, 103220, 46086, -32918, -101060, -118171, -77837, -5834, 68701, 115471, 105672, 43001, -34715, -95241, -116041, -80375, -4050, 69926, 109497, 102522, 47072, -34967, -96870, -110468, -77686, -8580, 69469, 111855, 98509, 43856, -30019, -94762, -113123, -74548, -5505, 64299, 108678, 101362, 42150, -33054, -89691, -109347, -77942, -4884, 67540, 104173, 97079, 45574, -31851, -92582, -105939, -73202, -8761, 64505, 106870]
580A06870j2215n4064o8851o0482j9373L6121O7700O5417M1020n410n5422p3356
592c2045n4258j6840K9098O8083P0322L5529q390m8629p2035n9249j3112L2326
604f9200O1244O8478M1317j0964n2150o6466n6059j9008L2955O5603O3323L7599
616I6672m882n1461p0371n2992j4799K7728O3086O7512L5683q880m6463o7703
628b6870n6883j4117L1771N9293O3702L9165q227n0251o4523n2505j7880K9996
640f7329O2508O1670L5177n150m7412o7357n1580j4039K7130N9044O4179L5454
652I2295q331m5490o3497n3652j5045K9775N7572O0505L6803o847m7226o2681
664b5819n0261j5885K7253N8982O0016L4009n655m5149o3047n0256j4244K6796
$$ y = [106870, 94655, 40591, -28260, -88742, -108115, -71994, -4294, 61123, 102143, 96733, 41311, -32045, -86303, -103143, -74045, -5962, 64360, 99889, 91499, 42870, -29165, -88414, -101526, -69200, -7956, 60522, 101839, 90875, 38725, -27741, -83800, -102808, -69853, -4250, 59073, 96672, 91790, 40329, -30042, -83034, -97833, -70105, -7019, 60493, 96176, 87296, 40833, -26870, -83753, -97870, -66099, -6806, 56896, 96061, 87834, 37583, -26940, -79445, -97325, -67329, -4821, 56849, 92026, 86876, 39464, -27893, -79473, -93512, -66382, -7338, 56841, 92295, 83964, 38474, -25023, -78675, -93720, -63945, -6373, 54132, 90935, 84088, 36862, -25819, -76080, -91965, -64712, -5730, 54286, 88295, 82640, 37491, -25556, -75812, -90056, -63260]
676f3260N6134O0307L4444o883m3898o1008n0225j4831K7234N5709N8222L4442
688H6387o409m3866o0527m8649j4608K6447N4993N7506L3751o241m2775n9535
700b3526m8070j4800K5665N4289N7055L2820n690m1945n9170m7561j4017K4852
712f0098N3080N6763L2742o149m0866n7389m7967j4378K5721N1849N4349L3826
724H1483n471m1805n6208m5550j5418K3832N2792N4063L1116m169l8993n7485
736b1813m6036j2871K3022M9835N5143L1812o618l8208n3821m6824j5200K5255
748e6324M9444N1406L3045l949m0703n4088m2765j5195K1333N0926N2924K8974
760G5028l464l6505n5259m4545j2284K1968M6317N3151L1925o481l7358n0427
$$ y = [-63260, -7126, 53181, 87625, 80742, 36844, -24164, -74389, -89220, -61986, -6277, 51945, 86387, 79978, 36112, -24415, -73064, -87672, -61225, -6232, 51274, 85025, 78784, 36009, -23526, -71596, -86396, -60731, -6442, 50613, 83433, 77743, 35798, -23372, -70933, -84950, -60098, -7018, 49745, 82487, 76338, 35472, -21917, -69884, -84262, -58541, -6692, 47657, 81483, 76012, 34207, -22001, -67551, -82969, -59137, -6345, 47718, 78834, 74665, 35672, -21813, -67849, -80720, -57698, -7863, 47280, 79092, 72474, 34266, -19555, -66379, -81579, -56324, -6880, 44526, 77571, 73622, 32919, -21169, -63934, -79129, -57796, -6870, 46054, 75028, 71564, 35059, -20200, -64745, -77029, -55061, -8744, 44407, 76332, 69851, 32493, -17934]
772a7934m4862j5433K3826M8208M8023L1482k228l8488n2725m0749j4038J9162
784e5756M8466N1567K7699m496l3295n2709m4012j1637K1814M3701M9915L2100
796G3357n984l6700m7886m1951j6112K2434M7131M6309K8710j288l5871n1889
808a9740l8933j2438J7768M5335N0191K7206n105l1970m8985m2870j1858K2042
820d9357M1188M6921L1023m636l5772m6161l8924j5861K0451M5751M4561K6538
832F5722q50l3610m9692l8124j0960J7072M2257M8272K6954n851l0844m5782m1026
845e6462j2546K1461M0740M3641K9321l365l4750m4851l6517j4286J8298M3837
857e479M3570K4882j789l1088m7156l7368j0431J7461L9554M5975K6231n333l0694
$$ y = [-17934, -62796, -78229, -54403, -6195, 41828, 73310, 71082, 32594, -20131, -60880, -74918, -55756, -7290, 44277, 71976, 67480, 34185, -18524, -62536, -74173, -52359, -8658, 41257, 73357, 67373, 30673, -17213, -59164, -75276, -52842, -5711, 40598, 69308, 68020, 32149, -19740, -58673, -71111, -53343, -8008, 42183, 69389, 64284, 32314, -16671, -59541, -71399, -49357, -8169, 38752, 69775, 65139, 29367, -16794, -55718, -71579, -51128, -5377, 39184, 65722, 64872, 31262, -18430, -56554, -67514, -50442, -8185, 40087, 67041, 61190, 30346, -15436, -56462, -69008, -47547, -6807, 36834, 66155, 62790, 28040, -16811, -53328, -67614, -49316, -5479, 38091, 62973, 61184, 30096, -17060, -54428, -64859, -47398, -7844, 38131, 64362, 59029, 28335]
870B8335m3269l8623j2644K0510L9702M1648K6803k273l2934m4123l4648j2693
882f4209J7390M0819M2664K3987k964k9531m4197l6416j0184J7856L7765M2849
894C5829K5626n057k9922m1504l5937j1891J8853L8791L9818K5204k661l0792
906B6357m2405l3894j1000J6718L8409M1262K3170l358k8828m1609l4791j0352
918f0321J7835L6503L9893K4599l866k9398m0166l3666j1316J7548L7125L8849
930C3619K3548k876k8981m0360l2925j0543J6579L6551L8987K2761l108k8246
942B5006l9900l2622j0622J6605L6116L8286K3167l344k8193l8983l2666j0084
954e7234J6343L5485L8157K2304l298k7663l8388l2068j0343J6781L5094L6571
$$ y = [28335, -14934, -53557, -66201, -45691, -5989, 35659, 62462, 60189, 27255, -16868, -51516, -64209, -46819, -6000, 36664, 60651, 57687, 28156, -16041, -52457, -62641, -44785, -7020, 35829, 61455, 56398, 26476, -15028, -50965, -62856, -44003, -5212, 34606, 59810, 57149, 26357, -16048, -49942, -60942, -44224, -5815, 35447, 58617, 55259, 26431, -15178, -49969, -60321, -42486, -5983, 33910, 58509, 54643, 25245, -14921, -48587, -59903, -42355, -5230, 33619, 57167, 54291, 25310, -15050, -47975, -58518, -41939, -5388, 33599, 56360, 53252, 25006, -14894, -47516, -58138, -41533, -5417, 32869, 56036, 52692, 24499, -14484, -47150, -57234, -40891, -5406, 32751, 55055, 51757, 24094, -14294, -46362, -56705, -39924, -4830, 31741]
966C1741K2541k709k7785l8417l0915j0054J5624L5219L6800K1492l380k6126
978B4031l8231l1579q819J6159L3119L6695K2374m408k6911l6187l0748j0402
990e4907J6503L4482L4799K0903k142k6980l7521k9127q777J4379L3732L6189
1002C1533K0015m285k4238l6582l0814q449J6440L1376L4718K2008l866k6894
1014B0962l4626k8625j0473J5452L3680L3662J9360j692k5385l6720k8302p761
1026e0468J3528L1817L5724J9212m677k3335l4158l0343q374J6321L0423L2756
1038B8426K1512l472k6366l3557k6935j0056J4273L2919L2370J8103j668k3843
1050B1706l5532k7507p191J3470K9899L4520J9225n121k3451l1732k9163q861
$$ y = [31741, 54282, 51573, 23788, -14629, -45544, -55598, -39974, -4755, 32045, 53537, 50157, 24031, -14200, -45779, -54598, -38439, -5320, 31375, 53749, 49341, 22430, -13757, -44505, -54907, -38404, -3922, 30877, 51780, 49638, 22658, -14863, -43990, -52767, -38388, -4656, 31533, 51548, 47263, 23025, -13557, -44371, -52820, -36380, -5004, 29714, 51722, 47856, 20962, -13664, -42289, -52762, -37310, -3630, 30032, 49392, 47700, 22315, -14405, -42707, -50468, -36940, -5123, 30601, 49813, 45136, 21801, -12357, -42700, -51074, -34753, -4330, 28426, 49938, 46466, 20100, -13457, -40392, -50448, -36175, -3256, 29114, 47217, 45549, 21706, -13826, -41333, -48524, -35054, -5155, 29365, 48590, 43469, 20018, -11714, -40877, -49738]
1062d9738J6184L0020L0675K0172k439k5431l2927k5573q993J3075L1983L1612
1074B8620J7131k586k2067l4554k6972o348J3945K8110L2604J9280m966k3249
1086A8948l0611k7302r275J5928K9761K9163J8759j843k4522l2594k4148q122
$$ y = [-49738, -33554, -3534, 27141, 47313, 44874, 19443, -13484, -39057, -48050, -34975, -2992, 28620, 45751, 43165, 21098, -13456, -40428, -46776, -32831, -4721, 27883, 47163, 42197, 18948, -11663, -38965, -48240, -32312, -2551, 26612, 45371, 43528, 19006, -13588, -37736, -45858]
$$ [...]
8191B2
##END NTUPLES=NMR FID
##END=
