##TITLE=1H_PR180_1
 D2O, 8 sc, 
 2.8.2019
##JCAMPDX= 6.0         $$ Bruker NMR JCAMP-DX V2.0
##DATA TYPE= NMR FID
##DATA CLASS= NTUPLES
##ORIGIN= UXNMR, Bruker Analytische Messtechnik GmbH
##OWNER= root
$$ XWIN-NMR		Version 3.5
$$ Fri Aug  2 15:16:56 2019 Russian Standard Time (UT+4h)  she@DPX200
##.OBSERVE FREQUENCY= 200.13155
##.OBSERVE NUCLEUS= ^1H
##.DELAY= (6, 6)
##.ACQUISITION MODE= SIMULTANEOUS
##.ACQUISITION SCHEME= undefined
##.AVERAGES= 8
##.DIGITISER RES= 18
##SPECTROMETER/DATA SYSTEM= spect
##.PULSE SEQUENCE= zg30
##.SOLVENT NAME= D2O
##.SHIFT REFERENCE= (INTERNAL, D2O, 0, 15.7039)
##AUDIT TRAIL= $$ (NUMBER, WHEN, WHO, WHERE, WHAT)
$$ ##TITLE= Audit trail, XWIN-NMR		Version 3.5
$$ ##JCAMPDX= 5.01
$$ ##ORIGIN= Bruker BioSpin GmbH
$$ ##OWNER= she
$$ F:/spectra/data/she/nmr/H-F/1/audita.txt
$$ ##AUDIT TRAIL=  $$ (NUMBER, WHEN, WHO, WHERE, WHAT)
(   1,<2019-08-02 15:15:55.29 +0400>,<she>,<DPX200>,
      <created by zg, POWCHK disabled, PULCHK disabled
       configuration hash MD5:
       00 E9 B6 7A A2 85 ED C7 34 08 36 98 17 FE 4E 26
       data hash MD5: 16K
       19 DA 8A CA 6E 84 2A 0A D8 A8 F2 E4 01 B9 E0 97>)
$$ ##END=
$$ 
$$ hash MD5
$$ 46 F0 76 D7 EA 44 7F E3 52 C9 66 D9 E6 92 F6 5E
##$RELAX= 
##$RELAX= 
##$RELAX= 
##$RELAX= 
##$RELAX= 
##$RELAX= 
$$ Bruker specific parameters
$$ --------------------------
##$DU= <F:/spectra>
##$EXPNO= 1
##$NAME= <H-F>
##$PROCNO= 1
##$TYPE= <nmr>
##$USER= <she>
##$AMP= (0..31)
100 100 100 100 100 100 100 100 100 100 100 100 100 100 100 100 100 100 
100 100 100 100 100 100 100 100 100 100 100 100 100 100 
##$AQSEQ= 0
##$AQ_mod= 1
##$AUNM= <au_zg>
##$AUTOPOS= <>
##$BF1= 200.13
##$BF2= 200.13
##$BF3= 200.13
##$BF4= 200.13
##$BF5= 200.13
##$BF6= 200.13
##$BF7= 200.13
##$BF8= 200.13
##$BYTORDA= 1
##$CFDGTYP= 0
##$CFRGTYP= 5
##$CHEMSTR= <none>
##$CNST= (0..31)
1 1 145 1 1 1 1 1 1 1 1 1 1 1 1 1 1 1 1 1 1 1 1 1 1 1 1 1 1 1 1 1 
##$CPDPRG= <>
##$CPDPRG1= <>
##$CPDPRG2= <>
##$CPDPRG3= <>
##$CPDPRG4= <mlev>
##$CPDPRG5= <mlev>
##$CPDPRG6= <mlev>
##$CPDPRG7= <mlev>
##$CPDPRG8= <mlev>
##$CPDPRGB= <>
##$CPDPRGT= <>
##$D= (0..31)
0 1.2 0 0 0 0 0 0 0 0 0 0.03 0 0 0 0 0 0 0 0 0 0 0 0 0 0 0 0 0 0 0 0 
##$DATE= 1564744554
##$DBL= (0..7)
120 120 120 120 120 120 120 120 
##$DBP= (0..7)
150 150 150 150 150 150 150 150 
##$DBP07= 0
##$DBPNAM0= <>
##$DBPNAM1= <>
##$DBPNAM2= <>
##$DBPNAM3= <>
##$DBPNAM4= <>
##$DBPNAM5= <>
##$DBPNAM6= <>
##$DBPNAM7= <>
##$DBPOAL= (0..7)
0.5 0.5 0.5 0.5 0.5 0.5 0.5 0.5 
##$DBPOFFS= (0..7)
0 0 0 0 0 0 0 0 
##$DE= 6
##$DECBNUC= <off>
##$DECIM= 24
##$DECNUC= <off>
##$DECSTAT= 4
##$DIGMOD= 1
##$DIGTYP= 9
##$DL= (0..7)
0 120 120 120 120 120 120 120 
##$DP= (0..7)
150 150 150 150 150 150 150 150 
##$DP07= 0
##$DPNAME0= <>
##$DPNAME1= <>
##$DPNAME2= <>
##$DPNAME3= <>
##$DPNAME4= <>
##$DPNAME5= <>
##$DPNAME6= <>
##$DPNAME7= <>
##$DPOAL= (0..7)
0.5 0.5 0.5 0.5 0.5 0.5 0.5 0.5 
##$DPOFFS= (0..7)
0 0 0 0 0 0 0 0 
##$DQDMODE= 0
##$DR= 18
##$DS= 0
##$DSLIST= <SSSSSSSSSSSSSSS>
##$DSPFIRM= 0
$$ [...]
##$SUBNAM2= <"">
##$SUBNAM3= <"">
##$SUBNAM4= <"">
##$SUBNAM5= <"">
##$SUBNAM6= <"">
##$SUBNAM7= <"">
##$SUBNAM8= <"">
##$SUBNAM9= <"">
##$SW= 24.9336996594482
##$SWIBOX= (0..15)
0 0 2 0 0 0 0 0 0 0 0 0 0 0 0 0 
##$SW_h= 4990.01996007984
##$TD= 16384
##$TD0= 1
##$TE= 0
##$TE2= 300
##$TE3= 300
##$TEG= 300
##$TL= (0..7)
0 120 120 120 120 120 120 120 
##$TP= (0..7)
150 150 150 150 150 150 150 150 
##$TP07= 0
##$TPNAME0= <>
##$TPNAME1= <>
##$TPNAME2= <>
##$TPNAME3= <>
##$TPNAME4= <>
##$TPNAME5= <>
##$TPNAME6= <>
##$TPNAME7= <>
##$TPOAL= (0..7)
0.5 0.5 0.5 0.5 0.5 0.5 0.5 0.5 
##$TPOFFS= (0..7)
0 0 0 0 0 0 0 0 
##$TUNHIN= 0
##$TUNHOUT= 0
##$TUNXOUT= 0
##$USERA1= <user>
##$USERA2= <user>
##$USERA3= <user>
##$USERA4= <user>
##$USERA5= <user>
##$V9= 5
##$VALIST= <valist>
##$VCLIST= <CCCCCCCCCCCCCCC>
##$VD= 0
##$VDLIST= <DDDDDDDDDDDDDDD>
##$VPLIST= <PPPPPPPPPPPPPPP>
##$VTLIST= <TTTTTTTTTTTTTTT>
##$WBST= 1024
##$WBSW= 4
##$XGAIN= (0..3)
0 0 0 0 
##$XL= 0
##$YL= 0
##$YMAX_a= 177539
##$YMIN_a= -123820
##$ZGOPTNS= <>
##$ZL1= 120
##$ZL2= 120
##$ZL3= 120
##$ZL4= 120
##$ABSF1= 10
##$ABSF2= 0
##$ABSG= 5
##$ABSL= 3
##$ALPHA= 0
##$AQORDER= 0
##$ASSFAC= 0
##$ASSFACI= 0
##$ASSFACX= 0
##$ASSWID= 0
##$AUNMP= <proc_1d>
##$AZFE= 0.1
##$AZFW= 0.1
##$BCFW= 1
##$BC_mod= 2
##$BYTORDP= 1
##$COROFFS= 0
##$CY= 11.3945322036743
##$DATMOD= 1
##$DC= 2
##$DFILT= <>
##$DTYPP= 0
##$F1P= 20.1537800932815
##$F2P= 0.134698688090026
##$FCOR= 0.5
##$FTSIZE= 0
##$FT_mod= 4
##$GAMMA= 1
##$GB= 0.15
##$INTBC= 1
##$INTSCL= 1
##$ISEN= 128
##$LB= 0.24
##$LEV0= 0
##$LPBIN= 0
##$MAXI= 10000
##$MC2= 0
##$MEAN= 0
##$ME_mod= 0
##$MI= 1.114404
##$NCOEF= 0
##$NC_proc= 0
##$NLEV= 6
##$NOISF1= 3.799351
##$NOISF2= 2.8
##$NSP= 1
##$NTH_PI= 0
##$NZP= 0
##$OFFSET= 15.70392
##$PC= 1
##$PHC0= -9137.913
##$PHC1= 15.80097
##$PH_mod= 1
##$PKNL= yes
##$PPARMOD= 0
##$PSCAL= 0
##$PSIGN= 0
##$REVERSE= no
##$SF= 200.130013532006
##$SI= 16384
##$SIGF1= 3
##$SIGF2= 2
##$SINO= 400
##$SIOLD= 16384
##$SREGLST= <1H.CDCl3>
##$SSB= 0
##$STSI= 0
##$STSR= 0
##$SW_p= 3612.71676300578
##$SYMM= 0
##$S_DEV= 0
##$TDeff= 0
##$TDoff= 0
##$TI= <>
##$TILT= no
##$TM1= 0
##$TM2= 0
##$TOPLEV= 0
##$USERP1= <user>
##$USERP2= <user>
##$USERP3= <user>
##$USERP4= <user>
##$USERP5= <user>
##$WDW= 1
##$XDIM= 8192
##$YMAX_p= 0
##$YMIN_p= 0
$$ End of Bruker specific parameters
$$ ---------------------------------
##NTUPLES= NMR FID
##VAR_NAME=  TIME,          FID/REAL,        FID/IMAG
##SYMBOL=    X,             R,               I
##VAR_TYPE=  INDEPENDENT,   DEPENDENT,       DEPENDENT
##VAR_FORM=  AFFN,          ASDF,            ASDF
##VAR_DIM=   8192,          8192,            8192
##UNITS=     SECONDS,       ARBITRARY UNITS, ARBITRARY UNITS
##FACTOR=    0.0002004,     1,               1
##FIRST=     0,             0,               0
##LAST=      1.6414764,     0,               0
##MIN=       0,             -123820,         0
##MAX=       1.6414764,     177539,          0
$$ Real data points
##PAGE= N=1
##DATA TABLE= (X++(R..R)), XYDATA
$$ [...]
1445a507K114J839p05j570m36m81j420P2K639J972q88j480m8l69j732l43K347
1462DK042l22r84k71q96j646J6K000J333j38N1J27j552k053J70K074J035j70M01
1481A221L71j527k106J2J610Q27K51Q97K43j787j843K11J163K57M04J490M97j961
1499B30j951K01R48J01M40J568N84j587j749j61M15J28Q05J586L56j359j237k96
1517i78j36j60J057J718L74j163j061l95n14j18J024J544L88o37p32p07r35j79
1535a610J288J326K64l09l16p90j298k92J257J264K75m9r1q68j381l68J044J077
1553D23L89L51R7j018j493l45R03P59M61O19K88r61j550m42O47O57N35P67M10
1572A497q77j381n38K76M55P29R52L82p76j196o11j9K76P61J120M40o75r92o68
$$ plain form
1445 -1507 607 2446 1741 171 -265 -746 -2166 -2094 545 2517 1629 149 101 -268 -2000 -2343 4
1462 4 2046 1724 740 469 -427 -2073 -2057 -57 1276 1138 1189 1316 -236 -2289 -2119 -45 990 820 1221
1481 1221 1592 65 -2041 -2029 -419 408 659 1556 1799 12 -1831 -1620 -457 -200 204 1694 2191 230
1499 230 -1721 -1520 -572 -471 -31 1537 2121 534 -1215 -1376 -961 -833 -28 1558 1914 555 -682 -978
1517 -978 -1114 -1274 -217 1501 1875 712 -349 -744 -1258 -1376 -352 1192 1580 943 211 -496 -1431 -1610
1535 -1610 -322 1004 1268 959 643 -147 -1445 -1737 -480 784 1059 1010 919 51 -1330 -1698 -654 423
1553 423 812 1163 1260 242 -1251 -1596 -693 66 527 1146 1434 473 -1077 -1519 -872 -215 320 1087 1497
1572 1497 620 -761 -1299 -1023 -568 161 1113 1495 719 -477 -1088 -1107 -831 -70 1050 1490 815 -177 -845
1591h45k91J05P80J169M70m22q19p25n28j34P87J181N56k52o15p77p39j90O42
1610f47J114O81pm91q22q07l20M80J013P77K54l64q51q85m17L62Q60Q44M35j77
1630A032p71r64n33J58P13R19O02l8o78r29o57k9O18R24P13R1n16q59q23k62N40
1651g49R08P90K48l18q05r32m55L78Q70Q16L98p2p31j013o46K47Q28P37N32J59
1671A190n93j114p44J41O17P08P28M12n10j167p81MM70N63Q85O02m36j139p88
1690i52j09K01M82J001Q52l41j090p68k50n1L72J130R48k05r32p34m13l17K72
1709i04J183J071j31p41o27n59n79J94J201J055M4n45m87p28q17J22J144J068
1727I64J46k12l95q74r95oJ082R27L14J06k77j003j101k8Q59Q13M90L51j46j089
$$ plain form
1591 -845 -1136 -1031 -251 918 1388 966 147 -578 -1106 -1240 -453 728 1284 1032 417 -360 -1099 -1289 -647
1610 -647 467 1148 1141 650 -172 -979 -1299 -819 194 971 1225 861 10 -875 -1292 -930 -70 774 1209 1032
1630 1032 261 -703 -1236 -1078 -365 554 1156 1118 440 -489 -1146 -1175 -557 367 1080 1171 655 -204 -1027 -1289 -749
1651 -749 159 949 1197 879 74 -858 -1313 -935 -65 751 1149 1077 346 -667 -1313 -1066 -238 499 1031 1190
1671 1190 597 -517 -1261 -1120 -503 205 933 1345 835 -332 -1113 -1109 -639 -76 809 1411 975 -164 -952
1690 -952 -1061 -860 -378 623 1475 1134 44 -724 -974 -1025 -653 477 1425 1220 288 -446 -859 -1176 -904
1709 -904 279 1350 1219 478 -149 -708 -1287 -1093 108 1163 1207 662 175 -553 -1370 -1248 -104 964
1727 964 1110 898 503 -371 -1366 -1372 -290 637 951 1057 780 -223 -1324 -1352 -493 320 810 1161 1015 -74
1747g4j098r8O24O61O05O51n3j124j112j91M01M68P85Q99j8j066j005l17N9L20
1767f83R80J057N5j004q62l84k86J14J100J213J05q29p44m73n77j6J087J286K05
1786A344o23n46o16q54j33J132J245K40l63k90p24j085k53J020J182L64o4j77
1804G99q08j211l11Q98R69M54L20Lr08j344l72P77P83M66N91K45r06j416m36N17
1824h90N89N98Q82L09r06j328m23J78L48O41J101M98q38j245n33mJ20O51J216
1843I64O35o50j066o68l14o4P65J235O08l86q28p13o47k73Q00J286O44k31n43
1862E54p21r01m07O49J186O90J32l20p55j160m59O25J007O27L64O7p30j327o96
1881a575N25R37O70M80K74o32j276p99K04P33P12Q14M13o44j221p97J8M10O63
$$ plain form
1747 -74 -1172 -1270 -646 15 620 1271 1218 94 -1018 -1209 -808 -340 445 1344 1326 260 -745 -1062 -1003 -683
1767 -683 297 1354 1409 405 -457 -841 -1127 -1013 87 1300 1405 576 -168 -641 -1218 -1234 -147 1139 1344
1786 1344 721 175 -441 -1295 -1428 -296 949 1189 826 536 -188 -1273 -1526 -506 676 1040 976 799
1804 799 -9 -1220 -1531 -633 336 790 1110 1113 205 -1139 -1511 -734 49 515 1106 1351 445 -971 -1407 -890
1824 -890 -301 297 1179 1488 582 -746 -1169 -991 -643 -2 1099 1597 759 -486 -1019 -1023 -903 -252 964
1843 964 1599 949 -117 -785 -1099 -1163 -398 837 1445 1059 231 -482 -1129 -1402 -602 684 1328 1097 554
1862 554 -167 -1068 -1475 -826 360 1050 1182 862 107 -1053 -1512 -887 120 747 1111 1178 448 -879 -1575
1881 -1575 -1050 -113 557 1037 1311 679 -597 -1396 -1192 -459 253 1067 1480 836 -385 -1182 -1164 -754 -91
1900i1R39O83m07j256q66j94K38O46R77P46k11r62r10m95q9O28J173Q13j47p51
1920D64q01o72l53M55J175R89N1n42q47q37n06M10J054R14L20k52p05j086o92
1939a461K39J026R14M55j4n71j046q75KQ12R48P13J53m88j007r37j92N02R27Q38
1959I38M03k62r90j014m37L57P98R12O34j07q61j038o16O4P33R70P39N6o69r60
1979c50q04j70N34R50Q77L45m81r52r17l83L51R03Q97N28k00q65j024n74K23P31
1999c81R39P24Lp57j036p08l0N67R24Q91K55o13j002q07k53L67Q65J088L78m43
2019I71q85q06n45J10Q66J117N28k72o75q44p48j80P62J164O77j01n10p84r15
2038a070m24O69J120P68Q2k12p30j135o27N33J093P46K62L5n54j194q43K62R75
$$ plain form
1900 -91 848 1531 1124 -132 -998 -1192 -954 -308 669 1415 1204 242 -668 -1163 -1252 -624 549 1362 1215 464
1920 464 -337 -1009 -1362 -907 268 1257 1308 766 -81 -918 -1424 -1014 40 954 1274 1022 317 -769 -1461
1939 -1461 -1222 -196 718 1173 1159 588 -458 -1333 -1331 -519 429 1142 1295 807 -200 -1137 -1329 -827 100 938
1959 938 1341 1079 89 -925 -1362 -1005 -207 705 1339 1232 371 -667 -1283 -1219 -486 484 1223 1279 610 -350
1979 -350 -1154 -1324 -790 160 1037 1382 901 -51 -968 -1351 -1000 -97 800 1328 1128 263 -761 -1335 -1112 -381
1999 -381 558 1282 1285 528 -508 -1216 -1246 -679 245 1136 1391 778 -224 -1031 -1284 -917 -52 1036 1414 971
2019 971 86 -720 -1265 -1155 -289 828 1356 1084 409 -435 -1183 -1363 -601 563 1240 1139 629 -155 -1070
2038 -1070 -1494 -825 295 1063 1145 933 203 -932 -1559 -1026 67 813 1075 1110 556 -638 -1481 -1219 -244
2057b44P85N03K19m84j166r43Q1O59P45P59M86m15j144r17j09L59O61Q96O90k52
2077A169j040r14l98O7O57J078P39k25p79p06o05l84M63J310R34j64p13n90n95
2096f96o64J92J252J033J23n08m86q27q34J01J189J044J48j56k94r36j103n5J130
2115c47R96L09N6j90q92j134k24P94Q13O45L98j04j052j133j84N14N27O82P67
2134A241J28j091j211k21L04L65P12J008K10r70j075l74NP8R04J192K66r14q72
2153c15l29k93k24Q23J403M32p34q23m35n03k65P31J273N88l84n83n70q31l97
2172a436P69J243N06j80k15n50j028n63N74J145N98J42q3n84j143n80M90Q12N79
2191D96M69K76o59j256o65M30O33M38O65N33n19j319o86J58M17M94Q83O41m75
$$ plain form
2057 -244 541 1044 1263 779 -387 -1330 -1249 -590 155 914 1400 985 -159 -1076 -1185 -826 -165 731 1421 1169
2077 1169 129 -785 -1183 -1116 -459 619 1358 1133 354 -352 -957 -1341 -878 432 1366 1202 489 -101 -696
2096 -696 -1360 -1168 84 1117 1240 732 246 -581 -1415 -1314 -125 919 1067 911 617 -319 -1422 -1477 -347
2115 -347 649 958 1014 824 -68 -1202 -1426 -632 181 826 1224 1120 68 -1065 -1249 -735 -208 474 1241
2134 1241 1369 278 -933 -1154 -850 -485 227 1235 1445 475 -600 -974 -969 -891 13 1205 1471 557 -315
2153 -315 -644 -937 -1161 -338 1065 1497 763 -60 -495 -998 -1263 -532 741 1329 945 362 -208 -1039 -1436
2172 -1436 -667 576 1082 902 687 137 -891 -1454 -880 265 863 1005 922 338 -805 -1385 -895 -83 496
2191 496 965 1241 582 -674 -1339 -909 -276 162 827 1360 841 -478 -1164 -1006 -589 -95 788 1429 954
2210I54j164o73r4J08M38J039Q45m03j062o28k28j50L36J118Q73j99q11o37m40
2229g78l74K94J112Q82m9n33n32o86o11K25J074R13J24l01m48p48q43J07R69Q55
2249F52K97Jl53q78q99j4P77P54M85K40k18r01r76j69N58O70O01M78r3q55r65
2270h08l41L37N37P11O75J0p73r13m39M9M10P41Q06J89o36q71n30j85K15P75R35
2291H94K88m34p47o68l67M7P29R36M57k63n74p26n80m6O07Q57N79L3m74p08p27
2312h87k35M19Q50O97J99k57p15p81m05K80O58P90M42j48o31p75n35M8N56Q18
2332C88N66N1m88q03o04k01M49P95P08J80l49o58p47m05L01P72O89L08j24n37
2352B91q11n56J13P02P29M26P7m02q78o82l5O06O53N53K38k78q56p83j50M38N69
$$ plain form
2210 954 -210 -883 -977 -869 -431 608 1453 1050 -12 -640 -868 -1018 -682 436 1309 1110 299 -338 -778
2229 -778 -1152 -858 254 1136 1087 554 22 -664 -1275 -1050 24 937 1061 760 312 -436 -1279 -1172 -203 652
2249 652 949 950 597 -281 -1180 -1194 -417 337 822 1062 844 -57 -1033 -1202 -644 26 627 1105 1012 157 -808
2270 -808 -1149 -812 -275 436 1111 1121 348 -565 -1004 -955 -545 196 1002 1191 555 -316 -846 -1031 -816 -41 894
2291 894 1182 748 1 -667 -1034 -987 -258 678 1135 872 298 -428 -1008 -1054 -447 410 989 1022 548 -160 -887
2312 -887 -1122 -703 147 844 1043 786 71 -710 -1115 -835 -177 613 1055 907 276 -499 -1034 -986 -430 388
2332 388 954 1005 517 -286 -890 -1091 -642 153 861 1041 692 34 -713 -1118 -817 -45 644 952 828 291
2352 291 -520 -1076 -963 -261 468 894 971 569 -309 -991 -1026 -420 233 786 1024 746 -110 -893 -1043 -605 -36
2373c6N84N10j30p86q62k60K35M27P21O47j6p16q29l50k1L16P73P88R8n97p21
2394b25m62k59J52P85Q51K38m84n36n58m84L0P59Q61K88k27l76o22p37q4P47Q51
2415E08L04pj99o52q99j98O85P46L42K36jp07j031k26N52N75L81M30K33p54j064
2436g46l11M42M07L54O90L42p03j001l70K41J49M12Q97M56o44r88l17J6p5L87
2456c62J054N53n38q36l53j88k95M39J105O14m71n98k87m67m80L86J137O40l10
2475G43l86k24o59o50L24J080O20j31j05k58q02p36K97R68M90N5J52j39r27q88
2495a176K10Q09M95K40L03j09r69q06P9N66L57M75N72j56r98p12L0K67J89O27
2515B93Q02r9r12p04p4m0J40P71Q61k2q07m93k41l35J4Q90R87n6o64l41k85n86
$$ plain form
2373 -36 548 1058 928 142 -720 -980 -745 -318 403 1050 1034 318 -511 -861 -882 -566 207 995 1093 496 -225
2394 -225 -687 -946 -794 -9 842 1080 596 60 -498 -982 -952 -193 668 956 729 353 -269 -1006 -1090 -343 508
2415 508 812 805 606 -46 -945 -1143 -458 288 630 866 865 158 -873 -1099 -547 28 409 839 1072 318 -746
2436 -746 -1057 -615 -208 146 836 1178 475 -526 -896 -655 -506 -94 803 1259 615 -373 -690 -674 -749 -362
2456 -362 692 1245 707 -129 -482 -670 -965 -526 579 1193 722 124 -163 -630 -1110 -724 413 1053 743
2475 743 357 133 -526 -1176 -852 228 848 717 612 354 -448 -1184 -887 81 571 626 778 639 -288 -1176
2495 -1176 -966 -157 338 578 881 772 -197 -1003 -924 -358 -1 474 1046 890 -108 -820 -790 -523 -334 293
2515 293 1095 996 84 -620 -694 -734 -594 177 1038 1016 209 -284 -525 -860 -846 44 1031 975 311 -30 -315 -901
2537i01j35R01R97Q7m60k69m26p08j88Q31R20J21j65q3n14r55k47Q25Q08J54L8
2558F31J08n63r92l23O22O86K74L18J12n85r96l28M67M26L30N77K90o14r97l51
2578i08K97K42L76P00L80n14q76m48K3J56M13Q02M24m29p34l93k15j32M79R09
2598E52N03l57n98l93l61k73M16Q93N54j57m14m17o01l20L92Q14N24nj77l70p21
2619e16n33K92P79N54J55n2l51p32n47J13O53N21L69J36l58p51o12N0M62M92M28
2640E52L00k26o77o45j49L02M89N73L29j27n95o15l20R1M89O41M47l7n64n86l99
2661g27r6L91O53N54Q4l82n83n16k48K81O47N88K22k64n02n94l61J16N72O31L80
2682H46j35m76o12m26L3M23O05N26O8m47o39m61r8K66N91O31K20l93o01m42k59
$$ plain form
2537 -901 -1036 -135 862 949 489 220 -206 -914 -1102 -271 649 770 605 522 8 -947 -1194 -369 439 593 631
2558 631 739 176 -816 -1139 -517 169 443 761 873 288 -708 -1036 -569 -143 187 764 1054 440 -557 -908
2578 -908 -611 -369 7 707 1087 573 -303 -751 -728 -572 -159 643 1067 638 -96 -489 -704 -836 -357 552
2598 552 1055 698 100 -293 -654 -927 -511 382 936 779 365 -52 -653 -973 -581 233 757 752 575 205 -516
2619 -516 -1049 -757 22 576 731 679 328 -404 -951 -838 -185 336 705 841 483 -268 -880 -830 -368 124 552
2640 552 852 626 -51 -696 -845 -543 -54 519 848 721 126 -489 -809 -718 -229 412 859 822 258 -328 -727
2661 -727 -823 -432 221 775 859 477 -106 -622 -870 -589 58 646 868 604 102 -492 -853 -737 -165 466 846
2682 846 711 235 -377 -803 -770 -347 258 784 852 405 -234 -695 -793 -527 64 695 915 522 -79 -521 -780
2703g80R8M87P72L49k84n53m53l45q7M12P44N13j44m04n20m65j87M05O76M61R2
2724G87k65n00o13l08K99O32N23K51j54m88o60l31J65M42N16M50J44n64p72l19
2744g65J50K75L58O01L66m79q25l76P1J17L29P13M35l37p41l83j25o1K97Q27O04
2765A051l54p15k88j76k63J31Q91P03k14n87l23l23l87J71Q67O25j32k99k23n05
2785c50o38J79R12N83m7j77o1o10p63J01Q08N72M8L2l1p00q02Q3O68M09J53L62
2807G31K7q20q25P3N76K52K29M92J19p20q49o5L49K60L62N94J57p58o95j06R8
2828e19N5N02P48J55o43n97j99r7k5N27Q33J76n21m76k72l41r6O36Q36J28l81
2849D29k44l19n83j98O77P72J53k07j12l40p16k38N79O76J90K6P8m28q93k39N48
$$ plain form
2703 -780 -682 -195 577 926 642 89 -364 -709 -796 -384 360 873 729 325 -195 -660 -847 -442 234 695 787
2724 787 522 22 -591 -899 -600 32 555 806 652 164 -496 -827 -662 -220 296 746 890 326 -446 -765
2744 -765 -615 -340 18 619 985 506 -319 -695 -624 -507 -178 535 970 633 -108 -491 -616 -677 -380 447 1051
2765 1051 697 -18 -306 -482 -745 -614 277 980 766 179 -144 -467 -854 -683 184 809 677 378 155 -350
2785 -350 -988 -809 103 686 639 462 401 -209 -972 -871 -63 509 557 589 558 -142 -944 -861 -193 216 369 731
2807 731 758 -62 -887 -814 -238 14 243 735 854 134 -715 -780 -431 -171 191 785 942 184 -511 -617 -519
2828 -519 -464 38 786 941 298 -299 -498 -595 -620 -93 740 916 395 -81 -353 -694 -790 -154 682 810 429
2849 429 185 -134 -717 -915 -238 534 687 480 368 28 -688 -926 -347 329 519 545 623 195 -698 -937 -389
2870c89N61J42K29K16m52q82l54M81M30J80L79L58m48r56l13L28K64J99N56M51
2890I80m67q66l12J72P6J99P10N16m06q13k62pj18K23P93N26l15o01l14j93k44
2911g23K42Q05M92j63m67k72l21m16K27P98N05j05k59k31m76n06K02P38M78K1
2931E69o4k37n29n80J40O15M38J27J34j38o52n92M3N07L68L06K49j38o18o14k9
2952f95L07L23M02M05n4o51n67o9J43K37M77M62Qn59n50j75l0J57N48N67O2m71
2974B77m43l11j56J15N23O09J36l47l82m02k51nM96O02K25k05l15m14l79o2M39
2995b50N51K98l0k66m58m50j13L53N22L37J54k06m65m77j88K32M23M45K42j22
3015E32m19m78k71Q0L65M99L12K4m01m71l28p3K97M94M21P6l04m48l74k04K13
$$ plain form
2870 -389 172 314 543 759 307 -575 -929 -448 -18 162 541 899 451 -505 -818 -490 -226 -27 529 980
2890 980 513 -353 -665 -493 -417 -218 492 1008 602 -211 -473 -480 -598 -375 418 944 629 28 -286 -479 -723
2911 -723 -481 324 816 653 186 -86 -407 -823 -596 202 707 602 343 112 -364 -870 -668 70 548 569
2931 569 505 268 -261 -841 -701 -86 352 479 613 475 -177 -769 -726 -219 149 455 704 566 -52 -666 -695
2952 -695 -388 -65 337 742 688 37 -530 -599 -456 -219 258 720 728 169 -381 -556 -586 -429 119 686 748 277
2974 277 -166 -477 -633 -518 5 614 750 403 21 -381 -632 -637 -141 461 686 481 166 -248 -627 -689 -250
2995 -250 301 599 569 303 -155 -605 -718 -365 157 494 648 442 -23 -500 -688 -456 -33 412 654 532
3015 532 113 -365 -636 -556 -191 308 620 644 243 -228 -556 -629 -332 162 583 659 355 -93 -467 -671 -458
3036d58M60M57J79j89l80m42k96J30M27M51K69n9l26n13l16K5L54M27L49N4k44
3057C59m89m29n0K34M24L92K31k06n02m14j35P7L80N14L04j97m34l77k34k2L25
3078b49N03L80p1l70l55l01j88K39N92M54n8l39k29l61l51J65O09M56J5j75j93
3099A73m21m30P8N90L95N9l2r7m54n49L4N03M12J28R0j1m96n97l4M28L21J65K77
3122E32M2m90o15r0L37K22K37L62J39n29o12r3K13J29K65M87J64m43n85j15M5
3143c98mL63N66K23m84m38j61p8r8L48O27K51l72l75j71k52j57L67O42K10k34
3164C75k26k34l80k18L59O05K37j06j17k36m60k82L10N40K12L8L7k65o05k80L24
3185c72M09J83J79J91k56p08k31K12L10J08L45K80k20o58l42J98J24J53M39L47
$$ plain form
3036 -458 2 459 638 449 69 -373 -669 -539 -112 339 608 549 223 -290 -606 -581 -227 200 549 603 359
3057 359 -130 -559 -609 -375 49 441 672 466 -36 -450 -585 -508 -128 386 690 493 59 -318 -552 -574 -249
3078 -249 254 634 563 193 -162 -463 -651 -412 180 634 576 237 8 -353 -704 -539 70 526 541 366 173
3099 173 -248 -678 -600 -10 385 444 412 315 -139 -688 -654 -151 261 389 479 468 -28 -625 -659 -231 90 255 532
3122 532 574 84 -531 -621 -284 -62 175 537 676 147 -465 -558 -345 -216 49 536 700 257 -328 -443 -398
3143 -398 -402 -39 527 750 266 -172 -333 -411 -509 -161 466 717 345 -30 -201 -453 -610 -243 399 609 375
3164 375 149 -85 -465 -683 -324 281 518 412 295 59 -401 -683 -373 167 379 417 454 189 -416 -696 -372
3185 -372 37 220 399 590 334 -374 -605 -393 -83 25 370 650 430 -228 -570 -372 -248 -95 344 691
3205F91k41o36k34J09l3J08N21M64k62n82k25J0j24N5O12M40k03m34j64j38k96
3226e62R3O13M70j54l48j06k02m33R3O15M30q7j93p6l11m39L8N40L73L1l4o3m02
3249a14n21P9M83L31Q1Q1K1m47n44QL64K76J47K52L2m81n34j7K45J66K18L98O1
3272E85m99m76m1J13J23K45M44R8l84m72j32M7J0L43M58J31l56l53j76j19m8L59
3294a00M87J75k71k61k17k63p7L17N20J68j31j57k79l46j04L11M50J72J8j10k53
3315D9m45j62K82M20J43J09L3k85m84k10K00L46K26J97M3k80m25k89J51K63K10
3336I2K53J75k33m14l11m4K33K48L03J74j25l88l06j02J12K67L27K17r1k68l58
3357b39j88oL02L37K37k9j84l53k83k4K09L65K18N6j48k61l17j67J73L71K67Q8
$$ plain form
3205 691 450 -186 -420 -311 -344 -236 285 749 487 -95 -320 -310 -434 -379 233 673 470 36 -128 -266 -562
3226 -562 -469 144 614 460 112 6 -196 -629 -536 79 509 422 229 153 -158 -597 -559 -19 354 385 351 288 -114
3249 -114 -635 -556 -73 258 339 420 441 -6 -550 -542 -178 98 245 497 529 48 -486 -503 -258 -92 126 524 585
3272 585 86 -390 -431 -318 -195 50 494 592 208 -264 -396 -349 -339 4 462 593 237 -116 -292 -411 -459 -100
3294 -100 387 562 291 30 -187 -450 -527 -210 310 478 347 190 -89 -435 -539 -228 222 394 412 302 49
3315 49 -396 -558 -276 144 287 396 429 144 -340 -550 -350 -4 222 419 462 182 -243 -532 -381 -118 92
3336 92 345 520 287 -127 -438 -482 -249 -1 302 476 351 -37 -343 -445 -333 -66 261 478 387 119 -239
3357 -239 -427 -433 -131 206 443 414 230 -123 -406 -430 -221 144 362 418 270 9 -308 -475 -302 69 336 424
3379D24q9k34l59j97O6K62L35J94J9k36l31k78l4K41L61K62Mj81k74l16q8R3L69
3402A3L70L9j40k59k72k28O0L75L44J18r1j84k89l28K8L59L12J48Nj15l19l71
3424d25j05L35L38J55P4k8l08l83j25K05L03J84K07Ll22m19j51J95J87J95K82
3445C97J38l47m47j66J48Q7J83L85J83l10m08j52l5L6K04M63J76k62l65j11j29
3466c32j05K62M74K44k41k86j31j79j59J91M45L04j69j78j50l17j96K37M59K20
3486C93p3l3j53l99k70J87M30K04M5L2j42m44k71J37L32J66J52J49j21n45k67
3507d91J54K55Q7K58K95j96n12k66J00J22J04L03L33j87m50k12lJ6N3M09L67j35
3529D04m28j61m0j35K1M56L99j02l58j25j03k69M4M41M43j14k38p6j75l46pM68
$$ plain form
3379 424 335 101 -258 -455 -389 -127 208 402 421 185 -146 -424 -458 -217 144 406 410 229 -45 -361 -449 -356 13
3402 13 383 422 282 23 -249 -477 -417 -42 302 420 329 145 -144 -472 -444 -85 227 375 380 265 -54 -425
3424 -425 -530 -195 143 298 372 344 36 -347 -472 -267 36 220 427 430 108 -311 -462 -267 -80 115 397
3445 397 535 188 -259 -425 -277 -190 -7 378 561 251 -157 -309 -344 -308 -104 359 535 273 -92 -203 -332
3466 -332 -437 -175 299 543 302 16 -115 -294 -453 -262 183 487 318 140 -10 -327 -523 -286 173 393
3486 393 320 287 134 -265 -535 -348 82 286 331 363 221 -223 -494 -357 -25 141 293 442 321 -224 -491
3507 -491 -337 -82 5 263 558 362 -150 -416 -316 -194 -90 213 546 359 -91 -303 -306 -290 -237 172 539 404
3529 404 -24 -185 -225 -360 -339 117 516 414 56 -69 -172 -441 -397 44 487 373 135 59 -116 -462 -469 -1
3551aM22p3j42Rk50m43l8M68L41k2J3K4l05m79m4M12K70M4R3J21l56n05l3L29
3575a45J71R5K42Q8l44m92j9J83J10J61L38J16l66m24q8J24K4J89M02J74l57l49
3597a67j00l0mJ90M50J60k85k87r2j50q5K52M68J57k47j75j43k21j60K50M44J73
3619C98j39r4j31l47j58K29M24J20j6Jk10l51k32K35L31J52J20Oj85m11k08J43
3641c23K89J39J34J63j50m40k36J18J80J38K50J86j57m05k41N0P5J61L12K12j47
3662C08l55k03n3pJ59L72K20j10k62k18j69l0J46L52K86p3k38j88k10j28J05L66
3684G0K85J9j39j96k78j65M0L34K83O4l3j75k96k05M2K26K80J51L7j48k91k96
3706c91MK17K51J95Q9j07k69k71j08J07K41K85J43r2k35k92j71P5K47K75J70k
$$ plain form
3551 -1 421 348 206 215 -35 -478 -516 -48 293 271 284 308 3 -476 -520 -108 162 206 299 420 64 -441 -474 -145
3575 -145 26 121 363 451 107 -385 -404 -221 -111 50 388 504 138 -286 -374 -250 -226 -37 365 539 182 -167
3597 -167 -267 -297 -301 -111 339 499 214 -73 -165 -315 -400 -148 320 477 230 55 -88 -309 -469 -219 225 398
3619 398 259 165 34 -313 -471 -242 182 302 286 287 77 -274 -506 -271 60 212 332 338 153 -258 -466 -323
3641 -323 -34 105 239 402 252 -188 -424 -306 -126 12 262 448 291 -114 -355 -305 -230 -69 243 455 308
3662 308 -47 -250 -303 -310 -151 221 441 331 69 -149 -318 -348 -202 150 436 363 125 -63 -273 -401 -296 70
3684 70 355 374 235 39 -239 -404 -364 -30 253 317 284 109 -187 -392 -350 -124 156 307 344 196 -95 -391
3706 -391 -387 -170 81 276 365 258 -11 -282 -390 -283 -42 243 386 294 59 -233 -404 -329 -82 193 363 361
3728C61k22k76k00kJ77K87K05K0j15k82k78l5J38K63K23R0m4k67k88j49J51J82
3750f1K32K06Kk38l59j38L0J63K58K23R5k31l27j52k0N5K33L35J26j97l12j99
3772b76m1J8K20L48J29j54k19j90j27p8K11L68K07j00k32j49k17j10J61L88K00
3793C57o1r9j59k83j49J13L63K06ROj82l38k10J40L02J89J00O6j56l90k29J28
3815b77J98J65J52J81j76l91j92K7J82J01K07K25p9l87k29M8nJ13K94K85j09l26
3837Gk22nq3P3L62L05p8l33j10j23j25K9L74L61q6k15j71j06k35L3L82L32p7j25
3861A64l8k01l33J5L98K60j0l1rk29m02qL78K53LJ0O8k44m49MK91J71N4J92P7
3886C84l17m40k3K50J07J03K38J08k86l87q5J39P1J64L05P7k59l24o7L2n1K51
$$ plain form
3728 361 139 -137 -337 -339 -162 125 330 350 235 -47 -325 -360 -222 41 264 354 310 43 -245 -394 -243 -61
3750 -61 171 377 379 141 -218 -356 -326 -163 95 318 413 182 -145 -297 -317 -262 -29 306 432 235 -77 -276
3772 -276 -317 -299 -79 269 398 244 25 -165 -292 -370 -159 209 416 316 84 -65 -282 -392 -231 157 357
3793 357 296 197 38 -245 -394 -281 82 288 297 303 121 -217 -427 -287 15 204 304 370 214 -176 -405 -277
3815 -277 -79 86 238 419 243 -148 -340 -313 -131 -30 177 402 323 -64 -293 -245 -250 -137 157 442 333 7
3837 7 -215 -220 -303 -230 132 437 359 26 -84 -207 -332 -303 71 432 346 131 -40 -146 -381 -348 34 366 289 164
3861 164 126 -75 -408 -393 5 265 255 224 215 -14 -416 -424 -46 207 210 220 288 44 -405 -401 -110 61 115 307 384
3886 384 67 -373 -396 -146 -39 64 302 410 124 -263 -348 -209 -138 26 331 408 149 -175 -242 -210 -261 -10
3908a0L33J19l02k69n5o3m1K10L83J00k31j78r6j58j32K82L52Q7j55q4r0k69j51
3931d18K12M20Q0o3o1q4l28k35K52L22J16NN5j50l50k13J83K88P0R8J57j76l76
3954a96k24J85J70J19J58J84j73l48j73O7P9Q0K80K34j69l90j06Jk6P0L52K70
3976D44j47l26j22o1n1L7L91K34j20k19j28j03j69P1L45K54m6j45j39j53k09N1
3998c11L24K72J0j14r7k30k10K9K75K33R4j2q9k71k35K0K13J95J42L9m2k74k70
4021c09J1J52J87J50J54q1k72k54j2Q4J14J86K01J4k30k75j01K8J15K06K15M3
4043C26j87k63j39pP2J92K85L6j40k13j66j01Q0J75K38J20r1j87k00j05JJ66K36
4066A28J64mj87k03j80rJ15K25K39Qj17k22j98p0Q4K24K34J12j29j91k10o0j1
$$ plain form
3908 -10 323 442 140 -129 -184 -247 -288 -78 305 405 174 -4 -100 -258 -390 -108 244 331 176 92 2 -267 -418
3931 -418 -206 214 294 231 170 86 -242 -477 -225 97 213 218 273 123 -227 -440 -257 31 101 199 356 180 -196
3954 -196 -420 -235 -65 54 212 396 223 -125 -298 -231 -152 -72 208 442 273 -117 -223 -222 -248 -178 174 444
3976 444 297 -29 -151 -212 -263 -226 165 399 279 60 -68 -171 -340 -269 76 330 284 139 0 -153 -362 -311
3998 -311 13 285 295 181 84 -146 -356 -327 -52 181 275 263 174 -97 -332 -312 -99 96 238 277 235 -39 -309
4021 -309 -298 -146 41 191 345 264 -8 -262 -274 -190 -76 110 311 325 95 -180 -281 -253 -138 68 283 326
4043 326 139 -124 -263 -270 -198 -6 279 315 175 -38 -204 -305 -225 -50 188 308 217 30 -170 -275 -274 -108 128
4066 128 292 288 101 -102 -282 -291 -176 49 288 296 179 -43 -241 -311 -227 -3 231 343 214 23 -187 -247 -258
4089b58J87K44J64q1j59j97j80k1J41K66J99n9j28j46k02r9J31K84J67J2p7j50
4111C8k50j27J00K54J70O4Qj64k72j76J02K13J24J26N6j14k54j85PJ71J38K03
4133B32M9q1k44k09K8O5J09K46J35p6k81j33m5RP9K18K42o5k39j70l8r3R8K38
4157G4K23k7j70j42j28j44K8L01K57k9j19p2j72j98J1L10K31on2m1k07k52j1L15
4181b0J44L9M0K5k43l05PK58J37K4J37M1k58l24k4K28R4O1K27N5k70l32kJ22N9
4206h0P7K90R0k71k85l2M6K0J00K82J18k53k22k5m5n5J41L54J11k06k08k6j15
4229a94j24J86L23J50k05j30k2j79j37J74L16R3p8l0p8k65j64K09K61Q7l7L0p7
4252A09k78j93J72L14L1L0N5q3l53q0J15J52O6J22J34r8l46j40J26O1N7J70J96
$$ plain form
4089 -258 -71 173 337 256 97 -100 -280 -301 -160 106 305 246 118 -28 -230 -329 -198 86 253 265 188 38
4111 38 -212 -339 -239 15 185 249 257 93 -179 -355 -253 -40 84 210 266 152 -102 -287 -280 -109 29 232
4133 232 281 200 -44 -253 -225 -160 -51 195 330 254 -27 -160 -205 -196 -117 101 343 278 39 -131 -169 -262 -164 74
4157 74 297 270 100 -42 -170 -314 -286 15 272 243 124 52 -120 -318 -307 3 234 228 176 135 -72 -324 -335 -20
4181 -20 124 163 203 228 -15 -320 -313 -55 82 106 243 284 26 -298 -322 -94 0 61 288 343 73 -259 -261 -139 -80
4206 -80 -3 287 377 106 -179 -211 -165 -145 -45 237 355 102 -120 -145 -190 -245 -104 250 361 155 -53 -79 -194
4229 -194 -318 -132 191 341 136 6 -16 -195 -332 -158 158 251 173 143 65 -200 -364 -155 106 193 156 186 109
4252 109 -169 -362 -190 124 155 185 240 157 -196 -276 -161 -9 57 179 313 215 -131 -271 -145 -84 -27 143 339
4275C39j47k79j28O9ML8J98K50j22k98q7K4m0JK68K25q6k51q0j0j21M0K47K33
4299B87o1k09k1q6j74NL02K23q5p4m1j43k04J0K97J70np0M2k18k32K0K55J55l
4324A40K7kj53k73RJ90J01M9J07M5j95k68l4J64Q7R2J28N7k44k18K0J8O7J04K28
4349B46L8k33j77l9j8M8J46J81Q4j66j95k3r2RJ55K17M0q5j53p2j03k4J22K68
4373A74P4r7p0j27j04q4J22K15J06l8p6q4j44j10J01K16P8L5n6j34j13j08O4J74
4397A4R5Q7jj21k01r7L0J57J12R4K9q4j69j21n3J21R5J76K8q9j29j11p2O6J14
4422c0J45P9l7j34j28o2l3J56J39O4J6r8j30j65K0J25J20J06L6l5j79j25n1J22
4446g9N4J54J10p4j60j91j0N8P0J64J03j2j34j70m7OO6J12J67K1j52r1r9o4N7
$$ plain form
4275 339 192 -87 -215 -146 -142 -104 94 344 222 -76 -163 -139 -179 -178 90 315 229 -22 -102 -112 -233 -193 54 287
4299 287 226 17 -4 -90 -264 -259 43 266 181 107 66 -77 -281 -271 26 196 191 121 163 -55 -287 -267 -12 143 140
4324 140 167 165 12 -261 -252 -62 39 88 195 240 45 -223 -257 -93 -6 86 214 271 27 -191 -171 -153 -86 18 246
4349 246 284 51 -126 -165 -183 -135 11 192 276 110 -85 -108 -200 -191 -36 181 221 136 -17 -89 -192 -216 -94 174
4373 174 248 151 81 -46 -150 -234 -112 103 209 171 95 11 -133 -243 -142 74 152 187 131 -3 -116 -224 -160 14
4397 14 109 196 195 74 -127 -224 -194 -37 75 169 198 114 -55 -176 -229 -108 -13 163 191 102 -27 -138 -210 -144 -30
4422 -30 115 194 157 23 -105 -167 -200 -44 95 159 175 77 -53 -218 -198 -73 47 153 189 154 -25 -150 -201 -79
4446 -79 -25 129 239 165 5 -186 -196 -138 -68 96 199 187 53 -117 -164 -158 -92 20 187 208 56 -35 -134 -198 -141
4471a41J67J35j0n9j04r4j00JJ72J95nl0o3j25j63nK05J52J8J1l7j30j72m2J92
4496c2J04N0M0j1j32k14j1J64Q2K2J13K5j45k42NJ27JP6J56O7j93j97lQ4pK7K07
4523A63J01k02k13M7N4r9N6K42J22j93j75J9J6j67J02K98O6j70r0J8o0j64J05
4546a24K75O1j40m2j0p0j75Q3K68N0j02oK3j86j72J34K25Kn4Q9Ok50j42J24J85
4571E2J1jQ3j6k36j36J32J12k9Q9J49m7k53j25J22O5l2J05J75j0l10m9P0j1j8
4596a08J61J61p5k02k5L1p7j4K23J55q0k03J5k2q8m1K04J89p2j10rm2j61pK52
4621E5J25p6o4K3p6k10MK69J13j10J0O6j05k64L7K11R4p2N2O9j68k06M5J81K5
4646B8m2J01J08j80k08L9J66l7MJ38J04j88k12N4R5n3N1K02L0j39j74M1J3o8Q1
$$ plain form
4471 -141 26 161 151 92 -12 -106 -206 -205 -33 162 157 127 64 -61 -224 -229 -24 128 146 157 120 -10 -182 -224 -32
4496 -32 72 122 162 151 19 -195 -206 -42 40 62 175 200 55 -187 -182 -55 -54 22 178 245 52 -145 -148 -64 -71 -44 163
4523 163 264 62 -151 -104 -50 -149 -93 149 271 78 -97 -78 -62 -229 -127 171 237 67 -23 -5 -65 -229 -124
4546 -124 151 212 72 30 20 -50 -225 -142 126 176 74 68 91 -95 -267 -133 92 94 40 129 135 -115 -257 -133 52
4571 52 63 62 145 129 -107 -243 -111 1 -28 61 210 163 -90 -215 -93 -28 -60 45 220 210 -100 -149 -79 -90 -108
4596 -108 53 214 139 -63 -88 -57 -134 -148 75 230 150 -53 -38 -60 -148 -189 15 204 132 22 13 -29 -190 -197 55
4621 55 180 104 40 63 -13 -223 -219 50 163 53 63 129 24 -240 -203 8 102 30 82 151 -17 -223 -178 3 28
4646 28 -14 87 195 15 -193 -154 12 -25 -21 117 221 33 -179 -125 -30 -83 -32 170 200 61 -113 -72 -59 -127 -46
4671d6K07K6j66r9N8n4p4R1K20M4j81o2L2o7j18J35J90J8j17j7L4j48j06J18J86
4696A04L7n6j2l2j54r1J08J65QJ8J4k6j91p4J05J07L4PO2m9j88o2P3Q1M7N8O3
4723A56p9j39o1MP8J5P0J08o1j11r2K8K2jJ46P1m2p8r3l4qK5J53N6k3o0n4q4j8
4752a06L7Q3J22np7o2n8o4K4J02J28k0l4n4j35j6J5J07N2O3K0o6j05q0L1O2O7
4779C1N6L1o7j16k8k9J8J27N7M2m5n4q1k6MQ9Q1J9J1o5j02l5m6Q1J05M9l9k0q0
4808c2r3J2Q0R4MON7j21j28JM9P3K9N8N0r9j32k6M4N6J1J04O2j26j23K3NML2J33
4838A07O6j24j18jK6o8P7J48M8j16j00K4j3r8M7J94O5j04m3j2l0j57P5K12M1r4
4864E2o4N6q1j50J18J69M6j22J2P0j50j49Q1J93K8q9K0P2j34j62R5J63m0n7J36
$$ plain form
4671 -46 161 187 21 -78 -20 -74 -148 -57 163 207 26 -36 -4 -71 -189 -54 136 154 37 20 54 -94 -200 -82 104
4696 104 141 85 73 41 -113 -204 -96 69 77 95 109 83 -108 -182 -77 30 64 71 133 84 -104 -166 -93 -12 35 93 156
4723 156 77 -62 -123 -119 -41 -26 44 152 91 -20 -112 -84 -62 -63 83 154 112 34 -59 -93 -101 -76 77 133 110 50 -4 -88 -106
4752 -106 -69 14 136 131 54 -8 -66 -130 -106 -4 124 104 70 16 -119 -135 -120 -13 39 102 122 56 -49 -129 -98 -36 31
4779 31 87 118 51 -65 -93 -122 -104 23 80 122 77 23 -58 -84 -80 9 90 109 120 55 -47 -82 -128 -47 58 107 68 48 -32
4808 -32 -125 -113 -33 61 65 71 128 7 -121 -120 -71 2 31 89 139 40 -92 -118 -74 -18 -7 97 159 33 -90 -67 -62 -58 -26 107
4838 107 173 49 -69 -70 -44 -112 -35 113 161 45 -55 -31 -44 -142 -95 99 164 60 17 5 -25 -182 -107 105 146 52
4864 52 -12 44 -37 -187 -69 100 146 24 36 106 -44 -193 -112 81 109 20 40 112 -22 -184 -89 74 34 -23 113
4889A13J8k01j04J09J07n5J4J39nj90j27J20N6p9J04J47rk04n0P1k0m9R3J84m1
4914A41j90m5J16j11j7R9J92n7j82J8N2j11o4J79J54q3j28N2L6j90n3J90J36q5
4938D9o5J05m3k04j7K23Q9j26pJ17p4k08j8K18L0r3N6J41j27k06LJ76Jn1J00J01
4964A70j22k03M5J51q7J0J28J05j40j84O2O2o3k9J82J39k04j36J00K9j24L6J55
4987H2R1j31j21J07p0o9M4K01J7r8o4N9q3j21N6K22J0j41L9N2j33r3R0J39oq3
5013dM7L9j24j25R2J38j4j4N1J8j96j00J34R5k1k6J33k4j72m1N0R1o0N9J23l5
5039A14j60q4J09Pm8R0J13j4j58n4O6l5k9J18Q7jj27j9j2o3OR5Q5k9r4K4J5j04
5067a02oJ02J25o1n0Om7m9LM7Q8l6L3j1n1p1l4J10K4M5pKm8r8nQ8J9K4K8J6o7
$$ plain form
4889 113 131 -70 -174 -65 42 -13 1 140 135 -55 -182 -62 -6 -85 19 166 157 -47 -97 -26 -46 -95 -2 182 141
4914 141 -49 -94 22 -89 -106 -7 185 128 -54 -36 16 -95 -159 20 174 91 -37 15 51 -139 -192 -2 134 49
4938 49 -16 89 46 -158 -175 48 137 11 4 121 47 -161 -179 39 69 -24 32 173 46 -160 -157 19 20 -31 69 170
4964 170 48 -155 -110 41 -46 -36 92 197 57 -127 -65 -3 -66 -95 87 226 22 -114 -14 15 -109 -73 82
4987 82 173 42 -79 28 -42 -111 -67 134 151 53 -11 48 -35 -156 -100 122 132 -9 30 82 -51 -144 -54 85 79 -4
5013 -4 43 82 -42 -167 -75 63 49 35 86 104 -92 -192 -58 37 16 -10 123 99 -73 -114 -64 27 -33 26 149 114
5039 114 -46 -130 -21 -14 -62 28 141 127 -31 -85 -19 -54 -83 35 122 121 -6 -25 -37 -100 -94 1 86 57 -37 -13 2 -102
5067 -102 -108 -6 119 58 8 14 -33 -82 -79 -32 56 20 53 42 -9 -80 -114 -4 20 65 58 60 12 -86 -91 -3 16 40 68 84 17
5098A7q6KK4JP0M8J8q3l3l6J2j5O1P5K7q0m9n0jK3L1J05Nl1m0n3l8L5L1M1M5j
5130G5n0l2o4mM3M4M5K7m1p8m1j2N4M0N3K3k4p5l6Pj3L2O7Q4o4p9pjk7J1Q9K6
5162G2Jm6l4l3l1pJ21O8p3k1pj9j33N9J33M5q4J4K3p2q2jJ34L0l5J2L2r3p5J0
5192i2J20L5q5O9N0j15j32O3J33j8l1P2M8j34p8M0O3l3K7J08L7j40p7L6L5o7O4
5219bJ23rj13k3J3k3n1K0J46J2r9n0L9l3m6Q8R2m6o3L0J4o2q8Q3J56n4q1Q7k5
5248C5q0q1J13J02p8J5M8Nj91k9J63Q0j21J9J16o2j20n6J14P0j05M7J24o3j47
5273h2k3J14Nn2O0J16p8j60L6P6m8l7Q7J35q6j51N9L4o0m9J35J14j23j03J03k5
5299cj07J0J48R9j11j13Q6qj26J9J67M3q6m9O9k4j25JJ46L2p6K5O4q6j38R0J34
$$ plain form
5098 17 -69 -67 -43 -42 28 76 94 11 -22 -58 -46 -61 0 75 102 22 -27 -77 -78 -55 -24 81 86 55 15 -38 -76 -41 -10 31 76 75
5130 75 25 -7 -71 -75 -32 12 57 84 43 -35 -76 -88 -34 6 59 82 58 -17 -53 -46 -59 -27 40 124 60 -19 -26 -27 -54 -43 46 72
5162 72 73 27 -7 -40 -71 -78 43 111 38 17 10 -9 -142 -83 50 95 11 25 48 -24 -106 -107 27 57 22 34 66 -27 -102 -92
5192 -92 28 63 -22 47 97 -18 -150 -87 46 28 -3 69 117 -17 -95 -55 8 -25 2 110 147 7 -70 -34 1 -66 -2
5219 -2 121 112 -1 -24 -11 -34 -85 -65 81 93 -6 -56 -17 -50 -96 -8 84 38 -25 5 19 -43 -131 -48 108 54 -27 60 35
5248 35 -45 -126 -13 89 11 26 74 79 -112 -141 22 102 -19 0 116 54 -66 -122 -8 62 -43 4 128 65 -82
5273 -82 -105 9 14 -38 22 138 60 -100 -64 12 -36 -73 14 149 63 -88 -29 5 -55 -104 31 145 22 -81 22 -3
5299 -3 -110 -100 48 147 36 -77 9 1 -125 -106 61 104 18 -31 38 14 -111 -110 36 68 -8 17 81 -5 -143 -53 81
5326H1Jj13O5P6j05r8J7J02Qo9R0L1q9r8N7R1l5l2J10J2j14r4N6L9j7QJ16Kj04
5355fj01R7Jp3O4J39m9j07k3O3l7m9M0J27l7q6K0Kn1k6P4J25n6o3M7m9k3n4J01
5384A0Q5o2m2N9Or6m1M6Q7Mn1O9k5j15QN4J7J8j4N3l7j06l2P8L1j7M9K5k2j23
5414h4L9K3Qk0P1L2n8p6LM8k2j3J18Qm2p9mL4m3J5N7L7j7n5jl6OJ7P9oK1o4J0
5447Frk1j3R2J4k4k8k0J2p4K0N2J8k7M4mo3m4lN3P9o1JJ6l1l6j3O0PJ0K4k5%o1
5481d9j1%M9N4k3M6l1n9j9k7R4J5JJ8l4n0m6L2L5K8%O%Jr6mR8pJ3NK1m2p5K6N3
5516B2JjPJ4m2o0qO5k1RO0L7m5q1k6M4k8J0J03K5q6l8J5J3m5J5M4N2k5n7N1o5
5548d1KJ0R4po7k0M0l4l9JJ27K5q6J0K0p2j9N0M5j5j1M2k8q7l2N6J12o1mO0p4
$$ plain form
5326 81 82 -31 34 110 5 -93 -76 26 34 -35 55 86 -3 -101 -44 47 12 -20 90 102 -12 -106 -50 -11 -28 -20 96 98 -6
5355 -6 -107 -10 -9 -82 -18 121 72 -35 -58 5 -32 -81 -41 86 49 -37 -17 -15 -66 -92 -18 107 51 -12 35 -14 -37 -91 10
5384 10 95 33 -9 50 56 -40 -81 -35 52 56 5 74 49 -66 -58 -4 13 31 17 70 33 -73 -105 -27 4 -13 36 61 39 -84
5414 -84 -45 -22 -14 -34 37 69 11 -65 -62 -14 -36 -49 69 77 35 -44 -48 -14 -57 -42 15 52 35 -20 -21 -57 -51 -34 45 39 60 -4 6
5447 6 -3 -24 -37 55 69 45 17 -3 9 -65 -45 7 25 -2 42 38 -25 -69 -72 -19 60 -1 0 16 -15 -51 -64 -4 3 13 37 12 12 -49
5481 -49 -60 -60 -11 43 20 66 35 -24 -43 -70 24 39 40 58 24 -26 -72 -40 -5 23 23 29 29 30 -66 -70 28 21 34 39 60 18 -57 -31 22
5516 22 23 22 29 43 1 -59 -67 -2 -23 -14 46 83 38 -43 -69 -25 -53 -43 60 85 -1 -39 -24 -11 -56 -41 3 55 30 -27 24 -41
5548 -41 -39 -29 65 58 -9 -29 11 -23 -62 -61 66 91 5 15 35 -37 -56 -6 39 24 13 55 27 -60 -92 -36 76 15 11 71 -3
5579cl7n3Q1N2n0K6N9o0p0k2P8pk4K7O4j5j33L4N8rn5N0J15q1r6M9M0l6m3O9J16
5610A24p3j22N8K7m8k1J06M1n2n7L6K2q0l5J23N0n9p0O2Nj04NJ09Rl3n1N8rj07
5639h6PQ0N8o6K3L6l9q2J6R0k5k6L5M4p5r5O0P1k3k4Q3L1p1q7L2N5l6l0O8N8j14
5670c2n1O2kj4K2R2j3j03oJ4L4o6N8Q3Mr3qN1l8p7R4O3j1n4j3J3m1m0O5O3%p8
5702b2N0Mn4n2O2P0m0j5K6J3r1m3P3L0K6k3L8Jr9NK8N4n5K7M2k9r1NO6J7m2L2
5734A3M8k2m9k6JN3l6L8N8l4n7n1N9K1k9P5L6q7k1KKk2K2M9L5m2o5J0k4k4M6L9
5766A8N0m0l6qj5j1j5Q0OL%j2j5n9jR7Lk8Kj9j2l1J0N3Pj6LK4n4l1J9M0jmL9J
5802D7k8m8j9L1J8K0M1j3l6Kn9K1K4K8K7l1k2om7J9J9K8oK5K3n8k8k6O2Jj1M1
$$ plain form
5579 -3 -40 -93 -12 40 -10 16 75 15 -55 -77 1 -6 -30 -3 61 46 -87 -53 5 -4 -59 -9 106 25 -71 -22 18 -18 -61 8 124
5610 124 51 -71 -13 14 -34 -55 51 92 40 -17 19 41 -39 -74 49 99 40 -30 32 37 -67 -62 47 56 23 -28 30 21 -86
5639 -86 -79 1 59 -7 16 52 13 -69 -53 37 12 -14 21 65 -10 -105 -45 26 3 -21 62 93 22 -65 -33 22 -14 -44 24 82 -32
5670 -32 -83 -21 -23 -37 -15 77 64 -39 -45 -31 3 -63 -5 78 82 -11 -19 32 -6 -83 11 74 63 9 -4 9 -32 -72 -7 56 56 -22
5702 -22 28 32 -22 -74 -12 58 18 3 29 42 -49 -92 -19 11 37 14 52 53 -46 -41 -13 41 -14 13 55 26 -65 -60 6 23 -19 13
5734 13 61 39 -10 -36 -35 18 -18 20 78 44 -13 -64 -5 16 -13 62 98 11 -10 -8 -6 -28 -6 43 78 36 -29 -19 -43 -67 -21 18
5766 18 68 28 -8 -16 -31 -42 -57 23 29 32 32 20 5 -54 -55 42 45 17 19 0 -12 -43 -33 20 27 11 14 38 -16 -47 -28 12 11 7 46 47
5802 47 19 -29 -48 -17 1 21 62 49 13 15 -44 -23 1 29 56 25 3 -3 -50 -31 -12 16 10 35 58 0 -28 -54 8 9 -2 39
5834C9Qn9n5oN8j7M0L7Lo0l6PL5LL2mNrm0kKJ1J2J9K6j2o4qJ4j2O0K5Ql3o1J4
5870b0k5jO8L6k7l2nOk0j2KJ00pn9Nj0k1m1M9N2n6J4J3J2n2m4M3L7MkJ4nn1k9
5904f4M6O1l6J5O2o5p0rP0J6l7M5M8j5j01PN4l9J0L5L5j1o2jJ9j3rL2M8k1j10
5935f0K9M8k2q0J07O0o0k2nkn7J5L6O6l1k9M1m2n2pJ02J0l9j0L5j1j24M4P6K7
5965D3l9OJ7k3p1J9R2%p6N2L4n4n3K9L6oK4J2K2o7m9J2O7l2L6J7qm0n7O2J5o0
5997d0J5J14k7q1k2K5K0l4LO1J9l6k5mJ1n7O1K1K4m2l6M5n5k7M1P5J0q8L0j2l0
6028d1JLO7Qn4L3L2r1j9K6P6k7lM1qp1j6M8L8k1PL3n4l8j8L0J8J1L6mj1o8J7J5
6062domN5J3qr6rO0Rk8MO3l1l4k0KJ5j8M5M9m0o0L7kn9L2M3N3m3l2NOm4J1O9L3
$$ plain form
5834 39 47 -12 -67 -73 -15 -32 8 45 48 -12 -48 -41 -6 -3 29 25 30 21 -19 -21 -19 -8 4 23 49 37 -27 -35 -21 -33 27 52 60 27 -34 -20
5870 -20 -45 -46 22 58 31 -1 -6 0 -20 -32 -30 70 63 4 9 -1 -22 -63 -14 38 -18 -4 9 21 -31 -75 -32 5 9 7 21 16 -35 -64
5904 -64 -18 43 7 22 84 19 -51 -60 10 26 -11 34 82 67 -34 -27 27 -12 -2 33 68 57 -5 -6 13 0 -9 23 71 50 -60
5935 -60 -31 17 -5 -85 22 82 22 0 -5 -7 -64 -49 -13 53 22 -7 34 -8 -60 -67 35 45 6 -4 31 20 -104 -60 16 43
5965 43 4 10 27 4 -67 -48 44 44 -32 20 54 0 -53 -24 12 6 30 42 64 -3 -52 -40 27 -5 31 48 40 0 -57 5 20 -40
5997 -40 -25 89 62 -19 -41 -16 4 -30 -27 34 53 17 -8 -12 -1 -58 3 24 48 6 -30 15 -40 -67 -26 49 59 -29 1 -11 -41
6028 -41 -40 -37 30 38 -16 17 49 -42 -61 -35 41 14 11 52 44 -27 -43 5 43 22 29 62 8 -30 -48 -18 0 11 47 43 32 -36 -19 -4
6062 -4 -10 -14 41 54 46 -50 -59 1 10 -18 -14 49 18 -16 -36 -34 -19 -37 8 57 17 -43 -6 -8 -67 -35 8 61 18 -14 -9 -3 -47 -36 33 66
6098F6m5pK3n4l8K6O4j2Qk8M2k8r9K7M7L0Qj8pk2p8M8K4L7K7R%p1m2J8O0jJ2j5
6132A1Km6Pj1J0L1NJ2mj5m6j1N1k8K7M2J3ko7pqJ9K3L7qj9j9j9k6K8M0K6j0J8
6166E6n1j3l2J1N9nOJ1j7n5J5k9N0j3M2j2Ml5k2J9kQL1M5n5k5k5lJ5J4O1k1l0
6199Bk9K0k3nK4K8J8k3Qk6qm2J4O0L1Ok8k2l2n0O8N5j3L1rn0l8mJO2j5PKml5k9
6235d8L8K1pK8J6j1l6m9M0k7J4N9kop7KL2nLM7L0n0l6J4j9RqO4Qrk1l4No5N1O6
6271C7J1k3k1Kk0n0J2O8M8l5l4L9p6jlO3J9k2J2pn0n6L1N8K6%L3Nr6m7N2k7P9
6304B7k7L5km7n7L3KL4J8L9Lm4n6J8j6L9MM9K1j14K2l4N0m6L8M7J6n4J9l3K2m4
6336c8LP6Lk1k5j8pk7M2P3J9p2j2Rk2l6L0J04j9l4Krq9qM8Q0k1jK9o1m6l0M8M0
$$ plain form
6098 66 21 14 37 -17 -55 -29 35 23 31 3 45 17 -82 -55 -8 22 30 12 5 -17 -95 -47 -23 14 41 50 50 -21 -63 -45 15 14 26 11
6132 11 13 -33 -26 -37 -27 4 9 21 17 2 -44 -55 -4 -32 -5 37 50 48 -19 -26 -34 -15 8 45 37 18 -1 -20 -46 -18 22 48 38 56
6166 56 5 -8 -40 -29 30 25 31 42 25 -30 -15 -44 6 -7 35 23 27 -8 -30 -11 -13 -5 26 71 16 -9 -34 -37 -22 -8 53 32 2
6199 2 -27 -7 -30 -35 -11 17 35 12 20 -6 -14 -56 -42 18 49 55 27 5 -27 -77 -9 46 33 64 55 5 -33 -37 -36 26 11 18 20 16 -19 -48
6235 -48 -10 11 4 32 48 37 1 -48 -8 -35 -21 38 36 30 -47 -45 -13 -18 -15 32 62 12 -24 -10 -29 -20 -28 36 44 35 14 -20 -15 -80 -29 37
6271 37 48 25 4 6 -14 -64 -52 16 64 29 -5 34 -42 -43 -46 17 36 14 26 19 -31 -87 -56 2 28 28 61 66 -30 -77 -25 -52 27
6304 27 0 35 33 -14 -71 -38 -36 -2 16 55 58 14 -42 -24 -40 -1 3 52 73 -41 -19 -53 -3 -49 -11 36 52 -2 17 -16 6 -38
6336 -38 -35 41 44 23 -2 -20 -27 -54 -12 61 80 8 -4 5 -17 -53 -23 81 62 28 30 21 -68 -76 -28 52 31 30 59 -2 -48 -78 -30 10
6370A0J1OJ1j8l9m8N6j6K6L7j0K0p7j9L0J5J9QO0m8m6k8PM0k0O8K4m3n6k2N%R
6403b8Q2K1m2k7j0m2k1J9P9K7l2l9pRn3K1M4O8n1JMm3l2kL5O3l9N1oq2j8J4J9
6436a7RK2J4J2r1j2kO1K3J1K1J2o1n4RJ2K4L9L6mo5qm0K2M1N5J5k2l3o3Nj0K2
6469a7N9J2Nk2m0m9J7j2L8O0J3k6l2l1Rl4M7L1K4k5j4k7o0OL6O4L0ml5n1J3k5
6501d0L1QN0k6M3o4m1JKM1L0J5No1Lk2rL1K5O8l8j9l6n0mK5O1NJ2j1n6l6NM2k
6536a2O9J5l8j5o1Pk4M0L8N2l5k6l8k0l4Q0K7J7Ok3n7l0K1JJ6M1M3l0l7k0j7L0
6568a4JM8J9K5p0Mo0nK5L1N7J0n8m5q%K6L8M9l4k0l1n2kJ0O2O7m5j0j5j7o3J3
6601f4L3Q3Jkl2j4o7k3O7N5l9N1j7k6n9J1MM1K6K6j1l8l7j8pQ0kO6m2l1l6j9K3
$$ plain form
6370 10 21 27 38 20 -19 -67 -11 -27 -1 36 26 46 -31 -50 -20 -5 14 22 82 34 -12 -40 -33 7 -13 55 79 36 -20 -42 -37 -37 -28
6403 -28 54 75 33 6 -4 -46 -67 -48 31 58 26 -13 -20 -11 -64 -43 1 69 18 19 23 -20 -52 -54 -19 44 5 56 50 -32 -50 -36 -17
6436 -17 -8 14 28 40 -51 -63 -65 -4 19 30 51 63 2 -52 -43 -31 -7 32 68 64 -1 -9 -49 -27 14 69 84 62 29 -34 -29 -39 -17
6469 -17 42 54 59 37 -3 -52 -35 -47 -9 51 64 38 6 -25 -16 -50 -3 28 52 27 13 -14 -74 -68 -32 32 62 58 23 -28 -15 -40
6501 -40 -9 -1 49 23 66 2 -39 -38 -36 5 35 50 55 -6 -3 -25 -34 -3 22 90 52 33 -3 -53 -57 -32 29 34 46 35 -21 -57 -52 -10 -12
6536 -12 57 72 34 19 -42 -35 -59 -19 19 71 36 10 -28 -48 -82 -2 25 42 48 25 -32 -62 -41 -40 -24 17 60 30 -7 -27 -44 -14
6568 -14 -13 35 54 79 9 13 -47 -52 -27 4 61 71 13 -32 -40 -40 -14 24 73 39 19 -12 -64 -66 -56 6 73 28 18 3 -14 -77 -64
6601 -64 -31 52 53 51 19 5 -62 -85 -18 37 -2 49 32 6 -53 -42 -38 3 29 55 44 6 -31 -49 -56 24 22 88 46 15 -21 -40 -17
6634a7j1Q6j2M7n4n4o4M1KO7L6J8k1p1k0k5mM4N7J3l2m8J6l5QM2L2j2j8J6l5n6
6666f4roJ08kO%l0n6j7O2J5RL1k2l4l8jJ8M5K5L4ol1n1l9K6J7K5L2J1j6o0l2M5
6700el4N8N4K5l8n5n2j5J5L6M0K8mn1m6Oj5K0P8J4J6m9n9pk7L6M5K7L2m2m2k4
6732c5l5L1M2L2K5k3j3n9jnL5O6Rl3J2l3o5mM6M7%Qj0o3rl6M5L5K6J0K5n1p5J9
6766c7okO5L5j7op8OJ5L3K3K5j9j2n5j1rL1M4L4j4m4k4k2k5L5M1M0J9j5m8l9j4
6799e1J4M7%N9j5Jo6k9qL2N0J8PMo6m8KK7M6N2j7j7n1m2MJ4J5M2K1j8%o5k9K0
6833d7K3K1N0j7k5mk2k8K3L1N3Jk6l3n2nj8P6K0O8l6o8l4K1l3M2O8rjj8j8o3%
6866f0K1N1L1J1l2n5j5kj0Q2L3k0J8o0m1l2L7M4L8K7%j8o8k3k2L5K7M5J3m0n0
$$ plain form
6634 -17 -28 58 46 93 39 -15 -79 -38 -36 31 67 85 64 -7 -27 -52 -56 -12 45 58 26 -22 -6 -41 -33 9 41 29 11 27 -8 -64
6666 -64 -73 -79 29 27 33 33 3 -53 -70 -8 7 16 47 25 -9 -47 -48 -30 15 40 74 68 37 -14 -53 -27 -10 15 47 58 42 -18 -50 -5
6700 -5 -39 19 73 98 60 5 -47 -62 -47 -11 29 57 53 2 -44 -38 -53 -33 45 59 75 26 -33 -40 -67 -31 14 41 73 31 -11 -35
6732 -35 -70 -39 3 35 60 37 24 -35 -36 -41 -6 60 69 36 48 15 -50 -54 -8 39 39 47 37 -26 -35 -71 -26 9 35 45 70 19 -56 -37
6766 -37 -43 -45 20 55 38 32 -46 -40 -25 8 31 56 37 25 -30 -41 -50 -19 25 59 45 1 -23 -45 -70 -35 6 46 65 50 2 -37 -51
6799 -51 -37 10 10 69 54 55 -11 -40 -48 -16 34 52 59 63 -3 -51 -49 -22 24 76 59 42 -9 -51 -47 -33 -18 24 45 27 27 -38 -67 -47
6833 -47 -24 -3 47 30 5 1 -21 -49 -26 5 58 59 33 0 -52 -57 -75 1 21 89 53 -15 -49 -28 -61 -19 49 40 39 21 3 -60 -60
6866 -60 -39 12 43 54 22 -33 -48 -50 -60 22 55 35 53 -7 -48 -80 -43 1 39 66 66 48 -20 -43 -65 -30 -3 42 55 15 -35
6897c5m9M7K3K7kM7mq6jj9JK4K5M5mj0n4k8J1L1L3J3K6n1j0n5j3K4M7M1kpk5p6
6931f6K7jN7L3Qll1n4j5kM6K3L9k1j2m3j2l1N5M3rJ6j8l7n3K7qL9J3N5l2j6o1
6964d4J0j8MO0L6Nl8n9k0J6qJ02NOk8o7j3K6J0J5N3pJ1n6j2l6KM6L0M8j2p1l5
6997c9NJ3J0L7K3K2o0k4l1k4M3L1M0rk0m3J4n5J1N0L4K7j2m3m5l3J4P6J9J0lj7
7029B1n4J1kJ1M4N2k9k7j9l8m1K9M7M2Olqr8RRL9N7L2n5l5rm1J1NM2N7rm8n3%
7064d5J1%P1NJ8l8m3j7j3j1L6P9J7m0k5k6l4J5M3J8J9j5pnm0j4J1O8JLj8n0k6
7097e2RjN5L5Nk5J3q3%lM5M7l6N8m3m8k5J0M9K1K0ppm6m0jJ3L8oN6J4p4j8n7K8
7132e6M8L9Ok3l1k2k1LJ2M9O3K3q3k7l4k2O6J5N8Rk5o2k5mJQ4K1jn1j5k4j4lM5
$$ plain form
6897 -35 -84 -37 -14 13 11 58 54 -32 -33 -52 -51 -27 -2 43 39 29 -25 -53 -42 -11 22 35 61 10 0 -55 -68 -44 3 44 42 35 10 -66
6931 -66 -39 -40 17 50 58 55 24 -30 -45 -47 -1 22 61 40 28 -15 -27 -58 -3 40 31 47 29 -8 -61 -34 -42 -3 10 65 33 17 -44
6964 -44 -34 -52 -48 12 48 53 15 -44 -64 -48 -56 46 51 57 29 -38 -51 -25 -15 0 53 46 57 1 -11 -47 -45 1 31 79 67 -4 -39
6997 -39 -34 -21 -11 26 49 71 11 -13 -44 -68 -25 6 46 37 17 -26 -12 -67 -56 -6 28 55 43 0 -45 -78 -64 12 31 41 38 21
7029 21 -33 -22 -24 -13 31 83 54 27 8 -30 -71 -42 5 47 53 50 42 -56 -47 -38 1 58 90 35 0 -9 -50 -39 -34 8 65 56 8 -45 -45
7064 -45 -34 -34 37 42 60 22 -21 -38 -51 -62 -26 53 70 30 5 -21 -55 -40 3 21 40 25 18 13 -27 -41 -30 38 39 42 24 -26 -52
7097 -52 -43 -44 11 46 51 26 39 -44 -44 -47 -2 45 9 67 24 -24 -49 -39 10 31 51 44 37 -9 -49 -50 -37 1 -5 51 65 -9 -27 -84 -56
7132 -56 -8 31 37 14 -17 -39 -60 -57 -45 4 67 90 7 -20 -54 -76 -10 5 63 72 47 -15 -40 -44 -43 41 62 61 10 -5 -29 -43 -46 -1
7166aK1K8Rj5o4j9jM4OL6nJ4o7j9j8L0L8K4K0l9l9k5qJ4M9M0Kjk4q7k2rN1O2O
7201C1K1op9l0K7RK1N1nj7n6Lk5QN7K2L3l0l5l7Qj4K7M8L2j7k8m0k0K7LL5JL2
7235E7rl8l8l1K0N2PL5j0k0p1K0k1J7N8K0k0l0j7l2%J2O1kK9m8ll7j6lN2L3J6
7268D3j7pp2k8N0M0K5Kmj2Mq9L6L6L7K2rPj04MnM5J5K4%jm7m7L3J4K9%ML5o7m1
7304d5QPLP1LJ8o8k9Nk5L8K5N5lk4m9lk2nM0N0ml6k3%k4j1N7K5j5J7j6pn1jM7
7340HL2lK5l9j7m6K3J6O7n8L9ml6m2JJO4j9J8ool7l0K4J0L3J9K1n8l9j2K6JK8
7374DNM1l4n5j9M3m2M8L1L9n4ql3j8kM0L5M0l9m3K9n7LK8J7L8Qk7k5k6rK5N7j3
7408B7j8J5jm3m8N0M8j5jK5m1j1l9kL0K2L7J0k1m7Rk9L7L0j2L8k9l2m4J2M5nM
$$ plain form
7166 -1 20 48 57 42 -22 -41 -42 2 8 44 39 53 -14 -33 -51 -21 17 41 61 22 -17 -42 -50 -36 13 53 55 54 30 -57 -79 -88 -37 25 31
7201 31 52 46 -33 -63 -36 -27 -6 45 40 23 -33 -30 -55 -47 10 32 65 35 0 -37 -29 -43 -16 32 64 47 19 -21 -41 -14 -11 24 25 57
7235 57 48 10 -28 -59 -39 13 20 55 45 25 -46 -26 -47 -30 28 48 28 -2 -19 -51 -51 -39 22 20 49 1 -2 -39 -55 -58 -6 27 43
7268 43 26 19 -53 -81 -31 9 34 36 32 20 24 -65 -29 7 44 66 57 64 -40 -36 -41 4 19 43 43 42 -5 -52 -19 -5 24 24 28 63 -4 -45
7304 -45 -37 -30 -27 44 47 65 -3 -32 -27 -52 -14 11 66 63 39 -10 -13 -35 -40 0 50 46 10 -13 -13 -37 -48 9 34 19 36 20 13 -38 -39 8
7340 8 40 37 62 23 6 -40 -17 -1 66 8 47 43 7 -35 -34 -33 31 12 30 24 18 -19 -49 -25 -15 18 37 58 0 -39 -51 -25 -24 4
7374 4 9 50 16 -39 -58 -15 -57 -9 22 61 7 -1 -34 -52 -54 -14 21 61 22 -21 8 -49 -46 -18 -1 37 45 18 -7 -33 -42 -17 40 27
7408 27 9 24 23 -20 -68 -18 30 15 14 39 -2 -13 -52 -54 -24 -2 35 45 24 -23 -14 -43 -6 24 12 50 21 -11 -55 -43 2 -3 1
7441AM1j6l4l1K3lQM5K2k3l6l1K0jrN0KJ3j2m0j3qk6R7j4K2k8j3m8jLO2J7pk1
7476A1j0k7j5MJ6K2N4k0on5l5L2K8M7pnj4l5Jj2J2K2K4JoK3p8rL3OLQJ9k0k1j7
7512b6J4J7J2L9J5p8Koqj7M5L8j6oll0k7K0QL2K2j0m1J1j8j0J4J6K2Rl0Ml6JK1
7547@J6K3ml5pqk4j6L5L2K5k6J7l1mk0K7J8j2QJ9o2J6oj7K9M7j0l3J0k5n7P5j
7581aM5Kj5Rn2k5K7M1rN2nk7l1l6k5O6j1J5QJ9m3l9oL1K3KJ6Mj6p7NL4KK5K2M1
7617G1o7l5rM6l0J6M4j2j2l6Pk3K0L7O0m0k4j9Qm8M2K3%M3k8m0lj6j1J8L6J1k5
7650Dnj4j4m4O1K7L6pl8j1n3%N6J6k1L9mj9p1J2J2K3J2L0Pm1j6l7M5K9k5L2Mr
7684A6n5MM8l8%N0Mj1l2k1L5k9K6K2L1k4k7k5L2k0k3N9J2Qo2M3m4l1M7M8Ol3j3
$$ plain form
7441 1 42 26 -8 -39 -16 -19 -11 34 56 33 -3 -34 -14 -15 -24 26 28 41 29 -11 -24 -32 -58 39 25 47 19 6 -42 -43 -40 22 39 32 11
7476 11 1 -26 -41 -37 -21 1 55 35 29 -26 -61 -29 -1 46 39 34 20 -15 -14 -26 -14 8 32 33 27 50 -28 -37 -4 2 5 13 32 12 -9 -26
7512 -26 -12 5 17 56 71 -7 -5 -11 -19 -36 9 47 31 25 22 -8 -35 -15 -7 25 47 37 -4 7 -11 -21 -7 9 31 40 10 14 -22 -21 0
7547 0 16 39 35 0 -7 -15 -39 -55 -20 12 37 11 28 -3 -7 -27 0 18 6 14 33 -29 -13 -19 -36 -7 40 30 -3 7 -18 -75 0 -1
7581 -1 44 46 31 40 -12 -37 -10 31 22 74 69 42 11 -25 -50 16 5 20 28 47 4 -35 -41 -10 13 15 31 35 19 -58 -53 -19 -17 8 30 71
7617 71 4 -31 -40 6 -24 -8 36 24 12 -24 -17 -40 -20 17 77 37 13 -6 2 -46 -4 19 19 62 34 -6 -9 -25 -36 -18 18 29 4
7650 4 -1 -15 -29 -73 -12 15 51 44 6 -5 -58 -58 -2 14 -7 32 28 9 -62 -50 -38 -15 -3 27 34 -7 -23 -60 -15 14 -11 21 25 16
7684 16 -39 -35 13 -25 -25 25 29 18 -14 -35 0 -29 -3 19 50 26 -1 -26 6 -14 -37 22 34 42 -20 23 -21 -52 -5 43 49 16 3
7717CMk6j9J0JQ1n5K6k3k3m5K1Q0k5K6oom7j7j3N4J1mL7l4m3j2N0PmJ3K6j3k7
7751Ho7K0M8m8N0K4K7o1k3K3J2l0K2K6j0k2k9L1j8j1J4N2k0J5k9l0%lOO7l3j0
7783Ak5K2k9qJ9M6kk8J1km5j0K7K7j2J1K2j3m9LN2j6rK7j3j6j2jK2J2QJ8jk1k0
7818dNoJ6mrN9k3p9M1MLk8K2L5j6l8mPj7J5L0Ook0k7K2oK5L1oj5qj8Po0O2MK3
7856B3n0L8j6l4J5mN3K7k9J2l1j2j3kL1K3k6njml3K9K1K3k0J6j8l2kK0JQJJ8J1
7891C8k8m0J0mJ1K8kJ6n2K2k5KL5KJ5k1j0j3j2j6J6M7K5k3j8l7K5k6PK9%NrJ9
7925A6l9L0k8K0L6k0%k4k1JPK8K7j0K2m0j6J6Ml7L9K4j1mk0rroK0J2K1%j6nl1
7960b3qJ1O0k0j1l2%k0mL0J9j3K3Pj9Lk5M7J8k0k3K6k5Nm4Q0l5J1LqM0o4qL3k5
$$ plain form
7717 3 7 -19 -38 -28 -27 54 -1 25 2 -21 -66 -45 35 10 36 30 24 -23 -40 -53 1 12 8 45 11 -32 -44 6 13 9 22 48 35 8
7751 8 -59 -39 9 -39 11 35 62 1 -22 1 13 -17 5 31 21 -1 -30 1 -17 -28 -14 38 18 33 4 -26 -26 -29 -23 44 11 1
7783 1 -24 -2 -31 -39 -20 26 24 -4 7 5 -40 -50 -23 4 -8 3 25 12 -37 -34 18 2 -7 20 7 -9 -21 -22 0 12 20 38 37 16 -4
7818 -4 1 -5 11 7 -2 57 34 -45 -4 0 3 -25 -3 32 16 -22 -26 -19 -36 -21 9 15 9 -11 -38 -16 -22 3 34 28 13 5 -13 -6 -66 -4 0 23
7856 23 -27 11 -5 -39 -24 -28 25 52 23 35 4 -8 -21 -23 8 31 5 0 -1 -5 -38 -9 12 35 15 31 13 -19 -21 -1 0 8 9 27 38
7891 38 10 -30 -20 -24 -13 15 13 29 -23 -1 -26 -24 11 13 28 7 -3 -16 -28 -44 -28 19 44 21 3 -34 -9 -35 -28 1 1 6 -3 16
7925 16 -23 7 -21 -1 35 15 15 -9 -30 -29 -22 6 33 23 45 5 -11 5 9 -28 11 35 24 20 0 -9 -18 -24 -4 8 29 29 13 8 -23
7960 -23 -31 -20 40 20 9 -23 -23 -43 -47 -17 2 -11 12 19 0 3 -22 25 43 23 0 26 1 6 -38 42 7 18 21 13 53 -11 -19 14 -11
7995a1K2J7J3qo6K8J7Ol4L0L0l5l2J5lJ4j6M1nk1k3K3Nk7J8K9J5l1j4J1k5j0P
8028b0K2L2j3k9Kk0PJ2QO1m7k0K7mm4j9R0J8l2l4K1k9Jk9O1j4J0qK6m0k8K3PL
8062AK2K1l5rpM5l9Nl6O7Rn1l2K2MNJ4NJ8k8k7L0kl6K0M9k1j5rJ1k1J6lL6j2k8
8098a1Rlj7k4J6N1Jj0Qok3J1J1J1nPjj2k6K4lJ8l3J7N3p8KJ5J6k9K5j1J8J4m7
8133a2j7j4M1k0OL5j2j8j1M4k2k9M3J8j2n0J5J0Om0M6K1Jm2Oj8J1L1nmJnNj2l0
8168c3J7L2Qj5j5QrK1rOM3l4j0Qk3l6L3K1K7m2L1l4K1
$$ plain form
7995 -11 11 28 41 33 -33 -5 12 18 -16 14 44 9 -23 -8 -11 3 -13 28 23 2 -21 2 7 -20 -2 27 42 11 -3 8 -17 -27 -20
8028 -20 2 34 21 -8 -6 -26 -19 -7 1 62 15 -5 22 18 -26 -45 45 63 31 -3 18 -11 -10 -39 22 8 18 10 36 -4 -32 -9 -2 1
8062 1 23 44 9 0 -7 38 -1 4 -32 35 44 -7 -39 -17 -13 -8 6 11 29 1 -26 4 2 -34 -14 35 14 -1 -10 1 -20 -4 -7 29 17 -11
8098 -11 -2 -5 -22 -46 -30 21 22 12 20 14 -9 2 13 24 19 26 25 13 -13 11 8 26 -7 10 63 -15 -13 2 18 -11 14 3 21 35 -12
8133 -12 -29 -43 -2 -22 -16 19 7 -11 -22 22 0 -29 14 32 20 -30 -15 -5 1 -39 7 28 29 -13 -7 -25 -14 17 12 8 9 4 9 -3 -33
8168 -33 -16 16 24 9 -6 2 -7 14 5 11 54 20 10 18 -5 -41 -8 13 40 -2 29 -5 16
8191A6
$$ Imaginary data points
##PAGE= N=2
##DATA TABLE= (X++(I..I)), XYDATA
0@%%%%%%%%%qJ6j6J6k4L2l2M0m9N7p2Q8r8J12j34J52j72J96k24K56k88L24l65
32a93M10m61N14n71O37p08P86q73R68j073J186j313J455j612J790j990K218k482
50a312K791l160L607m157M863n804P125r142J2627k0317O5995m0486j36100M7262
64g6208M4526J15J6368J03002M5318p6956j17213l7033J1366K9801N9909Q4034
76H7029J9700n9067p0511l4392k7465n200O2243J05404M5055m8036q0205n2619
88e8064k4242O163M5398O8011M9691Q508m3604q7261p5406Q392P9995O6211J6675
101F0467P893K747n4937r9228m0762O2847R0510M3131N376j1725m7705p5046m0819
114i7251K5016N7243N6373M6521P183o1953r0673l9626K7491M6756M1931M6453
$$ plain form
0 0 0 0 0 0 0 0 0 0 0 -8 8 -8 8 -16 16 -16 24 -25 32 -40 48 -50 62 -72 80 -92 104 -120 136 -152 172 -193
32 -193 217 -244 270 -301 336 -372 414 -459 509 -564 622 -691 764 -848 942 -1048 1170 -1312
50 -1312 1479 -1681 1926 -2231 2632 -3172 3953 -5189 7438 -12879 53116 12630 -123470 -76208
64 -76208 -31682 -31567 -15199 87803 133121 56165 -61048 -98081 -86715 -56914 2995 87029
76 87029 106729 47662 -22849 -57241 -84706 -89906 -27663 77741 122796 74760 -5445 -58064
88 -58064 -82306 -76143 -30745 37266 86957 95465 51861 -35400 -110806 -102414 -22419 43792 60467
101 60467 68360 71107 16170 -83058 -123820 -60973 29537 72668 78044 66319 18614 -56432 -97251
114 -97251 -72235 -14992 41381 87902 95085 33132 -57541 -97167 -69676 -22920 19011 65464
126F5464K8482l2556q1919o5548o159M4229O5314N4679J3322l2778n2179m9488
138d9137l6636K866O4312Q5268L0795l9257n7108m1221l2567j1323M2495P8742
150C7229M9424j0505m5125n4587n1099j4371M7363P3141M0213l53j8428m1977
162A0925o7891m1249L5984P9750N0528L896j6191l4838o0742m8572J2567O1661
174a4172N8184K8650j719l8969o7268m8042Q650M7595M9110L7876J7975k5756
186E2114o7831n9574n638M0094N1053M3197K2580j7442n6090n8016k3161J8968
198e9746M7988N6116L4010j2878n1331n4360k9327L470L5646N6926M6262K187
210G4963m2528n6329l9447p279K9004N3799M8668J3603k7917n1525m8282k0523
$$ plain form
126 65464 93946 61390 -20529 -86077 -92236 -48007 17307 71986 85308 52530 351 -49137
138 -49137 -85773 -82907 -18595 66673 97468 58211 1103 -40118 -72685 -84008 -41513 37229
150 37229 86653 76148 31023 -23564 -74663 -89034 -41671 31470 71683 71330 52902 10925
162 10925 -56966 -98215 -62231 17519 68047 71943 55752 20914 -39828 -88400 -75833 -14172
174 -14172 44012 72662 70943 31974 -35294 -83336 -74686 -27091 22019 59895 77870 52114
186 52114 -15717 -75291 -80929 -40835 10218 53415 75995 58553 2463 -55553 -78714 -59746
198 -59746 -11758 44358 78368 65490 14159 -40201 -69528 -66058 -30412 26514 72776 74963
210 74963 32435 -23894 -63341 -70620 -41616 12183 60851 74454 46537 -4988 -53270 -73793
222g3793J9919N0680N2029K3713j5911m5446n1293k9761R075M2868N2504L4272
234F8856k472l9008n4096l7690o73L4390N0204M0370Q543k9270n1218m4401j3569
247g0034K4006M8551M6406J8006j9560m4656m6415k5100J1560M4516N0803K6562
259F4645q756l5902m7059l5926m32L9005N1247L1576J339k4456m4253m5690j4168
272f8830L1222N0725L5693J0107j3897l9340n0327k4529K1318M5694L8784K0636
284E7256l146l5101n2814l1123J2050L7484L8248K9551Q320k9000n3257l6713
296e8245J883K7989L7262L7211J6962k3079m9124l8158q914J5071L4621M5100
308C8579K5707j7577m4371l6895j7036K065K8538M9134L3732r714l7820l6166
$$ plain form
222 -73793 -53874 -3194 48835 72548 56637 11191 -40102 -69863 -60788 -17920 34584 68856
234 68856 66384 27376 -26720 -64410 -65083 -30693 19511 59881 68424 39154 -12064 -56465 -70034
247 -70034 -46028 2523 48929 66935 47375 2719 -43696 -68796 -57236 -12720 38083 64645
259 64645 55889 19987 -27072 -62998 -63430 -24425 26822 58398 59737 35281 -8972 -54662 -68830
272 -68830 -37608 13117 48810 58917 45020 5680 -44647 -69176 -47858 -2164 36620 57256
284 57256 54110 19009 -33805 -64928 -52878 -15394 22854 52405 60725 31725 -21532 -58245
296 -58245 -56362 -28373 8889 46100 63062 39983 -9141 -47299 -56213 -41142 -6521 38579
308 38579 64286 46709 2338 -34557 -51593 -49528 -20990 28144 61876 52162 14342 -21824
320b1824k5117q573K3193M9218L7350r31k7109l3283l3405j9026J8409M8126L8266
333D5294O318j5059k8022l9757k8465J2942M4473L6976J3193l046k2620m4314
345b2087l5660O930L7960L3526J9762R420j6214m6878m0566J343K9729K8573K5714
358C1552K1320r775m6757m2270l908J9587K2402L0952L1538l985m5059m1329q149
371d3881Q403J4404L4223M0194J885m1146l8747j2387k399O811L5346M5573P912
384E6191l4092l4235j6790j2955J42L5371M7735J2263k5188k7305k0349k3200
396d2412o228L4182M7521J5383j5943j9552k2580l1309j2039L1130M5198J8210
408D1561o251j1788k3854l6970j6429K6074M0211K0599L980m347k4454m0274j9692
$$ plain form
320 -21824 -46941 -55514 -32321 16897 54247 53316 26207 -7076 -40481 -59507 -41098 7028 45294
333 45294 51612 36553 8531 -31226 -59691 -46749 -2276 34700 47893 44847 22227 -22087
345 -22087 -57747 -50817 -12857 20669 40431 49851 33637 -13241 -53807 -52464 -22735 5838 31552
358 31552 52872 43097 -3660 -45930 -49838 -30251 -7849 23103 54641 50656 5597 -35732 -43881
371 -43881 -35478 -21074 13149 53343 55228 14082 -24665 -37052 -39451 -32640 2706 48279 56191
384 56191 22099 -12136 -28926 -41881 -41739 -6368 41367 53630 28442 1137 -19212 -42412
396 -42412 -48640 -14458 33063 48446 32503 12951 -9629 -40938 -52977 -21847 23351 41561
408 41561 35310 23522 -332 -37302 -53731 -27657 12554 33153 37133 32786 8332 -31942 -51634
421e1634J9417L3137K2200J3875L022k3977m1364k1799J1761K4496K3014K3077
433C5225J0058k2284m0335k2782M060J5288K2308L0048J6383j8505l7099k3678
445c1313m347O445K1284L4341K0281j3694l0817k3168j3144k938J9816L7446K2877
458D3069r020k3544k1104j9968j1182J6739L7758K4789k982j5725j9409k5783
470b6362j7190J4010L5326K4037K983o399j6607l0999k3052J0985L2547K2802
482B2081P416J407j2559l2699k7356N643K7504K2069J2964Q101r810l2740k8487
495c6466Q19K0012J9182J8041J5446o178l2112k9664l626J3442J6095K0565K0402
508C5958j312k7923k9224r782N329J3666K3771K3749J560k3124k5849j3638l415
$$ plain form
421 -51634 -32217 920 23120 36995 40017 16040 -25324 -47123 -35362 -10866 12148 35225
433 35225 45283 22999 -17336 -40118 -36058 -20770 1538 31586 47969 29464 -7635 -31313
445 -31313 -35660 -29215 -7931 26410 46691 32997 2180 -20988 -34132 -37070 -17254 20192 43069
458 43069 34049 10505 -10599 -30567 -41749 -25010 12748 37537 34555 18830 -579 -26362
470 -26362 -43552 -29542 5784 29821 32804 26405 9798 -21201 -44253 -33268 -721 22081
482 22081 29497 30904 18345 -14354 -41710 -36067 -8563 13506 26470 34571 24761 -7979 -36466
495 -36466 -35647 -15635 3547 21588 37034 30856 -1256 -30920 -34546 -21104 -5009 15556 35958
508 35958 34646 6723 -22501 -32283 -26954 -13288 10483 34232 35792 12668 -13181 -26819 -30234
521c0234Q586K5104K7644N683j8748k3463j6217r024L712K2809K8453J0957j1506
534B3756k0584j9721j4363L86K0582K7306J4162m322j5705k1068j9148m154J6982
547a5891K6230J7625J696j1929k1036k1124p945J1362K2761K0670Q822p599k1219
560B423k2885j0454O815J8474K1125J4299j818j8726k3924j4226J910J5006K1246
573I265J7624K994j4686k2897j7223l575J0700K0284K0064P845r924k1288j9755
586b0572p993O844J7848K0344J2218l730j8463k2095j2151L525J5191J9132J5277
599B5375K607j4691k3384j5635M85J1954J6681J7239Q746r823k3688j8900k659
612b5693R175J4309J7467J3007m343k1028k1004p431N112J3144J8520J5112q98
$$ plain form
521 -30234 -21648 3456 31100 36783 18035 -5428 -21645 -30669 -26957 -4148 24305 35262 23756
534 23756 3172 -16549 -30912 -30526 -9944 17362 31524 27202 11497 -9571 -28719 -32873 -15891
547 -15891 10339 27964 29660 17731 -3305 -24429 -32374 -21012 1749 22419 31241 23642 2423
560 2423 -20462 -30916 -24101 -5627 15498 29797 27979 9253 -14671 -28897 -26987 -11981 9265
573 9265 26889 29883 15197 -7700 -24923 -28498 -17798 2486 22550 30395 20471 -817 -20572
586 -20572 -28565 -21721 -3873 16471 28689 24959 6496 -15599 -27750 -24225 -9034 10098 25375
599 25375 27982 13291 -10093 -25728 -25243 -13289 3392 20631 29377 19554 -4134 -23034 -25693
612 -25693 -16518 -2209 15258 28265 23922 2894 -18110 -25541 -20429 -7285 11235 26347 25449
625B5449j7124j9749j1307q25J0197J9560J7867K466j3639j8402j4059n238P403
638a7401J8385J8047O235p154j5772j8454j0956O296J9184J6534O064j314r073
651A0621j9376j8230J315J9669J8076O812R70n139j7251k0361l682J5068J7023
664E515J0197O057k419j7735k1802n473J1850J3827J0298J0091K524j5059k2930
677a5059j0193P101J3268J3049J1434K363j1778j7628j1678k345P531J7614J7931
690B1610K206j3950j4543p999o195m77J5305K2451P312j1884j4463r243q654k615
704b1139J3919K1216P966o900q654r547j5132p647J4682K3530Q095o518n298n834
718B739j5680j3122Q789K2588J2937j114m750q307j5498j1153N907J5574J1297
$$ plain form
625 25449 8325 -11424 -22731 -23556 -13359 6201 24068 26534 12895 -5507 -19566 -24804 -17401
638 -17401 984 19031 25266 18112 2340 -16114 -27070 -20774 -1590 14944 21008 19694 10621
651 10621 -8755 -26985 -25670 -6001 12075 18887 19857 14718 -2533 -22894 -26576 -11508 5515
664 5515 15712 21769 19350 1615 -20187 -25660 -13810 17 10315 20406 22930 7871 -15059
677 -15059 -25252 -18151 -4883 8166 19600 21963 10185 -7443 -19121 -21466 -13935 3679 21610
690 21610 23816 9866 -4677 -12676 -18871 -19348 -4043 18408 25720 13836 -627 -9870 -18524 -21139
704 -21139 -7220 13996 21962 15062 6408 -3139 -18271 -25918 -11236 12294 20389 13871 8573 2739
718 2739 -12941 -26063 -17274 5314 18251 17137 12387 4080 -11418 -22571 -16664 -1090 10207
731A0207O252K452r273k0240j2520O474J3550Q583P229O828n290j8952j5050Q63
745a8887R721J0502J1603P816o461j6627j1360j729J720P071J6469J3541n656
758A7723j8148j1410j622l56L938J4634J5040n81j3328j2322p656l693O144J6233
772D596J2394j279p601p098j0470j0829L367J8602J4627n23o557n538r972j1848
786a8129M86J4625J3515M198o84n484j4238j3339K299J3560R234L639M936m21
800A4197j5099j7477o21J3096R818M430N645Q58j2437j5900l697P027P995Q548
814F383R853N92j3707j4353k669L649L430Q326J3454M129j2144j4897n074J137
828a1891K828Q761J2973M534q251j0959o915m866N9J1118J5046M069p761p951
$$ plain form
731 10207 16459 18911 9638 -10602 -23122 -16648 -3098 5485 12714 19542 14252 -4700 -19750 -18887
745 -18887 -9166 1336 12939 20755 14294 -2333 -13693 -15422 -13702 -6631 9838 23379 17723
758 17723 -425 -11835 -13457 -13813 -9875 4759 19799 19218 5890 -6432 -14088 -17781 -11637 4596
772 4596 16990 15711 8110 1012 -9458 -20287 -16920 1682 16309 15786 9229 3691 -6281 -18129
786 -18129 -17643 -3018 10497 14695 14011 8527 -5711 -19050 -16751 -3191 6043 9682 14618 14197
800 14197 -902 -18379 -19000 -5904 3914 8344 13989 14847 2410 -13490 -17187 -10160 -2165 6383
814 6383 16236 16828 3121 -11232 -13901 -10252 -6822 1504 14958 19087 6943 -7954 -13028 -11891
828 -11891 -9063 -302 12671 17205 8954 -2005 -8920 -13786 -13727 -2609 12437 16506 8745 794
842G94n281p430m123R123J6151O920n164p305o389q312m710P236J3665P552p80
857A1947m066p278j1002o113O535J2559P594J229j633o096j1090p882L065J0433
871a798R302M644m33o746j0473p128N87O340Q693Q273K797o494j1256p386n63
886a1641L968P344R322N056m324j0170q143l030J619O902J0322O382l005q622
900A980p656m677j029N227J0556Q174o77p408q018n712k190L673R084Q728K290
915A2345m867q238p497l401K811P858Q438M215k225p356q354m847J179O450Q384
930D895N883o3o277q494n768o13M578Q002P267J969m879q126o616k425K940P520
946b07P974L304l191o919p020m399J079O923Q501M305j601n441o989n982p43N941
$$ plain form
842 794 -4487 -11917 -16040 -6917 9234 16154 10990 3685 -2704 -11016 -15726 -8490 5175 12727 11947
857 11947 7881 603 -10399 -16512 -9977 2582 10176 11405 9772 3676 -7414 -15296 -12231 -1798
871 -1798 7504 12148 11715 4969 -5504 -12632 -12045 -5705 2988 11261 14058 7564 -3692 -11078 -11641
886 -11641 -7673 -329 8993 14049 9725 -445 -8588 -11618 -9999 -3097 7225 13607 10602 1980
900 1980 -5676 -10353 -11382 -6155 4401 12575 11898 4490 -3528 -9240 -11430 -7757 1327 10055 12345
915 12345 7478 -760 -8257 -11658 -8847 -989 7449 11664 9439 2083 -6271 -11118 -9939 -3489 4895
930 4895 10778 10715 4438 -4056 -9824 -10437 -5859 2143 9410 11379 6500 -1626 -8242 -10667 -7727 -207
946 -207 7767 11071 7880 961 -6059 -10458 -9379 -2456 6045 10350 8749 3308 -3681 -9663 -10406 -4465
962d465Q229N212L90l750p021p292k098M883P471N373K333j544o614q390l411
977a0694L664O386N496M017L00o002q684m308K029M863N527N624J932n329q525
992c704m671M17K852N241P131L350m526p840m704j337P46M858Q213M419l542o592
1008C11m466l011j411M265Q891N187k478n053l926m450l438L481R030N578j268
1023G242l254l242n799m955K796Q567N345m3j097k574o866o142K190P694M763
1038D625J155R53j753p521o917J411O369M111K257K916j017p775p129N98M649
1053c068L149L438M598l99p666o818j60K643K055M435O034R1p122o188q34N95
1069e217J032N154O887N89o119n192j698j461J72N664P248Q96m718l918k455l352
$$ plain form
962 -4465 3764 8976 9366 5616 -1405 -8697 -10795 -5912 1559 6932 9265 7721 1107 -7283 -10694
977 -10694 -7030 -644 4852 8869 9169 3167 -5517 -9825 -7796 -2933 2594 8218 10150 4821 -3704
992 -3704 -8375 -7958 -5106 135 7266 10616 6090 -1750 -6454 -7791 -7045 -2187 6026 10445 6903 311
1008 311 -4155 -7166 -8577 -4312 4579 9766 7288 2235 -1691 -6141 -9579 -6098 2932 8510 7242
1023 7242 3988 746 -5053 -10008 -7212 1355 6700 6657 5560 2986 -3880 -10022 -7832 -138 4625
1038 4625 5780 6733 4980 -2541 -9458 -8047 -1678 2433 4690 7606 6589 -1186 -8315 -7717 -3068
1053 -3068 81 3519 8117 7718 52 -6766 -6926 -4283 -2228 2207 8241 8332 1210 -4978 -5812 -5217
1069 -5217 -4185 969 7856 8445 2326 -2866 -4564 -6025 -5853 -189 7059 7955 3237 -681 -3136 -6488
1085f488o22N956P089J098l080k420l187n042j221N840O598J327j335j047l712
1100b46o228j698N369N669J503N48K81m171p037j867M609M324J651K346J595m390
1116B258p466k104L732K994J731L763K575m297p300k141K367J538J958N124L201
1131G933m189o656j960J043j2J878O132L861l703o036j861j44j127J780O433L992
1147G364k791m566k021j731k123K161O490L656k127l008j545k997l274J968O435
1162A891L628j297j802j419l711l712J575N493L307N0k83j391m619m054J470M712
1178a62K676P69J080p93m826m612O44L918K753J587J584o63m277m144m05K145
1194b726K480K926K430p51m165l623p12P68J709L336L289k32l501l457j623k28
$$ plain form
1085 -6488 -7110 -1154 5935 7033 3953 1533 -1654 -6696 -7917 -2077 4521 5848 4513 3466 -246
1100 -246 -6474 -8172 -2803 2866 4369 4917 5198 1027 -6010 -7877 -3268 1056 2707 5053 6648 2258
1116 2258 -5208 -7312 -3580 -586 1145 4908 7483 3186 -4114 -6255 -3888 -2350 -392 4732 7933
1131 7933 3744 -2912 -4872 -3829 -3841 -1963 4169 8030 4327 -1709 -3570 -3714 -4841 -3061 3372 7364
1147 7364 4573 7 -2014 -3745 -5868 -3707 2783 6439 4312 1304 -241 -3238 -6512 -4544 1891
1162 1891 5519 4222 2420 1001 -2710 -6422 -4847 646 3953 4003 3720 2329 -2290 -6344 -4874 -162
1178 -162 2514 3283 4363 3570 -1256 -5868 -5224 -1306 1447 3034 4618 3955 -322 -4466 -4871 -2726
1194 -2726 -246 2680 5110 4359 194 -3429 -4141 -3373 -1664 1672 4961 4729 1228 -2229 -3852 -4080
1210d080J564L777L189j70k421k397k309j923J009M436L680k46k150j600k039
1225a680k732j35L933M136O74j480j655k381k798l44L142L617J278l45j067k618
1241d55l373q40K645L488J707J74p63k267l132j577J351L164K730R91r40k460
1257D43k593j419L26J969L059K147l21k540k753j534j15J359K835K546L27j947
1273A789k505j994q35Q67K768K925P61j593k276j920j182J59K121L083J645q38
1289B975k458k302j197J00J423K489K184L00k042k735j660k6J150K031K421J011
1305C664j547k754j810l44N34J612K659J664j031k706j948n75J24J238K540K010
1321C330m42k144k006j259l46J192K636J936j16j493j683j735r88R61K579K009
$$ plain form
1210 -4080 -2516 1261 4450 4280 1859 -538 -2847 -4770 -3761 675 4355 4109 1959 359 -1680
1225 -1680 -4412 -4547 -614 3522 4196 2716 1061 -1320 -4118 -4462 -1320 2297 3575 3230 2163 -455
1241 -455 -3828 -4668 -2023 1465 3172 3346 2583 316 -2816 -4393 -3042 122 2852 3843 2903 443
1257 443 -2150 -3569 -3243 -1274 1785 3932 3611 1071 -1682 -3216 -3331 -1972 863 3409 3736 1789
1273 1789 -716 -2710 -3545 -2678 90 3015 3776 2183 -93 -2013 -3195 -3036 -915 2168 3813 2975
1289 2975 517 -1785 -2982 -2882 -1459 1030 3214 3514 1472 -1263 -2923 -2949 -1799 232 2653 3664
1305 3664 2117 -637 -2447 -2791 -2257 -645 2014 3678 2647 -59 -2007 -2582 -2458 -1220 1320 3330
1321 3330 2888 744 -1262 -2521 -2867 -1675 961 2897 2781 1288 -395 -2130 -3118 -2157 422 2431
1337B431K92q37j548k212j331R63K335J498N75K85j030k855k074J054K437J204
1353A187M52Q33l77k802k508N81J997J163Q85J368l66k921k290N34J340N09J165
1370G50K205P5l102k556M45J150K43J110K309L94k490k282k21K61K40J747K473
1387B751%k261j495j16p18n17K061L007K68k221j397k53q80o25J784K619M82j210
1405A279r45r13j662m35K196K274Q0p47j05q47k258r22K011K345M36l70j22j062
1423B33k038o77J387J439P14P94K90j786k460j73J545P19K23J372R97j687k656
1440a764m95J229N44N25J637Q45j659k177j94M56k49P27K420J076k042k126M3
1457a204L98o57M06K436J381j474j871l85j81n74P91K213R12j108r95l07j021
$$ plain form
1337 2431 2723 1886 338 -1874 -3205 -2242 93 1591 2166 2451 1421 -1434 -3508 -2454 -17 1187
1353 1187 1639 2472 2095 -707 -3215 -2634 -637 526 1411 2779 2413 -508 -2798 -2264 -924 -415 750
1370 750 2955 3030 -72 -2628 -2183 -1033 -790 320 2629 3023 533 -1749 -1970 -1709 -1469 278 2751
1387 2751 2751 490 -1005 -1121 -1839 -2356 -295 2712 2980 759 -638 -891 -1771 -2396 -612 2007 2489 1279
1405 1279 334 -579 -2241 -2676 -480 1794 1874 1127 1022 175 -2083 -3005 -994 1351 1787 1417 1295 233
1423 233 -1805 -2482 -1095 344 1058 1852 2142 356 -2104 -2277 -732 -13 210 1582 2579 892 -1764
1440 -1764 -2259 -1030 -486 39 1676 2521 862 -1315 -1509 -1053 -1302 -575 1845 2921 879 -1247 -1204
1457 -1204 -806 -1463 -1057 1379 2760 1286 -585 -970 -1151 -1725 -934 1279 2191 1083 88 -219 -1240
1474a240j076J144K511P10j083n72j03j278j323R77K218P51n86j44l56j702j182
1491b334J175J824L67j86N35l25k081j440J149J776L30n8P01j88j951j426P01
1508a431J335N12M69P82m45j847j069M65P28M24R37R73n01j746j034K42M02M79
1526c25J071J023m32j401q84j90m5N51J426R44n21j107n74m86n23M95J634J003
1544A659m59q64n00o68p44M43J518J009k69n01m16r52r09M50J440Q59q1j42l51
1563E22j104j087L06J330Q64J69K7l47j135j059J60J025Q20M59K43l44j158j044
1581a353P8P22P16O62N22l17j148j009j33N19O32Q25O62k35j037r61l17K04N91
1600c77R13Q22j46r42q81m27o9M80R81R18Kp54q72o51j92M08R28R50J88n35q34
$$ plain form
1474 -1240 -2316 -1172 1339 2049 966 394 291 -987 -2310 -1333 885 1636 1050 906 550 -1152 -2334
1491 -2334 -1159 665 1032 846 1381 1056 -1025 -2465 -1316 460 790 732 1433 1245 -706 -2132 -1431
1508 -1431 -96 416 885 1667 1222 -625 -1694 -1229 -501 -77 860 1833 1332 -414 -1448 -1206 -804 -325
1526 -325 746 1769 1337 -64 -948 -1138 -1183 -632 794 1738 1217 110 -464 -950 -1473 -978 656 1659
1544 1659 1200 336 -164 -832 -1576 -1133 385 1394 1125 624 208 -744 -1653 -1203 237 1096 1015 873 522
1563 522 -582 -1669 -1363 -33 831 1000 1027 680 -455 -1514 -1354 -329 491 950 1193 849 -309 -1353
1581 -1353 -1275 -553 163 825 1347 1030 -118 -1127 -1260 -741 -109 716 1378 1143 106 -855 -1172 -968 -377
1600 -377 536 1358 1212 270 -611 -1038 -1107 -627 354 1272 1274 520 -352 -1003 -1195 -787 141 1091 1279 744 -90
1621i0p85l54K71R08R20L69l03p63q78n33J47Q03R24N47j01o96r02o72K8O31R27
1642C98P53N5o27r11o87j82M29R37Q70K23n13p96p99m06K92Q98R52L24l05o88
1662B17q22o48R2R23R36M26j19n47q15q66p0Q00R94N03N2l08q74r87k51P53Q88
1683B77N46K89j14r07j139l16O38P39N81N24J01r10j223m44N23N74O13P74K62
1702A388q79j273m42K79L95O21J020M04q36j163n33L4J49O54J187N37p08j060
1720b26n19k39j07P12J232O31n43q33n88n28k65O64J332O30l38o30n87q04m16
1739a422O48J283O69j60l65o19r34o19O39J157O35J37j14o45j172o14N47R86O06
1758F43L79J68o50j285p06M39P65N69O96L56o35j313p17K61M88N42R44O16o58
$$ plain form
1621 -90 -875 -1229 -958 -50 870 1239 936 173 -705 -1238 -1091 -288 636 1183 1082 386 -516 -1188 -1160 -529 398
1642 398 1151 1206 579 -332 -1019 -1201 -772 165 1035 1258 745 -51 -850 -1256 -964 -66 886 1210 905 217
1662 217 -605 -1253 -1161 -238 698 1124 1005 458 -357 -1223 -1293 -493 501 1004 1056 748 -126 -1113 -1364 -611 277
1683 277 823 1112 998 91 -1048 -1364 -726 13 594 1118 1219 309 -914 -1358 -835 -261 352 1126 1388
1702 1388 509 -764 -1206 -927 -532 89 1109 1513 677 -486 -1019 -985 -836 -182 1005 1542 834 -226
1720 -226 -745 -984 -1091 -379 853 1484 941 108 -480 -1008 -1273 -609 723 1353 1015 385 -202 -1006 -1422
1739 -1422 -774 509 1178 1018 653 34 -900 -1519 -880 277 912 1049 935 290 -882 -1496 -949 37 643
1758 643 1022 1190 540 -745 -1451 -1012 -247 322 1018 1374 739 -574 -1291 -1030 -542 0 944 1560 902
1777I02j314o83R9K12M90J148P20n45j198o33k00p1M91J302Q26m64j011n67l68
1796h64m47M83J382R07k82q46n43o30n60M14J376Q95j79m42n03r03q14M06J355
1815B05Q30pj40l97j063j010L07J227P92K40J06l60j164j054J97R71P16M57M36
1834A289k55j320j088O3P93O16N86O88j52j216j146j63N04N54Q57Q08j60j037
1852B21j026l14P0M28J032J008n9j000q89m27k31L27J034J077J09p18p56p47n10
1871a371K89J144J057J25m31n78q31q45P0J233J079K78k63m34q83r81j11J010
1889d43J052M66O6l18j003j090j92Q79Q62N80L79j24j020j198l91O17Q73P00N57
1908A252J2r24j161n25K62O65R12Q36O3q97j069n92J4M03R09J027K90p10j061
$$ plain form
1777 902 -412 -1095 -996 -784 -294 854 1574 1029 -169 -802 -1002 -1073 -582 720 1546 1082 71 -496 -864
1796 -864 -1311 -828 554 1461 1179 333 -210 -840 -1400 -986 390 1285 1106 664 161 -742 -1556 -1150 205
1815 205 1035 1028 888 491 -572 -1582 -1275 -48 744 984 1090 730 -434 -1488 -1291 -320 396 853 1289
1834 1289 1034 -286 -1374 -1311 -518 98 684 1372 1220 4 -1142 -1305 -801 -247 610 1418 1258 221
1852 221 -805 -1119 -1049 -621 411 1419 1360 360 -529 -956 -1187 -860 174 1251 1360 642 -114 -861 -1371
1871 -1371 -1082 62 1119 1244 813 235 -596 -1441 -1371 -138 941 1219 956 522 -361 -1342 -1453 -443
1889 -443 609 1075 1141 823 -180 -1270 -1462 -583 279 859 1238 1114 94 -1104 -1495 -878 -5 695 1252
1908 1252 1264 340 -821 -1346 -1084 -419 493 1329 1392 495 -574 -1166 -1152 -749 160 1187 1477 767 -294
1927b94p32k15K83Q80J065M25m95q64q09n42R2R14J133N29l07p16p90p55j90P75
1947f13J152P19m0n61r05q06l47N86J011Q28K77l53q74j025m56L85R55Q58M63
1966A254j24p73j071o38J27Q12R71O83J5o94r70p72j38N94R78Q59K41n11r44r29
1986a030l52M69Q89R25M22k76q46r89n81K46Q65R43N57m3o72j068p47J1P45R26
2006C94P00K48n17j086r11j28N34Q87Q11M60l75r98r63l24K58P75R50O70j58r99
2026B28r18m79MN59J068R08q9p86r28n67k61L76J099J016R5o62p24o75o01J55
2046a182J149J095K83n05o23o81q21j12R91J242M48k87n20p65r18k15P98J079
2064D56N97J40k81r26j091l33O44Q98O87M08j11q21j157m70L53P59Q45O75J6q80
$$ plain form
1927 -294 -1026 -1241 -958 -78 987 1412 917 53 -756 -1298 -1206 -292 841 1370 1063 347 -443 -1198 -1388 -613
1947 -613 539 1258 1218 657 -248 -1054 -1401 -815 196 1024 1301 948 74 -951 -1407 -1022 -67 791 1254
1966 1254 1130 357 -714 -1352 -1225 -413 558 1241 1256 562 -408 -1180 -1318 -724 254 1113 1354 843 -101 -1030
1986 -1030 -1382 -913 -24 901 1323 1047 201 -788 -1369 -1123 -258 685 1242 1199 527 -541 -1288 -1277 -532 394
2006 394 1094 1342 825 -261 -1172 -1300 -766 121 932 1392 1017 19 -944 -1268 -1010 -235 715 1385 1227 228
2026 228 -690 -1169 -1165 -606 462 1370 1281 495 -433 -1000 -1261 -885 214 1230 1325 663 -61 -736 -1337 -1182
2046 -1182 -33 1062 1345 840 217 -464 -1285 -1397 -406 836 1284 997 477 -288 -1206 -1421 -623 456
2064 456 1053 1193 912 -14 -1105 -1438 -794 104 791 1199 1088 267 -890 -1360 -1007 -248 597 1272 1288 408
2084D08j111m42R8L75Q38J098K79r29j137m47l9J39P02J182N50p03j060n78k99
2103a076j00P49J296O10n37q16n58n49l97O25J407P55l50o76n34p07n65N12J257
2122C46Q04j9l39o55j029n96N49J092O16J98J35n45j249q60M61J035N88L56L09
2141A197m32j273q44K69O65N46P16N97m61j344q42K15M27L33Q17R16k69j360r22
2160a049N0K32K83R04R68j24j066q47k90j39K73J099J052j15q56o54m11m80J08
2179a062J086J105R5n57o14o33o59Q1J048R56K44k24l92q42r51M7J035Q72K47
2198H82K7j34q52j174j22Q78Q54L69L25n5r58j127j88O35O49M73O23J38r57j203
2218i17k99M53M76N14Q54K66q64j113m19J41K92O87R59L58p28r74m77j85N1O91
$$ plain form
2084 408 -703 -1145 -1047 -672 166 1264 1543 614 -523 -970 -1009 -870 -168 1014 1564 861 -199 -777 -1076
2103 -1076 -1176 -427 869 1479 942 126 -432 -981 -1378 -753 654 1409 1059 383 -151 -858 -1423 -911 346
2122 346 1150 1131 792 137 -892 -1488 -939 153 769 967 1102 557 -692 -1552 -1091 -56 532 888 1197
2141 1197 765 -508 -1352 -1083 -418 128 844 1441 980 -364 -1206 -991 -564 -231 586 1502 1233 -127 -1049
2160 -1049 -999 -767 -484 420 1388 1264 198 -649 -939 -1078 -805 294 1346 1231 375 -279 -690 -1170 -1062
2179 -1062 24 1129 1224 667 53 -580 -1239 -1158 -110 846 1090 866 474 -368 -1319 -1272 -237 635 882
2198 882 909 775 -77 -1251 -1373 -495 359 728 1053 998 40 -1087 -1275 -640 9 482 1105 1243 286 -917
2218 -917 -1216 -763 -287 227 1081 1347 483 -630 -1049 -908 -616 71 1030 1388 660 -314 -791 -976 -925 -234
2238b34J128M80o13q18n30l66j63O53J148N70l54o13n93o57k79O38J069O24j13
2257I77m10n91q18m88M97J036O61J22j90n72r31n65L43Q46P33L23M4n62r95o37
2277a177J82O45O72N81K37m55r98p11kM48O22P22M40l38r14p82k11K22O07Q05
2297E95N92k05p55q16l95M2N25Q23O73l0n84p68n62k10M17Q10P57J83m25o90p07
2318g30l45K72P05P68M54k45o67p72m61R0N79P88N48M7n83q26n72n7L86Q00P27
2339I06J68m50p41o49k92K35P71Q19L22k92o91o10n02J2O82Q76M57j05n29o52
2359b65o46k05N97Q81N49Ml13o27p92l70M75Q67N82J70j12o08q73m65L31P24O10
2380E14M07L7n24r53n53K06N19N89N64K85m90r22o27M8L54N33O95M45l78q76n75
$$ plain form
2238 -234 894 1374 761 -57 -587 -953 -1116 -463 685 1255 901 288 -305 -962 -1241 -603 466 1090 977
2257 977 567 -24 -842 -1330 -833 203 864 986 796 224 -707 -1272 -929 -83 650 973 1017 455 -540 -1177
2277 -1177 -995 -350 322 903 1140 685 -313 -1024 -1026 -578 44 766 1206 868 -46 -828 -1039 -817 -210 595
2297 595 1187 982 227 -589 -984 -942 -417 406 1079 1049 465 -303 -865 -1075 -658 152 909 1092 667 -23 -730
2318 -730 -1075 -803 -98 670 1124 879 212 -560 -1021 -931 -352 436 984 1031 448 -378 -950 -1007 -621 179 906
2339 906 1074 624 -117 -766 -1058 -823 -52 767 1089 797 106 -504 -1006 -994 -312 564 1021 916 387 -265
2359 -265 -911 -1116 -519 362 911 915 602 -25 -817 -1187 -712 155 737 907 795 187 -686 -1151 -820 -96 514
2380 514 921 958 434 -519 -1072 -866 -347 242 806 1091 601 -321 -948 -900 -546 -13 682 1127 749 -127 -702
2401g02j69J08M87Q74N38l03p62n22l30j72M29R89O30k41n46n10m91l70L53R95
2421B85O57r2l18m43p03n63K79J057N94L8j47k70p96p77K31R00O30J28J20j84
2441F26r38q43J64Q10M71K42M33r9j000r42P7O54L47L98N88O5r88r67K4L33K38
2462c07M95Q56Q2r33q46r5J05N2O49R75J47q60p47j47j68j16O81J118J96o45n92
2483a00k55m24k40P73J072K43n34l33l37o64l69P40J060K99k94j68m16q47m06
2502a200O54R25L08L4j1n03r74l98N89O83L17K91K27n38j053m57M48N45K74N73
2522G34L51n40j035l93K32K10L10P98N57n75j018l54J29l3K41R49O49m28r16l80
2542e12j12j96K58J037O80l79o78k73l44m93K98J069P06k92m94k08n10o15J64
$$ plain form
2401 -702 -871 -763 -276 598 1136 833 71 -451 -781 -953 -524 465 1095 854 308 -202 -693 -1063 -710 285
2421 285 942 850 532 89 -614 -1177 -898 159 753 791 644 374 -422 -1199 -968 -68 562 690 810 626
2441 626 -312 -1155 -991 -181 290 532 965 866 -134 -1076 -999 -345 2 400 988 1053 65 -902 -878 -545 -307
2462 -307 188 1044 1126 193 -653 -748 -643 -591 58 1033 1180 320 -427 -574 -742 -858 -177 941 1137 492 -100
2483 -100 -355 -779 -1019 -246 826 1069 535 202 -135 -799 -1168 -428 632 931 637 469 53 -794 -1200
2502 -1200 -546 379 687 721 710 207 -767 -1165 -576 107 424 715 942 404 -649 -1106 -658 -113 161 734
2522 734 1085 545 -490 -883 -651 -441 -131 667 1224 649 -369 -723 -594 -627 -386 563 1212 784 -132 -512
2542 -512 -624 -820 -562 475 1155 776 98 -175 -519 -1012 -714 355 1061 769 275 67 -443 -1058 -894
2561h94J074O78q0k92k49o16p31K12R02N77Q9J8j39q34q29J93P71N08K03K15p7
2582F99q18q56N1N66M74L68M38j11p96p90q4L45K89N63O26qp91p39k21J60K50
2603c85N46P05J53o98o73l07j08J71O53P91R9m80n36l86l59J0O74Q55K19l80m51
2624A13m22m82j13O28P69L48j65l14n43n90j96N20P45M22J2k05n24o90k56L66
2644e77O64N17J96j15n39o94l45J98N47N48M05J5n26o77m49P1L66O11N55R0l97
2665D64o66m60j43K48N82O27K57l24n85n67k84K12N12O19L55j36n16o20l64L7
2685g52N06N66M24R5m38o69m75j2L44N31N17K46k97p09n57r7K56M29N42M65j38
2706G77p23o03k11J32L61N65N29L2n61o83k88n3K92N68O17J18m39n31m74k44J86
$$ plain form
2561 -894 180 858 778 486 237 -379 -1110 -898 4 581 670 688 549 -285 -1114 -921 -150 358 561 776 699
2582 699 -119 -975 -924 -358 116 484 922 811 15 -775 -859 -514 -225 338 964 956 165 -574 -795 -635 -385
2603 -385 161 866 1019 321 -352 -659 -767 -596 57 848 947 467 -69 -455 -814 -804 -130 725 944 564 113
2624 113 -309 -791 -904 -276 493 841 676 362 -181 -771 -967 -447 298 720 732 527 3 -687 -943 -577
2644 -577 87 604 800 685 146 -548 -893 -695 -148 400 805 820 294 -383 -832 -761 -395 216 771 861 464
2665 464 -202 -662 -805 -557 25 652 909 585 0 -567 -851 -639 -127 492 847 711 195 -425 -789 -752
2685 -752 -246 320 744 839 401 -268 -743 -755 -411 120 637 883 586 -123 -680 -777 -521 -92 450 915 777
2706 777 54 -549 -760 -628 -267 298 827 859 298 -385 -673 -726 -434 134 751 869 430 -101 -575 -819 -633
2727f33O54N89J87k24n20n26l68J18N70O13K55Nl74o82n50P2N90M88K95J58r1
2748F26p19p91rN66M42L15L26Jo83q04r8L69L19L77N84J05p56q33r0K94J49L49
2770C9P24K58o53q27k21J26Q1M25P39L20n71o63k28j38j25M72R27L30n98m91j82
2791b56l20l14M64R78L60l38m04k54n26l54N00R25K77k28j49k08p27m80N02Q62
2811C10K99j12J9j80p65o28L95P57L42R8J59k18q99n01K73N25L23L14L31k74q95
2832c27n28K07L81K16M93M57k71p83m77RJ36K40O69N39l14o81l79j01j49K29P84
2853C50O01k70o24l15j97l24J87Q12O17j66m31k31m13m78J73Q70N81j55j90j48
2873B49n08o85J09Q41N55k6k8r3n82p30K4P46M95N9K26l0o73p92M7O32L24J45
$$ plain form
2727 -633 21 610 797 573 53 -473 -841 -723 -153 460 715 720 346 -336 -886 -814 -224 264 559 717 626
2748 626 -93 -884 -893 -327 115 430 756 757 74 -730 -828 -459 -140 237 821 926 170 -663 -753 -459 -310 39
2770 39 763 1021 368 -459 -680 -554 -473 -48 691 1011 440 -223 -451 -589 -714 -242 685 1015 417 -74 -256
2791 -256 -576 -890 -426 552 912 574 170 -84 -610 -964 -464 461 738 510 361 153 -574 -1054 -552 310
2811 310 609 497 516 336 -429 -1057 -662 95 437 535 694 476 -423 -924 -651 -126 197 511 842 568 -327
2832 -327 -855 -648 -267 -51 442 899 628 -155 -632 -623 -487 -247 422 961 647 -34 -413 -514 -663 -434 350
2853 350 951 681 57 -258 -455 -779 -592 220 837 671 240 9 -404 -882 -709 161 742 587 397 249
2873 249 -259 -944 -835 6 561 535 507 414 -168 -898 -874 -128 367 426 652 622 -51 -843 -796 -164 160 305
2895C05L82R5p06q41oM51K57K47N39J24o60p50q7K18J28L96O25J85o43o69j27
2916e37mK8M47P41K16n49n46k41j33p3M91P25K87m10m14k83l86j11M70P49K65
2937G32k40k77l28m87k23M85O56K83n7j71l32n88l22L91O43L40Q0k9l72o65l59
2958h40L28M96L38K56Q8l41o94l86J56M08L23M14J97l27o97l86Q3K42L16N25K85
2979G84k60o11m25r3J16L20N71L44j57n09m65k29K4L12N83L69k2m45m21l38j04
3000f56K79N16M69L5k82m27m11j81J73M64N01J82j32m39m87k74J54L64M66L22
3020F36n9l38n24l26NL63M25L80J12k97n23l81j35K42M57M36K09k15m74m42k06
3041f55R1M78M71K79j70l33m34l37L7L32N07K98Pk47m77m14o7K77N14L14J41j69
$$ plain form
2895 305 687 782 76 -765 -771 -320 -63 184 723 847 187 -563 -650 -432 -304 92 717 902 259 -410 -537
2916 -537 -541 -513 -66 675 891 342 -204 -445 -578 -651 -160 565 852 442 28 -255 -641 -752 -282 467 732
2937 732 492 215 -113 -600 -823 -338 318 601 544 373 41 -547 -869 -478 165 505 585 556 184 -481 -840
2958 -840 -512 -16 322 578 666 325 -369 -755 -599 -191 132 546 743 416 -281 -667 -584 -342 -26 499 784
2979 784 524 -87 -512 -605 -489 -169 402 746 589 80 -385 -614 -590 -278 305 674 652 207 -214 -552 -656
3000 -656 -377 139 608 643 361 -66 -477 -658 -485 -21 480 662 530 91 -396 -670 -516 -152 314 636
3020 636 577 239 -285 -611 -606 -243 182 562 674 377 -146 -527 -662 -420 37 473 682 467 -7 -449 -655
3041 -655 -564 -86 385 664 494 161 -273 -610 -573 -241 266 564 571 324 -153 -567 -634 -357 157 471 612 443
3063D43m65n01j21K11M09M00K48o8m38n10k26J10L19M11L70O3m31n07k66N2J61
3084c36M19M52J66l96m76k45j10N4L82N93K20l62m53k07j82r8L33O47K97k56l80
3105F2k01l02k28L24O89K60j82k15k10m09l10L08O19L29j04r7j88n02l87K58N99
3126A13K76oP7j44o04m31K03N27K50Q4J84j25n99m69J60L74K20K22L24r9o50m74
3148e87R3K64J32L30M23r1n69m78K0J09R2M55M80j13m95l69q5q8O1N27N02k5m46
3171A42l03j62k15K7N76N11l8k88j92l03l38L6N45M55qj25p0l59n26K9N42M39
3193C75jK7l2l93n52q6M80L84R0J60R5n07o05k9L90J87J69L26J71n12o71n1L32
3216b53J43J15M63K25n23n53o6Q8R5J96N47K27m73n09p6J9q2K62N94K76l94m63
$$ plain form
3063 443 -22 -523 -644 -433 -24 376 624 556 118 -392 -618 -508 -189 222 592 655 224 -283 -549 -497 -336
3084 -336 83 535 701 305 -171 -416 -526 -472 -90 503 723 361 -92 -299 -481 -579 -246 401 698 442 62
3105 62 -139 -441 -669 -345 344 604 422 207 -3 -412 -722 -414 205 534 430 333 145 -357 -744 -486 113
3126 113 389 383 460 316 -288 -719 -516 11 261 345 529 404 -195 -664 -504 -130 90 312 636 537 -113 -587
3148 -587 -494 -230 -98 232 655 564 -5 -483 -463 -354 -262 193 673 560 65 -304 -389 -477 -416 111 613 588 142
3171 142 -161 -323 -538 -511 65 576 538 250 58 -245 -583 -547 -2 453 445 320 250 -109 -635 -606 -64 375
3193 375 374 401 369 -24 -576 -662 -182 202 292 452 547 40 -565 -594 -204 -17 152 478 649 137 -534 -585 -253
3216 -253 -110 5 468 693 170 -383 -449 -361 -266 -70 477 704 231 -278 -354 -335 -417 -155 439 715 321 -142
3238a42r7j35j44K87O25K36k82k97j99k42k12L03O10K30k20j40j44m08k93L13
3258c51N54K34p4r0j16m78l17K34M89J99P7P7k01n06l60K20M00J73J54J84j64
3279C38n25l84J10L20K15K27K53j46n64l10J9K04J36L68L02j22m60l53o5J04J33
3300b00M30L24p8l89l19j61p4J69M57L31k1k97k47k42j92J21M53M04l3j80j79
3321G7k93l19J00M40L74L4r0j88k98l11mL61L56J63l0j29l34l53n3K93L28K06
3343C30R9r3k91l95j45J69L31K50J65j3l45l27k25R5K72L34K41l6k67l42j91p2
3365d56J73M14L00L8k64k74k58j40J48L14L59R5j42k77k79k09P4L03L63J50n3
3386C79k22l46k52L2K27L62K46J6k28l48k29n8J04L20L59J05j71l62k40q6K7K66
$$ plain form
3238 -142 -239 -374 -518 -231 394 630 348 51 -148 -390 -602 -299 311 541 321 181 37 -371 -664 -351
3258 -351 203 437 363 273 157 -321 -638 -404 85 284 361 438 237 -269 -629 -409 -9 164 318 502 338
3279 338 -187 -571 -461 -141 74 301 554 408 -156 -466 -447 -243 -107 261 563 441 -19 -372 -437 -333 -200
3300 -200 230 554 476 87 -232 -393 -467 -298 159 490 469 172 -75 -317 -509 -388 65 469 436 256 77
3321 77 -216 -535 -435 5 379 413 323 135 -163 -474 -478 -117 239 402 372 243 -91 -444 -497 -204 124 330
3343 330 429 336 45 -350 -495 -326 5 255 420 407 62 -265 -490 -395 -123 211 452 416 149 -193 -384 -456
3365 -456 -283 131 431 469 205 -69 -327 -467 -319 -5 354 449 307 30 -249 -458 -384 -81 282 432 379
3386 379 157 -189 -441 -409 -182 180 426 442 214 -134 -363 -421 -317 3 362 467 296 -66 -306 -392 -365 -99
3408i9L66K43j68k50k87j87o0K33M37K39n8k57k40k40j43J77M56K59j0j87j97
3429B7k82k45J44M22K85M2q9j95l70k55R8M08K52R0O3j69l85l41R7L04K67P4J81
3452D23p7m26l94N5K51J72K17K33o7m36l21jJ24J23K54L46%m22l78j6L6J15K65
3475G6L74J7l74k63j35p5K3L70M34K2l21k17j37j87m3M04M31L8k23j77j61l16
3497d40o8M11M04O0q1o4k80l86r5M05L37Q1M4J3l13m36j22L71K77R3J01Q6k74
3520A24n15p1K66J64J27K76J44l68m87j15K36O6J02L69K40l32m83r8Q4J2J46M46
3542C33K51l52m00p9J2j35J48N37K83k98l59j03p9k04J78M98L03k45k22j10k15
3563b58k57K09M90K38j22j13j09l30l01K02N04J55m1K3j06l97l38J76M39J67K0
$$ plain form
3408 -99 267 510 342 92 -195 -382 -442 -209 228 467 409 152 -88 -328 -471 -294 162 421 411 224 27
3429 27 -255 -500 -356 66 351 393 304 109 -261 -516 -418 -10 242 332 395 226 -159 -500 -403 -99 168 242 423
3452 423 346 -80 -474 -419 -168 4 221 454 387 -49 -370 -371 -247 -124 130 476 476 54 -324 -340 -304 -189 76
3475 76 450 467 93 -170 -305 -380 -357 13 447 469 148 -69 -206 -393 -436 -32 399 437 214 37 -124 -440
3497 -440 -508 -97 307 367 286 222 -58 -444 -539 -134 203 284 328 341 28 -408 -530 -159 118 211 312 398 124
3520 124 -391 -462 -196 -32 95 371 515 147 -340 -455 -219 -153 -51 318 558 226 -257 -355 -271 -259 -113 333
3542 333 584 232 -168 -247 -235 -370 -222 315 598 300 -59 -162 -241 -445 -267 231 534 289 67 -43 -258
3563 -258 -515 -306 184 422 300 187 78 -252 -553 -351 153 308 267 290 184 -213 -551 -375 64 231 251
3584B51P3m9m92l11J99K94J29J31J99r3m61l19J29J81J22K35K67r2m58k89J7J20
3606b17J07K83L13p5m04k91rj3Q7L44L23j7l37k43j17r5L0L68L80lk89j79j27
3629a81k40LM06L86J2j76j29j90l30kL50L56O0p3n8l09l13k4L37K90J04M1l0k94
3653dm16j6K68K41J34J44j1l13l62n5J57J86K07K04K6k84l31j63Q6J35K48K69
3675C50O0k39l21j39l3P5K42L28J45k44k96j93p8L8K43L42J16j09k45k00j88j1
3697c57K23L19J87n2j65k83k06o8J73L44K41m1q2k53k83j36J74K64K68Q2m4k41
3719F4k52j93M7K72K81J56k9k31k64k06J2K16K72J71L2j46k57k43j01J46K89K58
3741B94M3q2k25k41j83Q9K83K41J23n9j84k64k29M9K77K12J47N9j35l46k54RK43
$$ plain form
3584 251 324 275 -217 -528 -329 -35 94 225 424 331 -130 -449 -320 -139 -17 218 485 393 -65 -354 -337 -217
3606 -217 -110 173 486 411 7 -284 -293 -306 -219 125 448 431 94 -149 -266 -361 -331 37 417 414 125 -54 -181
3629 -181 -421 -418 -12 374 386 210 81 -109 -439 -441 -91 265 325 252 194 -115 -428 -452 -115 175 279 320 290 -4
3653 -4 -420 -436 -168 73 207 351 340 27 -335 -390 -233 -47 160 364 390 106 -225 -388 -302 -167 81 350
3675 350 410 171 -150 -289 -322 -247 -5 323 468 224 -72 -265 -343 -305 -62 280 396 287 42 -158 -346 -357
3697 -357 -134 185 372 320 155 -128 -334 -402 -229 115 356 315 233 -20 -303 -439 -265 -1 267 349 305 64
3719 64 -188 -381 -334 -62 219 375 346 115 -149 -355 -343 -127 145 316 348 202 -55 -298 -399 -253 36 294
3741 294 337 255 30 -211 -394 -305 -22 219 342 283 99 -165 -394 -345 -68 144 291 350 215 -131 -385 -376 -133
3764a33J84J89J20q5l17k76o8J57J94K33J93l9l02l26n5Q5J38K21K87jl18k65
3786a84q6pL0L17L07L0k47k59j33j10O3K70L50M3j88j77j87j76J1K66L49O6j40
3809B08r8k04k70l3K85L23Q8m6n0k40l26n5K89K71O0R2j3k43l72n0K19K11P9J75
3833C00O6k59l74j35J76J77J08K71R6k71m09r1J21R5R2L47J47k50l80o2jm7J70
3856a13M20J43k44k88p7o2j32J36M88J72k45k19m4j62j88J72M68J60j34j61n1
3877C9k51k45J86M16J92j04k1r6k92k82J59M09J90o3J8n1l57l30J60K95J83M2
3899A97J35r9l59l09J32K25J12J65J85p3l69l03J15J22P0K00K58p1l83k10L0J7
3921b13N6K90K96j07l03j95jj20PL55L70r9l02j14n4j76j4L44L53m2k07j15j24
$$ plain form
3764 -133 51 240 360 275 -42 -318 -386 -229 -35 198 391 352 50 -276 -331 -246 -108 113 400 399 81 -184
3786 -184 -270 -277 -247 70 377 407 160 -99 -232 -342 -279 -9 341 384 196 19 -168 -344 -333 -67 282 348 208
3809 208 110 -94 -364 -397 -112 211 299 253 203 -37 -363 -418 -129 142 202 294 281 38 -334 -384 -165 46 125 300
3833 300 366 107 -267 -402 -226 -49 59 330 426 155 -254 -345 -224 -129 -37 310 457 207 -173 -235 -236 -283 -113
3856 -113 307 450 206 -82 -159 -221 -353 -217 271 443 198 -21 -65 -227 -415 -243 225 385 251 90 39
3877 39 -212 -457 -271 145 337 233 212 116 -176 -458 -299 110 300 237 255 204 -153 -483 -323 -28 155 197
3899 197 332 233 -126 -435 -303 -78 34 199 384 311 -58 -361 -246 -124 -54 146 404 333 -50 -260 -230 -213
3921 -213 -157 133 429 322 19 -176 -177 -297 -290 65 435 336 34 -80 -134 -310 -324 20 373 331 124 9 -115
3944a15k13j6L21L18J3q1n7k19l17n8L65K68%J8Pk34l69%K24K22J20P8K7k84l19
3969c01n2K23J49N4K30Q3k91l92j8J21J27R8K81J07k70l47l9L1L3J56L08J23k59
3992A55k58j10k5k6K05K90J63k00k34j20r7m5J88L17J55j38j45j52j88r9K02L28
4014A66J39m5q7j90k00j66K00K87J53K8p6j30l02j07Q9K95Q7J31Oj69k78j86Q9
4037b66K17J63J08Q4j12l28j72L7J11K16J69P8p7k90k18l8J16J59K01J71j03j88
4059C8k34j00N5J49K55J40l9j66k29j57J9J09K30J93N8j69k43j64k3J09J78K01
4081B10R3m2k45k36q5Q5K08J80J28k0k23k25j13L8J21K19K20m7j53k19j10l0N8
4104a88K12K50O5j90j81j63q7L5K11K81N6j06j53j45k02J6K13K53J04p4q3j81
$$ plain form
3944 -115 -328 -344 -23 295 308 227 170 -49 -366 -424 -59 209 209 227 234 0 -369 -369 -145 77 197 275 302 18 -301
3969 -301 -353 -130 19 73 303 386 95 -297 -315 -194 -67 31 312 419 149 -198 -237 -206 -173 -17 291 414 155
3992 155 -103 -213 -238 -264 -59 231 394 194 -40 -160 -257 -302 -114 203 358 220 75 -77 -265 -364 -162 166
4014 166 305 260 173 -17 -217 -383 -183 104 257 285 209 79 -223 -330 -241 54 141 272 278 109 -169 -355 -266
4037 -266 -49 114 222 306 194 -134 -306 -269 -158 58 227 305 228 -62 -280 -318 -202 -43 158 329 226 38
4059 38 -196 -296 -241 -92 163 303 264 98 -131 -288 -269 -160 70 263 321 152 -91 -255 -278 -169 9 210
4081 210 303 261 16 -220 -305 -220 -12 168 296 276 53 -172 -285 -247 -126 93 313 266 113 -106 -216 -246 -188
4104 -188 24 274 339 149 -32 -195 -282 -247 -36 245 301 195 42 -103 -305 -289 -76 177 281 207 124 -57
4126e7k38m1K14K30J28K3p9k04k10q8J76J48J74R2J7k14l08o3J21J52J16J79N8
4149C26k16l05o5P1P2J60K01R1k14k15j23J2m0J98K48J49j76k87n3n3l2J61K90
4172B00J27j56j86q2q9j56J83L77R0j51j05n8j82j68J35L62J13o7o2l5k65j83
4194c58J20L36R5l9M0n5k68k70J51K89Q1KJ44o6l11k67J13K60N2O8J41J7l29k77
4218c31Q6J60L0J41K28l6l09k04L8O9J6J70K71o0k75j70kj1j4K22L24p4k57j11
4242i9k5j09j4K80K67k8k11q6n0j94j9K92K50jj68j1r3k51o7K89K39k9l8M4j92
4267b4k49l9K46J88k9J19jj92l27nK39J06L0J44J20k63l29rJ61P5L7K23Q2k29
4291G4k77k0Q4L2P0K43J22j93k79n9M2j3Q0L30Q6j73k18m8o2n9J22L05J28k16
$$ plain form
4126 -57 -295 -336 -122 108 236 259 180 -24 -234 -322 -146 2 176 268 285 71 -237 -300 -179 -27 89 268 326
4149 326 110 -195 -260 -189 -117 43 244 335 121 -94 -217 -205 -245 -47 201 350 174 -113 -166 -219 -251 -90 200
4172 200 327 171 -15 -97 -186 -342 -159 218 308 157 52 -6 -188 -356 -221 141 254 187 125 90 -175 -358
4194 -358 -238 98 193 154 194 139 -129 -399 -248 41 122 124 268 202 -109 -376 -263 -3 49 117 258 275 -54 -331
4218 -331 -245 -85 -55 86 314 278 -31 -235 -197 -128 -112 58 329 269 -6 -176 -178 -189 -203 19 343 269 12 -99
4242 -99 -124 -233 -247 33 300 272 61 -25 -75 -269 -288 4 254 253 85 74 -19 -270 -337 -48 191 162 124 168 -24
4267 -24 -273 -312 -66 122 93 212 211 19 -308 -313 -74 32 62 206 326 63 -266 -275 -114 -39 -2 221 303 74
4291 74 -203 -223 -139 -107 -37 206 328 135 -144 -203 -161 -174 -94 236 322 149 -69 -117 -179 -238 -116 189 317 101
4315A01r4k8j19j60J34L07J38j42p2p9j53j24J37K86R6p3k1l8k38j51J01K48P6
4338A32J6K6n5k54j50P5K19P1M7Q0o6k29j78P6J41N7J22J04o4k36j60N1N2N5J82
4363A14J59p6k45j27RQO8J48J91o4j71j39j8j6J5J87J86kj69j15p5m7J9J98J78
4388B16pj13p9j41q2J9J79J48K7nj45j28j00K4J47J49R3j9j03j56j05l1J11J63
4412F2R9N4q5j55j42n0J01J37J13R7r6r1j61p1K3J26J69N8l4r6j23j28k8J29J60
4437F8J25qo9j53j03n2N3J98Q9O0m5r6j97p0N7R7J30P3J9q5k15j13Q5J04R1J04
4463A47M9q4k03j05M3M1R3J29J06q8j60q4m0J8Q2J60J15o8j67o2p6j1N5K10J30
4488B30j05q2r2o6p6O5K17R9n6n1k4j67j37R6K06J03k0k3j0j88j73J25J69O7J1
$$ plain form
4315 101 7 -21 -140 -300 -166 141 279 137 65 -14 -167 -291 -154 132 228 155 134 96 -142 -293 -192 56 132
4338 132 148 174 119 -135 -285 -210 9 80 127 207 141 -88 -266 -190 -49 8 130 234 170 -66 -226 -175 -123 -68 114
4363 114 273 197 -48 -175 -166 -158 -90 58 249 185 14 -125 -143 -159 -144 43 229 227 58 -57 -132 -179 -160 38 216
4388 216 209 96 17 -124 -206 -187 -8 140 167 162 17 -111 -211 -187 -40 109 202 183 80 -76 -181 -212 -101 62
4412 62 161 215 130 -25 -167 -217 -116 21 134 231 135 44 -117 -188 -165 -39 130 188 154 58 -65 -193 -221 -92 68
4437 68 193 185 116 -37 -140 -192 -139 59 148 208 163 67 -130 -200 -143 -46 84 157 176 91 -124 -237 -152 -48 43 147
4463 147 196 112 -91 -196 -153 -112 -19 110 216 128 -32 -116 -156 -138 -56 104 219 151 -16 -78 -154 -165 -110 100 230
4488 230 125 43 -49 -115 -191 -126 91 190 134 83 59 -108 -245 -149 57 160 140 117 107 -81 -254 -129 40 107 118
4513A18K4Kk24j73R1J68M8J2J41j9k79j60J00J58n5P1J98Nk69k07J47O2k9J03
4537C3J86J7k82j30R7L8r6J23K61J6k31j26J3rr5J86K19J1k09q3M8j12o1J64K52
4562B30l6j65k2lj52q2J99K11m4q6M5n0k32m3K19J27l5l4Q1p8k58m3K65J03j19
4587bR6Q5j00k85m0K29L4%J00Q3j32k39k5J61J4J2J58J09j70k27%J04o7L0K34
4612A62R1j74j79kM9o7K1K32R4j60j25J6j7j51J08K87M2j72j15R7j00j80J16K63
4636A36K5j12k7N6j36j69R8K35L6j13N3O0k29j53J26K00J7q1J12M8k73j34R8J69
4660D2j0J2J12Pk18j62J66N1n6J03J31k2k21j19J03N6k7R5J62o9j81p7N1Jn6J84
4686E8J56r5j67k1jn2j9J81J33n0j50l2J7r5l8J81J36k6q4km8j34nJ28J50k8k8
$$ plain form
4513 118 142 144 -80 -253 -162 6 54 66 207 188 -91 -251 -151 7 -48 23 221 226 -43 -250 -103 -41 -70 33
4537 33 219 236 -46 -176 -79 -41 -137 -14 247 263 32 -94 -81 -90 -185 1 220 231 22 -61 -13 -125 -186 -22 230
4562 230 194 29 7 4 -148 -230 -31 180 136 50 95 45 -187 -230 -11 116 81 47 128 50 -208 -251 14 117 -2
4587 -2 94 179 79 -206 -246 -17 17 17 117 200 68 -171 -196 -35 -21 -9 149 258 88 -139 -139 -35 -102 -72 162
4612 162 253 79 -100 -102 -53 -120 -99 133 227 67 -58 -42 -59 -210 -102 185 227 55 -60 37 -63 -243 -127 136
4636 136 161 49 22 78 -58 -227 -129 106 142 29 82 142 -87 -240 -114 86 103 22 134 182 -91 -225 -127 42
4660 42 32 44 156 163 -55 -217 -51 0 -56 47 178 156 -65 -184 -81 -25 -52 43 205 136 -45 -122 -71 -70 -126 58
4686 58 214 119 -48 -69 -70 -122 -141 40 173 123 -27 -59 -42 -137 -175 6 142 116 32 30 -18 -152 -157 -29 121 93 65
4713F5j7o9j16l4J76O9JRM5j16j66j0J13R7j8M0O8j34j08m1R9M3N7O3Jo8j64j9
4741a34O8J8M4R0L5o1j15l8J7j3J28N4Op4p8k8k4L2L7J08K5k9m4q9p3J9P7J12
4769G0L7pr2q4k8l1Q7J00O8k4j8j25p6kO8O1Q3M7m0j08l7o9J5J00M2J04m7o1p7
4798d4n7J4L9R4N1l4k9p1m3k8M2J26M7k9l3j6j04r6O7J05O3nJ1l9p9r7L3J15N7
4827F0LK1J1j29j19L4J39MJ3P1Qj43j05L7Q8j9L3J51l4j66j02O9N1m4O0J77j9
4854A50j51q5M7J9r0R7J73j0j85m6P8n2q4J27J76n1j40mJ9n8p6J20J90l6j36J1
4880CK7j31o8J17J89p1n2PK3j83l4J57J28q5pO4k0k08k8J82Q4o6l5J50n0j97l4
4907a38J35M9r2J33R2j25j66%J13k8k9J29J10j06j91L8N5l4l9J82J00j36j33L7
$$ plain form
4713 65 48 -21 -137 -171 5 74 75 84 129 13 -153 -163 -50 47 29 69 137 3 -105 -146 -47 -4 53 116 117 49 -115 -134
4741 -134 -66 -48 -4 86 121 60 -55 -93 -76 -89 39 93 99 25 -53 -81 -105 -73 -36 72 97 68 24 -65 -138 -119 -42 70
4769 70 107 100 8 -76 -104 -135 -48 52 120 96 78 -47 -123 -125 -57 4 87 134 94 -14 -51 -120 -105 -5 37 141 94 33 -44
4798 -44 -101 -87 -48 46 97 63 34 -37 -80 -108 -66 60 107 78 45 29 -75 -171 -104 1 64 59 70 31 -48 -145 -112 3 60
4827 60 63 84 95 -34 -153 -119 20 24 37 108 116 -27 -132 -95 -7 -26 7 158 124 -42 -144 -75 -24 -68 -8 169 150
4854 150 -1 -86 -39 -20 -110 -13 160 150 -35 -81 -3 -55 -139 -12 164 113 -27 -31 -12 -70 -146 -26 164 128 -8 3
4880 3 30 -101 -169 -52 137 66 14 21 44 -139 -173 -16 112 27 20 84 64 -144 -172 10 94 28 -7 143 93 -104 -138
4907 -138 -3 46 -46 87 179 54 -112 -112 1 -27 -56 73 183 77 -114 -76 -21 -55 -94 88 188 52 -81 -44
4931d4M9r3k2K01R5j55j02P9%j49nK46O1j68l9J12o6j81P2K23J1j19mJ00j17j96
4957b11Q8K50k1q9K4R1j75j58J10J53J4j18J35J4j40j51J01J34l6o7J59N7k28
4980f4j19J41O9o1K7J26J3k02p4J20L7q5P1J49j9k15lN9Qp3Q9J65m7j48j6O0o3
5007e5o2J05J66n9j31JP1j05p6J30J89p7r4J8K4j68l9J50Q8k6n3M8k7j25j3Q9
5033c1R7j1k4O6q2j18m8J43N6l9J7R5o7j59K9R0j3qP2M2p6j07l8Q5j3JJ14O0q6
5062D7j10JL4j5k0J18R6p8r5j3no7P3J10K3o3l5Ln0n1O4R9K5j0n5lp6n9O8O7M7
5093G0j1k9Pj07j8K1P9K0J3J9j6r4m1J1O7L1%P2o3m9p6RN0M7L7L7k7o5p6J3K8
5124d1L5M8K4rq1k4o0L6N8P3JPk9m7p4pP0L6QM1k5l3p7J9L5J9M4L6j7m1r7j2O9
$$ plain form
4931 -44 5 -88 -110 91 186 31 -71 8 8 -141 -146 100 161 -7 -46 66 0 -181 -109 114 125 6 2 102 -15 -211
4957 -211 -123 127 106 17 41 132 -43 -201 -91 62 76 -42 93 107 -33 -184 -83 51 15 -52 107 164 -64
4980 -64 -183 -42 27 -34 -7 119 132 -70 -144 -24 13 -72 -1 148 129 -86 -89 -30 -22 -95 -6 159 112 -36 -52 8 -55
5007 -55 -117 -12 154 95 -36 -35 36 -69 -145 -15 174 97 3 21 45 -123 -162 -12 76 50 -3 45 18 -107 -120 -31
5033 -31 66 55 31 97 15 -103 -151 -8 48 9 26 121 54 -105 -76 14 1 -7 65 107 31 -76 -114 -29 -42 -41 73 133 47
5062 47 -63 -62 -28 -43 -63 55 151 73 -22 -35 -40 -107 -34 76 99 36 1 4 -46 -97 -33 66 91 81 26 23 -53 -112 -44 23 70
5093 70 59 30 37 -70 -88 -67 12 32 45 64 48 -46 -87 -76 -9 22 22 94 31 -18 -94 -85 -35 12 49 86 59 -6 -82 -69 -41
5124 -41 -6 42 66 57 -24 -48 -108 -72 -14 59 60 67 38 -9 -83 -90 -20 16 24 65 40 7 -70 -51 -16 3 47 83 66 25 -72 -84 -15
5157a5j0M9P5j5q4n8Rkj6O1P2L1q6k4j3k2j1K4J19Lo2l6Nn8m5O5J19ko9j7M7r5
5189f1n0Q1J12Qj04K9M4j33p6J19R0Jm6K4Jm8j19P3J46l9j8L2Pj28r5J02O0OJ7
5218C5Q6m3j32l9N0Q6r4O7R0k4j50l1N8olR8Q2q9j06K1O1r1MJ07J01q9j05L4L
5247a9n7k6J31Q9p3n2oK2j01k6J49P2q3rN0k9j52M5J52J8r6MQ0o2j36PJ64J1q5
5276a8L9O5q0j49P9J29l8o5J23N9j39j58O6J33n0k8P0R2j27j19P7O0n3l8J68L0
5302A28j32p3N1O2q6j8J83J7j41n6M5J1p6M9J49k2q9m9J07q0j00R1J19pr9RK7
5329B0m3j15J06J25j3j03O0N2j30r5R2J26k4o3Q3k8j09q4J00J04m7j4O5j3j04
5354e2m0O4M5q0N9J14p7j20PO8L1o6Q7N1m3j04k4N3ml8Q8J01o8j08K0M2n4k5J07
$$ plain form
5157 -15 -25 24 99 84 0 -58 -49 -51 -67 -6 66 97 11 -13 -26 -48 -59 -35 84 87 25 -11 -6 -64 -109 -44 75 73 4 -13 34 -61
5189 -61 -111 -30 82 90 -14 15 59 -74 -150 -31 59 60 14 38 39 -9 -128 -55 91 52 34 66 73 -55 -150 -48 12 18 35
5218 35 121 78 -54 -93 -43 43 -51 16 106 82 -68 -99 -41 -47 -50 48 130 41 -65 -44 17 -74 -70 37 138 49 -56 -22 -19
5247 -19 -76 -102 29 118 45 -7 -13 9 -92 -118 31 103 20 11 61 32 -120 -75 77 95 -1 3 83 21 -115 -108 56 67 -18
5276 -18 21 86 6 -143 -64 65 27 -38 85 144 5 -153 -87 46 -4 -32 38 130 3 -116 -39 21 -32 -70 98 128
5302 128 -4 -77 -26 36 -50 -68 115 132 -9 -65 -20 -9 -85 -36 113 91 2 -47 60 -20 -120 -29 90 83 -16 -7 20
5329 20 -23 -138 -32 93 80 -23 37 89 -41 -136 -44 82 58 -5 78 50 -59 -143 -43 61 14 0 65 52 -52
5354 -52 -92 -28 17 -63 -4 110 33 -87 -80 -12 19 -47 40 91 48 -56 -80 -27 -31 -69 19 120 52 -56 -36 6 -48 -73 34
5383C4Q6o1r7JL8m3j7J07O5q3n6M2j9o6QQ6M3n1JJ8n3q1K5J12K5k4j4J1m2o3K1
5414d7M5J3j2L3Qo1o8M4J2J7LO3K0j14m4L7M3nj0O7L5p7n4j9N2j7L5O6Pn2n4J8
$$ plain form
5383 34 120 59 -38 -37 1 -42 -59 48 113 30 -26 16 -3 -69 -61 25 68 17 18 36 -17 -98 -73 39 64 40 26 37 -5 -68 -47
5414 -47 -2 11 -1 32 40 -21 -89 -45 -33 -16 -13 50 70 -44 -88 -51 -8 -13 -23 44 79 2 -52 -71 -19 -36 -1 65 72 20 -34 -16
$$ [...]
8191a9
##END NTUPLES=NMR FID
##END=
