##TITLE=1H_PR179_rm
 D2O, 8 sc, 
 25.7.2019
##JCAMPDX= 6.0         $$ Bruker NMR JCAMP-DX V2.0
##DATA TYPE= NMR FID
##DATA CLASS= NTUPLES
##ORIGIN= UXNMR, Bruker Analytische Messtechnik GmbH
##OWNER= root
$$ XWIN-NMR		Version 3.5
$$ Thu Jul 25 13:54:08 2019 Russian Standard Time (UT+4h)  she@DPX200
##.OBSERVE FREQUENCY= 200.13155
##.OBSERVE NUCLEUS= ^1H
##.DELAY= (6, 6)
##.ACQUISITION MODE= SIMULTANEOUS
##.ACQUISITION SCHEME= undefined
##.AVERAGES= 8
##.DIGITISER RES= 18
##SPECTROMETER/DATA SYSTEM= spect
##.PULSE SEQUENCE= zg30
##.SOLVENT NAME= D2O
##.SHIFT REFERENCE= (INTERNAL, D2O, 0, 15.7039)
##AUDIT TRAIL= $$ (NUMBER, WHEN, WHO, WHERE, WHAT)
$$ ##TITLE= Audit trail, XWIN-NMR		Version 3.5
$$ ##JCAMPDX= 5.01
$$ ##ORIGIN= Bruker BioSpin GmbH
$$ ##OWNER= she
$$ F:/spectra/data/she/nmr/H-F/1/audita.txt
$$ ##AUDIT TRAIL=  $$ (NUMBER, WHEN, WHO, WHERE, WHAT)
(   1,<2019-07-25 13:53:12.48 +0400>,<she>,<DPX200>,
      <created by zg, POWCHK disabled, PULCHK disabled
       configuration hash MD5:
       00 E9 B6 7A A2 85 ED C7 34 08 36 98 17 FE 4E 26
       data hash MD5: 16K
       CE 65 C8 2D 5C 24 6E 60 63 D6 6F CA 5C 6B 27 EC>)
$$ ##END=
$$ 
$$ hash MD5
$$ A0 6B 7E 6A FC E0 66 61 9E B6 21 6A 9C 0A 3D 9A
##$RELAX= 
##$RELAX= 
##$RELAX= 
##$RELAX= 
##$RELAX= 
##$RELAX= 
$$ Bruker specific parameters
$$ --------------------------
##$DU= <F:/spectra>
##$EXPNO= 1
##$NAME= <H-F>
##$PROCNO= 1
##$TYPE= <nmr>
##$USER= <she>
##$AMP= (0..31)
100 100 100 100 100 100 100 100 100 100 100 100 100 100 100 100 100 100 
100 100 100 100 100 100 100 100 100 100 100 100 100 100 
##$AQSEQ= 0
##$AQ_mod= 1
##$AUNM= <au_zg>
##$AUTOPOS= <>
##$BF1= 200.13
##$BF2= 200.13
##$BF3= 200.13
##$BF4= 200.13
##$BF5= 200.13
##$BF6= 200.13
##$BF7= 200.13
##$BF8= 200.13
##$BYTORDA= 1
##$CFDGTYP= 0
##$CFRGTYP= 5
##$CHEMSTR= <none>
##$CNST= (0..31)
1 1 145 1 1 1 1 1 1 1 1 1 1 1 1 1 1 1 1 1 1 1 1 1 1 1 1 1 1 1 1 1 
##$CPDPRG= <>
##$CPDPRG1= <>
##$CPDPRG2= <>
##$CPDPRG3= <>
##$CPDPRG4= <mlev>
##$CPDPRG5= <mlev>
##$CPDPRG6= <mlev>
##$CPDPRG7= <mlev>
##$CPDPRG8= <mlev>
##$CPDPRGB= <>
##$CPDPRGT= <>
##$D= (0..31)
0 1.2 0 0 0 0 0 0 0 0 0 0.03 0 0 0 0 0 0 0 0 0 0 0 0 0 0 0 0 0 0 0 0 
##$DATE= 1564048391
##$DBL= (0..7)
120 120 120 120 120 120 120 120 
##$DBP= (0..7)
150 150 150 150 150 150 150 150 
##$DBP07= 0
##$DBPNAM0= <>
##$DBPNAM1= <>
##$DBPNAM2= <>
##$DBPNAM3= <>
##$DBPNAM4= <>
##$DBPNAM5= <>
##$DBPNAM6= <>
##$DBPNAM7= <>
##$DBPOAL= (0..7)
0.5 0.5 0.5 0.5 0.5 0.5 0.5 0.5 
##$DBPOFFS= (0..7)
0 0 0 0 0 0 0 0 
##$DE= 6
##$DECBNUC= <off>
##$DECIM= 24
##$DECNUC= <off>
##$DECSTAT= 4
##$DIGMOD= 1
##$DIGTYP= 9
##$DL= (0..7)
0 120 120 120 120 120 120 120 
##$DP= (0..7)
150 150 150 150 150 150 150 150 
##$DP07= 0
##$DPNAME0= <>
##$DPNAME1= <>
##$DPNAME2= <>
##$DPNAME3= <>
##$DPNAME4= <>
##$DPNAME5= <>
##$DPNAME6= <>
##$DPNAME7= <>
##$DPOAL= (0..7)
0.5 0.5 0.5 0.5 0.5 0.5 0.5 0.5 
##$DPOFFS= (0..7)
0 0 0 0 0 0 0 0 
##$DQDMODE= 0
##$DR= 18
##$DS= 0
##$DSLIST= <SSSSSSSSSSSSSSS>
##$DSPFIRM= 0
$$ [...]
##$SUBNAM2= <"">
##$SUBNAM3= <"">
##$SUBNAM4= <"">
##$SUBNAM5= <"">
##$SUBNAM6= <"">
##$SUBNAM7= <"">
##$SUBNAM8= <"">
##$SUBNAM9= <"">
##$SW= 24.9336996594482
##$SWIBOX= (0..15)
0 0 2 0 0 0 0 0 0 0 0 0 0 0 0 0 
##$SW_h= 4990.01996007984
##$TD= 16384
##$TD0= 1
##$TE= 0
##$TE2= 300
##$TE3= 300
##$TEG= 300
##$TL= (0..7)
0 120 120 120 120 120 120 120 
##$TP= (0..7)
150 150 150 150 150 150 150 150 
##$TP07= 0
##$TPNAME0= <>
##$TPNAME1= <>
##$TPNAME2= <>
##$TPNAME3= <>
##$TPNAME4= <>
##$TPNAME5= <>
##$TPNAME6= <>
##$TPNAME7= <>
##$TPOAL= (0..7)
0.5 0.5 0.5 0.5 0.5 0.5 0.5 0.5 
##$TPOFFS= (0..7)
0 0 0 0 0 0 0 0 
##$TUNHIN= 0
##$TUNHOUT= 0
##$TUNXOUT= 0
##$USERA1= <user>
##$USERA2= <user>
##$USERA3= <user>
##$USERA4= <user>
##$USERA5= <user>
##$V9= 5
##$VALIST= <valist>
##$VCLIST= <CCCCCCCCCCCCCCC>
##$VD= 0
##$VDLIST= <DDDDDDDDDDDDDDD>
##$VPLIST= <PPPPPPPPPPPPPPP>
##$VTLIST= <TTTTTTTTTTTTTTT>
##$WBST= 1024
##$WBSW= 4
##$XGAIN= (0..3)
0 0 0 0 
##$XL= 0
##$YL= 0
##$YMAX_a= 687059
##$YMIN_a= -954057
##$ZGOPTNS= <>
##$ZL1= 120
##$ZL2= 120
##$ZL3= 120
##$ZL4= 120
##$ABSF1= 10
##$ABSF2= 0
##$ABSG= 5
##$ABSL= 3
##$ALPHA= 0
##$AQORDER= 0
##$ASSFAC= 0
##$ASSFACI= 0
##$ASSFACX= 0
##$ASSWID= 0
##$AUNMP= <proc_1d>
##$AZFE= 0.1
##$AZFW= 0.1
##$BCFW= 1
##$BC_mod= 2
##$BYTORDP= 1
##$COROFFS= 0
##$CY= 11.3945322036743
##$DATMOD= 1
##$DC= 2
##$DFILT= <>
##$DTYPP= 0
##$F1P= 18.9103706918063
##$F2P= -1.10871071338519
##$FCOR= 0.5
##$FTSIZE= 0
##$FT_mod= 4
##$GAMMA= 1
##$GB= 0.15
##$INTBC= 1
##$INTSCL= 1
##$ISEN= 128
##$LB= 0.24
##$LEV0= 0
##$LPBIN= 0
##$MAXI= 10000
##$MC2= 0
##$MEAN= 0
##$ME_mod= 0
##$MI= 1.114404
##$NCOEF= 0
##$NC_proc= 0
##$NLEV= 6
##$NOISF1= 3.799351
##$NOISF2= 2.8
##$NSP= 1
##$NTH_PI= 0
##$NZP= 0
##$OFFSET= 15.70392
##$PC= 1
##$PHC0= -8859.948
##$PHC1= 1.40097
##$PH_mod= 1
##$PKNL= yes
##$PPARMOD= 0
##$PSCAL= 0
##$PSIGN= 0
##$REVERSE= no
##$SF= 200.130013532006
##$SI= 16384
##$SIGF1= 3
##$SIGF2= 2
##$SINO= 400
##$SIOLD= 16384
##$SREGLST= <1H.CDCl3>
##$SSB= 0
##$STSI= 0
##$STSR= 0
##$SW_p= 3612.71676300578
##$SYMM= 0
##$S_DEV= 0
##$TDeff= 0
##$TDoff= 0
##$TI= <>
##$TILT= no
##$TM1= 0
##$TM2= 0
##$TOPLEV= 0
##$USERP1= <user>
##$USERP2= <user>
##$USERP3= <user>
##$USERP4= <user>
##$USERP5= <user>
##$WDW= 1
##$XDIM= 8192
##$YMAX_p= 0
##$YMIN_p= 0
$$ End of Bruker specific parameters
$$ ---------------------------------
##NTUPLES= NMR FID
##VAR_NAME=  TIME,          FID/REAL,        FID/IMAG
##SYMBOL=    X,             R,               I
##VAR_TYPE=  INDEPENDENT,   DEPENDENT,       DEPENDENT
##VAR_FORM=  AFFN,          ASDF,            ASDF
##VAR_DIM=   8192,          8192,            8192
##UNITS=     SECONDS,       ARBITRARY UNITS, ARBITRARY UNITS
##FACTOR=    0.0002004,     1,               1
##FIRST=     0,             0,               0
##LAST=      1.6414764,     0,               0
##MIN=       0,             -954057,         0
##MAX=       1.6414764,     687059,          0
$$ Real data points
##PAGE= N=1
##DATA TABLE= (X++(R..R)), XYDATA
0 0 0 0 0 -8 8 -8 8 -16 24 -30 32 -41 57 -64 81 -102 118 -144 168 -199 235 -268 315 -364 418 -481 546
27 546 -622 708 -794 899 -1010 1130 -1268 1415 -1577 1755 -1947 2166 -2398 2655 -2944 3256
43 3256 -3604 3995 -4429 4923 -5478 6117 -6863 7732 -8781 10056 -11657 13739 -16562
56 -16562 20641 -27075 38800 -67103 276741 36533 -714446 -461160 -109111 -46121 -115029
67 -115029 293683 687059 465512 -278336 -654107 -447904 -87139 57141 234668 480506
77 480506 464711 -2886 -460470 -508204 -256310 -40252 176297 457164 543741 154208 -392104
88 -392104 -552018 -282311 -23130 76359 250569 504165 418626 -126379 -608630 -523573 -77389
99 -77389 204772 233998 286740 361570 160433 -314152 -603095 -394001 72774 369404 386769
110 386769 273100 96611 -163060 -399579 -415363 -167808 176648 412740 425284 199341
120 199341 -154178 -412793 -405513 -175045 95703 286387 372283 304779 35736 -314757 -479179
131 -479179 -317026 29189 301833 376345 281094 75008 -181151 -374804 -375613 -153248 172624
142 172624 403918 393054 142856 -176019 -356875 -327676 -166944 39275 257886 404304
152 404304 320554 -17909 -364585 -428258 -205681 62242 218219 296368 305521 140332 -189492
163 -189492 -432901 -360334 -52895 220419 320343 288245 153229 -91176 -335310 -380774 -175609
174 -175609 109454 292223 328085 227055 -9964 -289064 -400021 -235720 54247 246950
184 246950 290646 246915 103021 -163005 -392896 -352481 -49910 240592 315064 232896 112051
195 112051 -59405 -281024 -380728 -202964 132973 340053 302613 137299 -38564 -210807
205 -210807 -328851 -262268 1957 268245 339031 215393 19698 -170778 -307732 -295013
215 -295013 -84742 193233 329121 257551 79718 -105445 -259858 -313903 -177674 101156
225 101156 313319 305988 132291 -64368 -212391 -288784 -229616 -8307 244400 333362 207602
236 207602 -8686 -185145 -275468 -250802 -83633 159782 312168 263079 68158 -133505
246 -133505 -257560 -268588 -143211 85497 278667 295123 136535 -71754 -221259 -268409
256 -268409 -191325 6014 225597 310115 199624 -10984 -185314 -259797 -221841 -66448 152859
267 152859 295431 250906 57485 -142366 -248171 -239502 -122124 77385 257288 283090 130303
278 130303 -84817 -226432 -248670 -162102 10395 201830 289068 194956 -14568 -193293 -252933
289 -252933 -194193 -47079 141016 270496 239577 58712 -143726 -245974 -220317 -97790
299 -97790 79384 235663 265378 128748 -83010 -226647 -236554 -138898 20594 185936 265962
310 265962 187954 -10908 -192946 -249053 -175307 -28560 134902 245161 224591 62331 -138349
321 -138349 -244737 -209972 -77485 86334 217031 241837 123699 -74560 -220973 -232096
331 -232096 -125036 33858 178617 242779 172493 -8829 -185061 -243504 -166106 -17440 134196
342 134196 226813 205181 58028 -132178 -238620 -202274 -65637 91584 203811 221076 115610
353 115610 -67860 -212910 -226523 -114248 45154 175045 223510 157805 -4920 -172626
363 -172626 -235598 -160048 -6456 138289 214366 186480 52921 -121898 -227538 -196192 -58860
374 -58860 96748 197173 202626 102568 -64649 -202296 -219278 -109277 50130 172101 208059
385 208059 141638 -7655 -163725 -226385 -154412 -1586 139993 203730 168894 44712 -114538
396 -114538 -215631 -188902 -54587 100111 192599 187534 90107 -62059 -189225 -208889 -105113
407 -105113 53174 171470 197268 126656 -11268 -152972 -213403 -148627 760 140773 197996
418 197996 155646 36236 -109198 -202245 -180367 -52359 100350 189148 176910 78450 -62272
429 -62272 -178057 -198500 -101684 52577 169708 189367 113707 -17198 -144839 -201000 -143491
440 -143491 -504 138791 193972 144827 25288 -107070 -189215 -170334 -51876 96754 186021
451 186021 170938 68581 -66528 -169484 -184710 -95021 50400 164577 184928 106817 -22728
462 -22728 -141222 -189238 -133225 1526 134667 188017 137426 18736 -106225 -179402 -159558
473 -159558 -48617 93920 181536 164320 60007 -70289 -162741 -171742 -88509 47446 158513
484 158513 179441 101600 -28453 -140422 -179022 -121665 4139 128783 179514 131281 15666
495 15666 -105880 -173735 -150560 -42138 93449 175324 155710 53062 -71195 -156388 -162766
506 -162766 -83405 46825 155271 174551 94241 -34080 -138421 -168854 -112359 5145 123269
517 123269 174579 128363 12309 -107386 -168614 -140463 -35301 91256 167538 149515 50882
528 50882 -70323 -152378 -156081 -77566 47570 151178 168190 88057 -36666 -134859 -160466
539 -160466 -105624 4492 117562 169967 125126 7628 -110607 -164126 -129915 -29562 86042
550 86042 157485 145052 51273 -70791 -152772 -151313 -68062 51879 144239 157732 84252 -33832
562 -33832 -130902 -157623 -101272 9508 118308 163686 116884 4171 -107384 -157156 -123535
573 -123535 -26791 84683 154109 139981 46215 -73464 -150148 -143317 -61016 52544 138602
584 138602 151017 80651 -34849 -130650 -153883 -94222 15403 117028 155876 109582 2239
595 2239 -104994 -153391 -119024 -22128 86978 151060 132850 40132 -74187 -145213 -136440 -56216
607 -56216 52837 135068 146810 76910 -38288 -130694 -148395 -85571 19245 112640 148049
618 148049 105156 3054 -104232 -152875 -114976 -14876 89565 144316 122989 37093 -70041
629 -70041 -140720 -135294 -54562 57037 136392 140211 67646 -40046 -124406 -141198 -83652 18303
641 18303 111927 146702 100156 -2399 -104611 -146989 -107636 -11978 87168 138601 118659 35027
653 35027 -69378 -139107 -132446 -50518 60250 134853 132885 59956 -40507 -117909 -135025 -82818
665 -82818 16474 112671 147982 96339 -10992 -106834 -137856 -96348 -11130 79451 134809 121103
677 121103 35707 -75426 -142744 -124146 -37825 61278 123975 124023 61931 -35748 -119515 -138408
689 -138408 -78724 26484 114861 138264 85453 -11678 -100064 -133182 -96667 -11196 81674 134771
701 134771 115962 29252 -77649 -139205 -117355 -31991 61426 117656 117857 61373 -32950 -118892
713 -118892 -140229 -74780 35104 117786 127953 72939 -11423 -88896 -127396 -101712 -14306 88766
725 88766 141420 107851 13769 -79992 -125054 -105487 -35884 52037 118456 124434 58914 -44952
737 -44952 -123597 -129310 -61427 35260 107521 121890 75875 -8857 -91989 -130180 -97000 -5736
749 -5736 91418 134811 99442 10923 -77228 -119754 -102298 -36026 50859 118908 124953 55036
761 55036 -51629 -125170 -120093 -50506 34758 96521 115388 80231 -3946 -97750 -137678 -90574
773 -90574 9844 94538 119575 85939 15914 -64617 -119548 -111472 -35729 64063 124551 111825
785 111825 40258 -49269 -110763 -114529 -56625 32333 102837 118318 72268 -13310 -96215 -127591
797 -127591 -84653 9240 92705 117921 82193 11400 -64225 -115636 -109115 -34753 67506 127440
809 127440 105907 28191 -52149 -101258 -105695 -60051 25513 106653 125955 67032 -28227 -99735
821 -99735 -112967 -71496 3887 80772 118643 90642 9711 -76127 -118213 -95777 -22392 63201
833 63201 115464 103274 34051 -51906 -106391 -105127 -51291 31474 102227 118495 64342 -27462
845 -27462 -99668 -111976 -66168 8606 77993 112591 88671 10838 -78580 -121148 -91092 -12691
857 -12691 65468 105770 94586 35973 -45801 -108031 -109761 -46729 42771 103689 106140 54018
869 54018 -24059 -90538 -111149 -70662 10648 86248 112525 77539 2059 -73998 -111565 -88623
881 -88623 -15463 65591 109125 92089 27701 -49484 -102704 -103138 -44920 41316 103174 104741 48695
894 48695 -28757 -88152 -104531 -67575 9841 86051 113551 74184 -5069 -76155 -104714 -80647
906 -80647 -15120 61522 108118 93774 24747 -55946 -102613 -93898 -37254 39046 97251 102544
918 102544 49826 -30803 -92122 -102245 -59503 14101 81891 107420 72009 -4788 -76965 -104725
930 -104725 -76300 -9447 61955 103433 88956 23181 -55870 -102161 -90662 -31937 41080 94228
942 94228 97768 47527 -30372 -91451 -100768 -55207 18374 81483 101790 67476 -5309 -75521
954 -75521 -103008 -74085 -6060 63778 100408 83111 19993 -55549 -99188 -87648 -29429 42802
966 42802 92608 93498 43399 -31509 -89857 -97342 -51316 21033 80689 98144 63350 -7191 -74526
979 -74526 -100268 -70113 -3043 64322 97242 78848 16854 -55424 -97171 -84536 -26264 45009
991 45009 90909 89229 39583 -32785 -88208 -94265 -48247 22925 80024 94568 58754 -9392
1003 -9392 -74000 -97476 -66540 -393 64199 94531 74814 14393 -55205 -94618 -81043 -22798
1015 -22798 45932 88698 85381 36271 -33581 -86223 -90992 -44216 25202 78977 90556 54890
1027 54890 -10587 -72515 -94964 -63288 2980 65166 91071 69272 11476 -54571 -92159 -78567
1039 -78567 -20165 47628 87498 80369 31658 -34151 -83658 -87710 -41899 27235 79179 87335
1051 87335 49848 -13288 -70656 -91255 -60515 4550 66043 89332 65195 7622 -54116 -88620
1063 -88620 -74939 -18371 48376 86759 76850 27221 -35783 -81151 -83681 -39394 27622 78759
1075 78759 84746 45790 -16248 -69590 -87282 -56937 5702 65667 87419 61421 3903 -54896
1087 -54896 -85477 -70669 -15848 48658 85296 74048 23558 -37830 -79378 -79628 -35709 29129
1099 29129 77576 81899 41721 -19094 -69030 -83142 -53135 7664 65085 85146 57607 593
1111 593 -55339 -82501 -66404 -13644 48722 83709 70404 19966 -39704 -76953 -74946 -32887
1123 -32887 29229 76499 79761 38510 -21615 -68258 -78981 -49159 9042 63986 83374 54852
1135 54852 -2299 -55972 -79133 -61755 -11439 47924 81540 68971 17142 -41739 -75434 -70348
1147 -70348 -29320 28755 73576 77694 37104 -23968 -69058 -75929 -44052 10558 61207 80174
1159 80174 53880 -3497 -57460 -78398 -57611 -7685 46767 77272 66240 16862 -41835 -75343
1171 -75343 -67502 -24776 30664 70434 73737 35591 -23367 -68341 -74435 -40624 13484 60390
1183 60390 75780 50278 -3353 -55917 -77089 -55308 -4295 47888 74612 61117 14296 -40129
1195 -40129 -73081 -65893 -23279 32196 70510 69859 30775 -24286 -65531 -71325 -39082 13875 60329
1208 60329 74212 46431 -6575 -55458 -72997 -52202 -3675 47114 73892 59678 11300 -41900
1220 -41900 -70735 -61385 -21365 30934 68377 69252 29221 -26897 -65997 -67364 -34491 13936 57138
1233 57138 72376 46677 -7844 -57551 -71634 -46601 -682 44647 68915 58360 13097 -42396
1245 -42396 -72575 -58672 -15387 32075 63117 63937 30150 -23954 -66012 -68389 -31398 18777
1257 18777 55800 65832 43459 -4575 -54431 -73044 -46960 3472 47348 64935 51760 12213
1269 12213 -38389 -70182 -60771 -14652 36267 63635 58225 25243 -21908 -61078 -67792 -32954
1281 -32954 20311 58974 63542 36914 -7104 -49789 -68229 -48089 1495 49461 66579 48282
1293 48282 6863 -37483 -64739 -57673 -16657 35262 65701 57850 20694 -25270 -58059 -62007
1305 -62007 -32117 17368 57974 65060 35576 -11657 -50839 -63457 -42825 1552 45809 65462
1317 65462 48889 5196 -40235 -63950 -52712 -13484 33526 61885 56490 20678 -26364 -58843
1329 -58843 -59882 -28112 18892 55577 61930 34711 -11465 -51081 -62978 -40275 3833 45429
1341 45429 61950 45984 4898 -39267 -62880 -51470 -10647 35093 59873 52667 18717 -24756
1353 -24756 -56727 -59341 -27701 20873 56425 58793 30085 -12062 -47679 -59776 -40170 3395
1365 3395 46371 62111 42682 1960 -38942 -59464 -48955 -11451 33497 59635 52160 16362
1377 16362 -26136 -54898 -55757 -26561 19353 55197 58333 28614 -13728 -46740 -57053 -38330
1389 -38330 2589 44368 61890 42443 -463 -40093 -56672 -44875 -10578 31092 57714 52186
1401 52186 16586 -28082 -55232 -52224 -22624 19314 51860 55970 29095 -13686 -47582 -56294
1413 -56294 -35771 4201 43668 59226 40382 -830 -39780 -55407 -42876 -9343 30135 56084
1425 56084 50656 15035 -28728 -54442 -49898 -19872 19418 49591 53999 29048 -13516 -48048
1437 -48048 -55011 -32758 6727 42984 56133 38397 -1135 -38667 -54058 -41641 -7879 30885
1449 30885 54700 48944 13489 -29563 -53653 -47549 -17536 19217 47235 52388 28438 -14038
1461 -14038 -48988 -54695 -29653 9305 41381 52631 36585 230 -38010 -54597 -40674 -4912
1473 -4912 32764 52615 45113 12346 -27613 -51995 -46852 -17119 20492 47028 50608 26185 -14199
1486 -14199 -47503 -52911 -28075 9973 41034 50303 34574 89 -36514 -54166 -40453 -3071
1498 -3071 34257 51502 41232 10151 -26236 -49495 -46476 -17388 21586 48445 48480 22433 -15745
1511 -15745 -45380 -49822 -27025 9881 41165 50203 33279 -2268 -37273 -52396 -37692 -2187
1523 -2187 33451 50286 39940 9193 -26396 -48406 -44807 -15694 22546 47992 46994 20212 -16520
1536 -16520 -44255 -47930 -25838 9543 40285 49428 31835 -3663 -37661 -50606 -35147 -1015
1548 -1015 32518 48026 38876 9045 -26542 -48710 -43834 -13699 23552 46254 44051 18759 -15956
1561 -15956 -42850 -47242 -25548 11147 40995 48050 29119 -4927 -36566 -48397 -33893 -834
1573 -834 32681 47824 37037 7114 -26961 -47296 -41816 -12740 23294 45547 42238 17014 -16437
1586 -16437 -41785 -45592 -24297 11654 40922 47042 27201 -6470 -35787 -46496 -32586 -810
1598 -810 32298 47583 36180 5002 -27876 -45786 -39090 -11116 22836 44618 41800 16550 -17684
1611 -17684 -42053 -44042 -22179 11961 40079 45423 26009 -6963 -35771 -45324 -30802 610
1623 610 32337 46577 34737 4128 -27946 -44824 -37622 -10398 22711 43689 40589 15463 -18275
1636 -18275 -41466 -42584 -20184 12882 38895 44082 24637 -7516 -35503 -44592 -29573 1813
1648 1813 32206 45097 32921 2936 -27768 -43580 -36322 -9675 22928 43398 39359 13689
1660 13689 -18736 -40778 -40576 -19048 13112 38485 42981 23962 -8472 -35359 -43205 -27452 2498
1673 2498 31746 43822 32205 2203 -28392 -43033 -34661 -7635 23314 42094 37844 12907
1685 12907 -19285 -40275 -39434 -17649 13812 37690 41739 22190 -9219 -35361 -42141 -26370 3543
1698 3543 31688 42673 30641 1522 -28207 -42458 -33549 -6495 23697 40965 36278 11662
1710 11662 -19218 -39665 -38101 -16285 14581 37144 39949 21024 -9417 -34816 -40986 -24955
1722 -24955 4343 31421 41282 28923 572 -28043 -41689 -31870 -5382 24030 40053 34823
1734 34823 10271 -19400 -38961 -36964 -14611 15374 36798 38652 19444 -10079 -34071 -39788
1746 -39788 -23545 5717 31540 40339 27153 -765 -27922 -40183 -30518 -4021 24035 39269
1758 39269 33281 9081 -20014 -38119 -35822 -14063 15490 36386 37403 18310 -10722 -33831
1770 -33831 -38731 -22222 5810 31334 39381 25904 -1368 -27893 -39100 -29116 -3788 24036
1782 24036 38961 32214 7848 -20239 -37590 -33981 -12636 15533 35404 36593 17089 -11709
1794 -11709 -34032 -37355 -20595 7089 30949 38069 24743 -2156 -27800 -38351 -27761 -2433
1806 -2433 23975 38057 30908 7093 -20332 -36810 -32606 -11156 16148 34447 35109 15935 -12126
1819 -12126 -33909 -36599 -18913 8427 30455 36236 23207 -2608 -27382 -37538 -26822 -1144
1831 -1144 25147 37070 28837 5529 -20551 -35575 -31598 -10252 16845 34768 33932 14316 -13142
1844 -13142 -33290 -34908 -17657 8365 30057 35480 22226 -3360 -27701 -36948 -25473 27
1856 27 24963 35999 27387 4537 -20580 -34950 -31072 -9773 17423 34860 32396 12562 -14017
1869 -14017 -32011 -33379 -16899 8591 29427 35118 21408 -4510 -27850 -35739 -23619 853
1881 853 24073 34898 26825 4095 -20694 -34706 -29812 -8260 17505 33791 31247 11186 -14136
1894 -14136 -31173 -32190 -15661 8821 29229 34740 19849 -5891 -28459 -34258 -21554 1481
1906 1481 23330 33664 26197 3756 -21529 -34934 -28363 -6300 18650 31936 29467 11264 -13806
1919 -13806 -31429 -32002 -14742 10102 29466 32944 18269 -6106 -27474 -33428 -21160 2715 24009
1932 24009 32731 24498 3123 -20991 -34251 -27295 -5061 19181 31415 27403 10343 -12853 -30502
1945 -30502 -31794 -14404 11426 29992 30941 15442 -6592 -25471 -32320 -21320 2225 25062 33023
1958 33023 22483 623 -20576 -31913 -26014 -5717 18632 31758 27115 8334 -14359 -29350
1970 -29350 -29474 -13446 10827 29567 30831 14690 -8050 -25492 -30076 -19491 2074 23955 32970
1983 32970 21897 -1139 -21940 -30432 -23404 -5036 17235 31067 27497 7573 -15557 -29457
1995 -29457 -26821 -11122 10469 27567 29976 15244 -8170 -27064 -29794 -17064 3624 22998
2007 22998 30472 21957 34 -22179 -30976 -22361 -2582 17717 28928 25488 8077 -14953 -29659
2020 -29659 -27257 -9558 12013 27219 27570 13934 -7547 -25698 -29617 -16905 4774 23332 29121
2033 29121 19197 -718 -20715 -29707 -22182 -2091 18934 28796 23362 6022 -14459 -28323 -26537
2046 -26537 -9734 13054 27815 26588 11613 -8500 -24197 -27881 -16640 4520 23899 29633
2058 29633 17927 -3112 -21052 -27503 -20373 -2559 17670 29035 23746 5019 -16264 -27495
2070 -27495 -23915 -8255 11818 26078 26281 11827 -9382 -24945 -27013 -14163 5332 22824 28265
2083 28265 17768 -3146 -21456 -26998 -18700 -1017 16877 27409 23392 5017 -16525 -28046
2095 -28046 -22827 -5883 12202 24406 24504 11954 -8466 -25504 -26964 -13107 7170 22388 25570
2108 25570 15832 -2205 -20221 -27575 -18688 27 18321 26496 20909 3865 -15807 -26624 -22482
2121 -22482 -5965 12622 24428 23615 10796 -8985 -24588 -26135 -12464 7807 22574 24548 14412
2134 14412 -2354 -18969 -26494 -18816 320 19166 26315 18774 2090 -15541 -24564 -21334 -6499
2147 -6499 12506 24938 23566 8815 -10472 -23954 -24042 -11296 7412 21418 24272 14306 -3000
2160 -3000 -19933 -26112 -17441 1402 18846 25144 18113 1911 -14780 -24183 -20929 -5957 12990
2173 12990 24556 22445 7641 -10721 -22962 -22879 -10467 7156 21315 24026 13898 -3925 -20099
2186 -20099 -25048 -16258 2008 18237 23968 16930 1888 -14303 -23975 -20641 -5316 13494 24280
2199 24280 20834 6372 -10473 -21627 -21972 -10516 7150 21356 23773 12823 -5164 -19850 -23440
2212 -23440 -14613 2253 17484 23529 16925 1103 -15152 -23539 -19447 -4114 13173 23264 20173
2225 20173 6125 -10557 -21197 -21300 -10477 7451 20995 23048 11655 -5596 -19153 -22418 -13735
2238 -13735 1828 17397 23444 16458 622 -15280 -23217 -18098 -3363 13219 22413 19170 5978
2251 5978 -10301 -21033 -21219 -9144 7763 20956 21711 10652 -5666 -18403 -21714 -13524 2211
2264 2211 16628 22722 15712 -282 -15398 -22280 -16942 -3060 12474 21778 18987 5786 -10780
2277 -10780 -20893 -19391 -8349 7823 20218 21117 9927 -5723 -18388 -21070 -12671 2376 16786
2290 16786 22092 14889 -802 -15316 -21364 -16126 -2623 12405 21174 18445 4863 -11239 -20728
2303 -20728 -19005 -7234 7756 19123 20261 10003 -5851 -18510 -20401 -11636 3137 16520 21103
2316 21103 14374 -454 -15249 -20873 -15367 -1667 12733 20518 17650 4516 -10823 -20182 -18289
2329 -18289 -6366 8300 18921 19589 9384 -6214 -18324 -20516 -11073 3573 16243 20101 13112
2342 13112 -857 -14908 -20828 -14720 -1418 12617 19976 16262 4533 -10787 -19974 -17787 -5859
2355 -5859 8454 18450 18640 8709 -6038 -17794 -19798 -10426 3994 16246 19569 12702 -1138 -14702
2369 -14702 -20111 -14422 -908 13200 19538 15460 3507 -10964 -19574 -17307 -5606 8928 18148
2382 18148 17881 8654 -6006 -17366 -19185 -10069 4197 16018 19082 11899 -1466 -14485 -19754
2395 -19754 -13568 -643 12589 18870 15144 3317 -10393 -18871 -16648 -4945 8853 17938 17224
2408 17224 7547 -6080 -16796 -18472 -9701 4220 15652 18267 11246 -1647 -14152 -19051 -13545
2421 -13545 -329 12937 18784 14576 2467 -10559 -18481 -16387 -4845 9091 17851 16925 7183
2434 7183 -6477 -16871 -18337 -9206 4484 15778 18064 10453 -2059 -13821 -18423 -13041 -97
2447 -97 13147 18541 13837 2092 -10689 -17580 -15557 -4738 9011 17691 16586 6297 -6909 -16129
2461 -16129 -17017 -8755 4572 15407 17803 10544 -2342 -13745 -17640 -12706 187 13046 18573
2474 18573 13526 1837 -10721 -17307 -15039 -4454 8784 17408 16320 6146 -7091 -15997 -16429
2487 -16429 -8427 4640 15268 17436 10114 -2692 -13793 -17585 -11750 197 12100 17821 13142
2500 13142 1648 -10759 -16972 -14635 -4510 8766 17099 15703 5468 -7450 -15736 -15886 -7715
2513 -7715 4244 14853 17633 9955 -3089 -14148 -17030 -11117 690 12210 16973 13145 1557
2526 1557 -10677 -17121 -14203 -3477 9364 16843 15017 5338 -7081 -15342 -15455 -7452 4841 14773
2540 14773 16946 9207 -3733 -14273 -16371 -9991 1252 11754 17178 12817 977 -11369 -17067
2553 -17067 -13581 -2752 9219 16470 14429 4913 -7114 -15688 -15458 -7084 5320 14707 16362 8621
2567 8621 -4058 -13740 -15836 -10156 1403 12187 16565 12372 761 -11339 -16760 -12468 -1569
2580 -1569 8972 15223 13667 5306 -7354 -15539 -15648 -6168 6294 14936 15145 7476 -3535 -13396
2594 -13396 -15864 -9668 1778 12292 16487 11194 160 -11249 -16503 -12115 -1905 9043 15177
2607 15177 13721 4888 -7763 -15832 -15074 -5555 6187 14546 14532 7682 -3544 -12932 -15759 -9944 1955
2622 1955 12449 16130 10632 -630 -10708 -15557 -11836 -2140 8998 15677 13536 4002 -8050 -15472
2636 -15472 -13762 -5246 6053 14043 14316 7535 -3984 -12971 -15829 -9217 2867 12727 15250 9915
2650 9915 -468 -10630 -15296 -12052 -1681 9306 15374 13221 3402 -7858 -14815 -13282 -4812 6258
2664 6258 13637 14262 7109 -3976 -13449 -15401 -8351 2999 12303 14576 9480 -480 -10373 -15176 -11531
2679 -11531 -1240 9824 14942 11777 2827 -8083 -14581 -13261 -4586 6445 13825 13641 6370 -4436
2693 -4436 -12783 -14679 -8010 2925 12120 14521 9089 -1146 -10758 -14530 -10616 -683 9772 14755
2707 14755 11641 2257 -7970 -14023 -12920 -4727 6326 13994 13793 5718 -5188 -12830 -13873 -7462
2721 -7462 3117 12127 14584 8776 -1342 -10694 -14463 -10293 -551 9494 14670 11429 2044 -8202
2735 -8202 -13869 -11989 -3598 6344 13429 13021 5305 -5412 -12875 -13565 -6713 3273 12057 14177 8490
2750 8490 -1907 -10874 -14285 -9855 -107 9564 14226 10802 1315 -8279 -13604 -11562 -3401 6554 13303
2765 13303 13041 5116 -5736 -12875 -12892 -6407 3924 11619 13551 8221 -1925 -11053 -13917 -9165 541
2780 541 9805 14060 10195 1492 -8243 -13422 -11355 -2919 6974 13374 12379 4347 -5785 -12712 -12354
2795 -12354 -6123 3985 11736 13260 7453 -2400 -10959 -13767 -8595 827 9779 13387 9694 1068
2809 1068 -8456 -13484 -10858 -2785 7250 13275 11632 3929 -5828 -12387 -12326 -5815 3889 11779 13071
2824 13071 7270 -2713 -11196 -13391 -8157 1227 9573 13255 9402 642 -8559 -13260 -10514 -2025 7572
2839 7572 12712 11181 3849 -6008 -12203 -12229 -5314 4539 11815 12600 6775 -3328 -11050 -12790 -7591
2854 -7591 1243 9363 12848 9261 430 -8583 -13096 -9928 -1318 7102 12522 10781 3575 -5833 -12157
2869 -12157 -11778 -4690 4622 11615 12245 6053 -3136 -10566 -12558 -7453 1247 9576 12734 8588 -202
2884 -202 -8965 -12517 -9715 -1533 7211 12232 10500 2884 -5969 -12015 -11247 -4409 4805 11354 11312 5703
2900 5703 -3425 -10166 -12157 -7344 1666 9564 12359 8160 -238 -8503 -12408 -9067 -1409 7620 12331
2915 12331 10219 2653 -6187 -11556 -10658 -4424 4967 11138 11147 5421 -3576 -10356 -11495 -6690 2229 9425
2931 9425 12186 7854 -619 -8849 -12029 -8352 -839 7303 11710 9919 2388 -6377 -11622 -10417 -3764
2946 -3764 5031 10873 11074 5015 -3600 -10371 -11329 -6194 2434 9589 11710 7169 -1000 -8763 -11612
2961 -11612 -8448 -557 7636 11517 9121 1738 -6183 -11038 -9847 -3205 5075 11050 10506 4495 -3859
2976 -3859 -10310 -10955 -5696 2841 9556 11429 6947 -943 -8766 -11536 -7925 -281 7444 11110 8754
2991 8754 1504 -6573 -11157 -9217 -2865 5357 10543 10196 4076 -3832 -10003 -10511 -5430 2555 9505
3006 9505 10932 6419 -1441 -8656 -10789 -7819 -56 7722 11065 8526 1397 -6413 -10743 -9553 -2827
3021 -2827 5049 10203 9848 3824 -3921 -10070 -10359 -5151 2724 8997 10500 6112 -1378 -8301 -10733
3036 -10733 -7361 491 7593 10744 8184 1035 -6378 -10300 -8436 -2623 5343 10051 9180 3193 -3924
3051 -3924 -9282 -9572 -4647 2772 9053 10049 5927 -1816 -8320 -10409 -6962 321 7390 10273 7691
3066 7691 961 -6396 -9987 -8477 -1866 5370 9910 8954 3214 -4186 -9196 -9828 -4247 2985 8721
3081 8721 9838 5226 -1854 -7970 -9859 -6468 492 7224 10096 7066 619 -6095 -9782 -7848 -1890
3096 -1890 5249 9493 8762 2822 -4299 -9184 -8893 -4261 3138 8442 9237 5016 -1931 -7742 -9674 -5958
3112 -5958 934 7084 9670 7147 521 -6079 -9471 -7568 -1900 5160 9228 8188 2621 -4463 -8722
3127 -8722 -8712 -3986 3279 8360 9292 4604 -2220 -7746 -9065 -5651 970 7269 9467 6538 -146 -6220
3143 -6220 -9068 -7451 -1261 5133 9220 7937 2534 -4507 -8476 -8301 -3367 3222 8161 8811 4464
3158 4464 -2497 -7721 -8734 -5288 940 6965 9250 6259 -105 -6228 -8916 -6688 -1044 5205 9036
3173 9036 7454 2118 -4416 -8619 -7837 -3168 3087 8066 8464 4524 -2484 -7580 -8563 -4853 1412 6569
3189 6569 8508 5887 -27 -6163 -8833 -6547 -698 5457 8455 7281 1864 -4400 -8514 -7912 -2903
3204 -2903 3611 8052 8119 3996 -2366 -7455 -8401 -4694 1463 6809 8405 5942 -530 -6293 -8718 -6687
3220 -6687 -734 5113 8143 6901 1937 -4192 -8464 -7506 -2999 3685 7926 7738 3695 -2860 -7051
3235 -7051 -8000 -5238 1285 6634 8362 5356 -249 -6185 -8360 -5942 -510 5157 8383 6940 1904
3250 1904 -4519 -8211 -7159 -2701 3499 7762 7580 3308 -2671 -7272 -8055 -4327 1574 6771 8011
3265 8011 5115 -808 -5987 -8134 -6042 -334 5392 7891 6372 1392 -4438 -7938 -6880 -2050 3743
3280 3743 7508 7225 3127 -2632 -7133 -8040 -4147 1614 6566 7937 4561 -680 -5657 -7833 -5793
3295 -5793 -224 5236 7981 6007 1272 -4597 -7700 -7079 -2174 3596 7464 6922 3026 -2641 -7017
3310 -7017 -7946 -4100 2055 6542 7718 4229 -936 -5730 -7733 -5456 109 5535 7903 5766 833
3325 833 -4529 -7577 -6752 -2117 3618 7378 7215 3089 -2800 -6704 -7404 -3773 1884 6379 7605 4912
3341 4912 -898 -5828 -7554 -5047 -258 5360 7470 5530 792 -4528 -7426 -6136 -1789 3433 7037
3356 7037 6707 2622 -2886 -6696 -6930 -3386 1720 6328 7362 4340 -1130 -5796 -7304 -4947 104
3371 104 5027 7655 5746 584 -4751 -7216 -5999 -1447 3752 6747 6520 2418 -3061 -6845 -6495 -3140
3387 -3140 2126 6491 7076 4394 -1306 -6061 -7114 -4756 387 5138 7367 5872 539 -4576 -7375
3402 -7375 -6171 -1547 3758 7011 6539 2554 -2937 -6752 -6582 -3113 2144 6253 7282 4013 -1130
3417 -1130 -5438 -7081 -4592 -1 5253 6905 5244 575 -4738 -7060 -5671 -1173 3487 6780 6163
3432 6163 2231 -3110 -6811 -6607 -2929 2703 5901 6778 4045 -1533 -5799 -7199 -4328 669 5360
3447 5360 6912 5077 289 -4626 -6943 -5563 -979 3739 6620 6257 1950 -3219 -6396 -6201 -2595
3462 -2595 2386 6161 6591 3504 -1324 -5650 -6887 -4246 614 5055 6591 4870 72 -4829 -6973
3477 -6973 -5597 -1014 3776 6768 5847 2086 -3151 -6715 -6281 -2692 2598 6226 6432 3313 -1514 -5812
3493 -5812 -6617 -4055 1199 5361 6273 4504 176 -4481 -6679 -5043 -589 4142 6669 5912 1976 -2914
3509 -2914 -6345 -6118 -2435 2580 5913 6139 3206 -1410 -5535 -6937 -3952 742 5172 6580 4462
3524 4462 -189 -4713 -6784 -5053 -648 3847 6793 5528 1404 -3139 -6224 -6066 -2486 2822 6300
3539 6300 6326 3002 -1626 -5247 -6505 -3927 1105 5369 6897 4035 -383 -4592 -6322 -5008 -487
3554 -487 4066 6274 5266 1571 -3205 -6537 -5660 -2213 2695 6085 6060 2917 -1848 -5742 -6332 -3423
3570 -3423 1328 4997 6332 4279 -254 -4622 -6296 -4584 -482 4031 6449 5244 1194 -3488 -5892
3585 -5892 -5685 -2061 2785 6232 5844 2587 -2253 -5445 -5705 -3486 1476 5148 5970 4081 -857 -4706
3601 -4706 -6468 -4567 -291 3986 6411 5193 1064 -3364 -5952 -5519 -1714 2653 5966 5816 2523
3616 2523 -2031 -5552 -5869 -3188 1211 5192 5968 3727 -591 -4734 -6030 -4471 -340 3924 5973
3631 5973 4835 1111 -3674 -5773 -4892 -1689 2684 5812 5788 2500 -2330 -5370 -5648 -2979 1277 5130
3647 5130 5688 3732 -305 -4619 -5996 -4230 8 4138 6008 4618 859 -3508 -5616 -5039 -1314
3662 -1314 3021 5443 5536 2174 -2279 -5363 -5285 -2995 1491 4776 5980 3679 -793 -4631 -5922 -3847
3678 -3847 -122 3960 5687 4607 609 -3400 -5949 -5039 -1111 2633 5295 5363 2118 -2180 -5282 -5569
3694 -5569 -2559 1443 4743 5629 3244 -797 -4481 -5603 -3693 301 3997 5995 4255 508 -3529
3709 -3529 -5562 -4690 -1212 2893 5515 4859 2183 -2125 -5377 -5489 -2205 1630 4821 5440 3170 -1057
3725 -1057 -4607 -5355 -3645 301 3969 5178 4060 502 -3468 -5510 -4510 -934 3137 5435 4945
3740 4945 1649 -2149 -4817 -5083 -2242 1692 4753 5277 2663 -706 -4432 -5483 -3368 555 3885
3755 3885 5258 3819 554 -3223 -5177 -4409 -855 2878 5187 4554 1774 -2433 -4850 -4998 -2158 1946
3771 1946 4805 4670 2537 -1105 -4488 -5200 -3196 452 3916 5148 3594 424 -3541 -5149 -4033
3786 -4033 -820 3329 5317 4346 1180 -2438 -4947 -4665 -1740 1651 4434 4765 2453 -1054 -4069 -5084
3802 -5084 -3125 272 3936 4957 3856 -213 -3392 -4905 -3866 -335 2909 4671 4305 1102 -2422
3817 -2422 -4623 -4491 -1762 1828 4762 4459 2706 -1295 -4144 -4354 -2922 623 3864 5103 3414 -214
3833 -214 -3277 -4832 -3705 -652 2933 4664 4170 993 -2723 -4303 -4435 -1658 1602 4535 4428 2428
3849 2428 -1212 -3994 -4709 -2679 430 3692 4797 3241 -95 -3065 -4577 -3682 -327 2789 4610
3864 4610 3778 736 -2455 -4613 -4363 -1466 1975 4312 4251 2128 -1401 -4016 -4642 -2624 804 3733
3880 3733 4817 3034 -280 -2995 -4830 -3182 -138 2787 4423 3393 920 -2464 -4395 -4138 -1815
3895 -1815 1716 4283 4353 1836 -1539 -3789 -4155 -2211 846 3518 4481 2740 -325 -3120 -4430 -3167
3911 -3167 -335 3076 4188 3371 1059 -2567 -4297 -3568 -1247 1826 3666 3938 1808 -1225 -4068 -4383
3927 -4383 -2009 1128 3575 4579 2636 -672 -3239 -4404 -2546 -215 2868 4168 3293 894 -2404
3942 -2404 -4399 -3747 -1274 2211 3846 3902 1889 -1465 -4069 -4151 -2101 1257 3333 4004 2502 -453
3958 -453 -3159 -4249 -2831 70 2545 4016 3069 512 -2213 -4149 -3580 -913 2055 3774 3526 1263
3974 1263 -1316 -3344 -3643 -2093 756 3153 3944 1934 -532 -3116 -3817 -2603 113 2783 4065 3332
3990 3332 428 -2471 -3862 -3451 -925 1923 3709 3482 1219 -1304 -3672 -3701 -2147 963 3292 3895
4006 3895 1956 -711 -3100 -3919 -2386 340 2551 3822 2947 443 -2326 -3646 -2918 -676 1856 3825
4022 3825 3398 1227 -1484 -3598 -3265 -1568 1143 2922 3687 2364 -315 -2945 -3668 -2627 -60 2569
4038 2569 3708 2824 436 -2474 -3575 -3151 -1014 1623 3424 3431 1181 -1404 -3186 -3451 -1774 837
4054 837 3110 3740 2034 -321 -2776 -3599 -2454 65 2605 3604 2768 108 -2236 -3428 -3190 -639
4070 -639 1937 3691 3103 896 -1588 -3396 -3357 -1773 1201 2819 3455 1822 -406 -2928 -3230 -2206
4086 -2206 74 2463 3383 2615 -112 -2140 -3482 -3039 -766 1877 3537 3004 1074 -1462 -3627 -3041
4102 -3041 -1490 893 2865 3304 1904 -650 -2895 -3679 -1923 162 2429 3237 2400 239 -2290 -3000
4118 -3000 -2645 -736 1996 3181 2793 1156 -1372 -3125 -2969 -1471 1078 2885 3035 1704 -547 -2732
4134 -2732 -3267 -2202 137 2095 3099 2450 590 -2352 -3080 -2390 -803 1648 3095 2910 879 -1335
4150 -1335 -3077 -2976 -1051 1187 2774 3265 1613 -812 -2855 -2894 -1705 98 2285 3395 2225 157
4166 157 -1948 -3124 -2643 -255 1586 3019 2693 934 -1014 -2931 -3011 -1352 1166 2535 2871 1502
4182 1502 -797 -2194 -3094 -1657 225 2140 3176 2251 228 -2016 -2968 -2301 -435 1595 2869 2675
4198 2675 837 -1429 -2855 -2861 -1273 921 2792 2816 1625 -811 -2437 -2761 -1592 246 2176 2733 2221
4215 2221 212 -1928 -2752 -2446 -571 1592 2957 2518 805 -1335 -2819 -2682 -945 1395 2809 2848
4231 2848 1253 -627 -2555 -2768 -1670 324 2325 3076 1715 -79 -1671 -2818 -2162 -205 1639 2694
4247 2694 2464 604 -1599 -2894 -2728 -705 1279 2449 2612 1299 -833 -2428 -2779 -1567 690 2011
4263 2011 2690 2004 -252 -2028 -2646 -2048 -408 1631 3023 2266 464 -1255 -2269 -2447 -1080 1168
4279 1168 2412 2703 1319 -1044 -2408 -2867 -1463 568 2214 2819 1695 -90 -1708 -2983 -2139 -105
4295 -105 1661 2350 2325 588 -1447 -2495 -2365 -877 1262 2372 2764 1337 -805 -2206 -2572 -1566 563
4312 563 2180 2579 1803 -117 -2062 -2409 -2056 -384 1812 2693 1867 557 -1427 -2632 -1950 -751 940
4329 940 2467 2773 979 -530 -2456 -2654 -1444 554 2160 2535 1634 -167 -1972 -2353 -1843 -377 1854
4346 1854 2749 1794 387 -1838 -2462 -2058 -834 1466 2568 2261 1123 -885 -2483 -2605 -1291 683
4362 683 2091 2568 1123 -411 -2072 -2413 -1724 84 1620 2707 1734 -53 -1477 -2574 -2038 -339
4378 -339 1055 2085 2246 731 -1163 -2454 -2169 -1208 849 1855 2139 1598 -435 -1962 -2379 -1602 172
4395 172 1669 2516 1964 -123 -1706 -2388 -2003 -365 1289 2466 1826 812 -981 -2239 -2032 -1154 734
4412 734 1935 2074 1409 -314 -1692 -2556 -1465 -36 1933 2318 1781 74 -1562 -2326 -1937 -390 1264
4429 1264 2114 2261 448 -1158 -2277 -2276 -1074 719 1966 2509 1385 -619 -2109 -2348 -1234 341 1743
4446 1743 2608 1701 -21 -1685 -2391 -1689 -382 1400 2389 1777 400 -1152 -2296 -2055 -678 910 1988
4463 1988 1880 1028 -805 -1701 -2418 -1161 83 1657 2449 1517 -200 -1605 -2024 -1758 -151 1198 2132
4480 2132 1733 326 -1232 -2315 -2108 -406 716 2093 1986 910 -767 -2026 -2162 -1458 365 1599
4496 1599 1874 1666 20 -1488 -2083 -1952 -143 1297 1940 1471 360 -1506 -1965 -1685 -749 899 2041
4513 2041 1925 632 -303 -1889 -1776 -834 619 1937 1970 1406 -117 -1387 -2111 -1377 -97 1043 1972
4530 1972 1737 143 -1176 -2274 -1873 -298 1176 1740 1892 969 -596 -1616 -1756 -860 578 1473 2028
4547 2028 1350 -107 -1561 -1964 -1274 -30 1203 1922 1727 134 -1292 -1841 -1539 -406 985 1967 1621
4564 1621 913 -577 -1825 -1995 -945 604 1667 1900 973 -304 -1820 -1747 -1014 189 1402 1936 1234
4581 1234 -71 -1060 -1989 -1731 -516 941 1734 1677 511 -900 -1675 -1915 -873 635 1462 1703 999 -496
4599 -496 -1546 -1839 -1259 23 1278 1820 1382 58 -1063 -1686 -1280 -398 1027 1647 1392 550 -750 -1542
4617 -1542 -1494 -1027 268 1447 1607 819 -493 -1489 -1494 -1195 177 1451 1834 1588 -74 -1065 -1859 -1213 -100
4636 -100 1222 1519 1439 363 -899 -1668 -1538 -607 810 1546 1305 735 -438 -1441 -1750 -968 256 1478
4654 1478 1630 804 95 -1180 -1831 -1640 -330 788 1661 1609 282 -981 -1514 -1419 -709 534 1573 1530
4672 1530 721 -505 -1352 -1448 -974 541 1126 1802 888 -66 -1224 -1896 -1002 -271 850 1445 1104 271 -587
4691 -587 -1299 -1356 -555 599 1457 1529 492 -473 -1494 -1563 -789 381 1237 1663 1256 -366 -1122 -1313 -875
4710 -875 -371 1007 1372 1162 465 -890 -1612 -834 -575 537 1546 1587 678 -160 -1116 -1087 -772 74 1301
4729 1301 1473 927 -178 -1046 -1326 -945 2 855 1093 1400 382 -760 -1007 -1247 -329 513 1449 1257 427
4748 427 -379 -1219 -1303 -922 188 890 1004 803 -443 -874 -1124 -1058 30 932 1280 936 -88 -1054 -1147 -1071
4768 -1071 -162 375 1264 1294 246 -255 -951 -1264 -603 341 1052 1156 297 -354 -772 -1098 -722 307 863
4787 863 950 798 212 -678 -985 -1015 -200 382 844 1005 197 -307 -1280 -1468 -446 587 888 1294 594 -320
4807 -320 -507 -1397 -580 74 525 1116 745 -38 -606 -1283 -618 -97 578 1008 1043 540 -453 -746 -1119 -231
4827 -231 246 910 841 537 -522 -646 -736 -618 209 968 1045 731 79 -527 -805 -454 172 651 851 836 316
4848 316 -451 -734 -997 -417 448 680 1061 442 -143 -514 -687 -697 -25 678 1012 650 -115 -718 -830 -599
4868 -599 54 258 968 663 296 -346 -851 -760 -711 388 850 1098 222 -273 -454 -775 -203 -10 714 820
4888 820 608 53 -372 -818 -790 -156 370 780 833 96 -225 -610 -653 -544 181 359 622 275 -113 -646 -636
4909 -636 -496 -55 535 756 460 -1 -312 -1015 -548 -266 663 682 486 367 -741 -394 -652 -246 -68 632
4929 632 637 143 -437 -761 -686 -390 107 715 832 346 21 -512 -664 -129 -34 208 685 587 148 -538 -693 -398
4951 -398 -72 401 447 573 443 -267 -435 -747 -343 87 372 442 181 -201 -242 -836 -455 -1 452 754 582
4972 582 394 -246 -668 -573 -70 326 578 799 330 -340 -392 -276 -149 272 416 505 312 221 -395 -519 -546 -347
4994 -347 423 758 767 21 -200 -677 -445 -301 217 379 732 194 -256 -623 -470 -490 182 443 513 365 -150
5015 -150 -200 -718 -255 -217 49 596 653 9 -396 -680 -326 -56 445 412 282 435 -125 -482 -503 -180 184 380
5037 380 560 259 15 -536 -577 -446 -196 410 624 248 87 102 -362 -558 -125 279 447 577 22 -399 -670
5058 -670 -429 -348 190 610 478 246 -86 -480 -690 -160 201 208 714 393 43 -248 -454 -452 -372 432 661 422
5080 422 130 -367 -372 -536 -250 291 178 705 406 67 -566 -403 -409 102 209 452 255 38 -257 -330 -228 162
5102 162 172 591 571 61 180 -601 -442 -248 -51 433 567 61 270 -403 -714 -270 251 37 260 379 160
5123 160 101 -369 -401 -115 232 482 257 380 -196 -374 -520 -262 217 258 325 211 189 -284 -463 -386 46 252
5145 252 437 482 -200 -213 -181 -233 -490 240 371 543 435 -174 -343 -183 -131 105 162 300 300 -58 -287 -137 -479
5168 -479 -322 227 288 305 282 -105 -576 -294 -123 -95 273 433 201 -329 -419 -565 -180 -36 342 279 68 -91
5190 -91 -511 -332 -123 -93 239 354 571 198 -253 -370 -531 20 139 294 286 334 -209 -357 -311 -190 163 149
5212 149 228 167 20 -151 -280 -282 -66 158 539 314 -7 -293 -289 -268 -121 165 474 398 -85 -205 -394 49 -27
5235 -27 156 288 725 136 -8 -397 -260 34 61 57 479 409 -38 -283 -541 -447 -175 383 252 142 32 -39
5257 -39 -194 -451 -187 -10 195 238 436 -292 -312 -262 26 74 122 297 24 271 -448 -487 -492 -308 138 254 205
5280 205 68 85 -158 -361 -68 342 436 313 -30 32 -108 -240 -372 -336 88 268 329 145 -204 -120 -471 -209
5302 -209 315 271 338 35 -43 -321 -585 -109 14 530 110 72 -43 -115 -100 -339 138 174 594 -1 -147 -143 -399
5325 -399 -245 125 -59 172 180 396 -272 -446 -186 -358 226 337 496 189 -437 -362 -403 -117 66 86 287 219
5347 219 27 -298 -417 -216 -242 255 328 160 43 -237 -363 -422 27 93 177 134 -14 -135 -77 -322 77 6 256
5370 256 409 77 122 -48 -342 -463 -116 -63 233 256 -17 -85 -470 -481 -37 39 223 58 128 -146 -279 -156
5392 -156 9 87 122 297 56 -272 -261 -503 30 13 -41 208 488 73 7 -154 -139 -149 109 16 168 222 69
5415 69 -267 -217 184 -7 366 41 274 -365 -323 -265 -235 -120 92 466 -231 267 -277 -489 -49 -172 59 248
5437 248 100 67 165 -263 -257 -293 205 78 110 50 14 -169 -197 -237 14 305 124 -35 326 -184 -247 -161 -223 145
5461 145 385 56 17 -34 -428 16 -263 144 225 98 -158 -92 -269 -239 -209 -35 81 -41 -100 -71 -196 -73 289
5484 289 -97 101 44 -116 -219 -43 -95 -73 -108 29 164 222 132 100 -43 -223 134 69 147 198 434 -93 -213
5507 -213 -298 -119 369 87 295 117 -7 -115 255 10 -83 290 76 -9 29 348 -247 -31 8 160 274 300
5529 300 68 167 80 -113 -49 25 4 8 180 109 -43 -83 -267 149 273 293 -44 175 -47 108 -198 -211 62 35
5553 35 47 -116 -16 -314 -216 189 404 149 81 -247 -9 -146 -246 3 139 -71 86 -63 -24 31 165 91
5575 91 61 -93 158 238 -84 -188 62 -101 -152 50 269 100 129 -172 -44 34 29 262 281 -110 46 -127 -63
5598 -63 -107 88 13 -126 -46 -11 95 59 88 -215 33 119 -9 -46 199 -13 33 198 68 -65 -135 -9 143 165
5622 165 26 -135 -265 173 5 359 13 -214 -78 120 -22 149 79 -77 0 -197 -57 298 180 344 -10
5643 -10 257 76 -368 -239 -18 -120 109 277 -83 -210 122 116 -49 106 -104 496 129 -116 127 -148 -118
5664 -118 -301 -97 287 -127 -180 -75 -98 77 -273 197 203 254 -48 -162 36 -115 -1 -148 -28 14 140 -108
5686 -108 48 -188 -337 128 188 250 111 40 -60 -113 -70 74 148 117 138 -4 -200 -37 -303 64 198 75 -35
5709 -35 -77 113 56 -169 26 34 154 5 -20 -99 -348 -451 -302 171 48 329 60 71 -238 -340 -111 -58 -51 272
5733 272 183 155 -182 -110 84 -92 202 249 -71 -80 438 -36 62 -5 56 247 57 5 84 -95 -513 -37 223 15
5757 15 242 77 -15 -265 -416 -261 -154 7 179 250 276 32 -329 -59 -273 211 117 109 80 -156 -234 63 -76
5780 -76 -248 164 395 38 -79 26 -41 -368 -265 11 255 87 -189 46 -302 -457 -241 512 243 95 -35
5801 -35 9 -247 -103 -287 114 85 264 249 -96 -126 -182 -376 -55 134 243 62 136 -33 -329 -380 -316 51 270
5824 270 -16 -74 -295 -285 -56 -294 47 130 275 382 -269 -41 -353 -56 -98 94 278 83 215 -47 -60 -179
5846 -179 211 152 241 381 -63 78 -239 24 -70 -149 135 347 457 255 -90 -402 -341 -5 350 286 408 -91
5868 -91 -295 -640 -107 -69 34 263 190 101 270 -423 -254 -333 325 295 -21 233 170 -263 -397 -113 -104 197 231
5891 231 403 -74 -292 -65 -206 -149 7 430 256 -172 26 -331 -229 -90 -93 358 261 273 317 -69 -477 -304
5913 -304 15 183 541 216 232 -209 -373 -355 -560 141 192 204 226 44 -399 -546 -208 -233 33 271 140 237
5935 237 -591 -149 -35 -93 224 198 -2 59 -166 -313 -33 -196 -25 273 207 -38 26 -353 -466 -245 93 320
5957 320 472 324 -222 -392 -259 -403 132 69 236 115 -52 -96 -212 -385 -214 194 349 206 58 -226 -331
5978 -331 -325 -227 180 164 283 347 -156 -272 -367 -8 -240 117 320 236 -22 -110 -445 -283 31 89 289 361 43
6001 43 -162 -335 -611 -211 22 259 324 224 -235 -24 -313 -385 97 200 178 196 -229 -223 -411 -612 -129 335
6023 335 136 196 9 -22 -145 -235 -61 -90 383 425 181 -166 -415 -187 -388 -81 96 455 540 283 -282 -114
6045 -114 -229 -394 194 325 411 251 -245 -444 -518 -128 286 164 184 161 0 -342 -148 -443 306 406 262
6066 262 400 154 -111 -286 -252 134 440 275 476 159 5 -290 -518 -149 107 209 395 218 -77 -331
6086 -331 -209 -217 33 250 283 392 118 -421 -327 -11 -168 175 658 282 158 -177 -367 -211 -137 119 267 374
6108 374 -30 -210 -386 -213 -190 111 286 261 179 -147 -222 -427 -255 243 56 358 484 -112 205 -362 -347 -136
6130 -136 93 464 284 26 302 -404 -665 -450 141 436 316 315 53 28 -373 -449 -171 -5 398 373 -24 -142
6152 -142 -132 -274 -119 79 489 140 198 -75 -371 -468 -260 34 39 385 384 -78 -301 -299 -245 -119 233 235 584 65
6176 65 -355 -312 -409 -183 202 527 246 364 -193 -342 -446 -390 19 433 531 132 256 -309 -411 -316 -189 82
6198 82 126 132 431 -73 -384 -137 -194 203 271 303 255 -150 -332 -612 -247 -43 340 427 290 240 -436 -481 -167 -26
6222 -26 -110 360 468 207 -577 -311 -382 -368 -11 249 252 -49 -189 -246 -391 -371 -68 264 521 414 -72 -211 -521
6245 -521 -252 -93 5 344 643 166 -466 -325 -443 -299 35 255 382 306 -13 -323 -421 -134 -96 185 389
6266 389 366 -76 -243 -403 -682 -261 107 500 84 -141 -189 -445 -405 59 54 432 349 340 -27 -215 -91 -414 71
6289 71 66 224 625 -28 -508 -580 -410 -144 204 431 201 241 -416 -332 -111 -295 177 286 333 315 -77 -374 -280
6312 -280 -298 -77 -30 429 385 -267 -363 -365 -686 -273 219 192 398 61 -258 -381 -356 68 42 462 407 234 -61
6335 -61 -261 -515 -29 240 561 554 249 14 -414 -488 -453 -77 208 534 573 344 -241 -331 -629 -201 164 183 303
6358 303 415 -241 -451 -600 90 31 186 166 463 52 -301 -373 -174 49 651 409 391 427 -111 -403 -512 -208
6380 -208 -65 593 212 351 -328 -583 -362 -178 -184 272 362 162 -13 -203 -633 -304 44 173 652 415 338
6401 338 -121 -160 -727 -108 430 306 152 133 -43 -352 -284 -195 -151 417 515 430 280 -21 -314 -214 -317 330
6423 330 589 749 16 -397 -500 -306 -429 -29 544 337 163 73 -402 -515 -183 -85 314 450 514 79 -575
6444 -575 -489 -407 -248 270 439 227 -26 -70 -269 -448 -122 75 324 528 -200 42 -450 -538 -296 -227 392 375
6466 375 178 -180 -292 -316 -340 -62 -132 590 141 -64 -277 -282 -399 -332 -125 289 304 39 -102 -445 -348 -132 -23
6489 -23 368 850 203 4 -472 -540 -355 -78 35 444 588 -134 -506 -598 -739 -204 231 510 424 -6 -183
6510 -183 -433 -460 33 111 553 545 57 -38 -211 -435 -463 -32 173 463 531 273 -164 -631 -438 -253 296 670
6532 670 165 40 -257 -649 -585 -125 77 546 553 433 345 -313 -459 -432 170 91 482 485 150 -527 -415 -487 -259
6555 -259 353 281 423 327 -97 -347 -696 -530 303 432 789 467 -202 -322 -496 -353 -275 417 771 488 374
6576 374 -355 -222 -343 -235 290 536 476 77 41 -317 -591 -237 58 103 732 381 132 -572 -756 -163 -25
6597 -25 733 639 171 242 -380 -701 -427 -353 444 607 603 178 -144 -287 -523 -133 85 646 531 387 120 -268
6619 -268 -506 -203 54 84 483 522 -37 -570 -623 -508 -144 445 359 401 303 23 -239 -564 -204 414 620 644
6641 644 414 -150 -572 -473 -524 -91 557 271 564 66 -327 -490 -405 -27 157 439 399 150 -195 -471 -257
6662 -257 -80 52 487 619 429 -172 -287 -485 -133 -13 321 771 356 -14 -292 -623 -222 -198 522 586 701
6683 701 250 -103 -439 -279 -291 135 455 467 173 -411 -362 -446 -315 54 587 407 271 -30 -429 -504 -596 -294
6705 -294 346 243 592 44 -339 -341 -644 -148 52 371 809 228 -133 -418 -566 -512 -29 571 665 292 -74
6726 -74 -304 -661 -451 -10 393 496 480 97 -402 -579 -649 -151 13 495 492 -114 119 -411 -940 -308 34 423
6748 423 258 500 -4 -452 -650 -538 -254 295 666 595 48 -439 -574 -523 -423 234 527 473 329 209 -336
6769 -336 -731 -482 -122 572 390 357 -148 -498 -615 -333 114 424 468 379 9 -267 -696 -659 -336 293 623
6790 623 501 63 98 -628 -373 -55 86 488 654 226 215 -414 -804 -504 -64 565 503 393 351 -62 -403
6811 -403 -691 -184 247 309 604 209 -316 -714 -499 -300 -195 621 597 610 -77 -417 -579 -488 -24 509 565 515
6833 515 15 -347 -492 -550 -48 345 533 354 88 -150 -489 -519 -288 312 737 588 347 86 -416 -642 -494
6854 -494 149 98 701 505 -169 -360 -379 -506 44 382 578 438 312 -278 -494 -787 -326 406 331 673 229
6875 229 -177 -232 -665 -165 -44 598 661 458 -211 -350 -457 -348 -21 554 323 432 243 -205 -718 -740 -467
6896 -467 207 399 364 527 -68 -523 -646 -256 -123 254 412 471 -186 -306 -669 -505 -201 288 241 349 -3
6917 -3 -93 -639 -518 -456 17 258 602 254 49 -306 -578 -303 99 273 469 570 261 -527 -851 -262 94
6938 94 101 723 597 97 -238 -411 -450 -408 236 470 425 366 -134 -616 -463 -232 235 548 479 160 187 -459 -610
6961 -610 -298 -4 41 499 576 -79 -470 -397 -545 15 -39 527 611 351 -87 -444 -464 -695 269 334 476 447 -244
6984 -244 -314 -697 -614 124 218 495 304 56 -158 -517 -430 -323 274 740 684 219 -536 -346 -683 -349 72 213
7006 213 356 906 46 -315 -586 -392 -77 438 453 157 -19 -404 -490 -521 -10 475 530 340 472 -310 -457
7027 -457 -729 -281 437 378 403 322 11 -384 -724 -614 -146 -5 654 383 -21 -440 -676 -343 -199 94 412
7048 412 547 24 -51 -698 -551 -280 184 481 448 542 317 -529 -615 -651 193 282 498 544 -215 -411 -511 -352
7070 -352 -233 300 382 363 366 -324 -497 -533 -399 78 532 803 244 -117 -405 -446 -346 44 488 976 533 88
7092 88 -379 -574 -435 -222 348 526 584 280 -33 -355 -280 -220 -34 324 520 296 38 -404 -485 -476 218 513
7114 513 593 457 0 -290 -826 -634 -327 172 361 476 402 -88 -355 -737 -400 -63 466 358 539 199 -74
7135 -74 -799 -619 268 275 506 490 -113 -444 -537 -660 23 80 743 590 210 -301 -272 -522 -207 441 431 528 379
7158 379 -9 -412 -746 -482 15 33 512 570 -52 -320 -725 -386 -12 70 418 624 126 38 -510 -129 -446
7179 -446 133 578 430 378 -110 -429 -515 -536 -155 652 436 369 272 -301 -753 -557 -117 343 718 724 340 210
7201 210 -662 -673 -351 82 504 635 302 -176 -355 -681 -429 -140 527 366 718 326 -481 -487 -793 -90 374
7222 374 296 418 151 129 -757 -297 -357 220 494 373 526 72 -449 -453 -573 113 297 501 725 1 -415 -635
7244 -635 -629 -39 392 578 258 367 -312 -572 -623 -66 177 548 530 73 -124 -438 -571 -212 80 247 604
7265 604 658 255 -381 -386 -667 11 358 739 365 67 -330 -437 -569 -386 381 430 547 286 -241 -585 -725
7286 -725 -278 -75 235 698 380 -61 -533 -609 -217 111 269 540 584 251 -274 -737 -437 -204 125 597 482
7307 482 105 88 -659 -546 -395 217 574 674 363 51 -411 -721 -422 -92 250 758 351 -30 -24 -690 -394
7328 -394 -297 220 696 552 450 -385 -557 -543 -314 -30 647 630 268 114 -456 -961 -690 197 69 890 678
7349 678 224 -247 -565 -721 50 158 554 705 307 -217 -627 -803 -470 -50 681 741 336 396 -753 -662 -280
7370 -280 -131 355 400 318 69 -136 -646 -332 -179 88 725 374 -72 -467 -469 -430 -391 -44 273 668 505 -93
7392 -93 -470 -433 -625 2 57 643 527 61 -395 -679 -265 -273 219 699 149 128 -159 -587 -321 126 199 475
7414 475 843 334 -110 -677 -761 -574 193 162 1102 358 -38 -556 -660 -452 -561 221 520 464 449 -250 -611
7435 -611 -572 -214 343 422 560 282 -182 -443 -607 -449 120 295 595 285 109 -215 -548 -70 -408 264 776
7456 776 508 236 -100 -686 -538 -189 120 475 743 208 97 -346 -1033 -272 125 449 725 263 -80 -317
7476 -317 -268 -482 147 296 377 424 161 -310 -669 -440 -209 297 514 504 252 -241 -387 -570 -689 67 407
7497 407 712 235 -46 -484 -886 -408 -60 526 536 480 -102 -249 -489 -720 -314 106 446 758 393 -271 -466
7518 -466 -845 -496 -97 684 451 272 -28 -464 -465 -354 -51 367 502 384 108 -51 -493 -689 -239 319 780
7539 780 269 156 -132 -418 -369 -691 -23 444 465 437 48 -753 -705 -451 -143 193 580 471 -49 22 -621 -694
7561 -694 6 314 456 478 321 1 -918 -620 -310 -7 689 746 434 -184 -169 -682 -175 -12 308 573 104
7582 104 131 -554 -475 -396 -320 474 429 849 475 -234 -441 -525 -393 -41 671 431 581 -9 -444 -550 -310 -107
7604 -107 393 789 409 3 -353 -713 -546 -343 393 634 496 164 -37 -606 -450 -251 -69 481 194 476
7624 476 -124 -287 -577 -378 61 393 417 346 5 -307 -447 -539 39 363 218 -3 180 -405 -780 -428 -127
7645 -127 -99 182 693 372 31 -420 -592 -175 142 704 638 214 -272 -19 -322 -495 105 245 437 412 297
7666 297 -165 -525 -783 -173 178 376 479 450 -214 -281 -526 -152 8 563 619 290 38 -194 -418 -255 -264 205
7688 205 405 375 169 -405 -298 -469 -231 305 558 207 223 -205 -337 -460 -179 117 532 603 376 63 -178
7709 -178 -312 -410 -148 332 599 374 103 -185 -592 -549 -279 143 433 488 166 -140 -314 -534 -45 100 228
7730 228 448 363 -22 -400 -630 -457 -6 573 505 424 219 -428 -309 -369 -70 427 591 476 134 -105 -538
7751 -538 -338 -97 64 543 682 314 6 -491 -309 -131 237 564 533 146 36 -94 -542 -198 -130 245 583
7772 583 521 94 -159 -454 -238 -36 122 258 348 289 3 -567 -500 -236 -74 5 677 415 352 -4 -291 -709
7794 -709 -381 89 353 560 251 -83 -503 -205 -142 85 447 641 -10 -71 -511 -438 -403 146 380 580 512 101
7816 101 59 -478 -510 26 44 89 556 225 -324 -218 -374 -617 163 113 219 70 87 -409 -265 -302 -49 243
7838 243 604 584 53 -584 -291 -34 -150 235 454 322 183 -58 -465 -656 -374 124 461 749 246 91
7858 91 -415 -496 -315 -260 201 633 378 118 -172 -315 -96 -160 237 576 335 -65 -81 -137 -155 -259 -109 222
7880 222 251 513 59 -230 -617 -187 62 535 377 210 -136 -14 -301 -640 -209 272 176 168 330 -253 -631
7901 -631 -368 -269 473 231 393 544 -199 -341 -515 -334 -140 511 720 626 257 -319 -716 -357 -277 382 435
7922 435 124 54 -241 -386 -586 -20 50 313 488 125 -92 -143 -328 -283 94 124 481 208 -71 -353 -275 -452
7944 -452 122 83 469 353 113 -312 -393 -325 133 316 463 213 292 -127 -563 -608 -500 -13 121 688 386 -154
7966 -154 -227 -528 -283 -80 232 304 200 307 -32 -367 -192 -173 174 419 380 149 -250 -401 -168 -225 304 189
7988 189 292 342 -121 -159 -473 -515 -121 210 402 508 -22 -157 -154 -387 -313 86 444 465 -5 -13 -351 -430 -115
8011 -115 299 237 487 171 -467 -348 -547 -221 200 308 334 228 133 -257 -170 -407 -370 151 116 412 288 -354
8033 -354 -673 -389 -236 -102 273 323 261 -10 -251 -361 -440 -67 333 702 533 -112 -240 -273 -584 -36 194
8054 194 588 386 167 -157 -414 -415 -233 -50 357 343 460 -43 -510 -535 -54 87 233 603 294 -49 -401
8075 -401 -446 -344 -14 337 447 432 365 -101 -407 -465 -99 -27 -46 535 337 -91 -634 -526 -380 -38 490 458
8097 458 67 -128 -266 -428 -587 -387 245 649 627 150 -344 -292 -464 -307 151 71 383 268 54 -238 -357
8118 -357 -495 48 323 358 454 168 -76 -401 -524 240 390 321 494 -107 -159 -487 -577 -194 128 346 291 398
8140 398 56 -609 -371 -205 50 567 185 325 5 -282 -525 -291 -26 301 698 427 -8 -354 -730 -279
8160 -279 29 70 378 473 39 -38 -79 -383 -253 10 346 709 203 -40 -131 -591 -298 -85 -15 437 396 206
8182 206 -362 -247 -597 -35 149 292 488 22 24
8191B4
$$ Imaginary data points
##PAGE= N=2
##DATA TABLE= (X++(I..I)), XYDATA
0 0 0 0 0 8 -8 0 -9 16 -16 24 -24 40 -40 48 -65 73 -89 110 -128 153 -174 204 -239 271 -314 358 -406 466
28 466 -522 592 -670 744 -839 937 -1044 1164 -1290 1436 -1593 1762 -1957 2163 -2393 2653
44 2653 -2938 3263 -3628 4043 -4529 5087 -5752 6560 -7552 8826 -10503 12839 -16333 22103
58 22103 -33388 63812 -318235 -954057 -347358 230041 302560 128690 323984 455550 43675
69 43675 -633040 -714025 -176971 323047 382274 323037 305117 104978 -357680 -612930 -365233
80 -365233 97285 333801 374122 373461 211918 -238749 -615809 -483860 14904 330245 317455
91 317455 272196 276814 36820 -447112 -658983 -273851 299825 486600 296674 127284 52356
102 52356 -165373 -479371 -485226 -46544 433865 525593 267132 -30424 -226137 -351600 -364255
113 -364255 -164486 176245 424134 417027 178844 -155306 -413593 -436009 -190901 152232
123 152232 361447 359295 216576 -4793 -268074 -442455 -350585 -2849 343791 439051 271126
134 271126 2433 -227708 -356095 -332517 -130226 171004 395331 394676 156597 -178339 -397790
145 -397790 -365300 -130604 129631 289075 334537 257252 18109 -305067 -464276 -285681
155 -285681 84423 331524 331170 205485 54823 -149999 -365207 -387489 -114536 248368 402276
166 402276 289023 69990 -132928 -297239 -352836 -196689 111482 343050 345462 173030
176 173030 -51749 -259638 -370646 -267107 34008 308552 352693 199430 8635 -162393
186 -162393 -313494 -337704 -115691 230855 403349 277580 28413 -148150 -245193 -294906
196 -294906 -205933 72819 351910 375765 140692 -122908 -256462 -277305 -209718 -17318 241995
207 241995 368949 242659 -21952 -227272 -296234 -245783 -78821 168564 343121 293529
217 293529 60061 -170260 -275624 -261524 -143871 75227 296667 340686 152338 -113225
227 -113225 -267348 -268858 -171579 1341 213495 333243 237801 -17736 -236606 -293229 -208265
238 -208265 -46007 150889 297824 278380 76041 -166258 -286759 -246405 -100387 92868
248 92868 262828 300064 149952 -93499 -260564 -267909 -150058 27899 208368 299205 213132
259 213132 -15198 -224434 -283023 -192726 -28164 149897 274110 253980 68333 -164552
269 -164552 -282073 -231342 -78364 97777 238841 271633 141798 -88390 -258924 -262213 -129604
280 -129604 46699 197543 266941 194662 -7358 -212981 -279092 -181901 -6550 155835 250980
291 250980 226914 65704 -149928 -272136 -224672 -63654 109608 226835 244023 128642
301 128642 -78368 -245426 -256183 -120198 59803 195114 242469 174072 -4545 -197433
311 -197433 -270690 -176838 4489 161359 233807 200400 58673 -134915 -257505 -221662 -58654
322 -58654 118421 220984 218523 109040 -72560 -226888 -246833 -119157 63933 195364 226859
333 226859 151174 -10516 -183120 -255052 -171479 7230 163253 225195 181188 47727 -125986
344 -125986 -240989 -211540 -54418 121629 217582 202924 94615 -69059 -209669 -234056 -115524
355 -115524 66652 196505 216157 132379 -16636 -169755 -237859 -165817 4819 162592 219997
366 219997 165130 32906 -122534 -223838 -199973 -55129 118075 213198 191444 78916 -72836
377 -72836 -196639 -218821 -110479 64282 193456 208618 119047 -24121 -161035 -220632 -155940
388 -155940 4994 159593 215203 154329 22064 -119918 -207937 -186522 -53147 113873 208772
399 208772 183283 67167 -76926 -185260 -202095 -104102 59833 187379 202601 109425 -32211
410 -32211 -155653 -204583 -144214 4046 152844 209486 147741 13941 -120225 -195505 -171998
421 -171998 -49393 107947 202180 177240 59258 -81161 -178189 -188046 -96637 55739 179530
432 179530 196368 102287 -39170 -153468 -191736 -132998 3287 144214 202854 143055 7660
443 7660 -122527 -186425 -156978 -42968 101242 192693 173585 56967 -83543 -174239 -175016 -84543
455 -84543 55886 170114 188297 99548 -39927 -151498 -183180 -121367 7687 138364 193317
466 193317 135996 4284 -122404 -179978 -146611 -37357 96894 183186 165991 52314 -86233
477 -86233 -171705 -164796 -74556 55502 160377 179036 95829 -40367 -150707 -177354 -110815
488 -110815 14053 134023 182061 128042 3341 -118793 -174296 -138983 -31373 97308 176884
499 176884 157217 46460 -86656 -165743 -155242 -67487 55204 153984 172385 91753 -42839
510 -42839 -150109 -170686 -100504 18858 127856 172124 122690 3363 -117497 -172139 -132975
521 -132975 -23930 98009 168622 147235 43039 -83620 -160793 -150499 -63511 56393 149748
532 149748 165001 86112 -44662 -147244 -163742 -93201 20351 122733 164110 118801 3900
543 3900 -116620 -169922 -126283 -15954 97971 158875 137374 42214 -78118 -156921 -148785 -58844
555 -58844 61480 147979 154937 77104 -43592 -139227 -157204 -91226 21836 122992 160443
566 160443 111204 -1418 -114796 -162238 -118573 -13594 95471 153503 132128 38734 -78850
577 -78850 -154447 -142457 -52038 64431 143415 146344 71501 -42702 -135477 -153640 -87414 26167
589 26167 123371 154359 102139 -5507 -111663 -155702 -114187 -11250 95983 151265 126455
600 126455 33098 -80623 -150344 -135432 -46644 64196 139034 141084 68145 -43674 -134215
611 -134215 -150183 -80928 31541 122524 146467 94780 -6383 -107105 -151807 -112410 -8500
622 -8500 99001 148854 117305 25243 -78813 -141592 -129924 -47319 63152 139414 138386 60750
634 60750 -49360 -131098 -141097 -75012 29487 117731 143333 92736 -9055 -108489 -148120 -104635
646 -104635 -3591 97420 142642 111631 23689 -76785 -138092 -126420 -44547 64647 139094
657 139094 134123 54291 -52778 -126886 -131875 -70053 26784 112650 141837 93257 -13058 -113000
669 -113000 -146076 -94560 3983 92516 131958 107588 27449 -74812 -141547 -127236 -35957 73283
681 73283 134636 120971 47530 -46489 -118710 -132151 -72922 30507 118971 139832 81625 -20004
693 -20004 -108354 -135793 -90015 1458 90143 131910 106063 22792 -78009 -139597 -120742 -29929
705 -29929 74563 129617 112927 43328 -44056 -113500 -130270 -73920 33004 123920 138149 70544
717 70544 -28666 -102358 -122141 -85851 -5845 85654 137030 109748 13980 -88991 -135298 -103968
729 -103968 -21331 65072 117941 113905 50518 -46169 -122563 -130364 -61059 42917 117562 124150
741 124150 65757 -22559 -97327 -124456 -87506 -1198 91000 134960 100688 7415 -87656 -128533
753 -128533 -97963 -20679 62806 115363 113222 50429 -48475 -125798 -127851 -51183 49699 112553
765 112553 112080 61652 -14908 -91482 -128596 -92416 5714 102800 132366 83422 -2309 -77606
777 -77606 -113935 -99193 -30885 62880 125621 114464 36029 -59228 -117384 -111584 -48938 39901
789 39901 107111 117051 63417 -23070 -97472 -122759 -81545 9209 97620 127283 81687 -3959
801 -3959 -78353 -110846 -93782 -28966 61660 125889 113857 29495 -66988 -114996 -99436 -40861
813 -40861 33737 98945 119427 69169 -28456 -108882 -120932 -65062 18341 87136 113592 83130
825 83130 5408 -79632 -120644 -93198 -14581 69546 116335 100408 29555 -58267 -112483 -103501
837 -103501 -40752 41209 101555 111654 61184 -28221 -104126 -118172 -63299 22017 88501 108427
849 108427 76549 4688 -75852 -119899 -93664 -10258 76122 113903 89077 22372 -53041 -104350
861 -104350 -104332 -44548 44618 108969 108856 47927 -34742 -95801 -106996 -63198 15409 88879 113642
874 113642 74406 -5813 -80609 -111042 -83095 -9977 69909 112073 91082 20230 -58840 -104458
886 -104458 -96250 -37938 43417 104261 106343 46620 -37915 -96747 -102131 -56765 16452 84791
898 84791 110881 73765 -8268 -84461 -109475 -74702 -4102 66724 104985 89064 22110 -60227
910 -60227 -107857 -93030 -28889 47399 98290 98635 45769 -34642 -96678 -103088 -53151 23207 85702
923 85702 104030 67242 -8009 -81045 -108008 -73617 -660 69184 102131 82635 18543 -58561
935 -58561 -104577 -90972 -26455 49732 97000 93255 40653 -34263 -93614 -100789 -51362 25811
947 25811 86756 100030 61170 -10789 -78334 -103458 -71120 382 70388 101055 77824 14087
959 14087 -59003 -100947 -86375 -24220 50101 95614 89768 36717 -36023 -91437 -96631 -48018
971 -48018 27280 85670 96514 56850 -13265 -77555 -100408 -67402 2934 70260 98089 73957
983 73957 10601 -58786 -97504 -82929 -21313 51323 94579 86110 32794 -37640 -89187 -92675
995 -92675 -44424 28963 84949 93881 52934 -15521 -75895 -96801 -63751 4988 70470 95548
1007 95548 69737 7271 -59018 -94462 -78992 -18639 51452 92312 82227 29314 -39124 -87326
1019 -87326 -89126 -41090 30339 84060 90062 48159 -17677 -74692 -92669 -60333 6559 70658
1031 70658 93541 65008 3785 -58567 -90994 -75189 -16941 52154 91321 78365 24529 -40672
1043 -40672 -84342 -84504 -38426 30332 83001 87996 44561 -20810 -74022 -88095 -56209 7579
1055 7579 69145 91669 62281 20 -59783 -88013 -70372 -14289 51508 89378 76482 21669
1067 21669 -42739 -82736 -79751 -34528 31248 81119 85492 41871 -23556 -73982 -85136 -51585
1079 -51585 9591 67934 88820 59774 -2240 -60960 -85561 -65664 -11186 51003 86191 72867
1091 72867 18876 -44154 -81581 -75870 -30204 32462 78586 81980 38655 -25114 -73519 -81625
1103 -81625 -46880 12092 67001 86002 56455 -4818 -61140 -82797 -61293 -8209 50784 83853
1115 83853 70257 16563 -45620 -80319 -71429 -26026 32788 76008 78758 36551 -27020 -73386
1127 -73386 -78408 -42480 14479 65045 82190 53471 -5894 -61717 -81321 -57099 -4399 50266
1139 50266 80351 67190 15286 -46138 -79935 -68470 -21603 34273 73218 74965 34879 -26196
1151 -26196 -73293 -77404 -38917 17437 63958 77441 50062 -5831 -60293 -80671 -55243 -979
1163 -979 51426 76799 61981 13504 -44257 -77755 -67087 -19760 36497 72033 70292 31332
1175 31332 -26108 -70160 -75233 -37712 19467 64108 74227 45649 -7603 -57847 -77336 -53193
1187 -53193 154 52653 75624 58077 9578 -43860 -73997 -63804 -18868 36295 71725 68124
1199 68124 27430 -28359 -68754 -70514 -34531 19140 62416 72739 43609 -10329 -58841 -74454
1211 -74454 -48729 2013 50629 72825 56657 8784 -45294 -73470 -60278 -14555 36575 68032
1223 68032 64928 27050 -28443 -68831 -68997 -30501 21702 59781 68039 41901 -8721 -58014 -74788
1236 -74788 -46839 6201 51647 68038 51151 8730 -42009 -72623 -61322 -12615 40362 67143
1248 67143 59207 22937 -25550 -64223 -68866 -31600 24018 62720 65057 35444 -9925 -52878
1260 -52878 -70650 -48425 5061 54020 69157 46738 3542 -39935 -66371 -58821 -15529 39244
1272 39244 69418 57813 17520 -28262 -59943 -62899 -31857 20722 62660 66783 32865 -15407
1284 -15407 -52764 -64484 -43949 2664 50494 69766 47700 448 -43480 -63570 -52191 -13619
1296 -13619 35555 66902 59169 17440 -31669 -61032 -58222 -26614 19705 57764 65098 34427
1308 34427 -15812 -55495 -63642 -38463 5902 47725 64740 46573 1611 -43508 -64986 -50716
1320 -50716 -9370 36781 62799 55027 17223 -29947 -60560 -58022 -24560 22555 57604 60910
1332 60910 31104 -15215 -53293 -61826 -37447 7644 48679 62666 42934 350 -41982 -62291
1344 -62291 -49217 -8995 37423 62248 51988 13312 -29901 -56987 -55409 -24520 21837 57505
1356 57505 60363 28155 -18134 -52158 -58126 -35222 6339 46487 62508 42347 -1877 -43631
1368 -43631 -60071 -45166 -7182 35149 60159 51672 13816 -30891 -57086 -52597 -21801 21677
1380 21677 54925 58743 28226 -17955 -52083 -55986 -32269 7191 44054 60245 42133 -1345
1392 -1345 -44610 -60050 -42225 -4286 34416 56246 49731 14816 -30071 -57895 -52320 -18676
1404 -18676 23500 52730 54562 26452 -15945 -50491 -55955 -31215 9061 44559 57529 39377
1416 39377 -2390 -43056 -57933 -40348 -3198 34250 54578 47353 13882 -29761 -57114 -51024
1428 -51024 -16353 24723 51286 51492 24558 -15768 -49380 -55265 -30599 10968 45453 55652
1440 55652 35993 -3746 -41292 -56167 -39289 -2334 34050 53824 45515 12246 -30145 -55905
1452 -55905 -48767 -14147 25609 49521 48510 23842 -14757 -48457 -55515 -29166 13155 46077
1464 46077 52404 32308 -3541 -39035 -54527 -39813 -2383 36139 53777 42539 9196 -29608
1476 -29608 -52756 -46667 -14355 25137 49312 47307 21571 -15927 -47157 -52913 -27849 13546
1488 13546 45525 51056 29844 -4994 -37253 -52206 -38550 -2305 36455 53855 40496 5899
1500 5899 -30087 -49750 -43868 -14245 23640 49319 47690 19678 -18920 -46890 -49236 -25102 13049
1513 13049 43499 49661 29693 -5759 -38406 -51319 -36042 -152 36003 51894 38156 5220
1525 5220 -29723 -48897 -42491 -13050 24156 48910 46248 18030 -19587 -46121 -47188 -22931 13342
1538 13342 42144 48583 29118 -6622 -38896 -50472 -33933 1449 35610 49245 36382 4633
1550 4633 -29476 -48175 -41880 -11977 25338 48677 43991 15374 -20156 -44064 -45315 -22622 12999
1563 12999 42459 48281 26982 -8227 -38757 -48288 -31743 2231 34637 48332 35573 3478
1575 3478 -29736 -47093 -39604 -10384 25188 47359 42267 14222 -20476 -43379 -43781 -21277 13605
1588 13605 41399 47362 25667 -9762 -38705 -46026 -29357 2512 33760 47401 35297 2690
1600 2690 -30582 -46751 -37386 -8048 25112 45326 40876 14026 -20410 -43806 -42718 -19265 14784
1613 14784 40848 45029 24420 -10202 -38008 -45302 -28322 3782 33684 45939 33002 1837
1625 1837 -30766 -45878 -35760 -7414 25148 44163 39367 13186 -20494 -43048 -41456 -17871
1637 -17871 15587 40367 43205 22739 -10104 -37546 -44259 -26901 4494 33751 44879 31513
1649 31513 564 -30136 -43940 -34193 -6320 25074 43396 38072 11608 -21054 -42481 -40068
1661 -40068 -16105 15557 39468 41802 21623 -10791 -37405 -43155 -25434 5749 33468 43247
1673 43247 30169 156 -30267 -43710 -33106 -4882 25762 42227 36308 10663 -20954 -41714
1685 -41714 -38725 -14928 16434 38682 40256 20548 -11047 -37017 -42256 -24166 6403 33383
1697 33383 42090 28214 -958 -29851 -42860 -32345 -3844 25897 41653 34633 9418 -21260
1709 -21260 -40569 -37679 -13643 17006 38581 39176 18675 -11765 -36154 -40704 -22939 7162 33193
1722 33193 41228 27019 -2017 -29626 -41607 -30364 -2935 26176 40789 33186 7938 -21521
1734 -21521 -39715 -36165 -12601 17705 38088 37697 17182 -12746 -35275 -39433 -21420 7969 32991
1747 32991 40238 25578 -3122 -29372 -40230 -28887 -1956 25918 40109 32098 6624 -21740
1759 -21740 -38911 -34766 -11468 17796 37388 36686 16195 -13439 -35252 -37952 -20344 8302 32356
1772 32356 39304 24177 -4111 -29906 -39190 -27545 -1072 25841 38807 31087 5922 -22421
1784 -22421 -38211 -33284 -10280 18291 36540 35130 14898 -13581 -35003 -37130 -19084 9471
1796 9471 32548 37662 22686 -4479 -29301 -38188 -26351 20 25907 37869 29398 4887 -22651
1809 -22651 -37797 -31839 -8840 18500 35735 33802 13698 -13932 -34278 -36046 -17795 10264
1821 10264 32433 36293 20759 -5408 -28573 -37161 -25323 666 26460 37402 28041 3074
1833 3074 -23159 -36365 -30080 -8255 18573 35354 32792 12317 -14816 -34085 -34634 -15865 11201
1846 11201 32013 35139 19750 -6077 -28687 -36180 -23919 1665 26783 37006 26337 1850
1858 1850 -22751 -35120 -28862 -7718 18652 35202 32061 11330 -15936 -33547 -32693 -14824 11013
1871 11013 30702 34156 19427 -6177 -29146 -35545 -22327 2552 26761 35138 24932 1608
1883 1608 -22470 -34702 -28377 -6160 19186 34552 30592 9795 -15956 -32932 -31669 -13303 11448
1896 11448 30119 33392 18473 -6991 -29337 -34695 -20785 4356 25957 33244 23685 1505 -21807
1909 -21807 -34470 -27790 -5206 20717 33789 28321 8482 -15214 -31635 -30937 -13218 12050 30676
1922 30676 32272 16342 -8189 -28558 -33283 -19815 4481 26144 32999 22089 209 -22021
1934 -22021 -33249 -26738 -4446 20847 33452 26842 6586 -15498 -29799 -29294 -13247 11895 31144
1947 31144 31883 14280 -9981 -27530 -30607 -18811 3385 25408 33159 22291 -1386 -23554 -31767
1960 -31767 -23667 -3625 18940 32239 27554 6502 -17048 -30249 -27376 -10804 11948 29199
1972 29199 30580 14421 -10104 -28295 -29819 -16376 4477 24010 31923 22063 -1586 -24017 -31630
1985 -31630 -21837 -1245 18688 30061 26033 6870 -17011 -31078 -27012 -8697 13663 27892
1997 27892 28171 14226 -9258 -27665 -30213 -15946 6627 24417 29820 19599 -1087 -22565 -31493
2010 -31493 -22392 -705 20388 29584 23833 5729 -15706 -29705 -26843 -8732 14277 28677 27325
2023 27325 11528 -9841 -26046 -28739 -15579 6169 24933 29302 17778 -2979 -21940 -29170
2035 -29170 -21140 -1046 20270 29722 22669 3843 -16423 -28206 -24651 -8617 13338 28293 26862
2048 26862 10311 -11274 -26107 -26342 -13957 5624 23729 29343 18045 -4127 -23368 -28612 -18218
2061 -18218 112 18403 27928 22977 4291 -17186 -28671 -23851 -6011 13762 26769 25126 10503
2074 10503 -10625 -26005 -26822 -12794 7497 23426 27182 16701 -3889 -22611 -28415 -17884 1658
2087 1658 18974 26519 20828 4222 -16510 -28556 -23429 -4555 15444 25824 22778 9203 -9578
2100 -9578 -24624 -26764 -13173 8694 24970 26188 13656 -4664 -20749 -26644 -17923 886 19775
2113 19775 26963 19789 2162 -16807 -26723 -22010 -4802 14432 25658 22452 8071 -10573 -24217
2126 -24217 -25735 -11789 8892 24380 25327 12513 -5487 -20301 -24897 -17055 1085 19683 27586
2139 27586 18916 296 -17463 -25185 -19995 -4272 13507 24724 22526 7782 -11571 -24574 -24054
2152 -24054 -10283 9083 23235 24194 12230 -5388 -20395 -24796 -16057 1920 19893 26607 17336
2165 17336 -175 -16839 -24537 -19265 -4331 13538 24574 22125 6698 -12012 -23995 -22592 -9175
2178 -9175 8801 22311 23101 12214 -5424 -20404 -24301 -15271 3007 19261 24739 16183 -576
2191 -576 -16312 -23632 -18596 -3868 13694 24729 21052 5289 -12492 -23098 -20915 -8577 8466
2204 8466 21700 23119 12051 -5948 -20812 -23627 -13554 3329 18600 23678 15799 -788 -16333
2217 -16333 -23377 -18161 -2974 14331 23771 20133 5074 -12390 -22387 -20300 -8106 8327 21227
2230 21227 22515 10975 -6635 -20856 -22748 -12429 3859 18022 22815 15633 -522 -16619 -23232
2243 -23232 -17400 -2079 14176 22738 18855 4573 -12002 -21600 -19710 -7472 8912 21075 21829
2256 21829 9944 -7167 -19781 -21450 -11929 3849 17319 22061 14933 -809 -16523 -22630 -16224
2269 -16224 -1332 14039 22010 17941 4209 -11618 -21316 -19061 -6570 9126 20460 20723 9429
2282 9429 -7079 -19442 -20985 -11270 4220 16820 21634 14405 -1252 -16235 -22168 -15153 -729
2295 -729 13679 21182 17195 4221 -11652 -21300 -18637 -6027 9799 19490 19416 8990 -6537 -19132
2309 -19132 -20866 -10887 4561 17431 20482 12966 -1460 -16308 -21637 -14913 -543 14161 20331
2322 20331 16238 3487 -11390 -20935 -18125 -5062 9918 19554 18667 8021 -6738 -18165 -20105
2335 -20105 -10472 5174 17387 20048 12398 -1993 -15456 -20545 -14419 -6 13868 20417 15471
2348 15471 2633 -11626 -19981 -17729 -5122 9657 19276 17895 7169 -7261 -18397 -19363 -9763
2361 -9763 5219 17079 19550 11306 -2272 -14826 -19979 -13552 231 14222 19765 14562 2279
2374 2279 -11510 -19248 -16749 -4571 9809 18872 17219 6699 -7444 -17848 -18688 -9338 5297
2387 5297 17130 19207 10743 -2872 -14976 -19505 -13083 395 13843 19346 14387 1908 -11869
2400 -11869 -19097 -16107 -4638 9978 18714 16747 6364 -7556 -17275 -17721 -8952 5357 16678
2413 16678 18847 10483 -3279 -14662 -18645 -12505 310 13475 19143 13724 1436 -11590 -18427
2426 -18427 -15322 -4072 9734 18386 16407 5633 -7815 -16970 -17170 -8321 5259 16350 18387
2439 18387 9879 -3743 -14719 -18233 -12138 747 13620 18628 13737 987 -11774 -18139 -14660
2452 -14660 -3616 9636 17730 16415 5302 -8062 -16907 -16641 -7336 5441 16159 17995 9582
2465 9582 -3712 -14718 -17552 -11345 1075 13148 18688 13077 245 -12071 -17782 -13900 -3068
2478 -3068 9468 17423 16143 5264 -8259 -16898 -16180 -6780 5574 15456 17055 9426 -3452 -14938
2492 -14938 -17746 -11074 1836 13020 17700 12536 519 -11662 -17492 -13767 -2842 9639 16977
2505 16977 15303 5099 -7910 -16750 -15461 -6144 5937 15087 16362 9070 -3691 -14441 -17521
2518 -17521 -10180 2255 13061 16785 11799 403 -11372 -17248 -13358 -2309 10149 17080 14731
2531 14731 4363 -8289 -16285 -15088 -6146 5685 15059 16332 8856 -4160 -14781 -16726 -9202
2544 -9202 2490 12844 16355 11571 266 -11315 -17239 -13298 -1763 10410 16688 13750 3786
2557 3786 -8425 -15808 -15128 -5915 6341 15192 16036 8098 -4569 -14691 -16429 -9020 2714 12545
2571 12545 16098 11078 273 -11496 -17228 -12450 -1015 10603 16110 12788 3588 -7999 -15544
2584 -15544 -15117 -5879 6817 15516 15552 6756 -5030 -13924 -15550 -8865 2633 12927 16177 10732
2598 10732 -664 -12008 -16558 -11742 -780 10375 15583 12577 3273 -8130 -15374 -14642 -5153 6921
2612 6921 15572 14655 6411 -4751 -13454 -14842 -8826 2763 12806 16201 10044 -1329 -11928 -15888
2626 -15888 -11211 -658 10095 15663 12803 2895 -8203 -15523 -13754 -4426 7378 14754 14072 6267
2640 6267 -4711 -13503 -15123 -8496 3216 13046 15403 9420 -1640 -11426 -15211 -10643 -685 10115
2654 10115 15091 12445 2693 -8726 -14911 -13333 -3848 7403 14251 13923 5936 -4874 -13593 -15022
2668 -15022 -8050 3509 13077 14705 8588 -1887 -11503 -14630 -10706 -730 10287 15545 11678 1653
2682 1653 -9272 -14757 -12834 -3595 6954 14240 13355 5362 -5538 -13474 -14184 -7153 4145 12716
2696 12716 14833 8391 -2237 -11502 -15045 -9884 -283 10470 15080 11334 1248 -9247 -14434 -11997
2710 -11997 -3444 7139 14154 13410 5035 -5843 -13382 -13731 -6625 4009 12399 14116 8018 -2457
2724 -2457 -11518 -14392 -9274 332 10058 14580 10637 1041 -9094 -14164 -11565 -2894 7344 13905
2738 13905 12845 4710 -6072 -13363 -13451 -6373 4476 12349 13701 7479 -2778 -11289 -14260 -8828
2752 -8828 632 10221 14188 10373 716 -9399 -13733 -11364 -2327 7600 13253 12173 4350 -6174
2766 -6174 -13439 -13007 -5608 4748 12227 13224 7462 -2788 -11059 -13755 -8613 1397 10346 14068 9695
2781 9695 169 -9113 -13639 -10762 -2222 7520 13601 11991 3920 -6265 -13384 -12346 -5064 4995
2795 4995 12113 12887 6763 -3053 -11364 -13555 -8122 1684 10601 13355 9078 336 -9145 -13399 -10741
2810 -10741 -1769 7732 13103 11595 3171 -6613 -13059 -11709 -4642 4864 12146 12585 6572 -3213 -11528
2825 -11528 -13155 -7622 2219 10282 13205 8709 -12 -9129 -13225 -9959 -1272 7926 13086 10838 2872
2840 2872 -6738 -12441 -11522 -4249 5076 11735 12386 5888 -3412 -11088 -12915 -7056 2291 10263 12927
2855 12927 8404 -353 -9045 -13116 -9812 -951 8233 12735 10365 2339 -6703 -12408 -11715 -4276 5386
2870 5386 11931 11926 5482 -3728 -11073 -12160 -6661 2022 10271 12719 8100 -703 -9407 -12406 -9357 -583
2886 -583 8194 12395 10205 2183 -6734 -11879 -10894 -3795 5556 12085 11594 5068 -3993 -10758 -11945 -6524
2902 -6524 2430 10099 12454 7920 -1200 -9103 -12190 -8561 -327 8146 12465 9639 1849 -7005 -11764
2917 -11764 -10514 -3374 5552 11308 10982 4855 -4328 -10942 -11650 -6108 2594 10230 12067 7176 -1324
2932 -1324 -9105 -12150 -8143 -202 8039 12160 9194 1607 -6900 -12082 -10463 -2886 5733 11344 10720
2947 10720 4454 -4408 -10567 -11481 -5525 2997 10338 11367 6859 -1375 -9141 -11432 -8196 253 8046
2962 8046 11590 8662 1193 -6882 -11376 -9589 -2693 5809 10873 10222 3890 -4535 -10392 -10696 -5047
2977 -5047 3072 9823 11186 6564 -1842 -8901 -11197 -7735 690 7871 11119 8433 931 -6860 -11184
2992 -11184 -9210 -2354 5635 10710 9685 3810 -4737 -10134 -10316 -4584 3149 9728 10970 6112 -1993
3007 -1993 -9001 -10877 -7063 605 8196 10947 8078 893 -7186 -10541 -8932 -2066 5814 10766 9565
3022 9565 3455 -4884 -9913 -9890 -4622 3473 9643 10481 5733 -1982 -8817 -10731 -6864 881 7905 10464
3038 10464 7633 504 -6829 -10205 -8451 -1868 5835 10085 9222 2975 -4640 -9859 -9611 -3953 3449
3053 3449 9507 10055 5112 -2288 -8559 -10277 -6353 748 7517 10318 7201 427 -7070 -10294 -7877
3068 -7877 -1436 5634 10214 9016 2394 -4846 -9675 -9049 -3911 3377 8943 9440 4775 -2569 -8561
3083 -8561 -9827 -5796 905 7838 9978 6953 -4 -6958 -9842 -7804 -1289 5733 9754 8337 2201
3098 2201 -4676 -9497 -8779 -3351 3691 8896 9220 4441 -2187 -8097 -9503 -5492 1080 7739 9603
3113 9603 6652 -172 -6801 -9446 -7144 -1117 5874 9468 7667 2145 -4895 -9107 -8236 -3127 3898
3128 3898 8617 9025 4423 -2993 -8117 -9037 -5226 1465 7527 9338 6092 -399 -6522 -9275 -6605
3143 -6605 -777 5631 9109 7307 1728 -5090 -9186 -8382 -3026 3828 8386 8700 3849 -2789 -7868
3158 -7868 -8941 -4702 1938 7327 9050 6031 -205 -6828 -9148 -6444 -315 5975 8825 7098 1648
3173 1648 -4715 -8740 -7743 -2538 4166 8255 8124 3927 -2874 -7884 -8566 -4435 2087 7256 8653 5456
3189 5456 -703 -6772 -8843 -6258 -338 5883 8532 6750 1345 -4512 -8324 -7577 -2626 4102 8393
3204 8393 7877 3341 -2929 -7450 -8336 -4516 2140 7302 8431 4991 -985 -6568 -8671 -6273 -343
3219 -343 5694 8652 6630 1205 -4716 -8141 -7417 -2302 3977 8189 7811 3150 -3049 -7530 -7749 -4264
3235 -4264 2094 6897 8030 4761 -866 -6684 -8254 -5650 -100 5696 8281 6622 874 -4748 -8237
3250 -8237 -6659 -2302 4141 8025 7353 2810 -3185 -7466 -7810 -3874 1964 7142 8134 4675 -1087 -6265
3266 -6265 -7960 -5351 354 5521 8106 6385 1089 -5070 -8130 -7191 -1518 4016 7811 7422 2505
3281 2505 -2774 -7032 -7727 -4251 2229 7026 8012 4531 -1281 -6229 -7756 -5406 51 5484 8026
3296 8026 5884 710 -4949 -7662 -6403 -1930 3923 7715 7209 2789 -3059 -6885 -7351 -3720 2364
3311 2364 6843 7605 3988 -1725 -6444 -7595 -5271 437 5563 7952 5727 732 -5009 -7680 -6080
3326 -6080 -1282 3906 7199 6796 2400 -3235 -7269 -7059 -3076 2117 6640 7590 4004 -1441 -6422 -7637
3342 -7637 -4703 377 5171 7750 5502 482 -4813 -7542 -6073 -1198 3994 7465 6559 2431 -3291
3357 -3291 -7230 -6934 -2862 2605 6308 7271 3881 -1668 -5902 -7530 -4529 640 5691 7504 5266
3372 5266 547 -5021 -7297 -5830 -1219 4075 7275 6466 2462 -3138 -6823 -6675 -2731 2478 6598
3387 6598 7010 3659 -1598 -6233 -7157 -4338 819 5532 7167 5072 359 -5157 -7628 -5473 -685
3402 -685 4095 6815 6110 1920 -3254 -6760 -6541 -2599 2664 6593 6629 3432 -1812 -5997 -7035 -4264
3418 -4264 805 5712 7154 4901 67 -4784 -7179 -5465 -559 4203 6862 5953 1671 -3241 -6864
3433 -6864 -6828 -2502 2767 6397 6573 3235 -1705 -5954 -7064 -4145 1025 5503 6934 4757 123 -4935
3449 -4935 -6982 -5049 -624 4077 6776 5876 1571 -3599 -6738 -6336 -2262 2864 6682 6588 3115 -1817
3465 -1817 -5853 -6730 -3906 1510 5496 6665 4586 -343 -4706 -6627 -5118 -701 4302 6764 5608
3480 5608 1546 -3555 -6551 -6164 -2506 2950 6482 6602 2993 -2097 -5978 -6624 -3964 1067 5418 6667
3496 6667 4205 -407 -4611 -6974 -5176 -561 4248 6821 5488 893 -3412 -6591 -5755 -2163 2873
3511 2873 6475 6012 2934 -2288 -5905 -6689 -3559 929 5630 6514 4025 -212 -4940 -6697 -4798 -356
3527 -356 4407 6549 5615 864 -3464 -6361 -5649 -2016 3007 6412 5981 2654 -2460 -5812 -6650 -3531
3543 -3531 1108 5479 6544 4310 -343 -4857 -6460 -4336 -450 4529 6505 5137 1043 -3695 -6318
3558 -6318 -5564 -1851 3153 6147 5940 2750 -2140 -6014 -6084 -3227 1390 4997 6284 3562 -757 -4860
3574 -4860 -6424 -4445 8 4306 6081 4913 972 -3850 -6239 -5565 -1468 3202 6175 5756 2420
3589 2420 -2434 -5698 -6020 -3153 1628 5016 6305 3952 -697 -4824 -6412 -4258 4 4004 6141
3604 6141 5000 676 -3767 -6358 -5126 -1383 3130 5704 5699 2074 -2299 -5670 -5786 -2889 1355 5455
3620 5455 5951 3426 -896 -4705 -5989 -3999 60 4360 6099 4677 834 -3798 -6054 -5144 -1286
3635 -1286 2824 5524 5560 2034 -2458 -5523 -5768 -2637 1646 5399 5388 3419 -940 -4874 -5843 -4074
3651 -4074 247 4275 5539 4234 590 -3646 -5903 -4804 -1108 3273 5659 5294 2204 -2513 -5561
3666 -5561 -5457 -2344 1679 5313 5533 2939 -982 -4773 -5912 -3760 669 4283 5605 4135 467
3681 467 -3833 -5871 -4697 -1013 3305 5608 4783 1643 -2393 -5382 -5041 -2297 1891 4853 5508 2777
3697 2777 -1025 -4489 -5757 -3642 620 4259 5751 3747 236 -3700 -5567 -4243 -747 3175 5670
3712 5670 4823 1365 -2255 -5191 -5459 -2192 1959 5012 5325 2851 -1090 -4610 -5463 -3421 585 4024
3728 4024 5384 3763 163 -3764 -5322 -4311 -882 3293 5541 4643 1242 -2450 -5134 -5077 -2074 1817
3744 1817 4954 5190 2633 -1258 -4541 -5342 -3283 665 4025 5277 3937 78 -3689 -5117 -3890
3759 -3890 -375 3148 5122 4564 1097 -2558 -4899 -4968 -1660 2202 5041 4993 2554 -1533 -4606 -4960
3775 -4960 -2868 748 4186 5363 3503 -271 -3545 -5166 -3907 -585 3238 5069 4580 985 -2729
3790 -2729 -4718 -4706 -1469 2159 4836 5138 2274 -1272 -4508 -4785 -2918 759 4169 4896 3156 -615
3806 -615 -3915 -5095 -3714 -241 2794 4960 3724 933 -2673 -4638 -4472 -1537 2170 4746 4642 2042
3822 2042 -1603 -4345 -4661 -2591 1010 4055 4800 3099 -303 -3624 -4911 -4007 -298 3105 4992 4035
3838 4035 728 -2778 -4744 -4084 -1734 2192 4527 4352 2036 -1608 -4262 -4591 -2339 893 3802 4693
3854 4693 2794 -534 -3767 -4983 -3400 -59 3093 4588 3719 408 -2827 -4760 -3910 -1354 2199
3869 2199 4314 4136 1660 -1933 -4092 -4528 -2160 1121 3729 4318 2805 -343 -3732 -4673 -3524 65
3885 65 2971 4415 3130 878 -2636 -4287 -3851 -1144 2207 4279 4116 1563 -1483 -3810 -4280 -2245
3901 -2245 1169 3751 4266 2793 -735 -3353 -4291 -2897 -26 3061 4342 3578 601 -2821 -4356 -3774
3917 -3774 -838 2471 4082 3753 1618 -1661 -3804 -4095 -2069 1211 3587 4237 2578 -802 -3173 -4306
3933 -4306 -2840 90 3338 3743 3400 363 -2363 -4158 -3679 -815 2183 3965 3917 1477 -1567 -3905
3949 -3905 -4075 -1980 913 3564 4108 2176 -688 -3300 -4210 -2722 426 3010 4153 3245 361 -2555
3965 -2555 -3905 -3383 -949 2168 3792 3589 1066 -1755 -4028 -3859 -1915 1222 3597 3660 2103 -792
3981 -792 -3130 -4196 -2541 167 3118 4171 2746 109 -2348 -4111 -3206 -640 2133 3773 3256 1396
3997 1396 -1816 -3751 -3471 -1570 1216 3566 3775 1894 -703 -3280 -3987 -2402 510 2769 3972 2784
4013 2784 281 -2418 -3785 -2926 -784 2280 3710 3275 1242 -1781 -3791 -3670 -1567 1361 3271 3447
4029 3447 2083 -451 -3063 -3870 -2261 401 3047 3761 2848 176 -2709 -3795 -3118 -566 1821 3420
4045 3420 3147 1068 -1437 -3196 -3451 -1445 1471 3509 3419 1915 -752 -3265 -3236 -2344 316 2687 3464
4062 3464 2527 -71 -2347 -3709 -3229 -741 2200 3615 3176 1056 -1430 -3048 -3328 -1648 1340 3035
4078 3035 3425 1760 -808 -2966 -3278 -2395 91 2591 3532 2393 119 -2264 -3322 -2525 -648 1839
4094 1839 3260 3095 1010 -1556 -3178 -2934 -1243 1120 3044 3101 1574 -538 -2977 -3473 -1901 284
4110 284 2612 3415 2551 -37 -2332 -3256 -2391 -411 2109 3115 2869 969 -1627 -3419 -3176 -1354 1146
4127 1146 3175 3191 1396 -706 -2752 -3077 -2038 276 2330 3320 2242 228 -2405 -3257 -2410 -455
4143 -455 2052 3175 2585 742 -1520 -3113 -2926 -1123 1309 2679 3133 1531 -679 -2661 -3180 -2036
4159 -2036 367 2378 3045 2321 -5 -2083 -3293 -2391 -183 1861 3319 2688 559 -1622 -3077 -2620
4175 -2620 -1175 954 2977 2862 1443 -1047 -2842 -3148 -1616 374 2661 3101 2020 -122 -2078 -3407
4191 -3407 -2270 -426 1852 2830 2480 669 -1650 -2883 -2470 -986 1313 2691 2878 1431 -978 -2535
4207 -2535 -2840 -1461 629 2411 2920 2165 -206 -1979 -2950 -2057 -280 1851 2889 2518 480 -1636
4223 -1636 -3038 -2700 -1072 1262 2817 2757 1446 -727 -2641 -2897 -1847 479 2644 2900 2047 -106
4239 -106 -2056 -3170 -1988 -79 1661 2977 2105 712 -1372 -2718 -2659 -989 1198 2751 2623 1142
4255 1142 -579 -2586 -2532 -1206 789 1963 3009 1746 -314 -1880 -2666 -1985 -509 1858 3031 2297
4271 2297 417 -1405 -2916 -2401 -755 1352 2416 2661 1148 -1111 -2558 -2561 -1455 666 2408 2442 1620
4288 1620 -347 -2266 -2916 -1544 -204 1811 2872 2162 667 -1788 -2422 -2573 -381 1243 2538 2643
4304 2643 933 -880 -2827 -2360 -1035 761 2180 2496 1393 -383 -2193 -2565 -1926 8 1867 2486
4320 2486 1885 414 -1679 -2448 -2177 -621 1823 2567 2291 748 -796 -2321 -2695 -1406 916 2172
4336 2172 2642 1549 -543 -2107 -2751 -1677 -78 1857 2547 1918 -40 -1550 -2405 -2205 -436 1496
4352 1496 2098 2205 881 -756 -2324 -2268 -820 919 2124 2531 1306 -378 -1751 -2451 -1613 195 1833
4369 1833 2554 1762 215 -1501 -2700 -2202 -251 1262 2121 2034 604 -950 -2423 -2326 -1117 909 2087
4386 2087 2359 1114 -509 -2079 -2293 -1537 85 2051 2468 1813 -32 -1531 -2182 -1883 -575 1376 2206
4403 2206 1947 458 -1127 -2201 -2116 -1215 930 2225 2632 1189 -649 -2102 -2346 -1525 367 1881 2246
4420 2246 1745 -206 -1504 -2089 -2027 -215 1463 2398 1839 706 -1121 -2297 -1876 -998 822 2023 2248
4437 2248 1046 -730 -1950 -2337 -1320 362 1645 2274 1454 -262 -1352 -2560 -1551 -248 1640 2313
4453 2313 1843 279 -1340 -1995 -1835 -674 892 2219 2166 1072 -835 -1938 -1848 -1329 243 1693 2045
4470 2045 1486 -207 -1620 -2290 -1721 -272 1408 2019 1839 426 -1326 -2228 -1751 -564 804 2067 2221
4487 2221 792 -740 -2010 -2026 -1044 625 1561 2095 1209 -123 -1695 -2330 -1401 -101 1479 2197 1395
4504 1395 114 -1043 -1993 -1520 -727 891 1746 1851 522 -790 -2164 -1951 -912 532 1950 2066 1137
4521 1137 -24 -1485 -2132 -1259 82 1574 1990 1665 172 -1432 -1891 -1542 -821 1147 2030 1932 727
4538 727 -1001 -1611 -1845 -828 636 1447 2139 977 -320 -1623 -1894 -1293 98 1306 2078 1573 -42
4555 -42 -1329 -1985 -1381 -447 1090 1827 1815 786 -907 -1767 -1899 -897 712 1881 1734 1008 -437 -1754
4573 -1754 -1958 -1107 300 1831 1940 1329 339 -1180 -1739 -1465 -232 1111 1823 1470 396 -953 -1459
4590 -1459 -1699 -820 820 1783 1711 858 -144 -1571 -1837 -1134 252 1620 1573 1279 19 -1247 -1702 -1229
4608 -1229 -266 1056 1811 1686 268 -771 -1621 -1700 -360 808 1625 1502 614 -357 -1676 -1507 -1044 360
4626 360 1253 1882 985 -345 -928 -1614 -1369 -309 965 1701 1154 415 -1070 -1530 -1473 -569 623 1662
4644 1662 1557 774 -631 -1422 -1507 -905 484 1252 1747 923 -188 -1329 -1525 -1018 -120 1124 1891 1426
4662 1426 413 -858 -1628 -1162 -409 923 1630 1463 687 -497 -1383 -1483 -821 412 1277 1646 936 -222
4680 -222 -917 -1595 -1348 -61 1008 1517 1423 186 -948 -1280 -1464 -296 715 1512 1236 740 -740 -1457
4698 -1457 -1322 -612 519 1202 1511 1018 -349 -1330 -1285 -981 -89 873 1288 1295 457 -800 -1520 -1190 -506 589
4718 589 1405 1461 423 -575 -1222 -1353 -479 774 1141 1272 638 -127 -811 -1214 -840 -89 914 1066 1106 302
4738 302 -831 -1368 -996 -256 657 1005 1215 652 -448 -1161 -1534 -612 359 1207 1278 639 -134 -1093 -1576 -813
4758 -813 301 925 1054 777 236 -847 -1276 -1020 -98 451 1201 987 265 -441 -1179 -1230 -675 424 1102
4777 1102 1499 642 71 -715 -1192 -872 176 816 1283 1161 -314 -796 -1236 -1037 -105 433 1215 850 369
4796 369 -331 -1036 -775 -501 287 954 916 667 -475 -754 -987 -767 -54 579 979 605 -18 -588 -786 -962
4816 -962 -354 238 882 800 503 -483 -1067 -1087 -368 414 662 987 781 -144 -614 -780 -713 278 832 1220 708
4837 708 132 -583 -1095 -401 -168 739 1190 607 275 -428 -1030 -870 -332 428 870 767 654 -229 -576 -1112
4857 -1112 -442 129 997 997 593 -147 -653 -971 -716 -278 371 1058 794 -42 -494 -680 -723 -225 94 744 727
4878 727 486 59 -586 -890 -238 65 519 661 712 -131 -755 -629 -541 26 509 855 810 482 -155 -653 -681
4899 -681 -477 294 868 910 543 -72 -351 -669 -548 -18 158 833 454 -340 -527 -437 -718 -27 170 609 641
4920 641 247 -324 -535 -481 -164 547 887 928 443 -439 -652 -776 -482 148 607 789 592 136 -437 -778 -527
4941 -527 -85 195 643 596 277 -395 -644 -599 -366 212 509 284 156 -321 -719 -723 -427 265 487 700 627 -107
4963 -107 -500 -675 -619 278 639 526 261 50 -250 -753 -604 -284 192 367 449 271 -255 -498 -662 -373 139
4984 139 194 611 34 -191 -175 -526 -512 -30 387 616 608 333 -492 -730 -452 -334 68 620 571 117 -295 -484
5006 -484 -524 -285 426 473 547 366 -184 -430 -541 -61 -274 598 426 564 -219 -301 -766 -443 -276 0 409
5027 409 193 -24 -389 -350 -454 -139 84 486 473 73 -70 -333 -478 -401 -114 240 602 574 203 -35 -639
5048 -639 -758 100 337 535 606 4 -247 -561 -559 -195 353 554 560 486 77 -564 -603 -292 -11 361 502 141
5070 141 262 -276 -486 -495 -150 160 440 584 158 -206 -274 -449 -176 112 416 446 365 42 -430 -144 114 -141
5092 -141 678 447 400 149 -167 -622 -757 -216 -4 500 366 211 -323 -443 -396 -65 144 301 302 355 -102 -326
5114 -326 -571 -42 9 172 409 88 -16 0 -735 -348 -80 236 524 240 502 -117 -603 -533 -244 222 -23
5135 -23 271 264 -20 -289 -357 -300 -226 339 416 437 98 -261 -668 -538 -240 226 691 497 46 -188 -370 -273 253
5158 253 208 449 285 308 -415 -625 -498 -362 25 103 597 420 81 -248 -536 -357 -86 254 306 532 254
5179 254 -44 -409 -475 -392 14 -91 217 271 -215 -326 -439 -364 259 181 441 -11 200 -293 -257 -685 -99 287
5201 287 434 286 168 -135 -312 -412 -305 101 457 338 487 95 -289 -497 -227 -40 275 457 275 11
5221 11 -407 -258 -589 -181 192 155 333 -181 -30 -270 -576 -324 -32 486 409 211 -199 -128 -590 -628 -38 492
5243 492 405 129 245 -194 -386 -564 -254 214 405 286 48 -84 -350 -490 -22 220 275 414 386 -84 -713
5264 -713 -173 -120 106 230 192 432 -58 -365 -341 -304 162 77 360 337 166 -211 -477 -447 -334 -81 298 191
5286 191 25 9 -164 -271 -438 -40 238 303 259 143 -275 -474 -129 26 405 565 244 67 -119 -235 -491
5307 -491 -286 46 260 255 212 -246 -294 -320 -128 -108 216 181 15 -312 -263 -247 -157 -48 180 487 71 72 10 -498
5331 -498 -355 119 243 232 396 315 -50 -496 -393 -145 -150 231 70 102 -64 56 -174 -263 171 266 358 324 185
5354 185 -290 -377 -340 -55 57 -136 -56 249 51 -284 -272 -180 95 32 316 214 85 -368 -516 -210 11 41
5376 41 358 156 207 -211 -251 -9 -33 -74 366 210 -55 141 -357 -161 -186 -161 43 198 131 41 -143 -234 -202 -1
5400 -1 128 92 317 153 -236 -271 -240 -255 427 -7 101 33 -132 -337 -338 -118 -56 49 310 261 -280 -150 -158 41
5424 41 -143 344 -133 194 -48 -171 -306 -7 -294 -90 139 203 -75 -183 -148 -277 -378 53 -160 255 -82
5445 -82 49 -85 -369 -156 311 -35 282 -22 60 24 -141 -251 -58 124 230 542 -165 -179 -384 -138 -1
5466 -1 291 260 136 -131 78 -277 -155 -38 24 102 347 97 -116 108 -36 -111 73 275 357 198 -237 20
5488 20 -107 -295 -210 320 345 109 39 -286 -130 -41 -55 297 155 10 -241 57 -145 -124 23 30 -51 62 18 93
5512 93 16 -217 -11 -10 210 217 179 112 -16 151 -107 -147 263 94 168 255 -83 -265 13 -131 142 -86 -121 349
5536 349 -48 54 -107 -57 -70 226 66 -334 -53 -111 -169 -111 74 -18 31 242 257 -41 26 261 -199 56 192
5559 192 83 -74 -20 27 39 5 -68 230 -34 -64 68 -320 -159 150 -63 19 192 51 106 -160 16 61 83
5582 83 -46 167 -109 -136 -94 -134 108 176 57 145 158 111 204 -222 165 -54 -81 258 -1 240 277 -135 -106 -81
5606 -81 199 -65 112 -36 65 47 -23 96 12 95 69 -118 -34 117 96 -53 249 77 28 229 -298 -337 126
5629 126 -158 138 30 -259 71 -71 56 -175 -110 -220 67 129 -89 -65 -52 -258 126 -194 196 112 -57 -63
5651 -63 -183 -262 -73 328 151 321 -295 14 73 -167 212 7 -104 139 110 54 59 -230 -331 199 167 -85 124
5674 124 111 97 -311 17 -271 -25 242 -12 -125 1 -256 -47 118 -33 203 316 68 203 -424 -26 -84
5695 -84 97 124 72 -95 -24 -202 -495 0 157 171 36 166 46 -77 -280 -136 107 187 176 308 138 -4
5717 -4 -249 -264 -344 44 -73 272 202 3 -140 -273 -110 198 229 185 276 73 -285 -168 -155 -35 169 180 183 -47
5741 -47 56 -216 -246 -224 -8 82 30 116 96 -316 -385 -327 182 -82 455 156 -238 305 -457 -85 -9 89 -14 -131
5765 -131 -304 -162 -42 -265 -27 234 187 191 356 -81 -104 -60 89 173 103 117 276 302 -90 -261 -125 -6 160
5788 160 333 254 228 -1 -2 -88 193 7 160 218 297 -37 -197 -122 -165 -98 258 28 -49 -110 -82 -251 -316 -175 191
5813 191 -90 119 -191 21 -217 14 37 54 462 177 -18 -187 -209 -365 -142 196 221 73 9 -201 -639 -639
5835 -639 -59 127 -115 234 282 90 -186 -355 -331 -33 86 124 267 -162 -104 -377 -300 -101 95 217 423 282
5857 282 -258 -407 -151 -422 -80 411 286 134 57 -79 -289 -390 18 189 178 223 -53 -70 -308 -227 -115 178
5879 178 593 38 -14 -172 -41 -218 -392 -8 144 417 250 -120 -247 -125 -192 -294 122 173 233 188 -254 -481
5901 -481 -355 -27 87 398 148 28 -242 -339 -422 172 214 104 216 159 -63 32 -440 -143 -46 290 170 248
5923 248 213 46 -158 -292 -157 -51 214 406 190 14 -274 -305 -145 35 -24 355 257 124 -138 -394 -463 -42
5945 -42 303 319 499 -199 -62 -565 -186 -68 43 235 132 242 -110 -83 -365 -414 -59 -44 435 297 -111 -125
5967 -125 -497 -345 -113 163 337 310 248 -119 -124 -352 -177 -115 350 341 309 -21 -180 -221 -115 207 441 332 291
5990 291 187 -152 -410 -155 -40 260 398 387 74 -58 25 -200 -210 20 500 394 68 -87 -112 -314 -286 -13
6012 -13 341 483 143 239 -203 -495 -102 19 155 480 341 81 -333 -387 -450 -423 3 362 158 287 -301 -13
6034 -13 -504 -53 326 322 328 119 293 -302 -266 -145 117 -122 56 563 92 -126 -126 -246 67 236 270 356 426 89
6058 89 -204 -137 -242 -91 278 193 185 -55 -469 -585 -563 -402 151 369 368 188 -26 -212 -446 26 297 210 337
6081 337 158 -255 -278 -451 -457 84 456 179 154 -526 -197 -367 -293 -104 141 158 450 160 -150 -229 -261 -461 -21
6104 -21 491 194 268 31 -558 -246 -388 -71 285 296 129 -51 -291 -415 -291 49 152 251 519 129 -283
6125 -283 -329 -528 -99 -28 435 376 13 -119 -373 -398 -409 -14 296 370 146 -83 -123 -321 6 -64 378 398 404 3
6149 3 -341 -223 -231 -53 185 139 428 198 15 -88 -284 -213 131 540 296 113 -204 -308 -535 -179 -72 232
6171 232 545 366 -38 40 -287 -476 -78 204 517 264 152 223 -463 -364 -70 51 457 287 76 -95 -351
6192 -351 -297 -333 -149 10 498 474 -12 39 -465 -500 -366 222 666 406 463 -166 -87 -683 -472 -97 473 569 247
6215 247 -90 -272 -210 -417 61 352 267 476 21 -128 -541 -423 -141 189 299 465 357 -119 -355 -345 -235
6236 -235 -30 -34 556 434 -259 -390 -451 -274 -68 252 575 463 203 -141 -322 -359 96 153 483 470 -184 -17
6258 -17 -405 -440 -259 -8 282 389 521 83 -427 -507 -266 -84 51 255 483 229 -327 -429 -171 -415 190
6279 190 366 228 164 -128 -108 -321 -216 88 203 253 376 36 -165 -492 -206 -117 172 463 416 62 -153 -433
6301 -433 -453 -446 147 221 888 -33 -68 -545 -445 -341 -11 417 423 400 117 -375 -451 -478 -106 217 470 262 131
6324 131 22 -401 -506 -187 150 312 241 266 -149 -227 -645 -109 -100 -126 528 152 -242 -387 -356 -272 -74 163 318
6347 318 510 94 -445 -420 -206 -126 187 86 576 -53 -158 25 -412 -273 86 285 477 382 75 -116 -390
6368 -390 -166 -92 158 339 339 -253 36 -273 -442 -420 238 414 154 303 -69 -475 -308 -322 17 445 707 289
6390 289 148 -208 -388 -409 30 602 538 525 -48 78 -523 -521 -183 337 286 441 412 27 -432 -380 -299 -19 170
6413 170 728 212 42 -33 -369 -293 27 312 318 574 -12 -39 -327 -225 -260 22 379 751 -12 152 -158 -396
6435 -396 -174 13 459 513 282 20 -196 -436 -243 83 484 268 237 -135 -192 -618 -485 73 117 465 638
6456 638 465 -132 -665 -640 -475 94 151 565 284 -162 -495 -478 -620 67 492 499 473 -154 -416 -735 -444 -226
6478 -226 235 436 462 247 -119 -405 -714 -280 96 620 264 276 397 -287 -285 -531 -360 -17 578 298 -54
6499 -54 -110 -430 -421 103 142 366 629 156 -56 -226 -321 -145 102 79 672 -63 -116 -319 -649 -460 89 91 709
6522 709 352 -234 -385 -638 -462 17 327 367 455 154 -370 -516 -267 -349 155 584 597 239 -53 -174 -586
6543 -586 -183 -188 89 649 457 163 -243 -400 -387 -327 71 427 391 63 -134 -542 -389 -142 226 537 600 281
6565 281 46 -651 -662 -94 -68 337 579 91 278 -404 -316 -383 -138 165 309 605 251 -498 -263 -368 -262
6586 -262 -23 376 257 448 -120 -498 -354 -536 10 461 168 496 9 -648 -359 -594 -172 129 449 223
6606 223 173 -206 -870 -660 -181 332 371 677 246 -107 -477 -532 -452 140 510 639 444 197 -240 -808 -360
6627 -360 30 250 272 503 76 -109 -385 -598 -83 106 800 356 169 29 -391 -856 -436 26 272 488
6647 488 421 -101 -277 -628 -540 195 360 348 785 106 -66 -596 -508 -344 38 589 529 271 -212 -729 -712 -126
6669 -126 -39 333 598 444 66 -313 -551 -657 17 258 636 403 228 -95 -560 -551 -220 236 313 590 369
6690 369 -67 -312 -566 -21 355 546 566 263 -251 -343 -631 -720 -154 301 541 410 84 -74 -210 -587 -149
6711 -149 268 607 252 391 -146 -598 -616 -255 140 282 595 454 -176 -567 -472 -513 -155 412 684 383 -8
6732 -8 -477 -475 -737 -14 220 634 540 452 -153 -535 -565 -240 97 463 640 671 -108 -704 -380 -392 -200 444 370
6755 370 556 -97 -61 -483 -329 -249 0 508 442 437 128 -329 -594 -361 149 461 716 317 -243 -654 -187 -389
6777 -389 46 503 760 410 144 -238 -591 -516 -62 -10 317 522 201 -93 -556 -582 -121 308 399 329 179 -43
6799 -43 -444 -751 -156 -125 525 263 277 128 -193 -787 -578 -105 138 533 558 189 -199 -293 -510 -332 198 768
6821 768 523 217 13 -499 -329 -638 -22 653 615 500 -12 -535 -491 -247 -79 198 391 334 244 -289 -453
6842 -453 -756 -125 251 513 803 160 85 -456 -841 -177 143 354 634 201 -68 -495 -539 -459 -12 203 664
6863 664 366 137 -371 -588 -656 -336 149 422 601 487 190 -638 -542 -677 164 388 955 212 15 -437 -362
6884 -362 -564 46 257 506 551 201 -140 -466 -402 -252 145 611 747 110 7 -491 -480 -319 64 498 536
6905 536 311 77 -623 -765 -775 123 599 628 509 283 -30 -367 -609 -247 266 369 227 251 -184 -423 -608
6926 -608 -229 169 398 828 292 -60 -247 -794 -697 124 411 87 377 127 -360 -578 -305 234 187 618 521
6947 521 128 -213 -605 -500 -374 223 483 294 331 -58 -577 -404 -488 -144 346 528 556 93 -573 -325 -321 -291
6969 -291 327 186 452 190 -214 -524 -522 -482 -39 424 679 513 -131 -357 -440 -436 -209 229 768 530 261 -342
6991 -342 -250 -708 -243 -3 465 349 340 -161 -565 -587 -445 232 415 687 341 -188 -594 -537 -358 -203 314 492
7013 492 346 188 -299 -561 -706 -165 58 419 411 173 -354 -718 -526 -476 17 587 878 119 -30 -570 -700
7034 -700 -255 -328 463 739 511 262 -280 -596 -451 -138 142 139 452 114 -295 -480 -305 -359 317 193 597
7055 597 452 -266 -251 -566 -197 126 162 628 287 183 -170 -463 -441 -83 201 503 537 103 -274 -499 -171
7076 -171 -350 -10 388 406 368 -13 -418 -687 -230 111 191 635 467 147 -457 -769 -688 -142 290 300 182 86
7098 86 -116 -479 -387 -173 58 918 260 41 -92 -431 -589 -564 -63 487 293 745 172 -320 -486 -606 -250
7119 -250 141 484 500 447 -249 -371 -464 -291 330 460 477 361 -39 -467 -421 -334 54 292 556 252 -25 -327
7141 -327 -583 -499 -180 255 736 686 121 -255 -358 -585 -180 65 661 706 128 126 -461 -495 -366 -5 511 652
7163 652 258 -91 -389 -445 -427 -255 552 685 794 9 -240 -697 -368 16 201 701 681 393 -150 -396 -547
7184 -547 -631 214 128 341 93 157 -276 -522 -391 -223 461 542 412 401 -2 -434 -475 -376 184 514 362 287 -51
7207 -51 -313 -475 -437 11 726 767 542 39 -347 -396 -549 -233 357 863 711 20 -384 -412 -387 -5 295 379
7229 379 544 555 -20 -674 -619 -406 92 326 404 781 0 -92 -485 -521 14 306 381 308 241 -497 -521 -525 -261 196
7253 196 517 690 195 186 -449 -710 -265 69 593 823 140 77 -345 -742 -481 -161 418 525 598 168 -287
7274 -287 -254 -463 -274 472 555 441 400 -4 -489 -591 -282 -90 546 753 393 140 -418 -476 -445 -40 76 352
7296 352 398 40 -87 -775 -540 -258 159 301 402 333 -156 -601 -402 -408 161 392 620 423 -181 -241 -573 -468
7318 -468 7 403 529 330 134 -353 -582 -621 -227 219 692 449 80 -380 -451 -440 -254 -73 380 532 248
7339 248 195 -504 -694 -645 124 506 634 624 278 -262 -785 -390 -402 283 550 575 -47 -179 -568 -333 -130 70
7361 70 699 397 551 -347 -707 -491 -411 -184 410 648 334 197 -270 -644 -400 -181 498 413 634 176 -232
7382 -232 -659 -492 -233 39 385 579 575 -246 -240 -962 -389 -71 388 732 370 74 -332 -804 -457 109 258
7403 258 468 471 296 -272 -750 -556 -202 142 808 634 451 49 -450 -395 -573 -78 261 559 211 -1 -414
7424 -414 -474 -413 -76 425 559 474 76 -114 -582 -550 12 537 432 478 325 -84 -475 -293 -276 -116 294 392
7446 392 147 -74 -284 -678 -719 -263 245 542 367 32 -495 -494 -587 -298 187 537 479 297 -260 -514 -337 -37
7468 -37 -43 389 463 343 93 -280 -697 -780 22 246 519 299 -52 -386 -631 -738 137 350 387 394 322 3 -467
$$ [...]
8191d19
##END NTUPLES=NMR FID
##END=
