##TITLE=1H_PR179_K4
 DMSO-d6, 8 sc, 
 20.8.2019
##JCAMPDX= 6.0         $$ Bruker NMR JCAMP-DX V2.0
##DATA TYPE= NMR FID
##DATA CLASS= NTUPLES
##ORIGIN= UXNMR, Bruker Analytische Messtechnik GmbH
##OWNER= root
$$ XWIN-NMR		Version 3.5
$$ Tue Aug 20 14:51:12 2019 Russian Standard Time (UT+4h)  she@DPX200
##.OBSERVE FREQUENCY= 200.13155
##.OBSERVE NUCLEUS= ^1H
##.DELAY= (6, 6)
##.ACQUISITION MODE= SIMULTANEOUS
##.ACQUISITION SCHEME= undefined
##.AVERAGES= 8
##.DIGITISER RES= 18
##SPECTROMETER/DATA SYSTEM= spect
##.PULSE SEQUENCE= zg30
##.SOLVENT NAME= DMSO
##.SHIFT REFERENCE= (INTERNAL, DMSO, 0, 15.7039)
##AUDIT TRAIL= $$ (NUMBER, WHEN, WHO, WHERE, WHAT)
$$ ##TITLE= Audit trail, XWIN-NMR		Version 3.5
$$ ##JCAMPDX= 5.01
$$ ##ORIGIN= Bruker BioSpin GmbH
$$ ##OWNER= she
$$ F:/spectra/data/she/nmr/H-F/1/audita.txt
$$ ##AUDIT TRAIL=  $$ (NUMBER, WHEN, WHO, WHERE, WHAT)
(   1,<2019-08-20 14:50:17.39 +0400>,<she>,<DPX200>,
      <created by zg, POWCHK disabled, PULCHK disabled
       configuration hash MD5:
       00 E9 B6 7A A2 85 ED C7 34 08 36 98 17 FE 4E 26
       data hash MD5: 16K
       43 2B A8 85 D2 29 35 61 78 C5 51 33 B2 77 C7 B3>)
$$ ##END=
$$ 
$$ hash MD5
$$ AB 03 71 03 3D CA 8B 4C F6 18 32 2A 36 46 9B 5D
##$RELAX= 
##$RELAX= 
##$RELAX= 
##$RELAX= 
##$RELAX= 
##$RELAX= 
$$ Bruker specific parameters
$$ --------------------------
##$DU= <F:/spectra>
##$EXPNO= 1
##$NAME= <H-F>
##$PROCNO= 1
##$TYPE= <nmr>
##$USER= <she>
##$AMP= (0..31)
100 100 100 100 100 100 100 100 100 100 100 100 100 100 100 100 100 100 
100 100 100 100 100 100 100 100 100 100 100 100 100 100 
##$AQSEQ= 0
##$AQ_mod= 1
##$AUNM= <au_zg>
##$AUTOPOS= <>
##$BF1= 200.13
##$BF2= 200.13
##$BF3= 200.13
##$BF4= 200.13
##$BF5= 200.13
##$BF6= 200.13
##$BF7= 200.13
##$BF8= 200.13
##$BYTORDA= 1
##$CFDGTYP= 0
##$CFRGTYP= 5
##$CHEMSTR= <none>
##$CNST= (0..31)
1 1 145 1 1 1 1 1 1 1 1 1 1 1 1 1 1 1 1 1 1 1 1 1 1 1 1 1 1 1 1 1 
##$CPDPRG= <>
##$CPDPRG1= <>
##$CPDPRG2= <>
##$CPDPRG3= <>
##$CPDPRG4= <mlev>
##$CPDPRG5= <mlev>
##$CPDPRG6= <mlev>
##$CPDPRG7= <mlev>
##$CPDPRG8= <mlev>
##$CPDPRGB= <>
##$CPDPRGT= <>
##$D= (0..31)
0 1.2 0 0 0 0 0 0 0 0 0 0.03 0 0 0 0 0 0 0 0 0 0 0 0 0 0 0 0 0 0 0 0 
##$DATE= 1566298216
##$DBL= (0..7)
120 120 120 120 120 120 120 120 
##$DBP= (0..7)
150 150 150 150 150 150 150 150 
##$DBP07= 0
##$DBPNAM0= <>
##$DBPNAM1= <>
##$DBPNAM2= <>
##$DBPNAM3= <>
##$DBPNAM4= <>
##$DBPNAM5= <>
##$DBPNAM6= <>
##$DBPNAM7= <>
##$DBPOAL= (0..7)
0.5 0.5 0.5 0.5 0.5 0.5 0.5 0.5 
##$DBPOFFS= (0..7)
0 0 0 0 0 0 0 0 
##$DE= 6
##$DECBNUC= <off>
##$DECIM= 24
##$DECNUC= <off>
##$DECSTAT= 4
##$DIGMOD= 1
##$DIGTYP= 9
##$DL= (0..7)
0 120 120 120 120 120 120 120 
##$DP= (0..7)
150 150 150 150 150 150 150 150 
##$DP07= 0
##$DPNAME0= <>
##$DPNAME1= <>
##$DPNAME2= <>
##$DPNAME3= <>
##$DPNAME4= <>
##$DPNAME5= <>
##$DPNAME6= <>
##$DPNAME7= <>
##$DPOAL= (0..7)
0.5 0.5 0.5 0.5 0.5 0.5 0.5 0.5 
##$DPOFFS= (0..7)
0 0 0 0 0 0 0 0 
##$DQDMODE= 0
##$DR= 18
##$DS= 0
##$DSLIST= <SSSSSSSSSSSSSSS>
##$DSPFIRM= 0
$$ [...]
##$SUBNAM2= <"">
##$SUBNAM3= <"">
##$SUBNAM4= <"">
##$SUBNAM5= <"">
##$SUBNAM6= <"">
##$SUBNAM7= <"">
##$SUBNAM8= <"">
##$SUBNAM9= <"">
##$SW= 24.9336996594482
##$SWIBOX= (0..15)
0 0 2 0 0 0 0 0 0 0 0 0 0 0 0 0 
##$SW_h= 4990.01996007984
##$TD= 16384
##$TD0= 1
##$TE= 0
##$TE2= 300
##$TE3= 300
##$TEG= 300
##$TL= (0..7)
0 120 120 120 120 120 120 120 
##$TP= (0..7)
150 150 150 150 150 150 150 150 
##$TP07= 0
##$TPNAME0= <>
##$TPNAME1= <>
##$TPNAME2= <>
##$TPNAME3= <>
##$TPNAME4= <>
##$TPNAME5= <>
##$TPNAME6= <>
##$TPNAME7= <>
##$TPOAL= (0..7)
0.5 0.5 0.5 0.5 0.5 0.5 0.5 0.5 
##$TPOFFS= (0..7)
0 0 0 0 0 0 0 0 
##$TUNHIN= 0
##$TUNHOUT= 0
##$TUNXOUT= 0
##$USERA1= <user>
##$USERA2= <user>
##$USERA3= <user>
##$USERA4= <user>
##$USERA5= <user>
##$V9= 5
##$VALIST= <valist>
##$VCLIST= <CCCCCCCCCCCCCCC>
##$VD= 0
##$VDLIST= <DDDDDDDDDDDDDDD>
##$VPLIST= <PPPPPPPPPPPPPPP>
##$VTLIST= <TTTTTTTTTTTTTTT>
##$WBST= 1024
##$WBSW= 4
##$XGAIN= (0..3)
0 0 0 0 
##$XL= 0
##$YL= 0
##$YMAX_a= 139439
##$YMIN_a= -224699
##$ZGOPTNS= <>
##$ZL1= 120
##$ZL2= 120
##$ZL3= 120
##$ZL4= 120
##$ABSF1= 10
##$ABSF2= 0
##$ABSG= 5
##$ABSL= 3
##$ALPHA= 0
##$AQORDER= 0
##$ASSFAC= 0
##$ASSFACI= 0
##$ASSFACX= 0
##$ASSWID= 0
##$AUNMP= <proc_1d>
##$AZFE= 0.1
##$AZFW= 0.1
##$BCFW= 1
##$BC_mod= 2
##$BYTORDP= 1
##$COROFFS= 0
##$CY= 11.3945322036743
##$DATMOD= 1
##$DC= 2
##$DFILT= <>
##$DTYPP= 0
##$F1P= 20.1720416913024
##$F2P= 0.152960286110954
##$FCOR= 0.5
##$FTSIZE= 0
##$FT_mod= 4
##$GAMMA= 1
##$GB= 0.15
##$INTBC= 1
##$INTSCL= 1
##$ISEN= 128
##$LB= 0.24
##$LEV0= 0
##$LPBIN= 0
##$MAXI= 10000
##$MC2= 0
##$MEAN= 0
##$ME_mod= 0
##$MI= 1.114404
##$NCOEF= 0
##$NC_proc= 0
##$NLEV= 6
##$NOISF1= 3.799351
##$NOISF2= 2.8
##$NSP= 1
##$NTH_PI= 0
##$NZP= 0
##$OFFSET= 15.70392
##$PC= 1
##$PHC0= -9236.329
##$PHC1= 43.00096
##$PH_mod= 1
##$PKNL= yes
##$PPARMOD= 0
##$PSCAL= 0
##$PSIGN= 0
##$REVERSE= no
##$SF= 200.130013532006
##$SI= 16384
##$SIGF1= 3
##$SIGF2= 2
##$SINO= 400
##$SIOLD= 16384
##$SREGLST= <1H.CDCl3>
##$SSB= 0
##$STSI= 0
##$STSR= 0
##$SW_p= 3612.71676300578
##$SYMM= 0
##$S_DEV= 0
##$TDeff= 0
##$TDoff= 0
##$TI= <>
##$TILT= no
##$TM1= 0
##$TM2= 0
##$TOPLEV= 0
##$USERP1= <user>
##$USERP2= <user>
##$USERP3= <user>
##$USERP4= <user>
##$USERP5= <user>
##$WDW= 1
##$XDIM= 8192
##$YMAX_p= 0
##$YMIN_p= 0
$$ End of Bruker specific parameters
$$ ---------------------------------
##NTUPLES= NMR FID
##VAR_NAME=  TIME,          FID/REAL,        FID/IMAG
##SYMBOL=    X,             R,               I
##VAR_TYPE=  INDEPENDENT,   DEPENDENT,       DEPENDENT
##VAR_FORM=  AFFN,          ASDF,            ASDF
##VAR_DIM=   8192,          8192,            8192
##UNITS=     SECONDS,       ARBITRARY UNITS, ARBITRARY UNITS
##FACTOR=    0.0002004,     1,               1
##FIRST=     0,             0,               0
##LAST=      1.6414764,     0,               0
##MIN=       0,             -224699,         0
##MAX=       1.6414764,     139439,          0
$$ Real data points
##PAGE= N=1
##DATA TABLE= (X++(R..R)), XYDATA
$$ [...]
1940a02r9O9J21J29M5m25L26L5q7j94l9L2J32L21k07o0K40n58L70J20N2m03L71
$$ -102 -201 -132 -11 118 163 -262 64 99 12 -182 -221 -189 -57 264 57 -3 237 -321 49 169 221 -182 189
1963A89k46r3J73rJ18l23O5K3O4n9j6K2L9J07R1j0l32J1M81k5k77K23n06N52k49
$$ 189 -57 -150 23 14 132 -191 -126 -103 -39 -98 -114 -92 -53 54 145 135 -197 -186 295 270 -7 216 -290 262 13
1988A3j58J59j59L64l46K60k76L18j17k2k94R9L05j95P3J9J9J17j86J49m08Q3
$$ 13 -145 14 -145 219 -127 133 -143 175 58 36 -258 -159 146 -49 24 43 62 179 -7 142 -266 -183
2010a83J39M04n08K73m2j58L12l67j01J78M38m53o4L62k17K00j49l83K35K93k03
$$ -183 -44 360 -148 125 83 -75 237 -130 -231 -53 385 -68 -132 230 13 213 64 -319 -84 209 6
2031FK08J02l01K63m83M5J35J35m8qp8j68K30K23k18o0mK32k48O4j81K51p6R1
$$ 6 214 316 15 278 -205 -160 -25 110 62 54 -24 -192 38 261 43 -17 -21 211 -37 27 -154 97 21 112
2055A12j87%L57L8k97k93K43j42J5K59m48L09j17J88p1M5j52K93k40j3j19J64
$$ 112 -75 -75 282 320 23 -270 -27 -169 -154 105 -343 -34 -151 37 -34 11 -141 152 -88 -101 -220 -56
2077e6J72K45o35Q7L41p2j27rK06Kj99L88j08l43K06r9J52l37J71p2lN8j45j96
$$ -56 116 361 -274 -187 154 82 -45 -54 152 154 -45 343 235 -108 98 -1 151 -186 -15 -87 -90 -32 -177 -373
2101c73M13J30k76j05J15n2J81j28N3n0J21mr7J34k88J4L73l03j3L88k34j85K70
$$ -373 40 170 -106 -211 -96 -148 33 -95 -42 -92 29 25 -72 62 -226 -212 161 -142 -155 233 -1 -186 84
2124H4l38J73K07l90K37J15j87L0J28m59M63j43k24J23K12K0j44j78J88K0p5L31
$$ 84 -254 -81 126 -264 -27 88 -99 -69 59 -400 63 -80 -304 -181 31 51 -93 -271 -83 -63 -138 193
2146A93j43K38m2l32J62j33L28r8p0m8j49K84j31m1j13O6J80l7J7p7K2o6m6o6
$$ 193 50 288 246 -86 76 -57 271 173 103 55 -94 190 59 18 -95 -29 151 114 131 54 76 10 -36 -102
2170a02l32K47J57l2J22QJ32k52jP3j71L29J19k53O8j29r5J06J85m02K49MJ94
$$ -102 -434 -187 -30 -62 60 68 200 -52 -53 20 -151 178 297 44 112 -17 -112 -6 179 -223 26 30 224
2193B24j85l59J12J15J63p5j63J98j40L42k18J13l76J32J40k52O4K41k14L6J87
$$ 224 39 -320 -208 -93 70 -5 -168 30 -110 232 14 127 -249 -117 23 -229 -165 76 -138 -102 85
2214H5k85P1JK3l1l3L7J34k4J64r3R5j31j22j4J40j03j50LL25k44N40l57k97J60
$$ 85 -200 -129 -128 -105 -136 -169 -132 2 -22 142 49 144 13 -109 -123 17 -86 -236 -233 92 -152 388 31 -266 -106
2239a06L68l4j17j35K35k63j06L58j63J78l78K85J05l77J12J45M8k9j01N3j87
$$ -106 262 228 111 -24 211 -52 -158 200 37 215 -163 122 227 -150 -38 107 155 126 25 78 -109
2260a09Q4j68L8L92r2oM1o4j07J21k37K77k14J07Mq1l1K28k46j6L9K86K5k39j73
$$ -109 -25 -193 -155 237 145 139 180 116 9 130 -107 170 -44 63 67 -14 -45 183 -63 -79 -40 246 271 32 -141
2285a41K19o6q7K86l31N6J33j82L39k75j16L93m46J47j27M69k90J01k00J00k07
$$ -141 78 12 -75 211 -120 -64 69 -113 226 -49 -165 228 -218 -71 -198 271 -19 82 -118 -18 -225
2306b25M14l13k28M71No8k37M7L27j66J76k01j52K55j83K16J70l75J59J98k11
$$ -225 189 -124 -352 119 124 56 -181 -134 193 27 203 2 -150 105 -78 138 308 -67 92 290 79
2327G9k36l8M00l01J16J11M5j18n6o1J70l58K47P2J44m40M33k47k10J23n9J88
$$ 79 -157 -195 205 -96 20 131 176 58 2 -59 111 -247 0 72 216 -224 209 -38 -248 -125 -184 4
2349DL33j10l69J45K00p9J44k79k50K61j50j09K65k8n5R0j28Q1j1R6J5J81k65
$$ 4 337 227 -142 3 203 124 268 -11 -261 0 -150 -259 6 -22 -77 13 -115 -34 -45 51 66 247 -18
2372a8J51j09k71N19j53qk6l41M10j24m6L45m27j96L26j43M43l93J68N9R3k53
$$ -18 133 24 -247 272 119 111 85 -256 154 30 -16 329 -98 -294 32 -111 332 -61 107 166 259 6
2394FJ92p7k57K02J77j01o7J0P8k14L9j82J41m2J14N5l3j29P2r2J7K39K24j98
$$ 6 198 121 -136 66 243 142 75 85 163 -51 -12 -194 -53 -95 19 74 41 -88 -16 -108 -91 148 372 174
2418A74k63K07J99k79j93N1o3K74j20j81L34J53l68J2l31M44J15j9L3n03K74p1
$$ 174 -89 118 317 38 -155 -104 -167 107 -13 -194 140 293 -75 -63 -394 50 165 146 179 -324 -50 -121
2440a21K17k67L91l00N1l0M0o0j29O79j28l15j53M03l5o17L14J08J80j17k27O1
$$ -121 96 -171 220 -80 -29 -59 -19 -79 -208 471 343 28 -125 278 243 -374 -60 48 228 111 -116 -55
2462e5K23l01Q9l21K54M63l86q8L14j91L9J50M8q62K73O78m81J66p4P2m0P9l2
$$ -55 168 -133 -44 -365 -111 352 -34 -122 192 1 40 190 238 -624 -351 327 -154 12 -62 10 -30 49 17
2485A7R2l55K69M3l45r3O04k29J84k64k11R4M37m81o4J22K52j07L7R3o5K55l05
$$ 17 109 -246 23 66 -279 -372 232 3 187 -77 -288 -194 243 -238 -302 -180 72 -35 2 95 30 285 -20
2508b0K9qL64k31K0l50K17L9P6j42k14J60J44%j74J65p0K28k69k32L65m7L1l0
$$ -20 9 1 365 134 154 -196 21 60 136 -6 -220 -60 84 84 -90 75 5 233 -36 -268 97 50 81 51
2532E1j19M8K1L81o25j8K22K58k37j55J86r0L75l55r4J0P4J05k99K24p0Q4K73
$$ 51 -68 -20 1 382 -243 -261 -39 219 -18 -173 13 -77 298 -57 -151 -141 -67 38 -261 -37 -107 -23 250
2555B50j59j36J58J6J39J21n84J97L64j71m77k6L00L31j2m47m0J01N36p38j5M11
$$ 250 91 -45 113 129 268 389 -195 2 366 195 -282 -308 -8 323 311 -136 -176 -75 461 -277 -292 119
2577A19j33J23q4l5k20P25k72j34l09L71M82p23j10m9M24J20k57k48J31J8J54
$$ 119 -14 109 25 -10 -230 495 223 89 -220 151 633 -90 -200 -249 175 295 38 -210 -79 -61 93
2598I3j18j74K40k28K61j72L8r1O83p05K1j35N99J55k97l48P0L44o8k91o6L77
$$ 93 -25 -199 41 -187 74 -98 -60 -151 532 -173 -152 -287 312 467 170 -178 -108 236 168 -123 -189 188
2620A88J77j75j90n0j79N04l01J49l3M4l66M41j80J49k37J50p1r1JL2K2k3j76
$$ 188 365 190 0 -50 -229 275 -26 123 90 134 -232 209 29 178 -59 91 20 -71 -70 -38 -16 -39 -215
2643b15J87L76q0l70M0L64j51L2m22j0K87M8J51m42k97O79J53l03k32j36K95J51
$$ -215 -28 348 268 -102 -62 302 151 183 -239 -249 38 86 237 -205 -502 177 330 27 -205 -341 -46 105
2665A05j30k3K83j72L7k0k27N58k53p6k42J99m1J32k48J12J07J1k65K78j58K09
$$ 105 -25 -48 235 63 100 80 -147 411 158 82 -160 39 -2 130 -118 -6 101 112 -153 125 -33 176
2687A76M5J74k87n09L21L86j96m61J98J36J24l29q7J71L10j43p9k72K04J17j08
$$ 176 221 395 108 -401 -80 306 110 -351 -153 -17 107 -222 -309 -138 172 29 -50 -322 -118 -1 -109
2708a09J12m25L65m9k0K01l15J39N9J08n7j52J89M43n69l1K51L24k91l58J93j88
$$ -109 3 -422 -57 -106 -126 75 -240 -101 -42 66 9 -143 46 489 -80 -111 140 464 173 -185 8 -180
2730a80M83j98m06K8k6N30k85m92M13K3J54L3k99N2K62o4j52k4J30J42j02l77
$$ -180 303 105 -301 -273 -299 231 -54 -546 -133 -110 44 77 -222 -170 92 28 -124 -148 -18 124 22 -355
2752c55O6L94N3j45j05j66K91o0l36M07K9R0k30L37l19R7J75J54p92R4J01M09
$$ -355 -289 105 158 13 -92 -258 33 -27 -363 44 73 163 -67 270 -49 48 223 377 -415 -321 -220 189
2774A89K39m75OK81m58K44j04n4L36j15p1j98L38k93K68k77J31J3K09m28J64O3
$$ 189 428 -47 -41 240 -218 26 -78 -132 204 89 18 -180 158 -135 133 -144 -13 0 209 -219 -55 8
2796Hk5M41j09j59k32K80k38J04k58J87m8J25n81N23J05P3k20J44J99l59L02l07
$$ 8 -17 424 315 156 -76 204 -34 70 -188 -1 -49 76 -505 18 123 196 -24 120 319 -40 262 -45
2818d5K8k3M5L02M1l41l8N2P4l18J47L0J29J21k50m0R2L64k11m56J00M3L82l04
$$ -45 -17 -40 5 307 348 7 -31 21 95 -223 -76 -46 83 204 -46 -86 6 370 159 -297 -197 -154 228 -76
2842g6J69k81j58L13K61n48J69N24m30nL5K10J5j43k40K6J39J76k37l7O6K93l05
$$ -76 93 -188 -346 -33 228 -320 -151 373 -57 -62 -27 183 198 55 -185 -159 -20 156 -81 -118 -52 241 -64
2865f4K88j02qk51q1N37n35M06k04q1j78J95kK39o0j37j39J13J41o3k41J74J11
$$ -64 224 122 114 -137 -218 319 -216 190 -14 -95 -273 -78 -80 159 99 -38 -177 -64 77 14 -227 -53 58
2888E8k20J54j8j20P3nj35K49J24l52L07k21J72R1M0q9j25Q0j19k8P3j89L42m2
$$ 58 -162 -8 -26 -146 -73 -78 -213 36 160 -192 115 -106 66 157 197 108 -17 63 -56 -84 -11 -200 142 100
2912A00m6k39K00j47K25r2q2K97l3l97q2M82m18J92K40k50J36M1J30k70k87L72
$$ 100 54 -185 15 -132 93 1 -81 216 183 -214 -296 186 -232 -40 200 -50 86 127 257 -13 -300 72
2934G2J10q5P8n0j27o4l0K11o2k64K67K69n45L02q2O9l2K51l99K8J49J79j15j5
$$ 72 182 97 175 125 -2 -66 -96 115 53 -211 56 325 -220 82 0 69 37 288 -111 -83 66 245 130 115
2958A15m08L07k0J02k12o5L83r1j31o7L10j25l31K52k04J40J16m38O34m50L31
$$ 115 -293 14 -6 96 -116 -181 202 111 -20 -87 223 98 -233 19 -185 -45 71 -367 267 -183 148
2979A48k81J60l25N04j39k35K19J44j07j15q5M0J36J48m6l57l7K9J65n7P3m0J50
$$ 148 -133 27 -298 206 67 -168 51 195 88 -27 -112 -72 64 212 166 -191 -228 -199 -34 -91 -18 -58 92
3002I2J09j97j18k72J96J28M1j4J70j49P9O5j67J28m3J94l14L01j44j7l5m8J48
$$ 92 201 4 -114 -386 -190 -62 -21 -35 135 -14 65 130 -37 91 48 242 -72 229 85 68 33 -15 133
3025A33j58J12j86k27R6K32J2l25L37j12l0K11p9q1q8L85k69j62K39j88K34p4
$$ 133 -25 87 -99 -326 -230 2 14 -311 26 -86 -116 95 16 -65 -153 232 -37 -199 40 -148 86 12
3047A2k0J17J93k49j00M27n69L66K62m68O3J13j92L15l43J02J71j05k11R0r9J27
$$ 12 -8 109 302 53 -47 380 -189 177 439 -29 34 147 -45 270 -73 29 200 95 -116 -26 -125 2
3069Bj16j39j32M11j3J92k71j27L53j04K1j12K67j24j98M9j51J44N21p19K17K01
$$ 2 -114 -253 -385 26 13 205 -66 -193 160 56 77 -35 232 108 -90 -41 -192 -48 473 -246 -29 172
3091A72j10J76l22K31q6K02j03j16k95M23j45K30j22j45j8Jo8n3J92J25m3J06
$$ 172 62 238 -84 147 61 263 160 44 -251 172 27 257 135 -10 -28 -27 -95 -148 44 169 126 232
3113B32l46k51N41j90p2J97k51L75k19Mj85K02P8n7r2k2m1R5L7K7L6p2L11j47
$$ 232 -114 -365 176 -14 -86 111 -140 235 16 20 -165 37 115 58 -34 -56 -97 -2 35 62 98 26 337 190
3137A90j94l1M1M4J7q6j03n4J46J18k82K21J38j1l41L46o6k49J66p9J95k89M6
$$ 190 -4 -35 6 50 67 -19 -122 -176 -30 88 -194 27 165 154 -187 159 93 -156 10 -69 126 -163 -117
3160a17K90k17O1j20M20j97l37K33J83k68J49k39J32P40n97k50P1n9K36j32k23
$$ -117 173 -44 17 -103 317 120 -217 16 199 -69 80 -159 -27 713 116 -134 -63 -122 114 -18 -241
3181b41J83M5Lr4r9J51j40L88m2k7l69L48k4j7M1J0K17m49J1o9LJ5J7L1J90o2
$$ -241 -58 -13 -10 -104 -203 -52 -192 196 154 127 -242 106 82 65 106 116 333 -116 -105 -174 -171 -156 -139 -108 82 20
3207B0J68k49K57j17l74M43k66M4J37pJ0l18M8L81j56P6j04j9j8Q5J20Ml12N8
$$ 20 188 -61 196 79 -295 148 -118 -74 63 56 66 -252 -204 177 21 97 -7 -26 -44 41 161 165 -147 -89
3231h9J99l50N19m39J49PL80p11K08K59K7l84J61J58O8m98N45l70L65m21j09N78
$$ -89 110 -240 279 -160 -11 -4 376 -335 -127 132 159 -225 -64 94 162 -336 209 -161 204 -217 -326 252
3253B52n89O28k79K1j41P8j04k05K50J87m41M62k2Kl24M25k96L88k92P3j42K49
$$ 252 -337 291 12 33 -108 -30 -134 -339 -89 98 -343 119 97 99 -225 200 -96 292 0 73 -69 180
3275A80jj05j27l8O3p0K02n1Q7j09J43j44R6K57k73j12M2P9k68j25K03K06k75
$$ 180 179 74 -53 -91 -28 -98 104 53 140 31 174 30 126 383 110 -2 40 119 -149 -274 -71 135 -140
3298a40K29R4l50J57r3O6j77j56L41k00L06J71m04L84k07r7l04M29P2j72L28m43
$$ -140 89 183 -167 -10 -103 -37 -214 -370 -29 -229 77 248 -156 228 21 -76 -380 49 121 -51 277 -166
3320a66J07LJ83J6q0J06L2m0l3k01N1P4J56k55j06L06O0M5o39N21l4j46K47k16
$$ -166 -59 -56 127 143 63 169 201 161 128 -73 -22 52 208 -47 -153 153 213 258 -381 140 106 -40 207 -9
3344imjL2j05k77R5K32J33K0k63L96k09j33MJ02o0K34k05L24l34J73N1k26l9J13
$$ -9 -13 -14 18 -87 -364 -269 -37 96 116 -147 249 40 -93 -89 13 -47 187 -18 306 -28 145 196 -30 -69 44
3369D4L0r9K96l77pQ0K86o40L49j8M0J26P4j03k15K23J97j07m04K44L9l5j1j94
$$ 44 74 -25 271 -106 -113 -33 253 -387 -38 -56 -16 110 184 81 -134 89 286 179 -225 19 58 23 12 -182
3393a82K01L1p8l1K90j00q2j25J86j05N1l0j69J90L7k47L77Q9m72K92r8j17j8
$$ -182 19 50 -28 -59 231 131 49 -76 110 5 56 26 -143 47 84 -163 214 303 -169 123 25 -92 -110
3416a10M7j22M16j64l8K5K35n10L59l28K10n5J21o3O4lk9j70j65N2K02J43j18
$$ -110 -63 -185 231 67 29 54 289 -221 138 -190 20 -35 86 23 87 84 55 -115 -280 -228 -26 117 -1
3439aN9Lpl29L62r7k01K1K88j65P2P6l5q9J73j17R0j13L80m90J21J91r9Pk96K05
$$ -1 58 61 54 -275 87 -10 -211 -190 98 -67 5 81 46 -43 130 13 103 -10 370 -120 1 192 93 100 -196 9
3465IJ09n9J24k82J39q5Mj76r4R4J82O4l4R5mM3N8J59l03k77N34l60J6L6J29j58
$$ 9 118 59 183 -99 40 -45 -41 -217 -311 -217 -35 29 -5 90 86 129 187 346 43 -234 300 -60 -44 -8 121 -37
3491c7l1kj1L58k00m4j64J8m7J24j14J96J16m72L12k13J87j06J19J37k56k88J27
$$ -37 -68 -70 -81 277 77 33 -131 -113 -160 -36 -150 46 162 -310 2 -211 -24 -130 -11 126 -130 -418 -291
3514b91K27j32R7J8o5M8J38M7k54K92l25J96k8Nj50N35k85j50q5K14j45J39R0
$$ -291 -64 -196 -99 -81 -146 -98 40 87 -167 125 -200 -4 -32 -27 -177 358 73 -77 -162 52 -93 46 136
3537A36O1m56L11k7l8KPl37K69OK69k80o2j29L44k2j27R7J83j68j08J83j20O9
$$ 136 197 -259 52 25 -13 -11 -4 -341 -72 -66 203 -77 -139 -268 76 54 -73 24 207 39 -69 114 -6 63
3561F3j36j8J04j25J01K70j6l98j22M01k64j50J91K06r9K39j20q5m8J20j99j54
$$ 63 -73 -91 13 -112 -11 259 243 -155 -277 124 -140 -290 -99 107 8 247 127 42 -6 114 -85 -239
3583b39J55Q3l2j67L18pj23j48J63J35j94J24p3K12Ol74J3K4J99k56J61o1J96
$$ -239 -84 -1 -33 -200 118 111 -12 -160 3 138 -56 68 -5 207 213 -161 -148 -124 75 -181 -20 -81 115
3606A15j10J44k78L68j32n48L05J19j68J63n1R3Q7k07K05O3j61J7J37ql69J60
$$ 115 5 149 -129 239 107 -441 -136 -17 -185 -22 -73 20 107 -100 105 168 7 24 161 153 -216 -56
3628e6N4m4k90K41m4K02N3n2M6l68M59K44l16n8p8K33k46J63m8n0Q8j62N1K3J0
$$ -56 -2 -46 -336 -95 -139 63 116 64 110 -258 201 445 129 71 -7 226 -20 143 95 45 133 -29 22 45 55
3653E5N8j34J53j98K26j96j12J53k81k0P30l91L8j91k20L60n6j2k0QK10n02J88
$$ 55 113 -21 132 -66 160 -36 -148 5 -276 -296 434 43 81 -110 -330 30 -26 -38 -58 -50 160 -342 -154
3676a54K19k99K78k81K59O0j27K01k25M18o08N07m8m40O7J3J76O2j18M0l75J40
$$ -154 65 -234 44 -237 22 82 -45 156 -69 349 -259 248 200 -240 -173 -160 16 78 -40 0 -375 -235
3698b35N22m55L16pk80L23k20J66J71m34L06r1Q5j31n5orp0J85J47l91M63l96
$$ -235 287 -168 148 141 -139 184 -36 130 301 -133 173 82 167 36 -19 -25 -34 -104 81 228 -163 300 -96
3721i6M02l47J80q4j31J01Q7j10j52k4N9o7rJ42J6J82k91J4k59N25j86l8Q8j50
$$ -96 306 -41 139 55 -76 25 112 2 -150 -174 -115 -182 -191 -49 -33 149 -142 -128 -387 138 -48 -86 2 -148
3745a48J02M2K96k05l2m8R6k18JJ02N77o08J13k83K96J05m76M44J1q9j59K4L9
$$ -148 -46 -4 292 87 55 7 103 -115 -114 -12 565 -43 70 -213 83 188 -288 156 167 78 -81 -57 -18
3768a8K74k07J9K9k15K10l14K44qJ85j45j10J04P1l76M2N57k71j55P3j74J71L6
$$ -18 256 49 68 97 -118 92 -222 22 14 199 54 -56 48 119 -257 -215 342 71 -84 -11 -185 -14 22
3791B2k1J28l52J10K3L26p27M15L61l00N3K59l33L12m30k1pK41l2o6K47k97K66
$$ 22 1 129 -223 -113 -90 236 -491 -76 285 -15 38 297 -36 276 -154 -175 -182 59 27 -39 208 -89 177
3814A77l66J29o7k13jL83Q3j14L9J11k1O5J5k56L17m85J4L09j00J52J43m76J73
$$ 177 -189 -60 -127 -340 -341 42 125 11 50 161 140 205 220 -36 281 -204 -190 119 19 171 314 -162 11
3837A1k94N04l99J0L6M17J05k54m46K9K82j03k24K51N3j24L8l7K11k03L28k63
$$ 11 -283 221 -178 -168 -132 285 390 136 -310 -281 1 -102 -326 -75 -22 -146 -108 -145 66 -137 191 -72
3859g2K55l41K9J33k63K39K55p9j97m0j59J42q4K38l4L9l09K20Q8o9J8j85J20
$$ -72 183 -158 -129 4 -259 -20 235 156 -41 -81 -240 -98 -182 56 22 61 -248 -28 60 -9 9 -176 -56
3882e6J43J23o7m11L93j25l44J50K6P7L48m18L12j18jj43O0K33m88M71M7k29J22
$$ -56 87 210 143 -268 125 0 -344 -194 -168 -91 257 -161 151 33 32 -111 -51 182 -306 165 212 -17 105
3905A05J69l08J06o8m23N82m97J67K73L9j91J65k24R9M03n55L00k40J78q6P4L23
$$ 105 274 -34 72 4 -419 163 -334 -167 106 145 -46 119 -105 -6 397 -158 142 -98 80 -6 68 391
3927C91m46Q9j45j01K64k5M4j10r5K65r6k07L11l13K27K0r6q9L1K03P9k76l42
$$ 391 -55 34 -111 -212 52 27 71 -39 -134 131 35 -172 139 -174 53 73 -23 -112 -81 122 201 -75 -417
3950d17M93J32k71r7K22j29O5rM45m14r6K9L1KR5j3j66J98m27O6P7N57l65L10
$$ -417 76 208 -63 -160 62 -67 -2 -11 434 20 -76 -47 -16 -14 81 68 -98 100 -327 -261 -184 373 8 318
3974C18l17J16j43j38J83j60L04M08o09J45j5p6k09R1L43l36L1r9J40j3P1L3N2
$$ 318 1 117 -26 -164 19 -141 163 571 -38 107 92 16 -193 -102 241 -95 -64 -163 -23 -36 35 68 120
3997A20M1j57J00jo6J2oK3j0j69R7n6L56l76K6mm2K60k21K76l74J74O2l05L65
$$ 120 161 4 104 103 37 49 43 66 56 -113 -16 -72 284 -92 -66 -70 -112 148 -73 203 -171 3 65 -240 125
4022A25k92J09P0q7J10j78K46O9l30J60P2K76o65J4K30J68k90L15l12K09L0p5
$$ 125 -167 -58 12 -75 35 -143 103 172 -158 2 74 350 -315 -301 -71 97 -193 122 -190 19 49 -26
4044b6j71K41j7k57l7K09J81J10k72m0J68k15K89j82q1L44j83k69J47L36l22J04
$$ -26 -197 44 27 -230 -267 -58 123 233 -39 -79 89 -126 163 -19 -100 244 61 -208 -61 275 -47 57
4066E7j4J8k99J29K67k24K75k23r1K15K61l30K2k16M70j35k56J87K2k51q1L5L55
$$ 57 43 61 -238 -109 158 -66 209 -14 -105 110 371 41 63 -153 317 182 -74 113 135 -116 -197 -162 193
4089A93k65K32k14K11j0l33J82p7j07M75l55J92l35K21n0J16K59j83k11O6l20
$$ 193 -72 160 -54 157 147 -186 -4 -81 -188 287 -68 124 -211 10 -40 76 335 152 -59 7 -313
4110c13J76J59L5j97j00M82k91J26j09q5J52n0j54K53j63l6J41o4j30O0O7K1j05
$$ -313 -137 22 57 -140 -240 242 -49 77 -32 -117 35 -15 -169 84 -79 -115 26 -38 -168 -108 -41 -20 -125
4133a25N13p12N23j15M2n8k11K06q2K15o5j71K2R9j68J74k1j12K76m13J42J14
$$ -125 388 -324 199 84 126 68 -143 63 -19 196 131 -40 -18 81 -87 87 66 -46 230 -183 -41 73
4155G3l25J13K45j36kp1R4J96l5P5k08J64k95J53n9Q9J02n58M86O2j02P1J6p7
$$ 73 -252 -139 106 -30 -32 -103 -9 187 152 227 19 183 -112 41 -18 71 173 -385 101 163 61 132 148 71
4179G1j24j61J92J8O7J57j84L4J9K4K12k78j39J42k72N12n11K19J85r6K75k83
$$ 71 -53 -214 -22 -4 63 220 36 70 89 113 325 47 -92 50 -222 290 -221 -2 183 87 362 79
4201G9j17lq4K70j28j96L28o0p8l30L83q0%n6J0j44L35K4j4o4l3j95Q1j04j0J32
$$ 79 -38 -41 -125 145 17 -179 149 89 11 -319 64 -16 -16 -72 -62 -206 129 153 139 75 42 -153 -72 -176 -186 -54
4227e4M0L20m53J86J31j65j4o6K95l00j67N61n31K26Q7q1J0P1J08k93J88l6Q7
$$ -54 -14 306 -147 39 170 5 -9 -75 220 -80 -247 314 -217 9 96 15 25 96 204 -89 99 63 150
4250A50j63l1L07J7r9l71J93l8j59M55l81J20L04m86K46Nm24P8M10l36M45k51
$$ 150 -13 -44 263 280 181 -190 3 -35 -194 261 -120 0 304 -182 64 69 -355 -277 133 -203 242 -9
4272ij02Q2m8j46K17l59M88lk25J16K8j43R7J52L3j08J66M0q9j14m18J25J44N5
$$ -9 -111 -29 -77 -223 -6 -365 123 120 -105 11 39 -104 -7 145 178 70 236 276 187 73 -345 -220 -76 -21
4296b1R2l17J66N01l34J8k66Q7R4q3M2l26L00j28J33J43l52L13O6j63R9k8l3q8
$$ -21 71 -246 -80 421 87 105 -161 -74 20 -63 -21 -347 -47 -175 -42 101 -251 62 128 -35 64 36 3 -85
4320h5J24J42J33l93n3j24K54J40k3j16n7Q2o6j22L82l14K81k07Q3PR4l88J76
$$ -85 39 181 314 -79 -132 -256 -2 138 115 -1 -58 24 -42 -164 218 -96 185 -22 61 68 162 -226 -50
4343e0O5%l8J61l46K53J03p2L6J28j54k78K87P7j01k84N67n26m0m2J72L49m28
$$ -50 15 15 -23 138 -208 45 148 76 112 240 86 -192 95 172 71 -213 354 -172 -212 -254 -82 267 -161
4366a61J06J23M3nO0N0k55k48j38N63k9k03k6O4J50k10J89Qoq8J33j97K49k36
$$ -161 -55 68 111 106 166 216 -39 -287 -425 138 109 -94 -120 -56 94 -116 73 81 75 -13 120 -77 172 -64
4390f4n0J11j46K7K02l4q9N4jq2J48qn9j43K58k12J91k17K48j22J00k06j39O26
$$ -64 -114 -3 -149 -122 80 46 -43 11 10 -72 76 68 9 -134 124 -88 103 -114 134 12 112 -94 -233 393
4414C93l52J83n6j5o2j91n1L06k64J40J46l16M12j50m59L54Jj38K27m3R0r2j29
$$ 393 41 224 168 153 91 -100 -151 155 -109 31 177 -139 273 123 -336 18 19 -119 108 65 155 63 -66
4437f6J45o7J4j10j9J81p6j34J28L0l01J21L76j68l7J90k82q9J47K22j53J99p2
$$ -66 79 12 26 -84 -103 78 2 -132 -4 26 -275 -154 222 54 17 207 -75 -164 -17 205 52 251 179
4460A79k31J82k06j05K50P0k47K13nl46j72L31L04q7M1j51k1j20J32P1q0p4L3
$$ 179 -52 130 -76 -181 69 139 -108 105 100 -246 -418 -87 217 130 171 20 -1 -121 11 82 2 -72 -39
4483c9l9J29l2J5l69L81O8r8O0o1k82K6K71nm03J09L69j46J59J9r4j01J65k0j48
$$ -39 -78 51 19 34 -335 46 114 16 76 15 -267 -241 30 25 -378 -269 100 -46 113 132 38 -63 102 82 -66
4508f6M2j6O9L0j82J90r0L21k06j56N4J98J1k14J48M1l14j11R4K06j07j93K59
$$ -66 -24 -40 29 59 -123 67 -23 298 92 -64 -10 188 199 -15 133 174 -140 -251 -157 49 -58 -251 8
4531Hk38J91j81K38M5j85L5K03q7j48J76j03J92k26M0K02m77N10j78j68J84k55
$$ 8 -230 -39 -220 18 63 -122 -87 116 29 -119 57 -46 146 -80 -40 162 -315 195 17 -151 33 -222
4553b22Q6J19L8j36J14K6K22k39k6J96p9L4j97L83j53j41MQ5l1r1j78q4L19k55
$$ -222 -136 -17 21 -115 -1 25 247 8 -18 178 99 133 -64 319 166 25 29 114 83 -8 -186 -270 49 -206
4577b06K14j03J24j75J28j12j21L54M9k44J39J22q2r8n1q5L25n74L71K02j55L
$$ -206 8 -95 29 -146 -18 -130 -251 103 152 -92 47 169 87 -11 -62 -147 178 -396 -25 177 22 25
4599B5j12k63L17J48j13J7r6L5k71J30J02R0o7k6K82k08nj05K24j77K8K54j22
$$ 25 -87 -350 -33 115 2 19 -77 -42 -313 -183 -81 9 -58 -84 198 -10 -15 -120 104 -73 -45 209 87
4622H7r5l9j91O4M19k68k02J45j03J27J58k29j0m9J7J73J50j91J11R8R5n19K67
$$ 87 -8 -47 -238 -174 245 -23 -225 -80 -183 -56 102 -127 -137 -186 -169 4 154 -37 74 172 267 -252 15
4645A5j39Q6M7N2J43k70J66N2k2m01M10p2l28L72P0k44M2J59j80m5L9j23J86L9
$$ 15 -124 -38 9 61 204 -66 100 152 130 -271 139 67 -261 111 181 -63 -21 138 -42 -87 -48 -171 15 54
4669E4j08j05q8K67m37J58L21L9m01J45N7R6j25p6J96K57k47m72N16j59n8K53
$$ 54 -54 -159 -247 20 -417 -259 62 101 -300 -155 -98 -2 -127 -203 -7 250 3 -469 47 -112 -170 83
4691H3j09M4j95L36l88pL99o0k19j2K29m5nJ40k40J21n9K5J38l16M31l5j30K4
$$ 83 -26 18 -177 159 -229 -236 163 103 -116 -128 101 56 51 191 -49 72 13 38 176 -140 291 256 126 150
4715A50j51k38k52P57l44Q0jj5P3O0k52l1K16r8L93k28m8J38j53l57J36K31p7
$$ 150 -1 -239 -491 266 -78 2 1 -14 59 119 -133 -164 52 -46 347 119 71 209 56 -301 -165 66 -11
4738a1j46L66j29J74l65m1M3J20j57j95O97m69k43M2m3M40r4J07k47Or8o6M81
$$ -11 -157 209 80 254 -111 -152 -109 11 -146 -341 356 -113 -356 -314 -357 83 -11 96 -151 -145 -243 -309 172
4761A72k38M7K59j57n7l41N56l06j89J31L81m74L30j06M4K9j61J58j72K32k24
$$ 172 -66 -19 240 83 26 -315 241 -65 -254 -123 258 -216 114 8 52 81 -80 78 -94 138 -86
4782h6K67O7j38l60K04k20K56J85k03J38o4l60J35J0J17J42j70O1n5O4j0J91r1
$$ -86 181 248 110 -250 -46 -266 -10 175 -28 110 46 -314 -179 -169 -52 90 -80 -19 -74 -10 -20 171 80
4805H0J67j85M5n7j87K90o0k70K96j01LK71j89o7m7J69k57ql0J71k29K39jk92
$$ 80 247 62 107 50 -137 153 93 -177 119 18 21 292 103 36 -11 158 -99 -107 -137 34 -195 44 43 -249
4829b49J38j42J75k0j70M18j5j70k1J03Q5k2Q8j99r2JqO4N7q5K47k04K7j3j42
$$ -249 -111 -253 -78 -98 -268 150 135 -35 -56 47 132 110 198 -1 -93 -92 -100 -36 21 -64 183 -21 6 -7 -149
4854a49J43n2j49J57j28J48j16J0L22k5j38j5j1k01J82p8L54k37J33J74j73n8
$$ -149 -6 -58 -207 -50 -178 -30 -146 -136 186 161 23 8 -3 -204 -22 -100 254 17 150 324 151 93
4876I3K8r5k1J83j92J49j44M0N2j65j91K04Q5P6l9j14Q0K4J55r0j72l17L58k48
$$ 93 121 26 5 188 -4 145 1 41 93 -72 -263 -59 26 102 63 -51 29 53 208 118 -54 -371 -13 -261
4900b61K28J36J2J79n80M28J29m05k3P8m1K18j56P1j21L00n9j01l16K56j91j29
$$ -261 -33 103 115 294 -286 142 271 -134 -157 -79 -120 98 -58 13 -108 192 133 32 -284 -28 -219 -348
4922c48K09L1R2j04K37oL7k43j19J55P2j7K89m68N05l36J1J77k24j89J47K47j86
$$ -348 -139 -108 -16 -120 117 111 148 -95 -214 -59 13 -4 285 -183 322 -14 -3 174 -50 -239 -92 155 -31
4945c1o2oM5L32r0l05J41LJ44j45m7K56k51n6L82ll25K03J83l53j34J44M3k79
$$ -31 -93 -99 -54 278 188 -117 24 27 171 26 -21 235 -16 -72 310 307 -18 185 368 15 -119 25 68 -211
4969b11L20P2k89M7M94n72M49k09J42m29L2J47N4k4j69Q5M8j52kL0K35J7k22J34
$$ -211 109 181 -108 -61 433 -139 310 101 243 -186 -154 -7 47 23 -146 -61 -13 -165 -167 -137 98 115 -107 27
4993B7P9k38J04j01JJ29K55n37M39j98K68k16M5r1L4K62j61k60J58K04k84J52
$$ 27 106 -132 -28 -129 -128 1 256 -281 158 -40 228 12 57 -34 0 262 101 -159 -1 203 -81 71
5015G1m0j6j25K13j92K34j6l60L34K5k74K1l4J94o6J07L6n0k38K16m19n7L71N8
$$ 71 31 15 -110 103 -89 145 129 -231 103 128 -146 -125 -159 35 -31 76 112 62 -176 40 -379 -436 -65 -7
5039gJ66m06L25j21k80M65K8O0m85J85K97m06L6J41K21k74J26k9j18J30k63K80
$$ -7 159 -247 78 -43 -323 142 170 230 -255 -70 227 -179 -143 -2 219 -55 71 42 -76 54 -209 71
5061G1K7k42J13J19K11j16o00O08l22P0O3J67m00q6O80j86o7kn1n8j98L58J08
$$ 71 98 -144 -31 88 299 183 -417 191 -131 -61 2 169 -231 -317 363 177 110 108 57 -1 -199 159 267
5084B67k84J91j34k21j9k7kL73j56J9Q8k10K8J00j13k75j6K39K88J45j52j71J70
$$ 267 -17 174 40 -181 -200 -227 -229 144 -12 7 95 -115 -87 13 -100 -375 -391 -152 136 281 129 -42 128
5107A28j32m9J04r9J80j90J20q3L1j13j4J76o5k19L53m1m02M07L1L54l90l88J33
$$ 128 -4 -53 51 -48 132 -58 62 -21 10 -103 -117 59 -6 -225 128 87 -315 92 123 477 87 -301 -168
5130a68m0J87m0j45K30m2j24J53L06j40L3j4m13K36K68j3m47Q3Q4J9K2K87k52
$$ -168 -208 -21 -61 -206 24 -18 -142 11 317 177 210 196 -217 19 287 274 -173 -90 -6 13 35 322 70
5153G0m28N42m53Q7K10kJ28k32J9j09J45J75n6l02K27j72K8L74m68M8O64p05K12
$$ 70 -358 184 -269 -182 28 26 154 -78 -59 -168 -23 152 96 -206 21 -151 -123 251 -217 -169 495 -210 2
5176Bm1r8K64k61K4K43ok03O1j40K74j76k08M38R2n50L58J36k31m7J71k22K15
$$ 2 -39 -137 127 -134 -110 133 127 -76 -15 -155 119 -57 -265 173 265 -285 73 209 -22 -69 102 -120 95
5199I5j52j71K48J05m76N02l11P8j08L76j43J41j64j00J07j27k1M3L7M7j40Q1
$$ 95 -57 -228 20 125 -351 151 -160 -82 -190 186 43 184 20 -80 27 -100 -121 -78 -41 6 -134 -53
5221e3j05J48o4o9J04o9J31J76k42J80K9k33K23J6K07m04Q8k38M4o3R3J41o1J05
$$ -53 -158 -10 -74 -143 -39 -108 23 199 -43 137 166 -67 156 172 379 -25 63 -175 -131 -194 -101 40 -21 84
5245H4j02J8j20j2K35j97N1Q3n2J19l8m74M26J33k75Kn1n2K86j85L45j52j72j22
$$ 84 -18 0 -120 -132 103 -94 -43 40 -12 107 69 -405 21 154 -121 -119 -170 -222 64 -121 224 72 -100 -222
5269b22K68q4M1Q9k27j5M6j12J65J5K17p7j70j77K50j53K82p9k95N3Nk0L07l32
$$ -222 46 -38 3 92 -135 -150 -104 -216 -51 -36 181 104 -66 -243 7 -146 136 57 -238 -185 -180 -200 107 -225
5293b25L24n2Q5J25j38k40K87j61l14K54R7q6OJ10l11K38q1K16n8J35m8j22mm2
$$ -225 99 47 132 257 119 -121 166 5 -309 -55 42 -44 -38 72 -239 -1 -82 134 76 211 163 41 37 -5
5317ek30K39j49K63J79k46J70j80k40O9j45J58j3J42j58J57m0r5J11Lm3N8j97
$$ -5 -235 4 -145 118 297 51 221 41 -199 -130 -275 -117 -130 12 -146 11 -29 -124 -13 -10 -53 5 -192
5340a92L72k16j33K9R7N3k39L17k43L70N3j94m9j6j45O1K4J78o03M39L77j98k25
$$ -192 180 -36 -169 -140 -43 10 -229 88 -155 215 268 74 25 9 -136 -75 -51 127 -476 -37 340 142 -83
5363h3J58K46m53N7k0J77k47K72j25r3o6K86o9k26J90Rk35K41k14N8K58j07k47
$$ -83 75 321 -132 -75 -95 82 -165 107 -18 -111 -177 109 40 -186 4 13 -222 19 -195 -137 121 14 -233
5386b33J47J92j44N6R5k5Q3j54J87j43n6J6q9J34k40J50L33m60J10J49j0j57L08
$$ -233 -86 106 -38 18 113 88 171 17 204 61 5 21 -68 66 -174 -24 309 -151 -41 108 98 -59 249
5409B49r1k66K36O0r9k19K66k72J21J62J97l5k03l11J51J08k7L5P9Lm6l52J77
$$ 249 158 -108 128 188 89 -130 136 -136 -15 147 344 309 106 -205 -54 54 27 62 141 144 98 -254 -77
5432g7%L4K84l91J23jk3J43j29l59M78M4o1K41j38j42K7k1j5j36L02k17K9L2m0
$$ -77 -77 -43 241 -150 -27 -28 -51 92 -37 -396 82 126 65 306 168 26 53 32 17 -119 183 -34 -5 27 -13
5457a3Pk79N94n59L15j33j44K27p2M1j86L22j56K75k89k5p1L73k49lk45K91N3
$$ -13 -6 -285 309 -250 65 -68 -212 15 -57 -16 -202 120 -36 239 -50 -75 -146 227 -22 -25 -270 21 74
5480G4K3j82L46P7m22L67k37K0l48P3N9M98k90l1j01J72r0J65k64q2k0M7J31m2
$$ 74 97 -85 261 338 -84 283 46 66 -282 -209 -150 348 58 27 -74 98 8 173 -91 -173 -193 -146 -15 -57
5504e7N9R4l16J53J61M8j95j76L95n23M81l4j76j07o2J65M9J63j80J14Mj26n5
$$ -57 2 96 -220 -67 94 142 -53 -229 166 -357 124 90 -86 -193 -255 -90 -41 122 -58 56 60 -66 -121
5527a21L1j55O9P0k0q2M29j45j18j83M89n27Q1M05j50j92K29R6l14K07K37m97
$$ -121 -90 -245 -176 -106 -126 -208 221 76 -42 -225 264 -263 -182 223 73 -119 110 206 -108 99 336 -161
5549a61K1K85j13j77j43M3L63P2k91r0K98J40l47n1L6O4P4Q9l24M38k25j68M9
$$ -161 -140 145 32 -145 -288 -245 118 190 -101 -191 107 247 -100 -151 -115 -51 23 112 -212 226 1 -167 -118
5572a18J21L5r0K80p2M7k05j94L1P9j94K91J06j54p0J11R0m95K25J08m2P8o8R8
$$ -118 3 38 -52 228 156 203 -2 -196 -165 -86 -280 11 117 -37 -107 4 94 -401 -176 -68 -110 -32 -100 -2
5596bK13j73j68L74m62K23j61L39r3j96N5o5J78J61m02j3R9j99L17qR7j58Q0K25
$$ -2 211 38 -130 244 -218 5 -156 183 90 -106 -51 -116 62 223 -179 -192 -93 -292 25 17 114 -44 36 261
5620B61k87j65J89k47N8J70k6q0K37k53J54N6l20J38K16q0k19J24J76J78k78R5
$$ 261 -26 -191 -2 -249 -191 -21 -47 -127 110 -143 11 67 -253 -115 101 21 -198 -74 102 280 2 97
5642I7J2p4k17J08l26M32j29M13k55k46K37R7j5l04L33j65K24r8k66N4N7j67K98
$$ 97 109 35 -182 -74 -400 32 -97 316 61 -185 52 149 134 -170 163 -2 222 124 -142 -88 -31 -198 100
5665A00j56J36k71M25j88j91L85l69K13P2j48k23R5jM32l81K65k2k01J6o2M23
$$ 100 -56 80 -191 234 46 -145 240 -129 84 156 8 -215 -120 -121 311 -70 195 173 -28 -12 -74 349
5687C49n69K87l96L64l00L55m9j62j47L29K74n04Q1J52q5K1J12m24K99K4l7M6
$$ 349 -220 67 -329 35 -265 90 41 -121 -268 61 335 -169 -88 64 -21 0 112 -312 -13 11 -26 20
5709B0P5j28k30L01j72O8M5K95l13k2o3K31m0l15N18r2m9k24pK00o0k53J86J69
$$ 20 95 -33 -263 38 -134 -66 -21 274 -39 -61 -124 107 67 -248 270 178 129 -95 -102 98 38 -215 -29 140
5733A40k46L43l29RK21k45L08j29p7J93k33J81n8K7j07n28M15K37P4k50J16J41
$$ 140 -106 237 -92 -83 138 -107 201 72 -5 188 -45 136 78 105 -2 -530 -115 122 196 -54 62 203
5755B03j95k47K38r0j12J12J04J63k81J75o2j07J58k22K34K08l13k43J78Q9j60
$$ 203 8 -239 -1 -91 -203 -91 13 176 -105 70 8 -99 59 -163 71 279 -34 -277 -99 -10 -170
5776a70O70n04k04L55n6l58J12M3j48K64r4K99N4j43R6k30L66l07j53j17M9K14
$$ -170 500 -4 -208 147 91 -267 -155 -112 -260 4 -90 209 263 120 216 -14 352 45 -108 -225 -176 38
5798C8j17J48R5k43N6J74j23J15l60L08k4J4j93J49l59K42K90k60M8m01L67k8
$$ 38 -79 69 164 -79 -23 151 28 143 -217 91 67 81 -112 37 -322 -80 210 -50 -2 -403 -36 -64
5820f4L50j38j26l42M81l52R7K43J65m03K1m7P1PJ77k8m49K07M7K16k23K63m6
$$ -64 286 148 22 -320 161 -191 -94 149 314 -89 -68 -115 -44 -37 140 112 -337 -130 -83 133 -90 173 127
5843A27k64M1J21l9m6K3n9K88n88M33O2K2k58l2K0J33N1K56m37K59k49K6m4L00
$$ 127 -137 -96 25 -14 -60 -37 -96 192 -396 37 99 121 -137 -169 -149 -16 35 291 -146 113 -136 -110 -154 146
5867A46L3m27M12l41Oq1K47K15j45K41l18j54M19k84j10J38K43n21L17Q1j96J37
$$ 146 179 -248 164 -177 -171 -252 -5 210 65 306 -12 -166 253 -31 -141 -3 240 -281 36 117 -79 58
5889E8j67o4M60j99k98M16n3L4m14J20p0K30l70L46k32L41k86R8J01q0K2O6p3
$$ 58 -109 -173 287 88 -210 206 153 187 -227 -107 -177 53 -317 29 -203 138 -148 -50 51 -29 -7 59 -14
5912a4L4m6J1J50l63J37J27J9j65L82n8k19K62k72J70k08j02J57j5J02k82K02
$$ -14 20 -26 -15 135 -228 -91 36 55 -110 272 214 -5 257 -15 155 -53 -155 2 -13 89 -193 9
5934IJ68l9k72N54m09l84L96K80j98k25M8J19P3L6k57K12J04l60P0J46j42J98
$$ 9 177 138 -134 420 11 -373 23 303 105 -120 -72 47 120 156 -101 111 215 -145 -75 71 -71 127
5956A27Nl46L3J08Q5l38j19N56j76J13o1k58R4J91J39K9l19rO9k83Q1M07j52J1
$$ 127 132 -214 -181 -73 12 -326 -445 111 -65 48 -13 -271 -177 14 153 182 -137 -146 -77 -360 -279 128 -24 -13
5980a3L18k40L3r5N0L6J49j42J10k55l32L48k41K08J81%m1k03J71J97j29k17M4
$$ -13 305 65 98 3 53 89 238 96 206 -49 -381 -33 -274 -66 115 115 74 -129 42 239 110 -107 -63
6003f3K00J33Knn59L16K35l07K50m70M32j78M5j93M6J8j8M18n62J32K74l51K91
$$ -63 137 270 272 267 -292 24 259 -48 202 -268 164 -14 31 -162 -116 -98 -116 302 -260 -128 146 -205 86
6026H6j53Q4j76j08L91j49L13l17K74j46N6m99K63J04J25j70J71j85P9p0j1J82
$$ 86 -67 17 -159 -267 124 -25 288 -29 245 99 155 -344 -81 23 148 -22 149 -36 43 -27 -38 144
6048A44J8k89M0J87L9m37J78K8J61j55J93L7q2N3k29L50m56K39RL7j68j82L48
$$ 144 162 -127 -87 100 139 -298 -120 -92 69 -86 107 144 62 115 -114 236 -220 19 28 65 -103 -285 63
6071F3p6L2k07J43LL9j13J31K94q7l35j55J74J01J8k41K53k33Q9n8J69k77J02
$$ 63 -13 19 -188 -45 -42 -3 -116 15 309 222 -113 -268 -94 7 25 -216 37 -196 -107 -165 4 -273 -171
6094a71k54O52l21J0j04J08j3J40j75K87k31Q4j16L05j28j79Q5o0p6J03j78M88
$$ -171 -425 227 -94 -84 -188 -80 -93 47 -128 159 -72 12 -104 201 73 -106 -21 -81 -157 -54 -232 256
6116B56l20K24j69j85J17n2j9N7J39%o4k41K37k17K44J47k88M0j74J43J52N6o2
$$ 256 -64 160 -9 -194 -77 -129 -148 -91 48 48 -16 -257 -20 -237 7 154 -134 -94 -268 -125 27 83 21
6139B1k71M81k13J71l72J07N3lMl9L92m76L19j59n28O42j91k5K57l43K00P6R0
$$ 21 -250 231 18 189 -183 -76 -23 -26 -22 -61 331 -145 174 15 -513 129 -62 -87 170 -173 27 103 193
6162A93l42q1J87L13P7m27R2R7m96P0J44jR4n4J85j79K06L8j21j48J27j06k49
$$ 193 -149 -230 -43 270 347 -80 12 109 -387 -317 -173 -174 -80 -134 51 -128 78 116 -5 -153 -26 -132 -381
6185c81L13L9q9L87o0k78k05L28j48M71j57l50q9M7%q1L06Pk33K06J0k3J33k31
$$ -381 -68 -29 -118 269 209 -69 -274 54 -94 377 220 -130 -219 -172 -172 -253 53 60 -173 33 43 20 153 -78
6209g8Q6R6m37O17k02N6k41L02L9l38N24q48L15N05m61k0J34J85l64J05J43j83
$$ -78 8 104 -333 284 82 138 -103 199 238 -100 424 -424 -109 396 -65 -85 49 234 -130 -25 118 -65
6231f5j43j29J19L23K0k40j01K25q9J42j04J4L59p59M01R4n0l6k1J95k66q2kj6
$$ -65 -208 -337 -218 105 125 -115 -216 9 -80 62 -42 -28 331 -428 -27 67 17 -19 -40 155 -111 -193 -195 -211
6255b11J60J94L9j23l5J59l80L64k10r1K17j81K21k18j41K07k12p1L30j7O9J81
$$ -211 -51 143 182 59 24 183 -197 167 -43 -134 83 -98 123 -95 -236 -29 -241 -312 18 1 70 251
6277B51j11l28L69n04N24m28R0K08j4r6K00l5j95k1J77lk15j53L4j36L92j38K46
$$ 251 140 -188 181 -323 201 -227 -137 71 57 -39 161 126 -69 -90 87 84 -131 -284 -250 -386 6 -132 114
6300A14j33nq8K82k00Kj28K6K4J78k04J76Q8j18J62j26P0m8m14J48p3O45j41o35
$$ 114 -19 -24 -112 170 -30 -28 -156 -130 -106 72 -132 44 132 14 176 50 120 72 -342 -194 -267 378 237 -398
6324c98K81j14Q6K94m7l0Q7j01o4j66J66J78n03L07J7m73K23K88j33K59k67Q9
$$ -398 -117 -231 -145 149 102 72 159 58 -6 -172 -6 172 -331 -24 -7 -480 -257 31 -102 157 -110 -21
6346b1Oj54J97m5p5Q4N6L5J40j58J60j58Lk01J2L43r7k63L58l23K16L3P3k18M17
$$ -21 -15 -169 28 -17 -92 -8 48 83 223 65 225 67 70 -131 -119 224 127 -136 222 -101 115 148 221 3 420
6371D20o11mL97k86P2J09n9j12l67N75k9j09J8l53J99Q2o5L8K20n46N33j16j32
$$ 420 -191 -195 202 -84 -12 97 38 -74 -441 134 105 -4 14 -339 -140 -58 -123 -85 135 -411 122 6 -126
6394a26Q3K72m06K42j24p9J72Q3k42q6L4K15M6m35M58j32MJ02j46J80k4k66j1
$$ -126 -43 229 -177 65 -59 -138 34 117 -125 -211 -177 38 84 -351 107 -25 -21 81 -65 115 91 -175 -186
6417a86K10j09J66n41P50j51n9r7j35L1J69n6k88K52J20K2q4N7l7j9L25o28K88
$$ -186 24 -85 81 -460 290 139 80 -17 -152 -121 48 -8 -296 -44 76 98 14 71 34 15 340 -288 0
6440@J96j97L38m96K35l96M02j81M56l82k17P9L96k72o9J27P4k01M9J03j26K7
$$ 0 196 -1 337 -159 76 -320 82 -99 357 -25 -242 -163 233 -39 -108 19 93 -108 -59 44 -82 -55
6462e5P8l69L94qn2k34K48j13J9K06k31R8k21K82j99J48J02J40j87n7j28N40j63
$$ -55 23 -346 48 40 -12 -246 2 -111 -92 114 -117 -19 -240 42 -157 -9 93 233 46 -11 -139 401 238
6485B38k93J08j47l7K46l45L46j34K93k42l47K30L21o5r6l03J55j09N2J2K19p4
$$ 238 -55 53 -94 -131 115 -230 116 -18 275 33 -314 -84 237 172 76 -227 -72 -181 -129 -117 102 28
6507B8r6K09N9k45K30l83K85j02Q3M7j75M4J29K35n73K89j1Jk62J91j9J26k67
$$ 28 -68 141 200 -45 185 -198 87 -15 68 115 -60 -16 113 348 -225 64 53 54 -208 -17 -36 90 -177
6530a77J43j92N1J20o4O9J79l02M16j11j35O5j20n8q0K19j76K53n2m1l99K76k31
$$ -177 -34 -226 -175 -55 -119 -50 129 -173 243 132 -3 62 -58 -116 -196 23 -153 100 48 7 -392 -116 -347
6553c47L20n9L37k04P3o8j0p8L59l65k11j16N64k12J01j09N6O9j82k7K10j89j7
$$ -347 -27 -86 251 47 120 52 42 -36 323 -42 -253 -369 195 -17 84 -25 31 100 -82 -109 101 -88 -105
6576a05J37nj05N7J11Q0m2k96J64M7j99O09m07M7j96l8K83q5M6nl92K43J69k04
$$ -105 32 27 -78 -21 90 170 128 -168 -4 43 -156 453 46 93 -103 -141 142 57 103 98 -294 -51 118 -86
6600h6K57l25N3j30J17L38l36P1R6k57N2L34k89Q6m1J34l70M87k28q2K03j10K76
$$ -86 171 -154 -101 -231 -114 224 -112 -41 55 -202 -150 184 -105 -19 -60 74 -296 191 -37 -119 84 -26 250
6623B50q5J2k03k17M10j78J62q9J58j32K60m00q9L90j45l3k09J53j04q8M08l23
$$ 250 165 177 -26 -243 167 -11 151 62 220 88 348 -52 -141 249 104 71 -138 15 -89 -177 231 -92
6645i2k02K40J37j51j4L00j49j06J25m26K4K42J78j82Q5j14J19j75K85l29j7O6
$$ -92 -294 -54 83 -68 -82 218 69 -37 88 -338 -314 -72 106 -76 9 -105 14 -161 124 -205 -222 -156
6667a56K10k7l04J65P4o3L8j75J40J84k90N0K40j82M18n52P4M9k4L7j5J43j16
$$ -156 54 27 -277 -112 -38 -101 -63 -238 -98 86 -204 -154 86 -96 322 -230 -156 -107 -131 -94 -109 34 -82
6690h2K72L4q2j02k1o6R8J12l52O7J7K66q9q2j8K7j17K11j6l59R7J71O1k86K83
$$ -82 190 224 142 40 19 -47 51 163 -189 -122 -105 161 72 -10 -28 -1 -118 93 77 -282 -185 -14 47 -239 44
6715D4j30J95k03R1K77o7j82Q1l43J93K4k51J62p9K84J65k83K48k62N1m7M2rM43
$$ 44 -86 109 -94 -3 274 207 25 106 -237 -44 -20 -271 -109 -188 96 261 -22 226 -36 15 -32 10 1 444
6739D44n97M82m27k83O09k90J45n1L2m7J3l02M36m88J79J70l12J75j28K78L84
$$ 444 -153 329 -98 -381 228 -62 83 32 64 17 30 -272 164 -324 -145 25 -287 -112 -240 38 422
6760D22o22q3P4K90k64L57J70m00L12l38k2K60m47M08qk95q8L87j18k6L7J20o2
$$ 422 -200 -283 -209 81 -183 174 344 -56 256 -82 -104 156 -291 117 109 -186 -274 113 -5 -31 6 126 64
6783F4O5R7l42R1K51k93K4j04J03K59j65J33o8N3m7M7j60J00j44k95N13k16P0
$$ 64 129 226 -116 -25 226 -67 -43 -147 -44 215 50 183 115 168 121 168 8 108 -36 -331 182 -34 36
6806C6L4k82K39j44J29J23q8lp2j6J26k00pJ0J03j9K93k2l02J02po7Oj36R9K8
$$ 36 70 -212 27 -117 12 135 47 44 -28 -44 82 -118 -125 -115 -12 -31 262 240 -62 40 33 -34 -28 -164 -65 -37
6832c7j29N0J08k00M4J77K61j88p8Q1j5K43r2k82K72k86J23P6n51O16l42K43n6
$$ -37 -166 -116 -8 -208 -164 13 274 86 8 89 74 317 225 -57 215 -71 52 128 -423 193 -149 94 38
6855C8p0K14j59O4k22L08k11J8Ol0j0j02K04l7j97O2J89j88L02m99Q7K13J80n
$$ 38 -32 182 23 87 -135 173 -38 -20 -14 -44 -54 -156 48 11 -186 -124 65 -123 179 -320 -233 -20 160 155
6879A55M7j81k8n0N5L2R4j85J54K35n05J72j33m1J34o6l1J19j37J94k48K4J79
$$ 155 202 21 -7 -57 -2 30 124 -61 93 328 -177 -5 -138 -179 -45 -111 -142 -23 -160 34 -214 -190 -11
6902a1J60k56o1K12n7O9M8k45K26Lp0j79K99k10K8J48k37J05K53J27l58Q4np3
$$ -11 149 -107 -168 44 -13 56 104 -141 85 88 18 -161 138 -72 -44 104 -133 -28 225 352 -6 78 73 0
6926@j5J03k55J89m4L92j78j6l24J00J20K94k05p8j54K97p5l44L02J22j10k20
$$ 0 -15 88 -167 22 -22 370 192 176 -148 -48 72 366 161 83 -71 226 151 -193 109 231 121 -99
6948i9J04R1l31M58K09o50K23j07j34K72P1m8P1k01n2K51k42k9K63j78n4K64j75
$$ -99 5 96 -235 223 432 -218 5 -102 -236 36 107 59 130 -71 -123 128 -114 -143 120 -58 -112 152 -23
6971b3K03j26j05M38l48Q3Q4r3j01j41Q5K6O1l9k62L54k23J35K6m4J0k78L05k14
$$ -23 180 54 -51 387 39 122 206 113 12 -129 -44 -18 43 4 -258 96 -127 8 34 -10 0 -278 27 -187
6995a87K00n7j49Q0p7K56k46J50J47k49Q0k60N42m9K32p19J54J14J94l20j12J67
$$ -187 13 -44 -193 -113 -190 66 -180 -30 117 -132 -52 -312 230 181 413 -306 -152 -38 156 -164 -276 -109
7017a09O0J2J86l50L44r2Mj05J22J15j87j80J94j03J28N9R8o5l71J85O0J55j44
$$ -109 -49 -37 149 -201 143 51 55 -50 72 187 0 -180 14 -89 39 98 196 131 -240 -55 5 160 16
7040A6k18J56k17K96L5J55k16J3j28J26Po3K02P2k09j58R3J38j65J16J78k01O
$$ 16 -202 -46 -263 33 68 223 7 20 -108 18 25 -38 164 236 27 -131 -38 100 -65 51 229 28 34
7063C4M0j2J01j72J7Q9l09L73m9l15M34m5j47j29j51P6j99J58KK82k24K43qnJ70
$$ 34 74 62 163 -9 8 97 -212 161 112 -203 231 186 39 -90 -241 -165 -364 -206 -204 78 -146 97 89 84 254
7088B54j05k00L54l68K70j87k40J91j85K33O2j37j50M0L71k96J27m59K76P4J30
$$ 254 149 -51 303 -65 205 18 -222 -31 -216 17 79 -58 -208 -168 203 -93 34 -425 -149 -75 55
7109E5N6n36L99O9r2k95M12q8M8l45M12k64K07Q2j26j74K26M0m7k39K74p9n3L5
$$ 55 111 -425 -26 43 -49 -344 68 -20 28 -317 95 -169 38 120 -6 -180 46 86 39 -200 74 -5 -58 -23
7133b3j26L5J25l76K91K91l06J56r6O0l3K8K08m46K07l7L12k59J52m46N69k29
$$ -23 -149 -114 11 -365 -74 217 -89 67 -29 31 -2 26 234 -212 -5 -42 270 11 163 -283 286 57
7155E7n4K21r7L32m67L15l25%Ok4Q4K07m0l00J82Qok54J22P0j70K00J6Q2k55L
$$ 57 3 224 127 459 -8 307 -18 -18 -12 -36 48 255 215 -85 97 105 99 -155 -33 37 -133 67 83 165 -90 -87
7181h7j26L39j36M5j27P1q5K08j46o2l3J25l9k56M29J4o9m9k37J66J28n14L40
$$ -87 -213 126 -10 35 -92 -21 -106 102 -44 -106 -139 -14 -53 -309 120 134 65 16 -221 -55 73 -441 -101
7204a01o7L51m40K53J26J73m05q3J74j06J35P6j10q6J9k4P2q3L53k42j87J45l4
$$ -101 -168 183 -257 -4 122 295 -110 -193 -19 -125 10 86 -24 -110 -91 -115 -43 -126 227 -15 -202 -57 -91
7227i1L23j34q1r5m4J70J71k58q4k2M06m88L72K22m12K62j88N4p7q0j35K89R2
$$ -91 232 98 17 -78 -122 48 219 -39 -123 -145 261 -227 145 367 -45 217 29 83 6 -74 -209 80 172
7250A72Mp9k44K4K66J52j70k55k0J09M3J5N0N2k84k7L22p0k93M02k91M05l50l8
$$ 172 176 97 -147 -123 143 295 125 -130 -150 -41 2 17 67 119 -165 -192 130 60 -233 169 -122 283 -67 -105
7274a05K03k63M32J74l98M7k89J98J42k16j31L74j68J97j45j1p9J39m04J94l9
$$ -105 98 -165 267 441 43 90 -199 -1 141 -75 -206 168 0 197 52 41 -38 101 -303 -109 -148
7295a48m1M88J58l05m69J53J15j16L71m2j80P4m18O66j88k27J18r4K32n3j01M6
$$ -148 -189 299 457 152 -317 -164 -49 -165 206 164 -16 58 -360 306 118 -109 9 -85 147 94 -7 39
7317C9j40P0J02j8M1j0K1Q8p3K1j07L37k44k20M2K37j63k11N06k24n0k48L47j58
$$ 39 -101 -31 71 53 94 84 105 193 120 141 34 371 127 -93 -51 186 23 -188 318 94 44 -204 143 -15
7341a5pl82M05M52k47j46l41J69Q0J95j91Q3j41J7j6L23k86J30l85L50j95K08
$$ -15 -22 -404 1 453 206 60 -281 -112 -32 163 -28 55 -86 -69 -85 238 -48 82 -303 47 -148 60
7363F0o9O0MQ1l02K75k39Q0LkL62j95K2o8l64K68J18l29M4J53O9kj76L9M5J42
$$ 60 -9 51 55 136 -166 109 -130 -50 -47 -49 313 118 140 72 -292 -24 94 -235 -191 -38 31 29 -147 -108 -63 79
7389G9l06N35k40l23K68k21Q5L15j07J09p2M5k60n4K16l00J19K95l15J49P8J02
$$ 79 -227 308 68 -255 13 -208 -123 192 85 194 122 167 -93 -147 69 -231 -112 183 -132 17 95 197
7411A97l5r8K7m98K64K19RK55k12j44q2o0L70k42K60K82j30l80R5J06k03K08j03
$$ 197 162 64 91 -407 -143 76 85 340 128 -16 -98 -158 212 -30 230 512 382 2 97 203 0 208 105
7434A05j52L0J63j53k1L14j79j28k96N89m87O9L51k95L67l04O6k00N1L06j75M10
$$ 105 -47 -17 146 -7 -28 286 107 -21 -317 272 -215 -146 205 -90 277 -27 39 -161 -110 196 21 431
7456D31o10R4K20J37l16M9k34l9p3M48%j67k08M8N8K16k83K04k5L56P6j28m34
$$ 431 -179 -85 135 272 -44 5 -229 -268 -341 107 107 -60 -268 -220 -162 54 -229 -25 -50 306 382 254 -180
7479a80J57n4J91K18l05j15L47k93k1P4n9L3j59L81k91%l7M94m78P7j28J83o8
$$ -180 -23 -77 114 332 27 -88 259 -34 -55 19 -40 -7 -166 215 -76 -76 -113 381 -97 -20 -148 35 -33
7502c3n1J95n7L7j18m1K83q3j45J11j83K23k10l3m7J9jJ56L11m43K24j45j59L48
$$ -33 -84 111 54 91 -27 -68 215 132 -13 98 -85 138 -72 -105 -152 -133 -134 22 333 -110 114 -31 -190 158
7526A58o4o4jN5P6j86Q5R2k89Q1J44l63K71J51m53j05L96J65l37j7M31l48p2J92
$$ 158 94 30 29 84 160 -26 59 151 -138 -57 87 -276 -5 146 -307 -412 -16 149 -188 -205 226 -122 -194 -2
7550bk24K28J39O2m67N3j50M68l13q8J43j4K73k13J07N2J17k18J72k50J64n8l9
$$ -2 -226 2 141 203 -264 -211 -361 107 -206 -294 -151 -165 108 -105 2 54 171 -47 125 -125 39 -19 -58
7573e8m0N0r4L19j09l40J56Q2N3P9j78K7j40K70K1r6q4P9K86l71k8l15L17LL20
$$ -58 -98 -48 -142 177 68 -272 -116 -34 19 98 -80 -53 -193 77 98 2 -82 -3 283 -88 -116 -431 -114 -111 209
7598B09j37j93j49K92j79K7J46P0m90L37J44j7o4K50k23pj28K0M6k90M86m9N3
$$ 209 72 -121 -270 22 -157 -130 16 86 -404 -67 77 60 -4 246 23 16 -112 -92 -46 -336 150 101 154
7621A54J01j98k29L05o1j44k37M40k86J78Q8k51P3J12j40J15J8j81J17j99L8O6
$$ 154 255 57 -172 133 72 -72 -309 131 -155 23 111 -140 -67 45 -95 20 38 -143 -26 -225 -187 -121
7643a21J23J38j04K66m14o2K78L0l21K12J04k40J74J19K1j96j78j93M01j5J72
$$ -121 2 140 36 302 -112 -174 104 134 -187 25 129 -111 63 182 203 7 -171 -364 37 22 194
7664A94j19p4k32K1n8M27j57k03p9J93J50j96K57k43j72L91j79j46R1K04k94K53
$$ 194 75 1 -231 -210 -268 159 2 -201 -280 -87 63 -133 124 -119 -291 100 -79 -225 -134 70 -224 29
7686B9J44k73L59l3j89k05K80j83K14j93J51M8l06J03o9K38p2J05r4j34pK1m5
$$ 29 173 -100 259 226 37 -168 112 -71 143 -50 101 149 -157 -54 -123 115 43 148 54 -80 -87 -66 -111
7709a11J70l20PK09j14K90K03n0m61K21j48N5K62q3n4j33O2J80j94M7m21N02p3
$$ -111 59 -261 -254 -45 -159 131 334 284 -177 44 -104 -49 213 130 76 -57 5 185 -9 38 -383 119 46
7732D6k12K50%l06K69L2j40K12k39L57j90l37RL90r8N6L68n00J42p0j36K31J6
$$ 46 -166 84 84 -222 47 79 -61 151 -88 269 79 -258 -249 141 43 99 467 -33 109 39 -97 134 150
7755A50k40J16J35l07L44j73J66K9m85O07o60J62K10J02n8J8K29n88J16j0j5R4
$$ 150 -90 26 161 -146 198 25 191 220 -265 342 -318 -156 54 156 98 116 345 -243 -127 -137 -152 -58
7777e8K09j50k1J37o4K08k65j62J52J50j02K38l88K29J33k68l63L99J66j78p0
$$ -58 151 1 -20 117 53 261 -4 -166 -14 136 34 272 -116 113 246 -22 -385 14 180 2 -68
7798f8J37rj69q8M16l01JR8j47M57N9p26M76k12j31M47k25j20J66J92l66J65j43
$$ -68 69 60 -109 -197 219 -82 -81 17 -130 327 386 -340 136 -76 -207 240 15 -105 61 253 -113 52 -91
7821i1J04l6J4o9M9J97P8l40K24k2k2q2j21K02k70L74k06L4J53j76J89k89k6K73
$$ -91 13 -23 -9 -78 -29 168 246 -94 130 108 86 4 -117 85 -185 189 -17 17 170 -6 183 -106 -132 141
7845A41k00mJ61l60K76r9k40M10k53kJ01M16l66j65J66j21K09j06O3K56n2k57
$$ 141 -59 -63 98 -262 14 -85 -325 85 -168 -170 -69 347 -19 -184 -18 -139 70 -36 27 283 231 -26
7867b6K14l79L8J51j98n5j0J06J23k4J04J65j30Q8o3k71J30l1j51M71k35l08J23
$$ -26 188 -191 -153 -2 -200 -255 -265 -159 -36 -60 44 209 79 167 104 -167 -37 -68 -219 252 17 -291 -168
7890a68J88l32K22n9N81m72j77K71L5K63l84q9L59J55m56l1J19N9j76J24o8J39
$$ -168 20 -312 -90 -149 432 -40 -217 54 89 352 -32 -121 238 393 -63 -94 25 84 -92 32 -36 103
7912A03j59k4J98Q0n71O66k37k28j0L7j44L03K44n43K99P1r5J57j66qj18r7J11
$$ 103 -56 -80 118 198 -373 293 56 -172 -182 -145 -289 14 258 -285 14 85 -10 147 -19 -27 -145 -242 -131
7935a31J52P1k19L65p0l57r9K53K4L23n27J67p9J52N2k91M12j28R1k61K44j76
$$ -131 21 92 -127 238 168 -189 -288 -35 -11 312 -215 -48 -127 25 77 -214 198 70 161 -100 144 -32
7957c2J29j99L25o93O12J28L8l77J14j1q2k01R3K56k39J01J00r6j29n4J48M18
$$ -32 97 -102 223 -470 142 270 308 -69 45 34 -48 -249 -156 100 -139 -38 62 -34 -163 -217 -69 349
7979C49m82n3J26K2l30M95jk46K7K99j98l6k8K11n5l76M82j94k17K0O52j71k25
$$ 349 -133 -186 -60 -38 -368 127 126 -120 -93 206 8 -28 -56 155 100 -276 206 12 -205 -185 467 296 71
8002G1j8M1m23M84m60M28J55k48P4l10l56P38m40L35r2l0n9K6r3J24K28l43L6
$$ 71 53 94 -329 155 -305 123 278 30 104 -206 -562 176 -264 71 -21 -51 -110 -84 -177 -53 175 -168 -132
8025a32K36l76Q6j87N65Q2k04K62k66k6k22L51j71k73N11k16r8MK13JM5j74j42
$$ -132 104 -272 -186 -373 192 274 70 332 66 40 -182 169 -2 -275 236 20 -78 -74 139 140 185 11 -131
8048a31p6pL64j00k77L21P5k16J05O0J57j1j85M0k97J50O2K1l18M44J06k70r1
$$ -131 -207 -214 150 50 -227 94 169 -47 58 118 275 264 79 119 -178 -28 34 55 -263 181 287 17 -74
8071g4j5%l7K26Q8m53M23k29K32J03j27N9r0j25Q6j2j74J70j82R3r9L9J96k72
$$ -74 -89 -89 -126 100 188 -265 158 -71 161 264 137 196 106 -19 67 55 -119 51 -131 -38 -137 -98 98 -174
8095a74L48l17R3O4j98J74J88jL8o6j71j36L77ok43K99n78K94p6J22k34L30m1
$$ -174 174 -143 -50 14 -184 -10 178 177 215 149 -22 -158 219 213 -30 269 -309 -15 -91 31 -203 127 86
8118H6p4r7m1j63L91j16J59l28K35q1j19J14N5J21k13J63k3j73O1k83K91j82j0
$$ 86 12 -85 -126 -289 102 -14 145 -183 52 -29 -148 -34 21 142 -71 92 69 -104 -43 -326 -35 -217 -227
8141b27L2L6k7J37n1Q4l5J54p4J30k98K00J84l8j4o9j30j8O7m7N7l5m1J15J11
$$ -227 -195 -159 -186 -49 -100 -16 -51 103 29 159 -139 61 245 207 193 124 -6 -24 43 -4 53 18 -23 92 203
8166B03j64N1j67K51k27K06m3k25J05J6J42j50r2J51J38j75j88j54Q7K36P3m48
$$ 203 39 90 -77 174 -53 153 110 -115 -10 6 148 -2 -94 57 195 20 -168 -322 -235 1 74 -374
8188c74K25L63m50
$$ -374 -149 214 -236
8191b36
$$ Imaginary data points
##PAGE= N=2
##DATA TABLE= (X++(I..I)), XYDATA
0@%%%%%%%%%%qJ6j6J6k2L0l2L7m5N3o1P2q5R6j09J25j44J64j85K08k35K64k94
$$ 0 0 0 0 0 0 0 0 0 0 0 -8 8 -8 8 -14 16 -16 21 -24 29 -32 40 -45 51 -58 67 -77 87 -98 110 -125 139 -155
33a55L28l68M10m55N05n61O24o91P65q46R37j038J149j277J424j594J790k018
$$ -155 173 -195 215 -240 265 -296 328 -363 402 -444 493 -545 604 -673 751 -843 947 -1071
51a071K296k639L069l632M406n540P365j0777J9293p7395j60074J37264J43932
$$ -1071 1225 -1414 1655 -1977 2429 -3111 4254 -6523 12770 -64625 -224699 -87435 56497
64E6497l1294r9529O2798J29931j1907j50904p2742N8359N6764k2586q413N5287
$$ 56497 25203 -74326 -11528 118403 106496 -44408 -117150 -58791 -2027 -24613 -33026 22261
76B2261M3662k8381l7002l808j0799l9791K980O8094M2350m2548l8553M2600M3683
$$ 22261 65923 37542 540 -3268 -14067 -53858 -50878 17216 59566 17018 -21535 21065 64748
89F4748n8104q9661J8097R9641K6047p2707l3850O6426M9680n6842p9419J4310
$$ 64748 6644 -83017 -64920 34721 60768 -11939 -45789 20637 70317 13475 -65944 -51634
101e1634P0886J7413m3211j6520L5185K5619k3049l2407m654J4955J0160N075
$$ -51634 19252 36665 -6546 -23066 12119 37738 14689 -17718 -22372 -7417 2743 7818
113G818J851n319m307P512O690j4127k2316L655K7147J0484j8274j2982J4635
$$ 7818 9669 4350 43 7555 14245 118 -22198 -18543 8604 19088 814 -12168 2467
126B467J4424j3021k0452L276J7942M359q891q53O765K82p280j287K197k637k656
$$ 2467 16891 3870 -16582 -13306 4636 8995 104 -749 6016 6298 -982 -2269 -72 -2709 -5365
141e365O845P260o384q865M263P586o871j1896M715J3790j082j3449P29J5249
$$ -5365 1480 8740 2356 -6509 -2246 5340 -1531 -13427 -8712 5078 3996 -9453 -8724 6525
155F525k3j8348m696J9949R801j8353j3261J9494K1033j5088k7524P966L1067
$$ 6525 6502 -11846 -16542 3407 13208 -5145 -18406 1088 22121 7033 -20491 -12525 18542
168A8542J250l0609r151K7987J8109k0829k3291J0699K2712l156j9575k657J3716
$$ 18542 19792 -10817 -19968 8019 26128 5299 -17992 -7293 15419 12263 -7312 -9969 3747
181C747M756q288l061L269j881l799P156P823j0288j3787R629K1939m839k7864
$$ 3747 8503 215 -2846 423 -1458 -5257 1899 9722 -566 -14353 -4724 17215 12376 -15488
195a5488m674L0184J5775k6650k5840J9453L3006p968l5388n281L1609J5694k3687
$$ -15488 -20162 10022 25797 -853 -26693 -7240 25766 17798 -17590 -22871 8738 24432 745
208G45k2519J2900K4471k752k0385n572J2903Q889m538p557j953K364N677M620
$$ 745 -21774 -8874 15597 12845 -7540 -13112 -209 8680 4142 -3415 -5368 -3004 2673 7293
222G293m400j0904j042J4753R091j4217j7260R189K2798p73k5388q770K2561J6881
$$ 7293 2893 -8011 -9053 5700 14791 574 -16686 -7497 15301 14528 -10860 -19630 2931 19812
236A9812j6170k2173O867K3984J790k1118r195J5039J3210p006j3149N33J0304
$$ 19812 3642 -18531 -11664 12320 14110 -7008 -16203 -1164 12046 5040 -8109 -7576 2728
249B728M384m251o482j482M926O168J87q337n098P260J0646l580j4666k676J5387
$$ 2728 7112 2861 -3621 -5103 -177 5991 6178 -2159 -7257 3 10649 7069 -7597 -10273 5114
264E114Q828j3034j4853P814J8142j802j8239n330J5554J0677j1065j3769N818
$$ 5114 13942 908 -13945 -6131 12011 10209 -8030 -13360 2194 12871 1806 -11963 -6145
277f145J3498J48j1776m126P707O839l037o180j134L675L521L67l625m700K064
$$ -6145 7353 7501 -4275 -8401 -694 6145 3108 -3072 -4206 -531 2990 3357 -268 -4968 -2904
292b904P164K171q010p205P271J0944l559j3631j638J4012O425j1524j1467P989
$$ -2904 4260 6431 -1579 -8784 -1513 9431 5872 -7759 -9397 4615 11040 -484 -11951 -3962
306c962J4174k702j4625k472J2481P009r069r207M173R408M9p296l350M285M446
$$ -3962 10212 7510 -7115 -9587 2894 9903 834 -8373 -4200 5208 5257 -2039 -5389 -1104 3342
321C342j21l428k677N41M086K909l948o011J268Q362K412q758o475P226J0139
$$ 3342 3221 -207 -2884 -2343 1743 4652 704 -5307 -4039 4323 6735 -2023 -8498 -1272 8867
336H867l387j2702n53J2134N201j0017q689N985J1245k031j0752k612Q916N712
$$ 8867 5480 -7222 -7775 4359 9560 -457 -9146 -3161 8084 6053 -4699 -7311 1605 7317
350G317n861o756J909N981J540m153l498J259L418K360k497m505k82N031L775
$$ 7317 1456 -5300 -3391 2590 4130 -23 -3521 -2262 1156 3516 1019 -3486 -3768 1263 5038
365E038l934o768J393Q553J973q144n614O559Q478l598j0067j33R991L607p771
$$ 5038 1104 -5664 -4271 4282 6255 -1889 -7503 -944 7534 3936 -6131 -6264 3727 7334 -437
380d37o689M888P802j117p404j990N433L999k896m299m32L748K803k082l413j045
$$ -437 -7126 -2238 5564 4447 -2957 -4947 486 4485 1589 -2710 -3142 606 3409 1327 -2086 -3131
396c131K984L845j371n325j399N162M556m324o411J965P652J509p720m356O181
$$ -3131 -147 3698 2327 -2998 -4397 765 5321 997 -5414 -3449 4203 5712 -2008 -6364 -183
411a83O511l217p702p6P344K958o069m598L286N421o96m654j720K754L365p64
$$ -183 6328 3111 -4591 -4667 2677 5635 -434 -5032 -1746 3675 2979 -1675 -3395 -641 2724 1960
427A960l179j527J928K973K58l172k904K600M847j345m987k053N567M108l965
$$ 1960 -1219 -2746 -818 2155 2413 -759 -3663 -1063 3784 2439 -2548 -4601 966 5074 1109
442A109o459J731P171J267o449l948M918N903k937o532P34N482K266m448l205
$$ 1109 -5350 -3619 3552 4819 -1630 -5578 -660 5243 2306 -4226 -3492 1990 4256 -192 -3397
457c397J947L866R5l287j551J657K181R45k452k401R78L431R47l116l592K360
$$ -3397 -1450 2416 2511 -776 -2327 -670 1511 2456 4 -2397 -1419 2012 2959 -157 -3749 -1389
473a389N056n72n473j832N077M025l402n792J067O320J313n839l175M081M727
$$ -1389 3667 3095 -2378 -4210 867 4892 1490 -4302 -3235 3085 4398 -1441 -4616 -535 4192
488D192j721n094p37L947K792k393l269J70K891K054k124k659M6K696J864j404
$$ 4192 2471 -2623 -3360 587 3379 986 -2283 -2113 778 2832 708 -1951 -1905 791 2655 1251
504A251l797K6M271J597l684l379J931M866m9m586k378L988L618k158m767O42
$$ 1251 -2546 -2520 1751 3348 -336 -3715 -1784 3082 3033 -1553 -3931 57 3675 1517 -3250 -2608
520b608M355J213l267k630J858L278n81k735o81J358J980q2k168p33P72J878P13
$$ -2608 1747 2960 -307 -2937 -1079 2199 1618 -1117 -1798 -440 1540 1458 -710 -1443 -671 1207 1920
537A920k522j699J818K915q77l542m91L205K206k528l427J551L579J95l472j635
$$ 1920 -602 -2301 -483 2432 1555 -1987 -2478 727 2933 405 -3022 -1471 2108 2303 -1169 -2804
553b804L128K434k058l111P70K814O34k465p50J553J414r93j430j15J025Q55m11
$$ -2804 324 2758 700 -2411 -1641 1173 1807 -658 -1408 145 1559 566 -864 -979 46 901 490
570D90j030l5L64J242r7j178j159J237J600p71j955l42K366J576j995k440J226
$$ 490 -540 -575 -211 1031 934 -244 -1403 -166 1434 663 -1292 -1634 732 2308 313 -2127 -901
587i01K890l52l090n37K549J793j780k679O89K606L84j786j382J045J890j55j620
$$ -901 1989 1637 -1453 -1990 559 2352 572 -2107 -1418 1188 1572 -214 -1596 -551 1339 1184 -436
604d36j512J506J766J77k200j164J409J963k84k195j155K340K246j554k773q0
$$ -436 -1948 -442 1324 1501 -699 -1863 -454 1509 1225 -970 -2125 215 2461 907 -1866 -1946
620a946L039J114k220k401J377K570J51k596j136K160J610r82j901l52J805J065
$$ -1946 1093 2207 -13 -2414 -1037 1533 1684 -912 -2048 112 1722 740 -1161 -1513 292 1357
636A357n71j761Q6Q09J348n86j590m43J366J780j354j935p1K724J052k261k167
$$ 1357 786 -975 -889 -80 1268 682 -908 -1351 15 1795 441 -1494 -1565 1159 2211 -50 -2217
653b217J336K839k04k868j158K602J941j586k483M51K148P82k145j224J429J565
$$ -2217 -881 1958 1754 -1114 -2272 330 2271 685 -1798 -1347 801 1583 -562 -1786 -357 1208
669A208l19j337o03P20J344o11o57p30J140L93M2q86n04P88P95k59j095l99Q99
$$ 1208 889 -448 -1051 -331 1013 402 -255 -985 155 548 590 -296 -800 -12 783 524 -571 -970 -71
688g1J087j066j202N99J620K90j427r32J042J474p11j625l55J554Q57q93j526
$$ -71 1016 -50 -1252 -653 967 1257 -170 -1102 -60 1414 703 -922 -1277 277 1134 241 -1285
705a285J76K096O47j713j433Q31J840L5j581j036J425J075m40j769k8J526R43
$$ -1285 -1109 987 1634 -79 -1512 -681 1159 1194 -387 -1423 2 1077 637 -1132 -1160 366 1309
722A309r31j556O1K092j34j123l42Q7J222J98r85o67L29R69K8o88n20K2J236L09
$$ 1309 378 -1178 -1117 975 841 -282 -624 -537 685 883 -102 -769 -440 529 557 -131 -651 -629 607 916
742I16j110j047P62J456J73k036p89J476J972j108k034J92K549L48j655j492R88
$$ 916 -194 -1241 -479 977 1150 -886 -1675 -199 1773 665 -1369 -1177 1372 1720 65 -1427 -439
759d39J910m40j705o82J537J214p87j571L50Q95L80j016K5L7L72L84j92o11k72
$$ -439 1471 1031 -674 -1356 181 1395 608 -963 -613 282 662 -354 -329 -292 80 464 272 -339 -611
778f11J16J109O4j174k31N81J261n02j529k12J456R70j465j088N46J790k6j611
$$ -611 -495 614 678 -496 -727 -146 1115 613 -916 -1128 328 1298 -167 -1255 -709 1081 1055 -556
796e56p68J384Q81r38q92M55Q07K31m62p91L49N20L1n81J91J96n3M35l28j82n60
$$ -556 -1324 60 941 3 -889 -434 373 604 142 -649 -300 220 251 -330 -139 57 4 439 111 -71 -631
817f31P82K04j87o15J03M91M88m52o18J98K22N85r16j76K85Q61l63m26l0K99N23
$$ -631 151 355 168 -447 -344 147 635 183 -435 -237 -15 570 -346 -522 -237 624 261 -165 -195 104 627
838F27o00r7N0J24K53l37n38M63L29k07k69L2K15J08j19l64M45p8K60k78R2K54
$$ 627 27 -70 -20 104 357 20 -518 -55 274 67 -202 -170 45 153 34 -330 115 37 297 19 111 365
860C65l56K5J13M1j34k00K13r2J01l51K09K63l00K35k56M29r4Mo32J80N98m46
$$ 365 9 34 147 188 54 -146 67 -25 76 -275 -66 197 -103 132 -124 305 211 215 -417 -237 361 -85
882h5l47J98J82M15k82l30O03j21k36k33q7M50M2N0l14m8M87l06l93L31J98P3
$$ -85 -432 -234 -52 363 81 -249 354 233 -3 -236 -323 127 169 219 -95 -143 344 38 -355 -24 174 247
904B47k25P3j52j19M6L84j37j33k02M31j67k9m17j06J100l87n54N0M88m4n5n64
$$ 247 22 95 -57 -176 -130 254 117 -16 -218 213 46 17 -400 -506 594 207 -347 -297 191 147 92 -472
926d72M13L23k8m88j12J12M92m78m8Q3J95K61j80j20k31o6K52J29n4m43L75K96
$$ -472 -59 264 236 -252 -364 -252 240 -238 -286 -203 -8 253 73 -47 -278 -344 -92 37 -17 -460 -85 211
948B11j09m71L90j78L56l7o98K44L39J0J26l89k2Q3L65k39Q6p2P5L39m68m34O80
$$ 211 102 -369 21 -157 199 162 -536 -292 47 57 183 -206 -228 -145 220 -19 67 -5 70 409 -59 -493 187
971A87J0l10l4L3L83n42J07n9J05P9J40l74M15k58K29L58o07l3O7M94j24j19l23
$$ 187 197 -113 -147 -114 269 -273 -166 -225 -120 -41 99 -275 140 -118 111 469 -138 -171 -104 390 266 147 -176
994a76K38L03r5n98K51K8N34m84j88o6M99K26m91j44J42J40L6k2k76K4K06J97
$$ -176 62 365 270 -328 -77 -49 485 1 -187 -253 246 472 -19 -163 -21 119 155 133 -143 -119 87 284
1016B84p10M38p3K19m71L51J20J02L9J84n92J43p2J76%k75J48J24J58m13k68K29
$$ 284 -426 12 -61 158 -313 38 158 260 299 483 -109 34 -38 138 138 -137 11 135 293 -120 -388 -159
1038a59L11k74K25l53K85k9J91n23J32J84M16k89k58J8L53k13j96K36j74K60K07
$$ -159 152 -122 103 -250 35 6 197 -326 -194 -10 406 117 -141 -123 230 17 -179 57 -117 143 350
1059C50l62jJ40o8J90l36m79O70Kj03k20K50J8qQ3k97j85J76K36L81m27K34j81
$$ 350 -12 -13 127 59 249 -87 -566 104 106 3 -217 33 51 43 126 -171 -356 -180 56 437 10 244 63
1082F3J50j53l65L32l18L57j11K0J41q7m8j50k94O70j68J90k36l33J76J75J74
$$ 63 213 60 -305 27 -291 66 -45 -25 116 29 -19 -169 -463 207 39 229 -7 -340 -164 11 185
1103A85m04j18L37L35j33m57K00OJ03O8k76L20m8J75l08k08l0K22J97l54R7L68
$$ 185 -219 -337 0 335 202 -255 -55 -49 54 122 -154 166 118 293 -15 -223 -253 -31 166 -188 -91 277
1125B77j99K14n78M24J39m8k67j62J38K8L03k91K93k82J72k08L0l18L70M40m6
$$ 277 78 292 -286 138 277 229 -38 -200 -62 -34 269 -22 271 -11 161 -47 -17 -335 35 475 429
1146D29n77k99M56J4K0Q6j45J09J03r0k98K1L23R1m55j0K08M9R1m5k82K06m2K47
$$ 429 -148 -447 9 23 43 129 -16 93 196 106 -192 -171 152 243 -212 -222 -14 35 126 81 -201 5 -37 210
1170B10j16k23L26o6o0O5j85O4k49NK49j53L7L5L29m46q7M03K6j2l95k5N08K30
$$ 210 94 -129 197 131 71 136 -49 15 -234 -229 20 -133 -96 -61 268 -178 -265 138 164 152 -243 -268 240 470
1194D70m94m3q4M12o9k27J6L15j32q6k10j71K79J30n2l11J40N8lJ1J92l08J56
$$ 470 -24 -67 -151 261 192 -35 -19 296 164 78 -132 -303 -24 106 54 -257 -117 -59 -62 -51 141 -167 -11
1217a1O1j57K2K62pk34j34n3L42j4K9n15j11M27M33l40k26r3M09N7m12J8P7N32
$$ -11 50 -107 -85 177 170 -64 -198 -251 91 77 106 -409 -520 -93 340 0 -226 -319 90 147 -265 -247 -170 362
1241C62l46k4j5R1J95j4l31j52K21K11k75N6j81L20L66o59K82K99m13J19Q5n57
$$ 362 16 -8 -23 68 263 249 -82 -234 -13 198 -77 -21 -202 118 484 -175 107 406 -7 112 197 -360
1263c60M27J55o6j6j8j82N22l56Q4J12n03Q9j51O6k0L70j43J33o1j18l3K22k89
$$ -360 67 222 156 140 122 -60 462 106 190 302 -201 -112 -263 -197 -217 153 10 143 82 -36 -69 153 -136
1286a36R0R9J60q5k65J5M03l51q8M6j29J34K77k23l88N52nJ49m71J79K39p3J33
$$ -136 -46 53 213 128 -137 -122 281 -70 -158 -112 -241 -107 170 -53 -441 111 106 255 -216 -37 202 129 262
1309B62l19j73J27L11k72j34J64K15R6l59j68K36J31K02l49l11K86M36j79l33
$$ 262 -57 -230 -103 208 -64 -198 -34 181 277 -82 -250 -14 117 319 -30 -341 -55 381 202 -131
1329a31m8l8J92j5l42K04K0K88On68M6N69J19m15J20l43N13J00j74n67L29L74
$$ -131 -179 -217 -25 -40 -382 -178 -158 130 136 -432 -386 183 302 -113 7 -336 177 277 103 -464 -135 239
1351B39K36o38j98N35k20J09k13k59M28J59R3m33j21L32J90J81r54P30o1K32l06
$$ 239 475 -163 -361 174 -46 63 -150 -409 19 178 271 -162 -283 49 239 420 -534 196 135 367 61
1372F1l33M8K97K02K66j068O81k34L58m59j27M52k41L84l39J00j66O01j2m94k01
$$ 61 -272 -224 73 275 541 -527 154 -80 278 -181 -308 144 -97 287 -52 48 -118 483 471 -23 -224
1393b24R8O37k98l53r7K58J35l07k72K25M44Qn13j81K01L22J47k64M2J57L89l82
$$ -224 -126 511 213 -140 -237 21 156 -151 -423 -198 246 254 -259 -440 -239 83 230 -34 8 165 554 172
1415A72k18l34N37m6mj99J68j05N27m56j67J02J35K69l52j23p9M99k28r4m13L82
$$ 172 -46 -380 157 111 107 -92 76 -29 498 42 -125 -23 112 381 29 -94 -173 326 98 4 -409 -27
1437b7N3K15o62L85K88L9j18l53K26P2o3O4k40J95M9l25K60m72N98k72K64j83
$$ -27 26 241 -421 -36 252 291 173 -180 46 118 55 119 -121 74 123 -202 58 -414 184 -88 176 -7
1459gk52N46l71K97k21QO5K46m69J37J97op5N15p75K21M4n4j27k04K94K64p7j7
$$ -7 -259 287 -84 213 -8 0 65 311 -158 -21 176 170 95 610 -165 56 100 46 -81 -285 9 273 196 179
1483A79p06N02N4O6m41K54K68Nr8k97K52o0K38k64K65k19K76j65j34j80J14L30
$$ 179 -527 -25 29 95 -346 -92 176 181 83 -214 38 -22 216 -48 217 -2 274 109 -25 -205 -91 239
1505B39K41o83M09j83K30q3k23k15L39j7Pm00M5K92J05L9l40M27O1j44j57M2l2
$$ 239 480 -203 206 23 253 170 -53 -268 71 54 61 -339 -294 -2 103 142 -198 229 290 146 -11 31 -1
1528aK07Q1o28L08j19L22k73K49j72j19J77j56K37j08L0n2K46l27m4K20J54l73
$$ -1 206 287 -341 -33 -152 170 -103 146 -26 -145 32 -124 113 5 35 -17 229 -98 -142 78 232 -141
1550a41lL66R0k20k72k7K77Oj55L01l79L76k55j71J39k26M73N2l25qJ45p0p1j49
$$ -141 -144 222 312 92 -180 -207 70 76 -79 222 -157 219 -36 -207 -68 -294 179 231 -94 -102 43 -27 -98 -247
1574b47K12j42j17O36n94j93M21J48l49L7q1K45j6j07k4J20L91m13j90K70O1j4
$$ -247 -35 -177 -294 342 -252 -445 -24 124 -225 -188 -269 -24 -40 -147 -171 -51 340 -73 -263 7 68 54
1596E4j69L71m32K73K38k91r6j89K90l9J27l97K31j58j62L32L0q4J84J65j13k16
$$ 54 -115 256 -176 97 335 44 -52 -241 49 10 137 -260 -29 -187 -349 -17 13 -71 113 278 165 -51
1618e1j16L01p8o5J32n0q2KM5K06j81j33K0L1J14j69N03r3m25j97L93m9j32k0
$$ -51 -167 134 56 -9 123 73 -9 -7 38 244 63 -70 -50 -19 95 -74 429 336 -89 -286 107 58 -74 -94
1642i4o0J48K04l56k1J41K39j24j3k6J10j99O2K46n72J66L63j83j98J77j84L63
$$ -94 -154 -6 198 -158 -179 -38 201 77 64 38 148 -51 11 257 -315 -149 214 31 -167 10 -174 189
1664A89n7m6RJ03l21M18l77J88j51j53K89j8k67J23Rn6M68m16L27l46j08M21l73
$$ 189 132 86 95 198 -123 295 -82 106 -45 -198 91 73 -194 -71 -62 -118 350 -66 261 -85 -193 228 -145
1687a45J80J80m55L04m7K37l64J85J91j62l8J90l62J3J08K1j32J15R5J12l50l4
$$ -145 35 215 -240 64 17 254 -110 75 266 104 66 256 -106 -93 15 36 -96 19 114 226 -124 -158
1709a58M84m90L95l94R5j31M2Q8l6j16J96p0J08J58r1Qk1L06j51K30m98J38j79
$$ -158 326 -164 231 -163 -68 -199 -157 -69 -105 -221 -25 -95 13 171 80 88 67 373 222 452 -46 92 -87
1732h7k7N0K75l34l7m5J39N2P3j26j67K81j97J75J04j46j63q9L77j5j52n3K13
$$ -87 -114 -64 211 -123 -160 -205 -66 -14 59 -67 -234 47 -150 25 129 -17 -180 -269 108 93 -59 -112 101
1755A01j28K79j88l18J74K2o5N20l62L0j12j55K34JK26k32m9m1M8L5q1j27J70
$$ 101 -27 252 64 -254 -80 -58 -123 397 35 65 -47 -202 32 33 259 27 -22 -63 -15 20 -61 -188 -18
1778a8K78m18K20J39k78l1K42m10J4M09J10k10J87k19j05O9J5j26K7J88P1k45
$$ -18 260 -158 62 201 -77 -108 134 -276 -262 147 257 47 234 15 -90 -21 -6 -132 -105 83 154 -91
1800i1J8O4K79j70J43k76J32j76J30K89n97M17k72J84m07L13k84K57L73m92J20
$$ -91 -73 -9 270 100 243 -33 99 -77 53 342 -255 162 -110 74 -333 -20 -304 -47 326 -166 -46
1821d6K92k62M6K21m03l8L02Nq3p2K33k78j30L32O4m5l76j59O12k69K62n0m76
$$ -46 246 -16 30 251 -152 -190 112 117 34 -38 195 -83 -213 119 183 138 -238 -397 215 -54 208 158 -318
1844c18K89k84J05L84j5k34J70r0N8Q7l83L20j08J7k55J20L07J50n50N90j23j04
$$ -318 -29 -313 -208 176 161 -73 97 7 65 152 -231 89 -19 -2 -257 -137 170 320 -230 360 237 133
1866A33j49M5J7L87j96m97L00j07J2O0p3k10L41j2M8j30j47L75k63j4J21j75J13
$$ 133 -16 29 46 433 237 -260 40 -67 -55 5 -68 -278 63 51 99 -31 -178 197 -66 -80 41 -134 -21
1889b1K1k39M29l65K14Kk2k11J0J61P2j52j55K31R9Q2k34Q4n7J89j80R3n5M77
$$ -21 0 -239 190 -175 39 41 19 -192 -182 -21 51 -101 -256 -25 74 156 -78 6 -51 138 -42 51 -4 473
1913D73m30j07K00K32kk90j42l1L0KJ80k09j14J83j79K65m12M59k80J9J8J78k53
$$ 473 43 -64 136 368 366 76 -66 -97 -67 -65 115 -94 -208 -25 -204 61 -351 108 -172 -153 -135 43 -210
1936b10K46r1J07j18j21K22k0r5J50L6L0q5r1J78n1j8k05K76P2l2j01P6p0l63
$$ -210 36 -55 52 -66 -187 35 15 -80 70 106 136 51 -40 138 87 69 -136 140 212 180 79 155 85 -278
1960b78J51K11l19K01L40R6m23m5l0j2j20N44m49J15j18J95oL6k22N6J64j54j2
$$ -278 -127 84 -235 -34 306 402 -21 -66 -96 -108 -228 316 -133 -18 -136 59 53 89 -133 -77 87 -67 -79
1983g9k01J73K00l45K29j56%j20M56l03J40J47k23J82k49J07j85K97J48l35k8
$$ -79 -280 -107 93 -252 -23 -179 -179 -299 157 -146 -6 141 -82 100 -149 -42 -227 70 218 -117 -145
2004a45K33n5L33o64N35R4j17j91l29L72J77k01j04j19J34K8n7l68L01J06J68
$$ -145 88 33 366 -298 237 331 214 23 -306 66 243 42 -62 -181 -47 -19 -76 -444 -143 -37 131
2025A31j55J70l30L10p3oj0o2R3j53LrK54j43J84n73K30q5L89J51n58M31k56k
$$ 131 -24 146 -184 126 53 47 37 -25 68 -85 -82 -91 163 20 204 -369 -139 -224 165 316 -242 189 -67 -69
2049f9L55l69K15k87N56m71k95K99l7L01j07j57L2K27j82J27k61N13k16j94O3
$$ -69 286 -83 132 -155 401 -70 -365 -66 -103 198 91 -66 -34 193 11 138 -123 390 174 -20 43
2070D3j3m0m1k88K68J67l37K80j64K09k3J71j14J51n05M52r9K0P6P1m62L66l25
$$ 43 30 -10 -51 -339 -71 96 -241 39 -125 84 61 232 118 269 -236 216 117 137 213 284 -178 188 -137
2093a37J34J07j34k26j09K44l8Q4N6K13k61K04n3J01l85j38O31o47K89j14K4N2
$$ -137 -3 104 -30 -256 -365 -121 -159 -75 -19 194 -67 137 84 185 -200 -338 293 -354 -65 -179 -155 -103
2115a03R7J28O1k17P9J48p5j5l22K80M3j01Q5J20j51l08L44j87K06J35j59M9q2
$$ -103 -6 122 183 -34 45 193 118 103 -219 61 104 3 88 208 57 -251 93 -94 112 247 88 137 55
2138E5M8j1nj99J47P4k21jQ2J5R2k05j7J61n8L96l78l05L88K03O1o35OK97p5R5
$$ 55 103 92 87 -112 35 109 -112 -113 -31 -16 76 -129 -146 15 -43 353 -25 -330 58 261 322 -313 -307 -10 -85 10
2164A0J04j65J43k28L43j59p1O9Q0J9o0o9j88RN2J56r1J09k84j11L90j79L74l34
$$ 10 114 -51 92 -136 207 48 -23 46 126 145 85 16 -172 -163 -111 45 -46 63 -221 -332 58 -121 253 -81
2188h1r6j06M20k8m1j20J7L4j31L50kk22J7o7L1K40l5j2k26q3M01m95L66K5r4
$$ -81 -177 -283 137 109 68 -52 -35 -1 -132 218 216 -6 11 -56 -25 215 180 168 -58 -141 260 -235 131 156 62
2213F2j25k2K35l31L94j38Q2R6l67P9J28J32j00l40P6N3k95L85j0l25L62Rj09
$$ 62 -63 -85 150 -181 213 75 157 253 -114 -35 93 225 125 -215 -139 -86 -381 4 -6 -331 31 40 -69
2236f9J40l68M69j35m8K6J76j68J24k70N9M4j70J07K02j18J73j94k14K91l15K92
$$ -69 71 -297 172 37 -11 15 191 23 147 -123 -64 -20 -190 -83 119 1 174 -20 -234 57 -258 34
2258C4M8l15J83R9L3k96K97k23j93M05j40R3o7M95m20M6J40l06J41k17J13K62
$$ 34 82 -233 -50 49 82 -214 83 -140 -333 72 -68 25 -42 453 33 79 219 -87 54 -163 -50 212
2280B12k25K26r8j99K17k4k21K30k50K67k9l94L33J12l1j90j83M15j48k18L84
$$ 212 -13 213 115 -84 133 109 -112 118 -132 135 106 -288 45 157 126 -64 -247 168 20 -198 186
2301A86j78Lj3J95J41m58M0j29qM74m97K56k56K72j41L1M29o24L81j51j95L27
$$ 186 8 11 -2 193 334 -124 -84 -213 -221 253 -244 12 -244 28 -113 -82 347 -277 104 -47 -242 85
2323H5k35K37J46j92j47N9J29J21k78M21m21kJ9L54j17L9l2k27j42L35j76k14
$$ 85 -150 87 233 41 -106 -47 82 203 -75 346 -75 -77 -58 296 179 218 186 -41 -183 152 -24 -238
2345b38J72O0k2J2k41J09K51j50Q2m1l4J05j96J40r3k29L59J07k82J21K1K15m15
$$ -238 -66 -6 -28 -16 -257 -148 103 -47 35 -6 -40 65 -131 9 -84 -313 46 153 -129 -8 13 228 -187
2368a87L18l28L00lr7M2j36j65L86k9l44L40n7j46k8l1K31L01l17om4J3J51j65
$$ -187 131 -197 103 100 3 45 -91 -256 130 101 -243 97 40 -106 -134 -165 66 367 50 44 0 13 164 -1
2392aj73o4J62J57k4j71j35N12j12j65l98O78m02M31m86J84j54K54K80o57J07
$$ -1 -174 -238 -76 81 57 -114 -249 263 151 -14 -412 266 -136 295 -191 -7 -161 93 373 -284 -177
2413a77J37J45j63L62o92L26K26r9j77N0N2J17j3k02j15M10l8j51l33K10M88o77
$$ -177 -40 105 -58 304 -388 -62 164 65 -112 -62 -10 107 94 -108 -223 187 149 -2 -335 -125 363 -314
2435c14K83kJ93K85n47Q9j07J54J10j14n4K2J55r5l0k12J29p4K39k97j27L69L35
$$ -314 -31 -33 160 445 -102 -13 -120 34 144 30 -24 -2 153 58 28 -184 -55 -129 110 -187 -314 55 390
2458C90q3n18J46J92r7j6J31m65M09K19k40l14L71mJ3k09j51J21K64j32m0N2M25
$$ 390 307 -211 -65 127 30 14 145 -320 89 308 68 -246 125 121 134 -75 -226 -105 159 27 -13 39 464
2481D64j85k41l62K86j0M84l84q6J11L3L83o06j54L10K28k26m0m71O40N9n7l11
$$ 464 279 38 -324 -38 -48 436 52 -34 77 110 493 -113 -267 43 271 45 5 -466 174 233 176 -135
2503a35j42M94r5k19l2J33K81o8j86l88R0K49J04l26L12l7K64k64k77L4M49J62
$$ -135 -277 217 122 -97 -129 4 285 217 31 -357 -267 -18 86 -240 72 35 299 35 -242 -208 241 403
2525D03k10l58J49Q5J66n91K58N4K66N2j25l69K26J90l68k41j9M27j15k4j55J55
$$ 403 193 -165 -16 69 235 -356 -98 -44 222 274 149 -220 6 196 -172 -413 -432 -5 -120 -144 -299 -144
2547a44L63j08n19J38K71K05j10l58j15M33K48k8n19L93k13L10J23j55n51N14
$$ -144 219 111 -408 -270 1 206 96 -262 -377 56 304 276 -243 150 -63 247 370 215 -336 178
2567A78Kl36J1q7K96p4P0r8m9K45j54J33k63k0K54Q5k52L07j88J67R7o87J81J90
$$ 178 180 -156 -145 -232 64 -10 60 -38 -87 158 4 137 -126 -146 108 193 -59 248 60 227 324 -363 -182 8
2591HN8J92k52J66lJ85k55j3l25N51j03o55L99J12M8J72n22K77K38Jl23L6K88
$$ 8 66 258 6 172 169 354 99 86 -239 312 209 -446 -47 65 113 285 -237 40 278 279 -44 -8 280
2614B80o8j13k52K8J08J84j03P4l24R2K50k08m4j28K76J99O8o97L74RL49k95P0
$$ 280 212 99 -153 -125 -17 167 64 138 -186 -94 156 -52 -96 -224 52 251 319 -378 -4 5 354 59 129
2637A29qK09j54k09p0J72L67k66l46J59J11L18l04o72L69J53L89l44k14P7L55
$$ 129 121 330 176 -33 -103 69 436 170 -176 -17 94 412 108 -564 -195 -42 347 3 -211 -134 221
2658B21m72J57l30J14M30m9J53p44M70P0J97l40J29j8J66j60j18r1K69J52j93
$$ 221 -251 -94 -424 -310 120 71 224 -520 -50 20 217 -123 6 -12 154 -6 -124 -215 54 206 13
2679A3Q0q6L04j79k41K6K05r5J17m4l40O30n12K47k92l5L85M03n76l4J38q1n4
$$ 13 93 7 311 132 -109 -83 122 27 144 100 -240 390 -122 125 -167 -202 183 586 10 -24 114 33 -21
2702b1lj9m8M98l14k34P6O6j38L67k78q2N23k8j58l86K32J81j5r1o6l07N36J09
$$ -21 -24 -43 -91 407 93 -141 -65 1 -137 230 -48 -130 393 365 207 -179 53 234 219 128 62 -245 291 400
2726D00l72k16K98j33K47l20JJ29NK2k33q2K63K75k08j43K58L9R3l31l7q4N55
$$ 400 28 -188 110 -23 224 -96 -95 34 39 61 -172 -254 9 284 76 -67 191 230 323 -8 -45 -129 426
2749D26k25m30M00j39K27l26k82L87K9K03l53k03K89NJ58rm86J30J67oJ7K0p9
$$ 426 201 -229 171 32 259 -67 -349 38 67 270 -83 -286 3 8 166 157 -329 -199 -32 -38 -21 -1 -80
2772h0j18J21q9L02j49O3l6j77J17J30ol18J9p4M39p3l36K45j65M58k01k31p1
$$ -80 -198 -77 -166 136 -13 50 14 -163 -46 84 78 -240 -221 -295 144 71 -265 -20 -185 273 72 -159 -230
2795b30P9K80j50q5J87k28K53k00o5M17o4N9k69k9ML51k10l02K76p1K19k84J74
$$ -230 -151 129 -21 -106 81 -147 106 -94 -159 258 194 253 -16 -45 -41 310 100 -202 74 3 222 -62 112
2818A12l03K35L6k29J84k17mJ75k1k1k47K44N45n94J50N9j23K09l58J24L2N58
$$ 112 -191 44 80 -149 35 -182 -186 -11 -32 -53 -300 -56 489 -105 45 104 -19 190 -168 -44 -12 546
2840E46m71l09J67m5J57L6m22K62J0R5k10O4k06K6M49j76p1K61P6j56l11K59J69
$$ 546 75 -234 -67 -112 45 81 -341 -79 -69 26 -184 -120 -326 -300 149 -27 -98 163 239 83 -228 31 200
2863B00j99K40k41J59k16K10j08k32O2n6L55m6l56L24j86J24k01J63j82L38r9
$$ 200 1 241 0 159 -57 153 45 -187 -125 -181 174 128 -228 96 -90 34 -167 -4 -186 152 53
2884E3k13J11J38K4k80L11l76K94r2J52j27J2kJ99k83M5o7J24k47mJ14k29L78
$$ 53 -160 -49 89 113 -167 144 -232 62 -30 122 -5 7 5 204 -79 -34 -101 23 -224 -228 -114 -343 35
2907C5k44R4R9j19K87k33jL5K20L1k74P4R3J31l85O8J20K2p4K09j61j70L26J44
$$ 35 -209 -115 -16 -135 152 -81 -82 -47 173 204 -70 4 97 228 -157 -89 31 53 -21 188 27 -143 183 327
2931C27k69k76J57J30j58J3%Q6L6o5q7J22rJ5M9J61k10O4J18m07J01K40l87M50
$$ 327 58 -218 -61 69 -89 -76 -76 10 46 -19 -106 16 7 22 71 232 22 86 204 -203 -102 138 -249 201
2955B01m78K33P5j04J02j67n8L47j70Lj97J63L09P7l41j73j76K73O7J71k70m6
$$ 201 -277 -44 31 -73 29 -138 -196 151 -19 -16 -213 -50 259 336 -5 -178 -354 -81 -14 157 -113 -159
2977a59r7L5p1K42J93p4j47L6M3OK4N9k85K59r6J3o6J86k58L22j12j60J91j08
$$ -159 -256 -221 -292 -50 143 69 -78 -42 1 7 31 90 -195 64 -32 -19 -85 101 -157 165 53 -107 84 -24
3001b4K03j07k9k19L77k61O6j90J6K77k61L1L14l11M71l94kk28L76Rj11j42J53
$$ -24 179 72 43 -176 201 -60 6 -184 -168 109 -152 -121 193 -118 353 -41 -43 -271 105 114 3 -139 14
3024A4k4k94MM0K99J94l7j45k58K46j8k35R1l31L88O2J04l37L25K82n32K02P0
$$ 14 -10 -304 -300 -260 39 233 196 51 -207 39 21 -214 -123 -454 -66 -4 100 -237 88 370 -162 40 110
3047A10L4J97n33J64O4K00k28JJ71K5k17M7J5O5j65J83j54l7L64l57L94k10j53
$$ 110 144 341 -192 -28 36 236 8 9 180 205 -12 35 50 115 -50 133 -21 -58 306 -51 343 133 -20
3070b0k2j49j9N5q4J60O5o9J2K44j57j14M6k79J61J23P1m2rL4Q8k79L39n76K48
$$ -20 -42 -191 -210 -155 -239 -79 -14 -83 -71 173 16 -98 -52 -331 -170 -47 24 -18 -27 7 95 -184 155 -421 -173
3095a73L3L77j95P8k19K35k03O3L43k41l5q5j6j05L29j81J67j37n1L55l12m0q8
$$ -173 -140 237 42 120 -99 136 -67 -4 339 98 63 -22 -38 -143 186 5 172 35 -16 339 27 -13 -101
3118a01K1K89Q5K02o71kO66n33J23Q1k28QJ57M5j57OK33l44R1M6L07l39j23J71
$$ -101 -80 209 294 496 -175 -177 489 -44 79 160 -68 -60 97 142 -15 -9 224 -120 -29 17 324 -15 -138 33
3142C3m7L19j27j60j84K62j18Q5j03J12J8k20J64r3J11J12m45L68j92J30Q8m1
$$ 33 -14 305 178 18 -166 96 -22 63 -40 72 90 -130 34 -59 52 164 -281 87 -105 25 113 72
3164G2l28n1L39J39Q0n31M17q2l1n7l5q4J21J67l23L31k29n5L47l6j48P6j48J70
$$ 72 -256 -307 32 171 251 -280 137 55 24 -33 -68 -152 -31 136 -187 144 -85 -140 207 171 23 99 -49 121
3188A21J15k40l9k56L44J13q3m9j0Mj47k01P7J65J82k61K47N6J5o88O53o2J5J3
$$ 121 236 -4 -43 -299 45 158 75 26 16 20 -127 -328 -251 -86 96 -165 82 138 153 -535 118 56 71 84
3212H4p8j78L63K3l34Q6J8O7K88M7k05j90L1K23n78J87K6L6L9n6n0k96L34J8J17
$$ 84 6 -172 191 214 -120 -34 -16 51 339 386 181 -9 22 245 -333 -146 -120 -84 -45 -101 -151 -447 -113 -95 22
3237B2k59K11p6k01M42J94j86Ll81Q1LJ53oN7r3k85L79k07L20K4j27o2J40r4l6
$$ 22 -237 -26 -102 -303 139 333 147 150 -231 -150 -147 6 0 57 -36 -321 58 -149 171 195 68 6 146 52 16
3262A6L0Q8L2J52k77k95L27J95k57k18M33j94L60m31k2lQ7P7r3K31l01J0k12J81
$$ 16 46 134 166 318 41 -254 73 268 11 -207 226 32 392 -39 -61 -64 23 100 7 238 -63 -53 -265 -84
3286h4J00k18M08k38k60M62j57j6q6m4K97n0k13j3lP8Q5l0m7J28N0N1l52J94k39
$$ -84 16 -202 206 -32 -292 170 13 -3 -89 -133 164 114 -99 -112 -115 -37 48 18 -29 99 149 200 -152 42 -197
3311a97qJ28Rk7J5j34J64N5j46K42k8p6n5L4r0J03J17l64J19K03k47j32L90L2
$$ -197 -205 -77 -68 -95 -80 -214 -50 5 -141 101 73 -3 -58 -24 -114 -11 106 -258 -139 64 -183 -315 75 107
3335A07j22L9k52M42j19J38n02N18m01r5L36j40j00L6J30k77K63j25l0l5j9K32
$$ 107 -15 24 -228 214 95 233 -269 249 -152 -247 89 -51 -151 -115 15 -262 1 -124 -154 -189 -208 24
3357B4k71K66M6k33r1r2N15n37L66m3J89r9k2j8o9R4j35K50J22m05n00N15K27
$$ 24 -247 19 65 -168 -259 -351 164 -373 -7 -50 139 40 18 0 -69 25 -110 140 262 -143 -643 -128 99
3380I9l21L92J67j61j3j03o4l59L62j13J09r7M33j28k46j80N3l3Q0J52j84K4m7
$$ 99 -222 170 337 176 163 60 -4 -363 -1 -114 -5 -102 331 203 -43 -223 -170 -203 -123 29 -155 -131 -178
3403a78J5J28N8O9j04q6Q4J23o6jl8k43K35J76o4k65K81J21o7k41NrK88k68o9
$$ -178 -163 -35 23 92 -12 -98 -14 109 43 42 4 -239 -4 172 108 -157 124 245 178 -63 -58 -67 221 -47 -116
3428a16N4N3K13j69k1M2k12J08j27K86J52l64L1L51k82j89K61R3q9k20J29L9L2
$$ -116 -62 -9 204 35 14 56 -156 -48 -175 111 263 -101 -70 281 -1 -190 71 164 75 -145 -16 23 55
3451E5k30l04K92J40N9l7l34K31K4J59p5j33L11k27L00J56m71rj00K15M9J18m03
$$ 55 -175 -479 -187 -47 12 -25 -359 -128 -104 55 -20 -153 158 -69 231 387 -84 -93 -193 22 71 189 -214
3474b14J65PK70l02N2J99n4m8p0J8j26Q0R2j93K06J64m4Rr6m72K20J08j24K54
$$ -214 -49 -42 228 -74 -22 177 123 75 5 23 -103 -23 69 -124 82 246 202 211 115 -357 -137 -29 -153 101
3498A01K47l30r8j43K26N12k81j24K12k35M2J11k43JJ1J18j69K4k98K84M25j96
$$ 101 348 18 -80 -223 3 515 234 110 322 87 129 240 -3 -2 9 127 -42 -18 -316 -32 393 197
3520A97j47j39L86k58O7j51M4k95K24Q2L5Q9k25l2J45j44M03k96m3K4q8J84RL4
$$ 197 50 -89 297 39 106 -45 -1 -296 -72 10 45 134 -91 -123 22 -122 281 -15 -58 -34 -122 62 71 105
3544A05Q4l13J86m19O25P2l48j5R3K17m81l6J11j17K44J72j21Ml10K97k10J99
$$ 105 189 -124 62 -357 268 340 -8 -23 70 287 -194 -230 -119 -236 8 180 59 63 -247 50 -160 39
3566C9p7K93k84J79rk00k0o2k2R2J76P7r2l2l1j27L27l07l4J43L5j60L86k17J99
$$ 39 -38 255 -29 150 141 -59 -79 -141 -163 -71 105 182 90 58 27 -100 227 -80 -114 29 64 -96 290 73 272
3591B72l6k04J70j65J85j61R0k62K20l54J23L11l62L39m11k3K66k88J77M22n41
$$ 272 236 32 202 37 222 61 151 -111 109 -245 -122 189 -173 166 -245 -268 -2 -290 -113 309 -232
3612b32L45k04K20j04r7K00M3Nk70J40M6k58M06o6l48q8M90m84J74j7Q2j64L31
$$ -232 113 -91 129 25 -72 128 171 176 -94 46 92 -166 240 174 -174 -262 228 -256 -82 -99 -17 -181 150
3635A50k04R8k07J71j32j76K37K87m02QJ3Q7j6k8J10j37K58k22K21J08l66K56
$$ 150 -54 44 -163 8 -124 -300 -63 224 -178 -170 -157 -70 -86 -114 -4 -141 117 -105 116 224 -142 114
3657A14l68P71o49K11j6K24o47L78K30j18k39J39k46K88j48K7m0J29q2K49k80
$$ 114 -254 517 -132 79 63 287 -360 18 248 130 -109 30 -216 72 -76 -49 -89 40 -42 207 -73
3678g3j60J34m6K59j67O4R3j66J96j44o7L16l74K72l13M40l47Q9j5j36J86j58
$$ -73 -233 -99 -145 114 -53 11 104 -62 134 -10 -77 239 -135 137 -176 264 -83 6 -9 -145 41 -117
3700a17j19L53j41k16K34M38n95m9K44J11j10j23q1J58K22k91O5j44j1J56M19
$$ -117 -236 117 -24 -240 -6 432 -163 -212 32 143 33 -90 -171 -13 209 -82 -17 -161 -172 -16 403
3721D03k04j86N8K18k93K0J47j24k99J37K04m65L90j24r9O1k7M55j28l42J43K01
$$ 403 199 13 71 289 -4 16 163 39 -260 -123 81 -384 6 -118 -217 -156 -183 272 144 -198 -55 146
3743A46n6o3j68K50o4m2k6m1J74k41q2K5L42n4j66j70K13J06j49L06m5m48O8n5
$$ 146 90 27 -141 109 45 3 -23 -64 110 -131 -213 -188 154 100 -66 -236 -23 83 -66 240 195 -253 -185 -240
3767b40K22J47J43k33j48K96j53K60k83p4k8%M4J14Q8k93K27j92OL99k55j8J5
$$ -240 -18 129 272 39 -109 187 34 294 11 -63 -91 -91 -47 67 155 -138 89 -103 -97 302 47 29 44
3790D4j41R5K51k45r2l5J46P8r9k65L58l8L7k08k44J62L77k66K44M3k35j7N3K06
$$ 44 -97 -2 249 4 -88 -123 23 101 2 -263 95 57 94 -114 -358 -196 181 -85 159 202 -33 -50 3 209
3814B09l79K29j5jq0q5J71l4j28J3j7j35K83r6j40L99j70k83L36K9j16o7pK28
$$ 209 -170 59 44 43 -37 -122 49 15 -113 -100 -117 -252 31 -65 -205 194 24 -259 77 106 -10 -77 -84 144
3838A44l13J40j87J42L62k39K40k29l89N25j17m5j96l0J75J71P1l13L04J18j46
$$ 144 -169 -29 -216 -74 288 49 289 60 -329 196 79 34 -162 -192 -17 154 225 -88 216 334 188
3859A88j81n3P8j6K4n0k75K09k11M49j62k54M32j21P4K7j8k25p4K7L10k03L5K35
$$ 188 7 -46 32 16 40 -10 -285 -76 -287 162 0 -254 178 57 131 158 140 -85 -159 -132 178 -25 10 245
3883B45j81k1K92m28J10o9J38J56l31P2l88K77J72M7N9L7j20k8M2K37k15l62l8
$$ 245 64 43 335 -93 17 -52 86 242 -89 -17 -405 -128 44 91 150 187 67 39 81 318 103 -259 -297
3906b97O5L87q4j78M1nP7K23k20Qk3L41k08j57J39q9j60K01n1K63j95k8l09J12
$$ -297 -232 155 71 -107 -66 -71 6 229 9 17 -6 335 127 -30 109 20 -140 61 10 273 78 50 -259 -147
3930a47M40k06j73p4O3J33n4K03k48K62j43K8l5j72j17N30K2l15M4j43J00K25
$$ -147 293 87 -86 -160 -97 36 -18 185 -63 199 56 84 49 -123 -240 290 312 -3 41 -102 -2 223
3952B23m06K29J31j33P8nR8j06J28l34j05J58o9K18m8O7p2J35k84K36L9k8j34
$$ 223 -183 46 177 44 122 117 215 109 237 -97 -202 -44 -113 105 57 124 52 187 -97 139 178 150 16
3975A6j18J09Rp2J95j39n9M6j85M84j79l8j62o4M55o02L76j05j0k4j24K28k0R4
$$ 16 -102 7 16 -56 139 0 -59 -13 -198 286 107 69 -93 -157 298 -304 72 -33 -43 -67 -191 37 17 111
3999A11o0l57J17Q6J30J48j80K46j80J49k69M12l70j35J62m2J6kj9k54J85J40
$$ 111 51 -306 -189 -103 27 175 -5 241 61 210 -59 353 -17 -152 10 -32 -16 -18 -37 -291 -106 34
4021C4k63K11O5jl24L23k61K18K1l18L81N2n69K28J50K82l24L71R1k03k86L40
$$ 34 -229 -18 47 46 -278 45 -216 2 23 -295 86 138 -431 -203 -53 229 -95 276 367 164 -122 218
4043B18l34P7J9k59j21J06L91j66K97r4j6j71J89j93K10k19M7j44j1M28l17N2
$$ 218 -116 -39 -20 -279 -400 -294 97 -69 228 134 118 -53 136 -57 153 -66 -19 -163 -174 254 -63 -11
4065a1l38K59N2n5R0K33j28k14L44k45m8K8k01L69k53K02j61Q6j61JL19N6k87
$$ -11 -349 -90 -38 -93 -3 230 102 -112 232 -13 -61 -33 -234 135 -118 84 -77 9 -152 -151 168 224 -63
4088f3N8kn4J3j59K64n1J30r0j84K18j44K39j02k19L43k51J8j55K0K66q6K7k0
$$ -63 -5 -7 -61 -48 -207 57 6 136 46 -138 80 -64 175 73 -146 197 -54 -36 -191 -171 95 9 36 16
4112A6j01J57j93J59j21o3RK48j82L38j03j24j36L0K87j31j09J34o5p2L46m31
$$ 16 -85 72 -121 38 -83 -146 -137 111 -71 267 164 40 -96 -66 221 90 -19 115 50 -22 324 -107
4134a07J63j28o0L61m05m6J49K2K54k37N7M2L9J47k96j36J10j4pK81l08o8m1M61
$$ -107 56 -72 -132 229 -176 -222 -73 -51 203 -34 23 65 104 251 -45 -181 -71 -85 -92 189 -119 -187 -228 233
4158B33k3l13L8r7K8m6R6j50j5L30o8l3n8P8K05j13p6j5J45m53K63j6o8J85l59
$$ 233 210 -103 -65 -162 -134 -180 -84 -234 -249 81 13 -20 -78 0 205 92 16 1 146 -307 -44 -60 -128 57 -302
4183c02O09m99J34K32m4L6PM8n7j26j27J61m02L70k36L6J51k4m4M3P1P1k88K54
$$ -302 307 -192 -58 174 130 166 173 221 164 38 -89 72 -330 40 -196 -160 -9 -33 -77 -34 37 108 -180 74
4207G4N3r6J0K21l00p8j4k6N65n19J33j33j32L90q0L5O5k4j88J65m4q1j8m59M79
$$ 74 127 31 41 262 -38 -116 -130 -156 409 -110 23 -110 -242 148 68 103 168 144 -44 121 77 -4 -22 -481 -2
4232bJ21l39K73j61K06o5K1K08m79M20j02k73J03Q5J4J49j80K89m48J4K32j74
$$ -2 119 -220 53 -108 98 33 54 262 -217 203 101 -172 -69 16 30 179 -1 288 -160 -146 86 -88
4254h8K04Qk35P4J55Pj02m5j35L64l25K61k60O0L41j93k58K02J98l4j81j89M18
$$ -88 116 124 -111 -37 118 125 23 -22 -157 207 -118 143 -117 -57 284 91 -167 35 233 199 18 -171 247
4277B47n28K38K25k11J31j94OK97l28K34j00K28j89l0J65l42K24k1L2n2j71K83
$$ 247 -281 -43 182 -29 102 -92 -86 211 -117 117 17 245 56 26 191 -151 73 52 84 32 -139 144
4299A44j74j8J60j43m1j73K44j19J06j13K69J41k09K4l4k70L59m07L0K65Qj26
$$ 144 -30 -48 112 -31 -72 -245 -1 -120 -14 -127 142 283 74 98 64 -206 153 -254 -224 41 49 -77
4321g7K77k34j96L13PK20l66O2J04J64l81L82l82n4J99J1k6j72J43L5P9K0j4j68
$$ -77 200 -34 -230 83 90 310 -56 6 110 274 -107 275 -107 -161 38 49 23 -149 -6 29 108 128 114 -54
4345e4k79K14o9j3K88j7k6k2J05j1m39m3M39m8J89j25J26qN6k06N7q0jj34M7o6
$$ -54 -333 -119 -188 -201 87 70 44 22 127 116 -323 -366 73 25 214 89 215 207 263 57 114 34 33 -101 -54 -120
4371a20J08K37m91K55k5J85j94k49K34L3r0K14J35k50L25n71j7M96k75r2M6N7
$$ -120 -12 225 -266 -11 -36 149 -45 -294 -60 -27 -117 97 232 -18 307 -264 -281 215 -60 -152 -106 -49
4393d9J14q9j25K70m75M03j8K81k83rJ15m03L91l75O21k64M4k5l08Q8J40r9Q8
$$ -49 65 -24 -149 121 -354 49 31 312 29 20 135 -268 123 -252 369 105 149 124 -184 -96 44 -55 33
4416C3j58L0J12J45j34j29R1m8J89l67K75j04N2J10k17j0L7r3K28l8j88K23K22
$$ 33 -125 -95 17 162 28 -101 -10 -58 131 -236 39 -65 -13 97 -120 -130 -93 -186 42 4 -184 39 261
4439B61k44j18L04k44J62k74N70o44m2J97j33j19L43k12j6N51l98n5O4Q2L3j11
$$ 261 17 -101 203 -41 121 -153 417 -227 -269 -72 -205 -324 19 -193 -209 342 -56 -111 -47 35 68 -43
4461d3J74j07m16M08j86K50j90J85l6K5J7k17Q8K12n2j96J19j4oj98K57m1J49
$$ -43 131 24 -392 16 -170 80 -110 75 39 64 81 -136 -48 164 112 -84 35 21 15 -183 74 33 182
4484A82Q2j1q6l63J24J22J92o13N61N3o1l95J78J75L7k83J86j01l2R3K6j80R4
$$ 182 264 253 167 -196 -72 50 242 -371 190 243 182 -213 -35 140 177 -106 80 -21 -53 40 66 -114 -20
4507b0L6q1p7J41o4P7P0l55K54K97k00j90J49j36l7J02Q9L3j95J74m49O19j58
$$ -20 16 -65 -142 -1 -65 12 82 -273 -19 278 78 -112 37 -99 -136 -34 55 88 -107 67 -382 237 79
4530G9m8k4l9j75M40j07m49M1M30k33J71K46k09Rk94J51N5j20L82j23J5k40M2
$$ 79 31 7 -32 -207 233 126 -323 -282 148 -85 86 332 123 132 -162 -11 44 -76 306 183 198 -42 0
4553@J65l27J59K61k70j38L24j34N9o6P1l61M02j57P8n8k66K60q7R8R8n7R3j61
$$ 0 165 -162 -3 258 -12 -150 174 40 99 33 104 -257 145 -12 66 8 -258 2 -85 13 111 54 147 -14
4577a4J68l53j5L71k38J13l89M96J0p7j79J40k17J77J81k59j27J40j92L52l7K9
$$ -14 154 -199 -214 157 -81 32 -357 139 149 72 -107 33 -184 -7 174 -85 -212 -72 -264 88 51 80
4599H0l35J32RK05J58n17K19J64K3n1j47j7n0J09p4J72j66n3m3M07l31K71j56
$$ 80 -255 -123 -114 91 249 -268 -49 115 138 87 -60 -77 -127 -18 -92 80 -86 -139 -182 225 -106 165 9
4622IK25j40RN9k26J44j25J44lk24J4O5N8K79k54q9N9j92J02Q6J31k10l3k6L36
$$ 9 234 94 103 162 -64 80 -45 99 96 -128 -114 -49 9 288 34 -55 4 -188 -86 0 131 -79 -112 -138 198
4647A98lO7k86K28n83J93J46R0J00j54j54O8l9R7j03p1K85o8j64L96k96J49N0
$$ 198 195 262 -24 204 -379 -186 -40 50 150 -4 -158 -90 -129 -32 -135 -206 79 11 -153 243 -53 96 146
4670A46M8j71k95N01m3k66l14J86K61J86l48Q2K00N4J57k92k15K70K3J62l41l0
$$ 146 194 23 -272 229 186 -80 -394 -208 53 239 -109 -27 173 227 384 92 -123 147 170 332 -9 -39
4692c9K03r2J06P7k81M3O0k96J26K83j57l68M36k2m2o2J07l00M70l30Q8j98K74
$$ -39 164 72 178 255 -26 17 77 -219 -93 190 33 -335 101 79 37 -25 82 -218 252 -78 10 -188 86
4715H6m31M58K3KL0j22j78O9k34L71l15J90J37j6K22l18j89K86J68m16J84Q0j7
$$ 86 -345 113 136 138 168 46 -132 -63 -297 74 -241 -51 86 70 292 -26 -215 71 239 -177 7 87 70
4738G0j00K88l28M0r1J50n4j12KM5J91j10J71O3m86K61J00J56m36J45K8J16m4
$$ 70 -30 258 -70 -30 -121 29 -25 -137 -135 -90 101 -9 162 225 -261 0 100 256 -180 -35 -7 109 65
4761F5j12L5j59p6M11k75J51j17L33l05j34K23j15J9L08k72n3J91j04M27k40l94
$$ 65 -47 -12 -171 -247 164 -111 40 -77 256 -49 -183 40 -75 -56 252 -20 -73 118 14 441 201 -193
4783a93r2L36J29l1o7p5q6K25R5n49L35j86j41M81r4j27q0k0M7Rq9N8J16L9m01
$$ -193 -285 51 180 149 82 7 -79 146 241 -308 27 -159 -300 181 87 -40 -120 -140 -93 -84 -173 -115 1 40 -361
4808c61R0M20P0j01P1r5k50L24j47k04K93m58N38l78L3M98k08n4J22k99l4K38
$$ -361 -271 149 219 118 189 94 -156 168 21 -183 110 -348 190 -188 -155 343 135 81 203 -96 -130 108
4830A08l1n7N7j17Q1Om8Q7j84M6M7J96K16o06J77j19L84k87J39j82L5n7R2K49
$$ 108 77 20 77 -40 41 47 -1 86 -98 -52 -5 191 407 -199 -22 -141 243 -44 95 -87 -52 -109 -17 232
4854B32n32K31Q3J6j06Q4r7l8L82m07J23L0o6J47m00L33J74j44k05J01L27m24
$$ 232 -300 -69 14 30 -76 8 -89 -127 255 -152 -29 1 -65 82 -318 15 189 45 -160 -59 268 -156
4876a56L48kk19q6p4L15l30K42J90L8k8j29o5L2j81N58k45k73K2N0O5J9k8q6p9
$$ -156 192 190 -29 -115 -189 126 -204 38 228 266 238 109 44 76 -105 453 208 -65 -43 7 72 91 63 -23 -102
4901a02J59j8L7j65o2J43o1j78L82K3l36K17M0l0J10j54N4j17r4L85L7j60n4k15
$$ -102 57 39 76 -89 -151 -8 -69 -247 135 158 -178 39 79 49 159 5 59 -58 -152 233 270 110 56 -159
4925a59L6j4P3K66n05N32k05j4K00k29m4L23l93J31q8L13k70J25r7J33J60m63
$$ -159 -123 -137 -64 202 -303 229 24 10 210 -19 -63 260 -133 -2 -90 223 -47 78 -19 114 274 -189
4947a89J2R4L61m65K03O9p3n9q6J82n1m3mk88J59K74j30J79K7k57j48M01j59J89
$$ -189 -177 -83 278 -187 16 85 12 -47 -133 49 -2 -45 -49 -337 -178 96 -34 145 172 -85 -233 168 9 198
4971A98j76k20n7M52n84O07k2n12O32q7k03n4K49l31k13K51j29L75k67R9k34J91
$$ 198 22 -198 -255 197 -387 220 198 -314 318 231 28 -26 223 -108 -321 -70 -199 176 -91 8 -226 -35
4993c5O7M1J6L1k40j8J57M6P0q1j7K02k96N4M8J27k63J25J88j58j31k36K73j58
$$ -35 32 73 89 120 -120 -138 19 65 135 54 37 239 -57 -3 45 172 -91 34 222 64 -67 -303 -30 -188
5017a88Q8K13j98K29k70N4N2j49M42m64K10J62m97L27j70K5L47j64J5r1O7J53
$$ -188 -100 113 -85 144 -126 -72 -20 -169 273 -191 19 181 -316 11 -159 -134 213 49 64 -27 40 193
5039A93Pj47K56n10N07n39L89j54L9r1L4l4N6P9k81L95k11N7r6j33L34m40M30
$$ 193 200 53 309 -201 306 -233 156 2 41 -50 -16 -50 6 85 -196 199 -12 45 -51 -184 150 -290 140
5062A40j08k4n5k19K16K41j08l8P7k83L07j85n0J74j25k08J00J45K03q1p9k9j68
$$ 140 32 8 -47 -266 -50 191 83 45 122 -161 146 -39 -89 85 -40 -248 -148 -3 200 119 40 11 -157
5085a57L45l9k60L30K89n47k8J98k32L69k17j34J25p5J67j13N9q1j54J86l3k67
$$ -157 188 149 -111 219 508 -39 -67 131 -101 268 51 -83 42 -33 134 21 80 -1 -155 31 -2 -269
5107b69L01j48m4K25K49l52L7k9j98L57O4qj39k33K50R9p3J9l52j4K46J56n7L5
$$ -269 32 -116 -160 65 314 -38 -1 -30 -228 129 193 185 46 -187 63 162 89 108 -244 -258 -12 144 87 122
5131A22m20k05M23K33j00J38j79m7k3J41l61K10l99N55j59l6J92P6j62l4o9j58
$$ 122 -298 -503 -80 153 53 191 12 -35 -58 83 -278 -68 -467 88 -71 -107 85 161 -1 -35 -104 -262
5153b62L57l0J12k46J3K27Q8j45k8J37j64mJ70n4l62J45M1r0l6J64K07j03k01
$$ -262 95 65 177 -69 -56 171 259 114 86 223 59 55 225 171 -191 -46 -5 -95 -131 33 240 137 -64
5176f4j40P1l1K15k04J65P4j58j0j02M0J22K12q1l85K61j74K25N9K3j56Q0K4J46
$$ -64 -204 -133 -164 51 -153 12 86 -72 -82 -184 -144 -22 190 109 -276 -15 -189 36 95 118 -38 42 66 212
5200B12l53j70J31K35Kj31o4L94l64j48J94o5K65l38L01j27J73j56J93m50L72
$$ 212 -141 -311 -180 55 57 -74 -138 256 -108 -256 -62 -127 138 -200 101 -26 147 -9 184 -266 106
5221A06k43L03Ok53j76J98j73N0J92m20L39J68j03J2O3o4q8k90N81k24J64j52
$$ 106 -137 166 172 -81 -257 -59 -232 -182 10 -410 -71 97 -6 6 69 5 -83 -373 208 -16 148 -4
5243dk57L57J32o93M77L5P6o6o6k5m4K61m46R7L29n7Mk13K50l72M04m19K67K3
$$ -4 -261 96 228 -465 12 47 123 57 -9 -34 -78 183 -263 -166 163 106 110 -103 147 -225 179 -240 27 50
5267E0m06L66k32L29J81l29j93J97J22n42L64K5j85K67J69j84j74K36l77L04J25
$$ 50 -356 10 -222 107 288 -41 -234 -37 85 -457 -93 -68 -253 14 183 -1 -175 61 -316 -12 113
5288A13Mk50J8N08l19k54M17j79OOp7J87r9j83k6M17m35L13Q0n93N27k10JN3q
$$ 113 117 -133 -115 393 74 -180 237 58 64 70 -7 180 81 -102 -128 289 -146 167 247 -346 181 -29 -28 25 17
5313A7M7k16Q3J99N8l42K26l48J31K99l39L33k54L08k81j58M74r6l52K88j29k15
$$ 17 64 -152 -69 130 188 -154 72 -276 -145 154 -185 148 -106 202 -79 -237 237 141 -211 77 -52 -267
5335b67M8J94j55R7m9K36K44j90O1k45J41p2m0qj99L99l44L66l55k7K09K55j79
$$ -267 -219 -25 -180 -83 -132 104 348 158 219 -26 115 43 3 -5 -204 195 -149 217 -138 -165 44 299 120
5358A20m3K38n41K21K06j73k26L80j69J0r6J43J38m56M09j27K24j40j34K82l24
$$ 120 77 315 -226 -5 201 28 -198 182 13 23 -73 70 208 -248 161 34 258 118 -16 266 -58
5379e8jK26l83M53k30m7Q4K8j0o05N00p1J88j28J2j20J39N3L03j59l23K62m05
$$ -58 -59 167 -216 237 7 -40 44 72 62 -543 -43 -114 74 -54 -42 -162 -23 30 333 174 -149 113 -292
5402b92L32j53Q2j9j75K18k5J79Q7k89J82R6j94j6j19JJ6P7P5q1J14j90M66l91
$$ -292 40 -113 -31 -50 -225 -7 -32 147 234 -55 127 223 29 13 -106 -105 -89 -12 63 -18 96 -94 372 -19
5426a9L13m86K73m5n5L46k17K31l52n5m0L62r6l07lp1L16P5j95J61j09O1j6j29
$$ -19 294 -192 81 36 -19 327 110 341 -11 -66 -106 256 160 -147 -150 -221 95 170 -25 136 27 88 72 -57
5450e7K22j8j18K2L02k93J95k64o1j02J04J25j23L69l26J06j94L6l5K52k16K61
$$ -57 165 147 29 51 353 60 255 -9 -70 -172 -68 57 -66 303 -23 83 -111 -75 -110 142 -74 187
5472A87K0k47K0M7j78M6K17j2l35nN76m65J87j20k22J25J35q5K47l08J51J34j85
$$ 187 207 -40 -20 27 -151 -105 112 100 -235 -240 336 -129 58 -62 -284 -159 -24 -109 138 -170 -19 115 -70
5495g0j26L64k78j42K93M8j08q2J92J6j26J22k4l1Q4J5j91m7K14m8k45J35R0k4
$$ -70 -196 168 -110 -252 41 89 -19 -101 91 107 -19 103 79 48 132 147 -44 -91 123 75 -170 -35 55 31
5519C1j43P7j10K31k90N47k24k19J58q6j36m1L40n2j03K02l60Q8J22P8j69q0q
$$ 31 -112 -35 -145 86 -204 343 119 -100 58 -28 -164 -205 135 83 -20 182 -178 -90 32 110 -59 -139 -147
5542a47K36N5k40R6o0L45k54l4k2P7J19j14l5J39M5m20M48n35J05K06Q6k28M03
$$ -147 89 144 -96 0 -60 285 31 -3 -25 52 171 57 22 161 206 -214 234 -301 -196 10 96 -132 271
5565B71r0j23J07L0k62j49p6K27L1L00k79K15m79K12M7m4l16K23L05m67J52K72
$$ 271 181 58 165 195 -67 -216 -292 -65 -34 266 -13 202 -277 -65 -18 -62 -378 -155 150 -317 -165 107
5587A07J90l07m0n8k1J32r9J95j0p4L4r2K43j83K3K14j50j05P6j01L11k38J82
$$ 107 297 -10 -50 -108 -129 3 -96 99 89 15 49 -43 200 17 40 254 104 -1 75 -26 285 47 229
5610B29m45J54K59n10L93K23l70Q8j78N4K52m6m6K04k84n6J95J30l1m18N28m48
$$ 229 -216 -62 197 -313 80 303 -67 21 -157 -103 149 103 57 261 -23 -79 116 246 215 -203 325 -123
5632a23L62k66J70PK80k83l9n3n3J5j23L0q0R4Q9J02j0k57M42l18P2j77K31N1
$$ -123 239 -27 143 150 430 147 108 55 2 17 -106 -76 -156 -62 27 129 119 -138 304 -14 58 -119 112 163
5656A63r3o7R1l4L0k85K75N6r4l3K10n51L83j09N11p45N90k94J82O7j11k05L41
$$ 163 70 3 94 60 90 -195 80 136 42 9 219 -332 51 -58 453 -292 298 4 186 253 142 -63 278
5679B78k47O9k78K36j48m5N8Q0L3k12L7N9K85m64J13K46J30m69L72k61J67km7
$$ 278 31 100 -178 58 -90 -135 -77 3 36 -176 -139 -80 205 -259 -146 100 230 -239 133 -128 39 37 -10
5702a0J90l04m5J98j26J94j31n7L18j73l5j95N1P5Q5J5k04K79j56j1o6K38j26
$$ -10 180 -124 -169 29 -97 97 -34 -91 227 54 19 -176 -125 -50 35 50 -154 125 -31 -42 -108 130 4
5725Dj60L36j56J84m25J3J00J22O8l9J33j72q4K43j89l20M45J11n3j31j9n6j13
$$ 4 -156 180 24 208 -217 -204 -104 18 86 47 180 8 -76 167 -22 -342 103 214 161 30 11 -45 -158
5748a58R1L96m29j01L03j5j08j71K30J12k43l01L62m5K00k34M69l12N9j64r6J27
$$ -158 -67 329 -100 -201 102 87 -21 -192 38 150 -93 -394 -32 -77 123 -111 358 46 105 -59 -155 -28
5770b8P6K9j38P4j26J98j58k92K75N7Q2L5O0Q8k01m32N14l39J88O7j62L24l05
$$ -28 48 77 -61 13 -113 85 -73 -365 -90 -33 49 84 144 232 31 -401 113 -226 -38 29 -133 191 -114
5793a14o2L66m9j02O4r3Mk16K74K38k51l56N0J01k6K63j4J75k31j41K12J8k3k86
$$ -114 -176 190 141 39 103 10 14 -202 72 310 59 -297 -247 -146 -172 91 77 252 21 -120 92 110 87 -199
5817a99J10J21j12j27J48J25m06K06M69m78j8J15j55J39P9j98K36m9M5J86m43
$$ -199 -89 32 -80 -207 -59 66 -340 -134 335 -143 -161 -46 -201 -62 17 -181 55 6 51 237 -206
5838b06J16L08q3l4k26P2j13J80M7k00L85m46M07j68K03m29J50J1J86j78M0j69
$$ -206 -90 218 135 101 -125 -53 -166 14 61 -139 246 -200 207 39 242 -187 -37 -26 160 -18 22 -147
5860a47L10j88J03K54l58j04K89P1l69J95l04J51Nj45J80k32J70K31j69K17l43
$$ -147 163 -25 78 332 -26 -130 159 230 -139 56 -248 -97 -92 -237 -57 -289 -119 112 -57 160 -183
5881a83J03J63J03k82J63pj03J12j83K36n8K79l00j11j63J03J50J52m88L27M2
$$ -183 -80 83 186 -96 67 60 -43 69 -114 122 64 343 43 -68 -231 -128 22 174 -314 13 55
5902E5j38j01K6L5R2nk73K69k55N04k76l8L2J44j84kj25L25O1p9l01j0M17k07
$$ 55 -83 -184 -158 -123 -31 -36 -309 -40 -295 209 -67 -105 -73 71 -113 -115 -240 85 146 67 -234 -244 173 -34
5926c4O0m0k41l5P5O9lM1M2q3L95l91J88j64L53l28K3J65m56L00K24R6j31J06
$$ -34 26 -14 -255 -290 -215 -146 -149 -108 -66 -149 246 -145 43 -121 232 -96 -73 92 -364 -64 160 256 125 231
5950B31l79j01Q7K47j46j51J67K53l99J13j28L76j85n8Q5L9K73n54J73J84j61
$$ 231 -148 -249 -162 85 -61 -212 -45 208 -191 -78 -206 170 -15 -73 12 51 324 -230 -57 127 -34
5971c4q1N5K41k41J53k02J39j03K92k64l7L20l47J82k7J36k69j8J15j60J09K90
$$ -34 -115 -60 181 -60 93 -109 30 -73 219 -45 -82 238 -109 73 46 182 -87 -105 10 -150 -41 249
5993B49j95j36J6L7j0m7j97J5J87q0L49m47K71j24L04m20K04K19n0J73l96j6N9
$$ 249 54 -82 -66 -29 -39 -86 -283 -268 -81 -161 188 -259 12 -112 192 -228 -24 195 145 318 -78 -94 -35
6016c5l9n3p8p1K71Q6j17j8K85q2k50J92l5o8J85k83J67l9j49n3L56l06P5J59
$$ -35 -74 -127 -205 -276 -5 81 -36 -54 231 149 -101 91 56 -12 173 -110 57 18 -131 -184 172 -134 -59 100
6040A00j86j1L48n79K96l5N1J91J71j67l85K06j6l33L82m8p4J27m74K35L2J86
$$ 100 -86 -97 251 -328 -32 -67 -16 175 346 179 -206 0 -16 -349 33 -15 -89 38 -436 -201 -169 17
6062A7j33J02k97J75K72j9j95K4J87j04L54n32K75J44j64r4O6k6r4o4L73m98J73
$$ 17 -116 -14 -311 -136 136 117 -78 -54 133 29 383 -149 126 270 106 12 78 52 -42 -106 267 -231 -58
6085e8L68l25m2L0K86k52J33k61Q5o5j39N02p2J06l52J1o8M4l0N4Q9k47Q4j26
$$ -58 310 -15 -57 -27 259 7 140 -121 -36 -101 -240 262 190 296 -56 -45 -113 -69 -99 -45 44 -203 -119 -245
6109b45L54l42mj0L75k72O1K48J91m05j41Nk3j22J01N04k83l49K97J91k57L08
$$ -245 109 -233 -237 -247 128 -144 -83 165 356 -49 -190 -185 -208 -330 -229 275 -8 -357 -60 131 -126 182
6131A82j08J97j2j96k89L25j0j46J95j97j29K66j38N1RO8k82M41l20j09M17m91
$$ 182 74 271 259 63 -226 99 89 -57 138 -59 -188 78 -60 -9 0 68 -214 227 -93 -202 215 -276
6153b76M83k52J72o6j22k25L89j10j2k8J04J77p8j41Lj07J45K45l63J54K47o27
$$ -276 207 -45 127 61 -61 -286 103 -7 -19 -47 57 234 156 15 18 -89 56 301 -62 92 339 -288
6175b88K45q3j04L3O2J82R5l74J80J61L9O5q0N4l01J58j0k75L30k78M23m94q0
$$ -288 -43 -126 -230 -197 -135 47 142 -232 -52 109 148 213 133 187 -114 44 34 -241 89 -189 234 -260 -340
6198c40M38J76k06j5l2j70K89j8l20R9mL40n10L20J75j84l61M45j79N6J45J4%
$$ -340 98 274 68 53 21 -149 140 122 -198 -99 -103 237 -273 47 222 38 -323 122 -57 -1 144 158 158
$$ [...]
8191a28
##END NTUPLES=NMR FID
##END=
