##TITLE=1H_PR179_K1
 D2O, 8 sc, 
 29.7.2019
##JCAMPDX= 6.0         $$ Bruker NMR JCAMP-DX V2.0
##DATA TYPE= NMR FID
##DATA CLASS= NTUPLES
##ORIGIN= UXNMR, Bruker Analytische Messtechnik GmbH
##OWNER= root
$$ XWIN-NMR		Version 3.5
$$ Mon Jul 29 14:06:24 2019 Russian Standard Time (UT+4h)  she@DPX200
##.OBSERVE FREQUENCY= 200.13155
##.OBSERVE NUCLEUS= ^1H
##.DELAY= (6, 6)
##.ACQUISITION MODE= SIMULTANEOUS
##.ACQUISITION SCHEME= undefined
##.AVERAGES= 8
##.DIGITISER RES= 18
##SPECTROMETER/DATA SYSTEM= spect
##.PULSE SEQUENCE= zg30
##.SOLVENT NAME= D2O
##.SHIFT REFERENCE= (INTERNAL, D2O, 0, 15.7039)
##AUDIT TRAIL= $$ (NUMBER, WHEN, WHO, WHERE, WHAT)
$$ ##TITLE= Audit trail, XWIN-NMR		Version 3.5
$$ ##JCAMPDX= 5.01
$$ ##ORIGIN= Bruker BioSpin GmbH
$$ ##OWNER= she
$$ F:/spectra/data/she/nmr/H-F/1/audita.txt
$$ ##AUDIT TRAIL=  $$ (NUMBER, WHEN, WHO, WHERE, WHAT)
(   1,<2019-07-29 14:05:03.03 +0400>,<she>,<DPX200>,
      <created by zg, POWCHK disabled, PULCHK disabled
       configuration hash MD5:
       00 E9 B6 7A A2 85 ED C7 34 08 36 98 17 FE 4E 26
       data hash MD5: 16K
       42 F3 E6 F1 4A 91 62 67 57 03 13 64 E4 79 DB 81>)
$$ ##END=
$$ 
$$ hash MD5
$$ 1B 49 86 A1 C2 B9 BD 01 37 52 BF 94 22 7E BA F1
##$RELAX= 
##$RELAX= 
##$RELAX= 
##$RELAX= 
##$RELAX= 
##$RELAX= 
$$ Bruker specific parameters
$$ --------------------------
##$DU= <F:/spectra>
##$EXPNO= 1
##$NAME= <H-F>
##$PROCNO= 1
##$TYPE= <nmr>
##$USER= <she>
##$AMP= (0..31)
100 100 100 100 100 100 100 100 100 100 100 100 100 100 100 100 100 100 
100 100 100 100 100 100 100 100 100 100 100 100 100 100 
##$AQSEQ= 0
##$AQ_mod= 1
##$AUNM= <au_zg>
##$AUTOPOS= <>
##$BF1= 200.13
##$BF2= 200.13
##$BF3= 200.13
##$BF4= 200.13
##$BF5= 200.13
##$BF6= 200.13
##$BF7= 200.13
##$BF8= 200.13
##$BYTORDA= 1
##$CFDGTYP= 0
##$CFRGTYP= 5
##$CHEMSTR= <none>
##$CNST= (0..31)
1 1 145 1 1 1 1 1 1 1 1 1 1 1 1 1 1 1 1 1 1 1 1 1 1 1 1 1 1 1 1 1 
##$CPDPRG= <>
##$CPDPRG1= <>
##$CPDPRG2= <>
##$CPDPRG3= <>
##$CPDPRG4= <mlev>
##$CPDPRG5= <mlev>
##$CPDPRG6= <mlev>
##$CPDPRG7= <mlev>
##$CPDPRG8= <mlev>
##$CPDPRGB= <>
##$CPDPRGT= <>
##$D= (0..31)
0 1.2 0 0 0 0 0 0 0 0 0 0.03 0 0 0 0 0 0 0 0 0 0 0 0 0 0 0 0 0 0 0 0 
##$DATE= 1564394702
##$DBL= (0..7)
120 120 120 120 120 120 120 120 
##$DBP= (0..7)
150 150 150 150 150 150 150 150 
##$DBP07= 0
##$DBPNAM0= <>
##$DBPNAM1= <>
##$DBPNAM2= <>
##$DBPNAM3= <>
##$DBPNAM4= <>
##$DBPNAM5= <>
##$DBPNAM6= <>
##$DBPNAM7= <>
##$DBPOAL= (0..7)
0.5 0.5 0.5 0.5 0.5 0.5 0.5 0.5 
##$DBPOFFS= (0..7)
0 0 0 0 0 0 0 0 
##$DE= 6
##$DECBNUC= <off>
##$DECIM= 24
##$DECNUC= <off>
##$DECSTAT= 4
##$DIGMOD= 1
##$DIGTYP= 9
##$DL= (0..7)
0 120 120 120 120 120 120 120 
##$DP= (0..7)
150 150 150 150 150 150 150 150 
##$DP07= 0
##$DPNAME0= <>
##$DPNAME1= <>
##$DPNAME2= <>
##$DPNAME3= <>
##$DPNAME4= <>
##$DPNAME5= <>
##$DPNAME6= <>
##$DPNAME7= <>
##$DPOAL= (0..7)
0.5 0.5 0.5 0.5 0.5 0.5 0.5 0.5 
##$DPOFFS= (0..7)
0 0 0 0 0 0 0 0 
##$DQDMODE= 0
##$DR= 18
##$DS= 0
##$DSLIST= <SSSSSSSSSSSSSSS>
##$DSPFIRM= 0
$$ [...]
##$SUBNAM2= <"">
##$SUBNAM3= <"">
##$SUBNAM4= <"">
##$SUBNAM5= <"">
##$SUBNAM6= <"">
##$SUBNAM7= <"">
##$SUBNAM8= <"">
##$SUBNAM9= <"">
##$SW= 24.9336996594482
##$SWIBOX= (0..15)
0 0 2 0 0 0 0 0 0 0 0 0 0 0 0 0 
##$SW_h= 4990.01996007984
##$TD= 16384
##$TD0= 1
##$TE= 0
##$TE2= 300
##$TE3= 300
##$TEG= 300
##$TL= (0..7)
0 120 120 120 120 120 120 120 
##$TP= (0..7)
150 150 150 150 150 150 150 150 
##$TP07= 0
##$TPNAME0= <>
##$TPNAME1= <>
##$TPNAME2= <>
##$TPNAME3= <>
##$TPNAME4= <>
##$TPNAME5= <>
##$TPNAME6= <>
##$TPNAME7= <>
##$TPOAL= (0..7)
0.5 0.5 0.5 0.5 0.5 0.5 0.5 0.5 
##$TPOFFS= (0..7)
0 0 0 0 0 0 0 0 
##$TUNHIN= 0
##$TUNHOUT= 0
##$TUNXOUT= 0
##$USERA1= <user>
##$USERA2= <user>
##$USERA3= <user>
##$USERA4= <user>
##$USERA5= <user>
##$V9= 5
##$VALIST= <valist>
##$VCLIST= <CCCCCCCCCCCCCCC>
##$VD= 0
##$VDLIST= <DDDDDDDDDDDDDDD>
##$VPLIST= <PPPPPPPPPPPPPPP>
##$VTLIST= <TTTTTTTTTTTTTTT>
##$WBST= 1024
##$WBSW= 4
##$XGAIN= (0..3)
0 0 0 0 
##$XL= 0
##$YL= 0
##$YMAX_a= 120890
##$YMIN_a= -185885
##$ZGOPTNS= <>
##$ZL1= 120
##$ZL2= 120
##$ZL3= 120
##$ZL4= 120
##$ABSF1= 10
##$ABSF2= 0
##$ABSG= 5
##$ABSL= 3
##$ALPHA= 0
##$AQORDER= 0
##$ASSFAC= 0
##$ASSFACI= 0
##$ASSFACX= 0
##$ASSWID= 0
##$AUNMP= <proc_1d>
##$AZFE= 0.1
##$AZFW= 0.1
##$BCFW= 1
##$BC_mod= 2
##$BYTORDP= 1
##$COROFFS= 0
##$CY= 11.3945322036743
##$DATMOD= 1
##$DC= 2
##$DFILT= <>
##$DTYPP= 0
##$F1P= 20.1537800932815
##$F2P= 0.134698688090026
##$FCOR= 0.5
##$FTSIZE= 0
##$FT_mod= 4
##$GAMMA= 1
##$GB= 0.15
##$INTBC= 1
##$INTSCL= 1
##$ISEN= 128
##$LB= 0.24
##$LEV0= 0
##$LPBIN= 0
##$MAXI= 10000
##$MC2= 0
##$MEAN= 0
##$ME_mod= 0
##$MI= 1.114404
##$NCOEF= 0
##$NC_proc= 0
##$NLEV= 6
##$NOISF1= 3.799351
##$NOISF2= 2.8
##$NSP= 1
##$NTH_PI= 0
##$NZP= 0
##$OFFSET= 15.70392
##$PC= 1
##$PHC0= -9221.887
##$PHC1= 11.80097
##$PH_mod= 1
##$PKNL= yes
##$PPARMOD= 0
##$PSCAL= 0
##$PSIGN= 0
##$REVERSE= no
##$SF= 200.130013532006
##$SI= 16384
##$SIGF1= 3
##$SIGF2= 2
##$SINO= 400
##$SIOLD= 16384
##$SREGLST= <1H.CDCl3>
##$SSB= 0
##$STSI= 0
##$STSR= 0
##$SW_p= 3612.71676300578
##$SYMM= 0
##$S_DEV= 0
##$TDeff= 0
##$TDoff= 0
##$TI= <>
##$TILT= no
##$TM1= 0
##$TM2= 0
##$TOPLEV= 0
##$USERP1= <user>
##$USERP2= <user>
##$USERP3= <user>
##$USERP4= <user>
##$USERP5= <user>
##$WDW= 1
##$XDIM= 8192
##$YMAX_p= 0
##$YMIN_p= 0
$$ End of Bruker specific parameters
$$ ---------------------------------
##NTUPLES= NMR FID
##VAR_NAME=  TIME,          FID/REAL,        FID/IMAG
##SYMBOL=    X,             R,               I
##VAR_TYPE=  INDEPENDENT,   DEPENDENT,       DEPENDENT
##VAR_FORM=  AFFN,          ASDF,            ASDF
##VAR_DIM=   8192,          8192,            8192
##UNITS=     SECONDS,       ARBITRARY UNITS, ARBITRARY UNITS
##FACTOR=    0.0002004,     1,               1
##FIRST=     0,             0,               0
##LAST=      1.6414764,     0,               0
##MIN=       0,             -185885,         0
##MAX=       1.6414764,     120890,          0
$$ Real data points
##PAGE= N=1
##DATA TABLE= (X++(R..R)), XYDATA
$$ plain form
0 0 0 0 0 0 0 0 0 -2 8 -8 8 -8 16 -16 17 -24 25 -33 40 -45 53 -61 71 -83 94 -107 123 -140 160 -179 203
31 203 -227 256 -287 320 -356 397 -441 490 -541 599 -666 735 -814 903 -1001 1113 -1238 1382
49 1382 -1550 1747 -1986 2274 -2637 3111 -3750 4679 -6144 8825 -15364 67671 17048 -138491
63 -138491 -81875 -16179 -10262 -22820 59071 120890 72227 -51226 -104529 -75614 -21324 8579
75 8579 48078 88785 82687 -2590 -90815 -100748 -40921 7052 39118 84007 100352 17825 -95984
88 -95984 -110628 -30551 17958 14336 42003 97730 71079 -46458 -124753 -86790 -1266 46863
100 46863 59610 64692 50170 -3789 -76948 -106487 -55881 35968 89233 75119 32740 -8113
112 -8113 -51861 -81873 -60875 498 53551 76238 72320 25728 -58256 -108092 -69995 9010
$$ packed form
0@%%%%%%%kJ0j6J6j6K4l2L3m1M9n8P3q5R8j14J32j54J77k01K30k63L00l39L82
31B03m30M83n43O07o76P53q38R31j031J140j265J401j549J717j904K114k351K620
49A382k932L297l733M260m911N748o861Q429j0823J4969k4189Q3035n0623j55539
63a38491N6616O5696N917j2558Q1891O1819m8663j23453n3303K8915N4290K9903
75H579L9499M0707o098q5277q8225r933N9827M7973L2066M4889J6345q2527j13809
88i5984j4644Q0077M8509l622K7667N5727k6651j17537p8295L7963Q5524M8129
100D6863J2747N082j4522n3959p3159k9539N0606R1849N3265j4114m2379m0853
112h113m3748l0012K0998O1373N3053K2687l918m6592q3984m9836L8097P9005
$$ plain form
124 9010 54082 63372 63458 34587 -33475 -87765 -79762 -23634 36257 74764 75284 32128 -28077 -65913
138 -65913 -70049 -46398 4279 65087 92029 57737 -14570 -75224 -86567 -43251 18636 53819
150 53819 58734 53348 26819 -39837 -98833 -77106 5424 60839 61234 48684 32019 -19002 -81256
163 -81256 -86867 -24857 43400 72856 66185 32390 -21823 -69849 -76229 -35866 23109 62217 64656
176 64656 39827 1248 -46403 -84011 -68311 6397 74600 75449 32879 391 -25991 -67261
188 -67261 -80625 -21716 61811 86656 47235 1909 -27095 -54338 -67087 -36461 26919 73872
200 73872 70860 27752 -25298 -61208 -67209 -41182 12114 65338 77441 36488 -19644 -51246
212 -51246 -59094 -49850 -9430 53332 83362 48637 -10173 -44100 -54331 -53443 -24357 35380 78661
$$ packed form
124I010M5072R290Q6k8871o8062n4290Q003N6128N9891L8507N20m3156o0205l7836
138f5913m136K3651N0677O0808K6942l4292p2307o0654j1343M3316O1887L5183
150E3819M915n386k6529o6656n8996K1727Q2530N5415L95j2550j6665n1021o2254
163h1256n611O2010O8257K9456o671l3795n4213m8026o380M0363N8975L9108K439
176F4656k4829l8579m7651l7608J5700P4708O8203Q49m2570l2488k6382m1270
188f7261j3364N8909Q3527K4845l9421m5326k9004k7243j2749L0626O3380M6953
200G3872l012m3108n3050l5910o001K6027N3296N3224J2103m0953n6132l1602
212e1246p848R244M0420O2762L0030l4725n8810l3927j0231Q88K9086N9737M3281
$$ plain form
225 78661 65292 10422 -40306 -63549 -56408 -22621 26063 62866 64200 28692 -24087 -60810
237 -60810 -61587 -31398 11924 53141 69569 43032 -13198 -56214 -61507 -39490 -2204 43136 72435
250 72435 53114 -3385 -50117 -60272 -43902 -11401 31987 64962 58328 13773 -35939 -60712
262 -60712 -54019 -21209 24302 59184 61662 27479 -23196 -59071 -59630 -27651 14570 49201 62109
275 62109 40118 -10321 -54392 -60768 -33586 3509 37950 60577 50936 4413 -46346 -63347
287 -63347 -42839 -5583 31191 57350 54241 16195 -33529 -60686 -50766 -16087 24296 52173
299 52173 54611 27277 -18778 -55553 -58145 -26035 16508 46545 54758 36571 -5538 -48651 -62053
312 -62053 -35169 7472 40432 53346 42431 6430 -38740 -60728 -44079 -3909 33244 52014
$$ packed form
225G8661j3369n4870n0728k3243P141L3787M8684L6803J334l5508n2779l6723
237f0810p77L0189M3322M1217J6428k6537n6230m3016n293K2017L7286M5340K9299
250G2435j9321n6499m6732j0155J6370L2501M3388L2975o634m4555m9712k4773
262f0712O693L2810M5511L4882K478l4183n0675l5875n59L1979M2221L4631J2908
275F2109k1991n0439m4071o376K7182L7095L4441K2627r641m6523n0759j7001
287f3347K0508L7256L6774K6159l109l8046m9724k7157R920L4679M0383K7877
299E2173K438k7334m6055l6775k592L2110M2543L0037Q213j8187m2109m3113j3402
312f2053K6884M2641L2960J2914j0915l6001m5170k1988J6649M0170L7153J8770
$$ plain form
324 52014 46860 15971 -27575 -56770 -51159 -15860 25372 50213 49254 23765 -15926 -49932 -55547
337 -55547 -26342 16603 46358 50273 30396 -4978 -41965 -56805 -36433 6077 40989 50816
349 50816 36668 4046 -33431 -54868 -43656 -5314 33331 50841 41653 12646 -24110 -50569
361 -50569 -48697 -16913 24328 48716 45926 20493 -15247 -44587 -51080 -27166 13996 44920 48876
374 48876 27254 -6703 -37746 -51098 -35126 2969 39144 50401 33691 2202 -30465 -48912
386 -48912 -40852 -7685 30832 49380 39798 10250 -23150 -45551 -44743 -17475 21136 46840 44329
399 44329 18213 -15297 -40765 -46645 -25995 11333 42636 47135 25858 -7911 -35692 -45770
411 -45770 -32192 1066 35429 48626 32740 -138 -30196 -44474 -36774 -8123 27124 46827
$$ packed form
324E2014n154l0889m3546k9195N611L5299M1232K4841r59k5489l9691l4006n615
337e5547K9205M2945K9755L915j9877l5374l6987j4840K0372M2510L4912R827
349E0816j4148l2622l7477k1437J1212L8342L8645J7510r188k9007l6756k6459
361e0569J872L1784M1241K4388k790k5433l5740k9340o493K3914M1162L0924L956
374D8876k1622l3957l1043j3352J5972L8095L6175J1257j6710l1489l2667j8447
386d8912Q060L3167L8517J8548r582k9548l3400k2401Q08K7268L8611K5704k511
399D4329k6116l3510k5468n880K0650L7328L1303M499k1277l3769k7781j0078
411d5770J3578L3258L4363J3197j5886l2878l0058j4278P700K8651L5247J9703
$$ plain form
423 46827 38803 8886 -23429 -42541 -39996 -16358 18243 43468 43119 17543 -15924 -39107 -41946
436 -41946 -23345 9239 38254 45160 25346 -7923 -34849 -42506 -29075 533 31774 45568
448 45568 32086 585 -29298 -41965 -33187 -7341 24397 43427 37214 9520 -22441 -40409
460 -40409 -37004 -14088 16699 39521 40737 17285 -15083 -37781 -39093 -20582 8584 34681 42675
473 42675 24972 -7325 -34001 -39905 -25576 757 27953 42482 31739 1377 -28489 -40196
485 -40196 -30792 -5810 22223 39740 35102 10027 -20975 -39024 -34777 -12391 15856 36001 37561
498 37561 17764 -13048 -36033 -37598 -18405 8743 31069 38317 25144 -5030 -33103 -39575 -23506
511 -23506 2954 25936 37052 29343 2877 -26070 -39111 -29565 -4641 21681 36442 31929 9380
$$ packed form
423D6827q024k9917l2315j9112K545K3638L4601K5225l49k5576l3467k3183k839
436d1946J8601L2584K9015O906j9814l3269k6926p657J3431K9608L1241J3794
448D5568j3482l1501k9883j2667Q778K5846L1738J9030o213k7694l1961j7968
460d0409L405K2916L0787K2822J216k3452l2368k2698j312J8511K9166K6097P994
473D2675j7703l2297k6676n904J4329K6333K7196J4529j0743l0362k9866j1707
485d0196R404K4982K8033J7517m638k5075l1002j8049M247K2386K8247K0145J560
498C7561j9797l0812k2985j565J9193K7148K2326P248j3173l0174k8073o472J6069
511b3506K6460K2982J1116p709k6466k8947j3041R546K4924K6322J4761m513k2549
$$ plain form
524 9380 -18719 -36387 -34116 -11945 16620 34952 33585 15366 -11149 -33389 -36849 -17856 10522
537 10522 30133 33827 21696 -2881 -28897 -38132 -23798 3240 26401 34841 26453 2850 -23717
550 -23717 -36614 -27603 -4569 20551 35195 30215 7801 -18159 -33209 -30708 -12271 13895 33320
563 33320 32560 14120 -10814 -30165 -34947 -19054 9518 30946 32980 18451 -4067 -25824 -35230
576 -35230 -22689 3107 24889 32195 24472 3363 -21745 -35154 -27008 -4030 18947 32361 29514
589 29514 9032 -17706 -32912 -29266 -10805 13753 31571 31023 11757 -11106 -26962 -29962 -18675
602 -18675 6276 28785 32865 17869 -4542 -23770 -33131 -23302 2237 25390 31965 21640 1957
615 1957 -20320 -33012 -25189 -2675 18627 29087 26266 8638 -14938 -30308 -26823 -11002 10449
$$ packed form
524I380k8099j7668K271K2171K8565J8332j367j8219k6515k2240l460J8993K8378
537A0522J9611L694j2131k4577k6016r235J4334K7038K3161Q440q388k3603k6567
550b3717j2897R011K3034K5120J4644m980k2414k5960j5050K501J8437K6166J9425
563C3320p60j8440k4934j9351m782J5893K8572K1428K034j4529k2518k1757r406
576c5230J2541K5796K1782P306p723k1109k5108j3409Q146K2978K2977J3414k847
589B9514k0482k6738j5206L646J8461K4558J7818n48j9266k2863j5856l000J1287
602a8675K4951K2509M080j4996k2411j9228r361R829K5539K3153O575j0325j9683
615A957k2277j2692P823K2514K1302J0460k821j7628k3576j5370L485J5821K1451
$$ plain form
628 10449 29360 32283 14116 -13096 -28939 -27883 -14585 6040 25932 31144 16889 -5245 -22238
641 -22238 -29630 -21665 434 23592 30057 20016 2865 -16485 -30522 -27493 -4738 20116 30289
654 30289 24455 6843 -15307 -29651 -25557 -7352 11289 23935 27210 15136 -8803 -26604 -27663
667 -27663 -14747 4459 24191 31080 17640 -5848 -22487 -27038 -20654 -1414 23298 32124 18478
680 18478 -2662 -17359 -24224 -21899 -7030 14169 27615 24968 9438 -13220 -29949 -27206 -6906
693 -6906 13644 23699 24985 13979 -8252 -27616 -27436 -10760 6849 20550 26506 17499 -4533
706 -4533 -22185 -24712 -16867 -2540 17412 30471 23466 293 -20536 -27892 -20978 -2502 17612
719 17612 25694 18939 6279 -9159 -24696 -27797 -9611 14809 24841 20893 10838 -4105 -22170
$$ packed form
628A0449J8911K923j8167k7212j5843J056J3298K0625J9892N212j4255k2134j6993
641b2238p392P965K2099K3158O465j0041j7151j9350j4037L029K2755K4854J0173
654C0289n834j7612k2150j4344M094J8205J8641J2646L275j2074k3939j7801j059
667b7663J2916J9206J9732O889j3440k3488j6639m551O384J9240K4712Q826j3646
680A8478k1140j4697o865K325J4869K1199J3446k647j5530k2658j6729K743K0300
693f906K0550J0055J286j1006k2231j9364J80J6676J7609J3701N956r007k2032
706d533j7652k527P845J4327J9952J3059p005k3173k0829p356O914J8476K0114
719A7612Q082o755j2660j5438j5537l101J8186K4420J0032l948j0055j4943j8065
$$ plain form
732 -22170 -28838 -15079 7127 23599 26818 15607 -5862 -23228 -24539 -13244 1282 15059 25127
745 25127 20038 1163 -16687 -24019 -20913 -6983 14757 28884 21774 2705 -12974 -21504 -23221
758 -23221 -11625 11325 27306 23431 6768 -9913 -20422 -21580 -11390 4531 16885 23624 18779
771 18779 -393 -22866 -28505 -14064 4021 16336 22916 19460 2120 -18299 -25061 -16929 -2606
784 -2606 12703 23712 20991 4662 -12892 -20510 -19951 -10539 7902 23461 23837 10289 -7620 -22502
798 -22502 -25526 -11300 9920 21331 19017 11256 81 -15516 -25641 -16839 2857 18013 21470
811 21470 16101 2458 -13934 -23346 -18782 -4533 12393 24571 22105 3811 -15103 -21581 -16470
824 -16470 -6485 7087 20751 21790 8640 -7455 -17826 -21011 -13733 4296 21185 23163 11581
$$ packed form
732b2170o668J3759K2206J6472L219j1211k1469j7366j311J1295J4526J3777J0068
745B5127n089j8875j7850p332L106J3930K1740J4127p110j9069j5679q530j717
758b3221J1596K2950J5981l875j6663j6681j0509j158J0190J5921J2354O739m845
771A8779j9172k2473n639J4441J8085J2315O580l456j7340k0419o762Q132J4323
784b606J5309J1009k721j6329j7554p618N59R412J8441J5559L76j3548j7909j4882
798b2502l024J4226K1220J1411k314p761j1175j5597j0125Q802J9696J5156L457
811B1470n369j3643j6392r412M564J4249J6926J2178k466j8294j8914o478N111
824a6470R985J3572J3664J039j3150j6095j0371l185P278J8029J6889J978j1582
$$ plain form
837 11581 -3791 -16515 -22618 -15402 1612 17252 22218 15325 673 -15811 -22122 -14573 -1221
850 -1221 9744 18289 20702 9094 -11826 -24178 -19058 -5000 8792 19059 20357 9228 -8031
863 -8031 -19426 -19891 -10651 5007 18602 20518 10256 -2948 -14436 -20662 -15579 602 16259
876 16259 20878 14561 2442 -12726 -22985 -17973 -539 14436 18733 14991 5503 -8844 -19952
889 -19952 -18943 -6046 8657 18020 19050 8575 -6445 -17775 -18816 -10897 3300 18022 21642
902 21642 11092 -4976 -15858 -18475 -12927 604 15276 20326 13059 21 -11229 -18934 -16808
915 -16808 -3274 12411 19862 15164 4800 -9086 -19277 -18172 -5996 9108 17405 17765 8096
928 8096 -6806 -17412 -17562 -8604 3824 14755 19147 11774 -3513 -15206 -18455 -12143 78 14235
$$ packed form
837A1581j5372j2724o103P216J7014J5640M966o893j4652j6484o311P549J3352
850a221J0965Q545K413j1608k0920j2352N120J4058J3792J0267J298j1129j7259
863h031j1395m65R240J5658J3595J916j0262j3204j1488o226N083J6181J5657
876A6259M619o317j2119j5168j0259N012J7434J4975M297l742r488j4347j1108
889a9952J009J2897J4703R363J030j0475j5020j1330j041P919J4197J4722L620
902B1642j0550j6068j0882k617N548J3531J4672N050p267j3038j1250p705K126
915a6808J3534J5685P451m698j0364j3886j0191J105J2176J5104Q297L60r669
928H096j4902j0606j50Q958J2428J0931M392p373j5287j1693l249O312J2221J4157
$$ plain form
942 14235 19958 13266 -684 -12147 -17398 -14527 -3125 11073 18862 14616 3432 -8804 -17025
955 -17025 -16772 -6381 8152 17036 16790 7757 -6194 -16666 -17683 -8260 4600 14970 17734 10511
969 10511 -3239 -14803 -17208 -10626 463 12269 18358 13065 -188 -12777 -16632 -12739 -2829
982 -2829 10097 17996 14905 3130 -9794 -16444 -14716 -5187 7316 15827 15739 6444 -6050 -15398
996 -15398 -16025 -7355 4333 14035 16682 9994 -2724 -14327 -16537 -9969 1686 11653 16477 12279
1010 12279 202 -12200 -16661 -11826 -1028 9285 15748 14121 3653 -9272 -16347 -14233 -4302
1023 -4302 7287 15206 15091 6440 -5718 -14941 -15647 -6870 4839 13490 14794 8774 -2403 -13353
1037 -13353 -16467 -9270 2138 11636 14944 11121 572 -10876 -16250 -11595 -720 9726 14694
$$ packed form
942A4235N723o692j3950j1463n251K871J1402J4198P789m246j1184j2236q221
955a7025K53J0391J4533Q884k46r033j3951j0472j017R423J2860J0370K764p223
969A0511j3750j1564k405O582J1089J1806O089n293j3253j2589l855L893R910
982b829J2926P899l091j1775j2924o650J728R529J2503Q511q8r295j2494r348
996a5398o27Q670J1688R702K647o688j2718j1603k210O568J1655R967M824m198
1010A2279j2077j2402m461M835J0798J0313O463j627j0468j2925p075K114R931
1023d302J1589P919j15q651j2158r223p06Q777J1709Q651J304o020j1177j0950
1037a3353l114P197J1408R498L308l823j0549j1448n374M655J0875J0446M968
$$ plain form
1050 14694 12450 3205 -8236 -15379 -13399 -4087 7461 14103 13322 5600 -5183 -13881 -14632 -6654
1064 -6654 5089 13071 14060 7891 -2410 -11981 -15199 -9036 2237 11538 14134 9358 202 -9639
1078 -9639 -15080 -11372 -753 9892 14189 10831 2577 -7577 -13935 -12644 -3612 7699 13659 12016
1092 12016 4608 -5517 -12404 -13539 -6349 4712 12971 13546 6539 -3107 -11463 -13505 -8699 1986
1106 1986 11451 13690 8505 -999 -9076 -13346 -10238 -821 9292 13940 10409 1393 -7485 -12429 -11380
1121 -11380 -3684 6432 13585 11949 3397 -5778 -11631 -11752 -5541 4041 12301 12739 6246 -3538 -10607
1136 -10607 -12224 -7564 1609 10468 13092 7879 -1361 -9357 -12316 -8746 -947 8280 13044 9934 973
1151 973 -7562 -12236 -9973 -3040 5896 12347 11542 3576 -5941 -11397 -10819 -4566 3752 10790 11922 5878
$$ packed form
1050A4694k244r245j1441p143J980R312J1548O642p81p722j0783q698p51P978
1064f654J1743P982R89o169j0301r571l218O163J1273R301K596m776r156r841
1078i639n441L708J0619J0645M297l358q254j0154o358J291R032J1311N960j643
1092A2016p408j0125o887j135P190J1061Q259N75p007r646q356k042M806J0685
1106A986R465K239n185r504q077m270L108R417J0113M648l531r016q878m944J049
1121a1380P696J0116P153j636q552r175n853j21O211R582Q260M38o493r784p069
1136a0607j617M660R173Q859K624n213r240p996k959L570P799R227M764l110q961
1151I73q535m674K263O933Q936O451q05p966r517n456N78O253Q318P038J132o044
$$ plain form
1167 5878 -3808 -10194 -11103 -6562 2007 9163 12310 7553 -1429 -8864 -11469 -7872 -710 7506 12019
1182 12019 9612 983 -7803 -11655 -8920 -1919 5657 10695 10397 3859 -5438 -11846 -10523 -3591 4203
1197 4203 9619 10859 5745 -3268 -10165 -10606 -5790 2047 8433 11032 7271 -1065 -9060 -11041 -6995
1212 -6995 484 6725 10297 8409 1652 -6654 -11437 -8740 -1018 6350 9832 8600 3255 -4581 -10835
1227 -10835 -10265 -3722 4729 9148 9113 4629 -2736 -9082 -10013 -4982 2564 8337 10141 6263 -854 -8162
1243 -8162 -10677 -6494 570 7435 9842 6872 790 -6105 -9709 -8512 -1537 6219 9929 7293 2231
1258 2231 -3945 -8957 -9558 -3870 4534 9218 8698 4075 -3053 -8744 -9480 -4261 2618 7542 8672 5580
1274 5580 -561 -7250 -9303 -5865 741 6884 9470 6608 8 -6108 -9027 -7365 -1376 5588 9865
$$ packed form
1167E878r686o386r09M541Q569P156L147m757q982p435k605L597P162Q216M513
1182A2019k407q629q786l852K735P001P576N038k98o538r297o408J323O932P794
1197D203N416J240n114r013o897m41M816P837O386K599l761q336p995j981M046
1212f995P479O241L572j888o757q306m783K697P722P368L482j232n345p836o254
1227a0835N70O543Q451M419l5m484p365o346r31N031P546N773J804l878p117p308
1243h162k515M183P064O865K407k970o082o895l604J197O975P756L710k636n062
1258B231o176n012o01N688Q404M684n20m623p128n691p36N219O879M924J130l092
1274E580o141o689k053L438O606O143K586k862o600o116k919J662N989O964M277
$$ plain form
1289 9865 7125 1218 -4515 -8194 -7752 -3317 3895 8522 7553 3360 -2373 -7843 -9020 -4626 3187
1304 3187 8042 8182 4174 -1583 -6964 -8566 -5317 1087 6552 8600 5401 -481 -5655 -7623 -5910
1319 -5910 -1454 4675 9055 7579 638 -4854 -7604 -6870 -2809 3392 8405 7411 2074 -3740 -6617
1334 -6617 -7265 -4128 2129 7417 7979 4041 -1576 -6487 -7781 -4911 720 5841 7999 5644 -597
1349 -597 -6384 -7903 -4719 -217 4167 7388 6700 1235 -5012 -7213 -5863 -2176 2586 7588 7821 2583
1365 2583 -3771 -6955 -6967 -3416 2451 7167 6843 3299 -1721 -5911 -6976 -4066 1158 5480 6451 4778
1381 4778 456 -5036 -7701 -5124 237 4297 6806 6377 1352 -5201 -7593 -4988 -643 2988 6043
1396 6043 6272 2270 -3132 -6394 -5737 -3090 1931 6098 6822 2888 -2094 -5616 -6853 -4109 1365 5886
$$ packed form
1289I865k740n907n733l679M42M435P212M627r69m193n733n470j177M394P813
1304C187M855J40m008n757n381j602L249O404N465K048l199n882n174j968J713
1319e910M456O129M380j476o941n492k750P34M061O201N013r94n337n814k877
1334f617o48L137O257N288N62l938n617m911j294K870N631N121K158k355o241
1349e97n787j519L184M502M384L221o88n465o247k201J350L687M762N002K33n238
1365B583o354l184j2L551N867M716l24l544n020m190j065K910N224M322R71j673
1381D778m322n492k665K577N361M060K509m29n025o553k392K605M345L631L055
1396F043K29m002n402l262O57K647N021M167P24l934m982l522j237K744N474M521
$$ plain form
1412 5886 6494 3682 -448 -4833 -6813 -4204 664 3998 5360 5242 1593 -3689 -7242 -5845 -500
1427 -500 3636 5936 5673 1879 -3307 -6449 -5235 -1957 2026 5571 6063 2334 -1963 -4947 -5757 -3369
1443 -3369 312 5149 6278 3302 -591 -4572 -6609 -4758 378 5479 5581 3091 381 -3228 -5690
1458 -5690 -4844 -522 3702 5072 4653 1944 -2696 -5706 -5050 -1980 1852 4981 5863 2827 -2572 -5486
1474 -5486 -4866 -2253 1274 4733 5435 2650 -961 -3341 -5025 -3930 -361 4256 5640 3470 12
1489 12 -3036 -5705 -5012 -792 4080 5621 4023 1220 -2654 -5521 -4304 -1069 2456 4348 4958 2456
1505 2456 -1413 -4944 -4808 -2369 951 4602 5566 2900 -1479 -4457 -4641 -3037 18 4098 5381 3021
1521 3021 -518 -2820 -3969 -4191 -1325 3026 5071 4069 1430 -2413 -5127 -4499 -1405 2937 4604
$$ packed form
1412E886O08k812m130m385j980K609M868L334J362j18l649n282l553J397N345
1427e00M136K300k63l794n186l142J214L278L983L545M92l729m297k984q10K388
1443c369L681M837J129k976l893l981k037J851N136N101J02k490k710l609k462
1458e690Q46M322M224J370m19k709m640l010O56L070L832L129Q82l036n399k914
1474e486O20K613L527L459P02k785l611k380j684J095L569M617J384k170l458
1489A2l048k669O93M220M872J541j598k803l874k867J217L235L525J892O10k502
1505B456l869l531J36K439L320L651R64k666m379k978j84J604L055M080J283k360
1521C021l539k302j149k22K866M351K045j002k639l843k714O28L094M342J667
$$ plain form
1536 4604 4233 1842 -1748 -4482 -4246 -1730 1407 3530 4406 2767 -1133 -3947 -4417 -2666 117 3298
1552 3298 5273 3349 -529 -3657 -4338 -3224 -482 3172 4472 3404 388 -2210 -4189 -4040 -1284
1567 -1284 2061 4439 3766 1917 -1576 -4335 -4479 -1769 1786 3691 4008 2231 -1177 -4121 -4241 -1904
1583 -1904 592 2768 4124 2938 -106 -3202 -4016 -2742 -663 2531 4375 3345 275 -2843 -3999
1598 -3999 -3548 -1144 2354 4048 3178 584 -1478 -3487 -3866 -1525 1474 3307 3397 2038 -570 -3464
1614 -3464 -4130 -2048 611 2992 3776 2557 -126 -3057 -3792 -2470 -63 2141 3437 3079 766 -2475
1630 -2475 -3766 -3070 -746 2019 3969 3341 1000 -1573 -3273 -3627 -1096 1742 3416 3251 1407 -835
1646 -835 -2778 -4036 -2006 961 3084 3546 2259 -303 -2820 -3643 -2287 703 2555 3503 2643 294
$$ packed form
1536D604l71k391l590k734K36K516L137K123Q76j639l900k814m70J751K783L181
1552C298J975j924l878l128o81J114K742L654J300j068l016k598j979J49K756
1567a284L345K378o73j849l493k759j44K710L555J905L17j777l408k944j20K337
1583a904K496K176J356j186l044l096q14J274K079L194J844j030l070l118j156
1598c999M51K404L498J694q70k594k062k009l79K341K999J833R0j359k608k894
1614c464o66K082K659K381P84j219k683k931p35J322K407K204J296l58k313l241
1630b475j291O96K324K765J950o28k341k573j700l54K531K838J674j65j844k242
1646h35j943j258K030K967K123M62j287k562k517q23J356K990J852R48q60k349
$$ plain form
1662 294 -2495 -3597 -2664 -665 2114 3347 2606 710 -1505 -3004 -2840 -1237 1444 3125 3230 1244
1678 1244 -933 -2650 -3061 -1530 1026 3238 2933 1699 -523 -2418 -3298 -2203 505 2251 3350 2295
1694 2295 215 -2129 -2992 -2494 -359 1863 3128 2612 483 -1577 -3077 -2597 -980 1246 2916 3014
1710 3014 949 -1121 -2622 -3124 -1293 534 2578 3346 1769 -879 -2157 -2900 -1896 389 1954 3015
1726 3015 1953 -133 -1890 -3080 -2298 -164 1652 2830 2227 400 -1483 -2924 -2459 -600 1296 2900
1742 2900 2592 1053 -1359 -2515 -2466 -1241 729 2373 2574 1264 -662 -2432 -2608 -1492 362 2096
1758 2096 2609 1662 -386 -1868 -3025 -1816 -58 1800 2628 1925 419 -1584 -2426 -2262 -542 1365
1774 1365 2321 2265 625 -1146 -2419 -2323 -1410 883 2226 2147 895 -882 -2101 -2702 -1355 345 1929
$$ packed form
1662B94k789j102R33J999K779J233p41j896k215j499J64J603K681J681J05j986
1678A244k177j717m11J531K556K212l05j234k222j895q80J095K708J746J099j055
1694B295k080k344q63M98K135K222J265n16k129k060j500M80J617K226J670R8
1710C014k065k070j501n02J831J827K044P68j577k648j278p43J004K285J565J061
1726C015j062k086j757j190P82K134J816J178o03j827j883j441M65J859J896J604
1742B900l08j539k412j156M9J225J970J644K01j310j926j770j76J116J854J734
1758B096N13r47k048j482j157J209J758J858Q28p03j506k003q42J64J720J907
1774A365R56n6j640j771j273R6R13K293J343p9j252j777j219o01J347J700J584
$$ plain form
1791 1929 2518 2070 119 -2028 -2761 -1599 285 1712 2600 2005 425 -1644 -2224 -1938 -395 1482 2116
1808 2116 2162 638 -1474 -2166 -2253 -903 741 2322 2116 1014 -571 -2167 -2310 -1263 416 1645 2139
1825 2139 1443 -554 -2013 -1973 -1799 107 1851 2311 1680 76 -1656 -2350 -1744 -120 1454 2374 1722
1842 1722 404 -1138 -2073 -1982 -508 1111 2026 2078 724 -615 -2121 -1948 -895 360 1831 1781 1034
1859 1034 -278 -1674 -2328 -1310 384 1437 1870 1308 -46 -1578 -2314 -1724 -2 1099 2127 1730
1875 1730 505 -1092 -1992 -1864 -794 1138 2019 1762 787 -1190 -1877 -1810 -1029 819 1426 1771 1311 -414
1893 -414 -1672 -1836 -1301 418 1603 2089 1305 -350 -1517 -1915 -1398 -75 1272 2221 1784 283 -1302
1910 -1302 -1732 -1958 -174 1145 1856 1713 484 -1060 -1939 -1551 -537 681 1728 1377 1136 -496 -1877
$$ packed form
1791A929N89m48j951k147p33J162J884J427Q88n95j580k069n80K86J543J877O34
1808B116M6j524k112o92q7J350J644J581k06j102j585j596j43J047J679J229M94
1825B139o96j997j459M0J74J906J744M60o31j604j732o94O06J624J574R20o52
1842A722j318j542r35R1J474J619R15N2j354j339j506J73J053J255J471n0p47
1859A034j312j396o54J018J694J053M33n62j354j532p36N90J722J101J028l97
1875A730j225j597r00J28J070J932Q81k57r75j977o87O7P81J848O07L45m60j725
1893d14j258j64N35J719J185M86p84j655j167l98N17J323J347R49m37j501j585
1910a302m30k26J784J319P11j43j229j544q79L88J014J218J047l51k41j632j381
$$ plain form
1927 -1877 -2002 -949 586 1656 2028 1072 -237 -1467 -1896 -1260 245 1265 2108 1526 -50 -1455 -1769
1944 -1769 -1344 4 1590 1834 1252 256 -1033 -1850 -1842 -402 1032 2062 1657 698 -637 -1875 -1597 -576
1962 -576 579 1545 1691 1030 -416 -1450 -1915 -869 100 1053 2093 1062 15 -1316 -1871 -1631 -44
1979 -44 1340 1979 1303 231 -961 -1541 -1407 -501 836 1576 1530 359 -1228 -1899 -1429 -474 586 1374
1997 1374 1375 848 -420 -1565 -1726 -964 669 1498 1670 1181 -67 -1377 -1622 -1219 89 878 1670 1296
2015 1296 35 -1361 -1581 -1189 -294 1077 1818 1511 519 -892 -1757 -1797 -423 830 1548 1350 907 -495
2033 -495 -1253 -1808 -517 586 1375 1595 962 -532 -1594 -1942 -889 268 1228 1902 1054 -166 -1215
2050 -1215 -1711 -817 -199 1266 1919 1086 417 -1199 -1950 -1250 -465 1287 1930 1445 229 -745 -1524 -1559 -366
$$ packed form
1927a877j25J053J535J070L72r56j309j230m29O36J505J020Q43n82j576j405l14
1944a769M25J348J586K44n82r96j289q17QJ440J434J030m05r59j335j238K78J021
1962e76J155R66J46o61j446j034m65J046R69R53J040j031j047j331n55K40J587
1979d4J384O39o76j072j192n80J34R06J337P40m6j171j587o71M70R55J060P88
1997A374Jn27j268j145j61P62J633Q29J72m89j248j310k45M03J308P89P92l74
2015A296j261j396k20L92Q95J371P41l07r92j411q65m0J374J253P18j98m43j402
2033d95p58n55J291J103P89K20o33j494j062l48J053J157R60O74q48j220j049
2050a215m96Q94O18J465O53q33o69j616p51P00P85J752O43m85j216r74p79l5J193
$$ plain form
2069 -366 808 1547 1510 587 -517 -1493 -1538 -879 472 1361 1416 1360 -364 -1453 -1760 -1093 489 939 1612
2088 1612 1250 35 -1080 -1906 -1169 -383 775 1607 1426 230 -1171 -1185 -1470 -497 1210 1673 1573 435
2106 435 -699 -1777 -1649 -727 755 1564 1541 787 -451 -1356 -1704 -788 14 1248 1664 1125 68 -1472
2124 -1472 -1808 -1010 -64 1241 1327 1100 178 -1158 -1403 -1076 -135 695 1541 1489 541 -684 -1427 -1728 -644
2143 -644 937 1814 1414 446 -574 -1779 -1411 -706 720 1370 1666 1240 -67 -1146 -1868 -1036 43 1144
2161 1144 1929 1217 -32 -1316 -1801 -1119 -43 1026 1596 1345 -79 -1171 -1403 -1121 -547 725 1571
2178 1571 1457 435 -689 -1381 -1878 -777 869 1750 1907 714 -582 -1232 -1531 -949 584 1269 1528
2195 1528 830 381 -1295 -1559 -1041 -128 1038 1789 1683 177 -1483 -1715 -1332 -161 766 1765 1333 -46
$$ packed form
2069c66J174P39l7r23j104r76m5O59J351Q89N5n6j724j089l07O67J582M50O73
2088A612l62j215j115q26P37P86J158Q32j81j196j401j4k85R73J707M63j00j138
2106D35j134j078J28R22J482Q09k3p54j238r05l48R16Q02J234M16n39j057j540
2124a472l36P98R46J305Q6k27r22j336k45L27R41Q30Q46n2r48j225p43l01J084
2143f44J581Q77m00r68j020j205L68P05J426O50K96m26j307j079p22Q32J079J101
2161A144P85p12j249j284m85O82J076J069N70k51j424j092k32K82N74J272Q46
2178A571j14j022j124o92m97J101J646Q81J57j193j296o50k99N82J533O85K59
2195A528o98m49j676k64N18R13J166P51j06j506j660k32L83J171R27R99m32j379
$$ plain form
2213 -46 -1169 -1205 -1339 -490 890 1513 1530 338 -385 -1557 -1735 -772 511 1533 1372 840 -427 -1514
2231 -1514 -1663 -1163 567 847 1610 1420 -86 -1026 -1521 -1039 71 871 1740 1557 -119 -1224 -1830 -1027
2249 -1027 -663 892 1813 1345 341 -704 -1510 -1275 -504 423 1596 1512 611 -393 -1270 -1592 -672 453
2267 453 1410 1567 704 -242 -1302 -1880 -1284 373 1163 1577 1385 287 -989 -1582 -1379 -148 975 1586
2285 1586 1427 174 -974 -1427 -1462 -547 665 1631 1688 684 -337 -1150 -1304 -875 314 1624 1443 761
2303 761 -448 -1190 -1693 -1037 74 1303 1852 1137 -340 -964 -1741 -1296 344 1079 1644 1088 166 -943
2321 -943 -1711 -1139 -579 803 1959 1567 236 -566 -1416 -1554 -855 584 1529 1912 444 -290 -1295 -1617
2339 -1617 -966 478 1324 1272 1136 -150 -1321 -1951 -1290 436 1224 1523 1185 300 -1085 -1616 -1317 -117
$$ packed form
2213d6j123l6j34Q49J380O23J7j192p23j172j78R63J283J022j61n32j267j087
2231a514j49N00J730K80P63j90j506r40m95M82J110Q00Q69j83j676j105o06Q03
2249a027L64J555R21m68j004j045q06K35P71R27J173q4r01j004q77l22R20J125
2267D53R57J57q63r46j060n78N96J657P90M14j92j098j276n93K03J231J123O11
2285A586j59j253j148m53l5R15J212R66N7j004j021q13j54M29J189J310j81o82
2303G61j209p42n03O56J111J229N49p15j477o24p77M45J640P35N65n56r22j109
2321i43p68N72N60J382J156l92j331q02q50j38O99J439R45L83j468p34j005l22
2339a617O51J444Q46n2j36j286j171o30O61J726P88K99l38q85j385n31K99J200
$$ plain form
2357 -117 1083 1554 1597 666 -1069 -1522 -1582 -584 533 1478 1702 541 -544 -1557 -1605 -741 403 1616
2375 1616 1788 1020 -212 -1320 -1417 -1409 156 1226 1730 1262 264 -1310 -1750 -1295 8 973 1462 1387 38
2394 38 -593 -1668 -1510 -643 965 1620 1846 755 -777 -1685 -1519 -627 320 1535 1173 863 -399 -1445
2412 -1445 -1468 -1134 417 1287 1607 1277 -101 -1069 -1672 -778 276 1217 1396 1271 314 -850 -1815 -1719 -11
2431 -11 1022 1624 1674 431 -824 -1594 -1586 -808 491 1366 1520 965 -700 -1660 -1498 -592 478 1347 1580
2450 1580 1014 -323 -1370 -1698 -1301 -14 982 1836 1130 231 -1074 -1662 -1198 -103 1193 1695 1153 470
2468 470 -1068 -1891 -1418 -609 810 1238 1403 655 -840 -1497 -1517 -897 674 1394 1886 888 -26 -1362 -1587
2487 -1587 -1036 382 1202 1991 923 -49 -1288 -1569 -1207 -246 997 1527 1237 213 -1001 -1491 -1112 -247
$$ packed form
2357a17J200M71M3r31j735m53o0R98J117R45K24j161j085j013m8Q64J144J213
2375A616J72p68j232j108r7QJ565J070N04m68r98j574m40M55J303R65M89p5j349
2394C8o31j075J58Q67J608O55K26j091j532r08J66Q92R47J215l62l10j262j046
2412a445k3L34J551Q70L20l30j378r68o03Q94J054R41J79j25r57j164r65R6J708
2431a1J033O02N0j243j255p70QP78J299Q75J54n55j665r60J62R06J070Q69K33
2450A580n66j337j047l28L97J287R96Q54p06q99j305n88M64J095J296N02n42o83
2468D70j538q23M73Q09J419M28J65p48j495o57k0O20J571P20M92r98r14j336k25
2487a587N51J418Q20P89j068r72j239k81L62R61J243N30k90j024j214m90L79Q65
$$ plain form
2505 -247 592 1358 1190 593 -667 -1187 -1771 -758 628 1371 1424 542 -390 -1374 -1529 -1154 358 1240 1575
2524 1575 1052 -70 -1254 -1631 -1195 -219 1187 1794 1073 379 -1233 -1565 -1242 -437 798 1735 1484 302
2542 302 -673 -1411 -1524 -467 799 1589 1695 928 -445 -1792 -1326 -1004 452 1319 1434 926 33 -776
2560 -776 -1580 -1021 -106 927 1580 1314 130 -1079 -1903 -1397 -326 909 1513 1157 314 -767 -1537 -1552
2578 -1552 -549 379 1321 1339 853 -478 -1554 -1787 -730 257 1271 1471 1071 -5 -1380 -1522 -1227 148
2596 148 1225 1749 1348 199 -1102 -1662 -1398 -195 845 1581 1151 166 -962 -1349 -1524 -682 823 1560
2614 1560 1317 686 -576 -1390 -1491 -484 515 1338 1551 824 -186 -1505 -1507 -800 46 1072 1458 1376 132
2633 132 -841 -1479 -1312 -240 911 1710 1154 224 -1026 -1583 -1453 -224 694 1327 1503 697 -693 -1552
$$ packed form
2505b47Q39P66j68n97j260n20n84J013J386P43N3q82r32r84j55L75J512Q82L35
2524A575n23j122j184l77M36R76J406O07p21o94j612l32L23Q05J235R37k51j182
2542C02r75p38j13J057J266P90J06p67j373j347M66L22J456Q67J15n08q93q09
2560g76q04N59R15J033O53k66j184j209q24N06J071J235O04l56q43j081p70j5
2578a552J003R28R42J8m86j331j076k33J057R87J014K00m00j076j375j42K95J375
2596A48J077N24m01j149j301n60K64J203J040P36m30r85j128l87j75Q42J505P37
2614A560k43o31j262q14j01J007R99Q23K13p27j010j319kP07Q46J026L86q2j244
2633A32r73o38J67J072J151P99n56r30j250n57J30J229R18O33J76q06j390q59
$$ plain form
2651 -1552 -1849 -638 503 1521 1353 890 -255 -1076 -1731 -664 -16 1208 1496 1079 132 -1271 -1746
2668 -1746 -1211 -106 1223 1516 1117 152 -799 -1719 -1600 -175 937 1434 1363 531 -504 -1249 -1425 -922
2686 -922 728 1381 1513 970 -433 -1397 -1454 -1079 470 1395 1487 888 107 -1051 -1602 -1220 126 1236 1316
2705 1316 1353 197 -987 -1433 -1281 -329 854 1450 1356 497 -792 -1323 -1139 -577 503 1501 1338 769 -380
2724 -380 -1190 -1519 -1052 471 1302 1644 1343 65 -813 -1633 -916 190 1267 1252 914 528 -1016 -1496 -1074
2743 -1074 -90 630 1348 1259 595 -948 -1583 -1289 -592 639 1499 1456 727 -449 -1049 -1400 -717 373 1536
2762 1536 1577 895 -112 -1052 -1728 -947 -96 1110 1696 994 492 -769 -1401 -1072 -297 956 1666 1464 399
2781 399 -839 -1520 -1202 -391 481 1151 1402 784 -691 -1044 -1614 -718 16 1384 1657 981 -340 -1169 -1554
$$ packed form
2651a552k97J211J141J018j68m63j145q21o55J067O48J224K88m17r47j403m75
2668a746N35J105J329K93l99r65r51r20J19J425J112M97p1q32j035p45j76N03
2686i22J650O53J32n43j403r64n7L75J549R25R2n99p81j158n51L82J346J110Q0
2705A316L7j156j184m46J52R52J183N96r4q59j289n31J84N62J080R98j63n69j149
2724c80q10l29M67J523Q31L42l01j278q78q20P17J106J077j5l38l86j544m80M22
2743a074R84P20P18q9o64j543o35K94O97J231Q60m3p29j176o00l51O83J090J163
2762A536M1o82j007r40o76P81Q51J206N86p02n02j261o32L29P75J253P10k02j065
2781C99j238o81L18Q11Q72O70K51o18j475l53n70Q96P34J368K73o76j321q29l85
$$ plain form
2800 -1554 -711 -182 934 1160 848 152 -920 -1344 -1239 -32 606 1502 1127 593 -613 -1627 -1239 -194
2818 -194 749 1413 1351 732 -709 -1159 -1065 -778 -114 1097 1097 757 -86 -755 -1494 -802 99 932 1402 1428 320
2839 320 -835 -1535 -1017 -67 1103 1265 780 399 -601 -1222 -1511 -403 393 1194 1267 802 -458 -1655
2857 -1655 -1354 -685 444 1370 1463 1063 -266 -1154 -1182 -695 52 827 1506 1183 187 -807 -1225 -1126 -242 994
2877 994 1752 912 323 -752 -1058 -1170 -241 721 1280 1221 522 -335 -1442 -1550 -509 290 1235 1414 1086
2896 1086 -244 -1171 -1239 -551 -152 1115 1350 1134 -181 -950 -1141 -1266 -468 682 1435 1182 421 -638
2914 -638 -1172 -1484 -539 665 1348 1517 520 -442 -1222 -1520 -702 812 1067 1417 702 106 -1207 -1439 -617
2933 -617 -306 691 1483 1322 71 -1054 -1566 -958 -78 1039 1673 1041 167 -992 -1158 -1227 -531 384 1413
$$ packed form
2800a554Q43N29J116K26l12o96j072m24J05J207O38Q96l75n34j206j014L88J045
2818a94R43O64o2o19j441m50R4K87O64J211%l40q43o69p39O92R01Q33M70K6j108
2839C20j155p00N18R50J170J62m85l81j000o21k89J108P96Q01P3m65j260j197
2857a655L01O69J129R26R3m00j329q88k8M87P47P75O79l23r96r94m18R9Q84J236
2877I94P58q40n89j075l06j12R29R62N59n9o99q57j107j08J041P99R45J79l28
2896A086j330r27o8O88L99J267K35k16j315p69j91j25P98J150P53k53p61j059
2914f38n34l12R45J204O83J69r97r62p80k98Q18J514K55L50p15n96j313k32Q22
2933f17L11R97P92j61j251j125n12O08Q80J117O34o32q74j159j66o9O96R15J029
$$ plain form
2952 1413 1394 552 -460 -1046 -1404 -630 157 1239 1432 810 -129 -1076 -1445 -893 120 780 1266 963 42
2971 42 -904 -1253 -842 -124 530 1121 1167 452 -1101 -1580 -1086 -517 573 1474 1528 573 -650 -984 -1219 -743
2991 -743 179 1366 1251 623 -96 -998 -1405 -927 55 834 1353 737 120 -1044 -1492 -865 137 777 1173
3010 1173 1016 428 -792 -1366 -1249 -510 434 1256 1420 402 -378 -1312 -1276 -651 93 1071 1166 920 -148
3029 -148 -1017 -1271 -898 56 1137 1549 1023 199 -1063 -1509 -1216 121 567 1314 1234 426 -698 -1779 -1255
3048 -1255 -308 584 1293 1444 785 -615 -1165 -1243 -884 430 1432 1216 600 -262 -1029 -1607 -1170 331 1049
3067 1049 1366 910 69 -915 -1385 -1044 -151 812 1133 1344 359 -373 -1423 -1413 -548 267 1389 1030 434
3086 434 -341 -1123 -1223 -710 355 832 999 721 -358 -902 -1140 -734 -227 873 1173 751 -181 -855 -1257
$$ packed form
2952A413j9q42j012n86l58P74P87J082J93o22r39r47l69N52J013O60M86l03r21
2971D2r46l49M11P18O54N91M6p15j553m79M94N69J090R01N4r55j223l34k35M76
2991g43R22J187j15o28p19r02m07M78R82P79N19o16o17j164m48O27J002O40L96
3010A173j57n88j220n74J17P39R44Q22J64j018p80r34L6O25P44R78R5k46j068
3029a48q69k54L73R54J081M12n26q24j262m46K93J337M46P47q0q08j124j081N24
3048a255R47Q92P09J51o59j400n50p8L59J314J002k16o16q62p67n78M37J501P18
3067A049L17m56q41r84m70L41Q93R63L21K11r85p32j050J0Q65Q15J122l59n96
3086D34p75p82j00N13J065M77J67k78j079n44k38M06N07J100L00m22r32o74m02
$$ plain form
3105 -1257 -1083 46 811 1293 1219 512 -578 -1408 -974 -349 463 1162 1230 702 -377 -1314 -1534 -383 530
3124 530 798 1210 677 -164 -976 -1292 -818 329 1073 1321 920 11 -729 -1283 -755 -314 829 1144 1114 192
3144 192 -407 -1130 -1246 -369 579 1333 1166 468 -282 -1261 -1167 -819 317 884 1372 798 -291 -978 -1256 -618
3164 -618 336 793 1067 644 -219 -736 -1041 -674 -27 822 1308 1219 92 -654 -1082 -1198 -449 692 1270 1153
3184 1153 591 -584 -1159 -1177 -694 209 1396 1320 859 -383 -1569 -1150 -763 392 1179 1363 725 13 -907
3203 -907 -1402 -1060 -324 702 1125 810 239 -658 -1094 -850 -150 294 940 1008 418 -713 -1228 -1169 -390 677
3223 677 1122 1200 618 -41 -1288 -1239 -624 399 1116 1356 762 -286 -697 -1097 -909 16 893 934 1019 224
3243 224 -807 -1072 -845 -296 580 1290 1227 317 -547 -947 -817 -595 420 927 921 578 -295 -892 -1072 -599
$$ packed form
3105a257J74J129P65M82p4p07j090q30M34O25Q12O99O8n28j079r37k20J151R13
3124E30K68M12n33q41q12l16M74J147P44K48m01r09p40n54N28M41J143L15l0r22
3144A92n99p23j16Q77R48P54j67o98p50r79R4L48J136N67M88n74j089o87k78O38
3164f18R54M57K74m23q63n17l05L67O47Q49M86q9j127p46m28j16P49J141N78j17
3184A153n62j175n75j8M83R03J187p6m61j242j186M19L87J155P87J84o38p12r20
3203i07m95L42P36J026M23l15n71q97m36K44P00M44O46O8n90j131n15N9P79J067
3223F77M45P8n82o59j247M9O15J023P17K40n94j048m11m00J88R25Q77M1Q5p95
3243B24j031k65K27N49Q76P10o3r10q64m00J30K22J015N07ol43q73n97j80M73
$$ plain form
3263 -599 386 1100 1116 927 38 -468 -1100 -988 111 704 1150 1198 524 -883 -991 -986 -48 577 1131 1004 327
3284 327 -620 -874 -822 -309 402 1061 894 298 -391 -914 -1197 -595 270 898 1160 815 -21 -1004 -885 -632
3304 -632 3 681 1042 815 160 -521 -917 -860 4 505 902 1110 260 -656 -1000 -831 -461 296 1086 1134 460
3325 460 -234 -1087 -987 -821 239 866 1066 504 -111 -693 -1073 -574 112 750 1312 681 178 -632 -735 -958
3345 -958 -245 555 1253 685 291 -658 -895 -981 -555 732 878 1037 535 -525 -588 -1066 -541 49 995 1027
3365 1027 361 -257 -850 -1192 -904 524 864 990 550 95 -771 -874 -994 -255 769 1001 686 288 -393
3384 -393 -875 -908 -369 717 723 923 559 -507 -1260 -940 -493 389 631 1071 347 -509 -903 -722 -529 -30
3404 -30 1055 1067 545 -168 -634 -894 -713 22 781 996 575 -53 -507 -1134 -807 -161 559 551 1039 244 -569
$$ packed form
3263e99R85P14J6j89q89n06o32J12J099N93M46M8o74j407j08NR38O25N54j27o77
3284C27r47k54N2N13P11O59j67n96o89n23k83O02Q65O28K62l45q36r83J19K53
3304f32O35O78L61k27o55o81l96N7Q64N01L97K08q50r16l44J69L70P57P90M8o74
3325D60o94q53J00J66J060O27K00n62o15n82l80M99O86O38N62o31n03q10j03k23
3345i58P13Q00O98n68l94r49k37q6M26J287J46J59n02j060o3m78N25N90R46L2
3365A027o66o18n93l42K88J428L40J26m40m55q66j03j20P39J024K32l15l98o81
3384c93m82l3N39J086OK00l64j066p53L20M47Q82K42M40p24q56l94J81J93M99
3404c0J085J2n22p13m66k60J81P35P59K15m21o28m54o27L27O46P20qM88p95q13
$$ plain form
3425 -569 -850 -961 -289 591 1082 982 479 -163 -1037 -1095 -337 163 847 771 505 21 -800 -826 -503 -118 593
3446 593 816 748 202 -328 -968 -986 -155 534 852 698 241 -453 -866 -873 -381 373 793 916 606 -374 -979
3467 -979 -833 -429 35 533 748 657 -231 -888 -690 -501 11 403 863 616 -76 -445 -697 -634 -188 615 1188
3488 1188 793 144 -187 -770 -689 -151 449 643 531 266 -645 -996 -782 -147 186 562 764 640 -260 -868
3508 -868 -1064 -359 205 644 1015 644 -170 -744 -925 -206 -97 542 1058 598 109 -509 -792 -873 94 466
3528 466 1149 392 286 -174 -759 -685 -122 507 868 572 432 -261 -616 -613 -304 172 971 1051 309 -38 -846
3549 -846 -826 -783 143 682 829 646 -148 -516 -873 -531 7 570 912 575 156 -73 -858 -932 -389 658 778
3570 778 427 618 -241 -942 -847 -390 328 609 852 268 -211 -555 -888 -615 -159 569 770 641 -111 -485
$$ packed form
3425e69k81j11O72Q80M91j00n03o42q74n8P58N00O84p6k66m84q21k6L23L85P11
3446E93K23o8n46n30o40j8Q31O89L18j54m57o94m13pM92P54M20J23l10r80o05
3467i79J46M04M64M98K15r1q88o57J98J89N12L92M60k47o92l69k52O3M46Q03N73
3488A188l95o49l31n83Q1N38O00J94j12k65r11l51K14O35L33L76K02j24r00o08
3508h68j96P05N64M39L71l71q14n74j81P19J09O39N16m60m89o18k83q1R67L72
3528D66O83p57j06m60n85P4N63O29L61k96j40o93l55LL09M76P99Q0p42l47q08
3549h46K0M3R26N39J47j83p94l68l57L42N38N63L42l37m19k29p85p4N43J047J20
3570G78l51J91q59p01R5M57P18K81K43n84m79l44l33K73M56P28K01j29p52l74
$$ plain form
3590 -485 -839 -977 -677 557 954 493 163 -599 -618 -633 -143 343 836 395 233 -338 -644 -950 -411 350
3610 350 632 627 460 -431 -969 -733 -237 435 505 803 539 -266 -570 -1044 -511 311 409 738 673 -16 -497 -573
3632 -573 -685 -43 618 935 519 48 -661 -568 -643 -162 367 626 827 18 -305 -644 -475 -377 43 728 404
3653 404 723 4 -462 -742 -337 197 565 450 725 -66 -789 -815 -599 90 662 714 462 233 -361 -535 -866
3674 -866 -211 319 749 737 142 -403 -365 -655 -541 514 655 558 475 -169 -265 -780 -479 16 557 716 604
3695 604 88 -527 -649 -340 -93 748 659 388 117 -518 -604 -411 -65 370 715 636 325 -148 -349 -590 8
3716 8 470 511 690 281 -60 -468 -510 -351 208 741 447 244 86 -373 -597 -392 -78 449 655 471 45
3737 45 -678 -613 -513 -42 295 568 722 233 -574 -651 -444 -211 321 564 566 406 -281 -837 -542 -547 252 479
$$ packed form
3590d85l54j38L00J234L97m61l30p62j9j5M90M86M93m41j62n71l06l06N39P61
3610C50K82nj67q91n38K36M96O72P0K98k64q05l04m74N33Q22R8L29o5o89m81p6
3632e73j12O42O61L17m16m71p09R3p5M81N29K59K01q09l23l39J69R8M20O85l24
3653D04L19p19m66k80M05N34L68j15K75p91p23k6K16O89N72N2k52k29n94j74l31
3674h66O55N30M30j2n95n45L8k90J14J055J41r7q3o44r6n15L01M95N41J59j12
3695F04n16o15j22L09K47Q41q9k71k71o35q6J93L46M35L45p9l11m73k01k41N98
3716HM62M1J79m09l41m08m2J59N59N33k94k03j58m59k24K05L14N27K06j84m26
3737D5p23O5J00M71L37K73J54m89q07p7K07K33N32K43Kj60o87n56K95nP99K27
$$ plain form
3759 479 713 418 -115 -578 -657 -248 78 417 642 253 -222 -326 -588 -23 -20 385 643 409 -24 -622 -684
3780 -684 -525 -166 320 508 637 4 -274 -588 -466 -311 188 684 845 223 -210 -803 -757 -363 -109 496
3800 496 637 196 -82 -391 -631 -222 -20 440 559 257 235 -405 -830 -762 29 248 1017 654 -272 -213 -368
3821 -368 -706 -17 571 369 620 138 -317 -502 -425 -261 -23 548 638 352 -235 -610 -584 -235 -138 573 863
3842 863 316 -51 -271 -788 -661 69 332 587 472 358 -518 -677 -80 -117 218 570 359 70 -240 -665
3862 -665 -571 -5 413 485 765 159 -135 -741 -569 -273 103 415 769 479 141 -197 -504 -33 -117 356 371
3883 371 617 29 -580 -471 -399 -218 248 493 725 75 -241 -791 -654 208 473 919 527 214 -282 -659
3903 -659 -877 -370 509 362 396 124 -240 -385 -564 -153 -36 698 444 386 -58 -569 -426 -592 -33 330 558
$$ packed form
3759D79K34k95n33m63p9M09L26L39K25l89m75j04k62N65LM05K58k34m33n98o2
3780f84J59L59M86J88J29o33k78l14J22J55M99M96J61o22m33n93M6L94K54O05
3800D96J41m41k78l09k40M09K02M60J19l02k2o40m25O8P91K19P69l63r26N9j55
3821c68l38O89N88k02K51m82m55j85P7J64K38N71R0k86n87l75K6L49R7P11K90
3842H63n47l67k20n17J27P30K63K55j15j14q76j59N97l7L35L52k11k89l10m25
3862f65R4N66M18P2K80o06k94o06J72K96L76L12L54k90l38l38l07M71q4M73J5
3883C71K46n88o09J09P2J81M66K45K32o50l16n50J37Q62K65M46l92l13m96l77
3903f59k18N07Q79j47L4k72l64j45j79M11J17P34k54n8m44n11J43j66N59L63K28
$$ plain form
3924 558 600 207 -460 -631 -692 -19 289 598 510 236 -199 -517 -618 -364 496 621 542 121 25 -480 -641 -385
3946 -385 175 550 624 420 30 -370 -427 -234 -63 370 674 590 247 -675 -610 -383 -37 303 291 720 42 -366
3968 -366 -593 -323 -66 60 663 626 406 -275 -414 -451 -300 182 538 814 196 -102 -48 -586 -403 70 281
3989 281 501 489 300 -338 -586 -96 -92 405 333 764 163 -46 -668 -488 -210 249 564 514 472 -349 -634 -221
4011 -221 -149 123 826 852 237 -494 -594 -392 -370 -143 270 618 307 -180 -552 -476 -263 -12 369 454 610 217
4033 217 -297 -420 -324 25 421 330 587 269 -29 -663 -618 -465 159 529 703 169 55 -478 -461 -222 134
4054 134 194 455 479 39 -472 -477 -344 95 428 791 671 -62 -381 -771 -565 -2 229 585 556 175 -270 -657
4076 -657 -276 6 90 332 490 449 -297 -905 -473 -354 69 689 465 385 -262 -272 -488 -479 -220 4 547 287
$$ packed form
3924E58M2l93o67j71o1O73L08L09q8k74m35l18j01K54Q60J25p9m21r6n05j61K56
3946c85N60L75P4k04l90m00n7J93J71M33L04q4l43r22O5K27L46L40j2M29o78m08
3968c66k27K70K57J26O03l7k20o81j39l7J51M82L56K76o18k98N4n38J83M73K11
3989B81K20j2j89o38k48M90MM97p2M31o01k09o22J80K78M59L15n0m2q21k85M13
4011b21P2K72P03K6o15p31j00K02K2K27M13L48l11m87l72P6K13K51L81Q5J56l93
4033B17n14j23R6L49L96r1K57l18k98o34M5J53O24L70J74n34j14n33J7K39L56
4054A34O0K61K4m40n11nJ33M39L33L63j20p33l19l90K06N63K31L56k9l81m45l87
4076f57L81K82Q4K42J58m1p46o08M32J19M23O20k24q0o47j0k16RK59K24N43k60
$$ plain form
4098 287 406 -371 -370 -586 305 473 291 205 412 -72 -537 -574 -115 383 531 750 182 -393 -394 -323 -337 332 548
4121 548 527 500 -86 -492 -674 -404 202 -8 697 479 -218 -390 -562 -433 131 509 646 129 -13 -81 -362
4142 -362 -127 -164 95 634 400 251 -243 -246 -414 -55 -22 498 406 274 17 -571 -454 -429 125 447 148 254
4164 254 -113 -408 -355 -183 -69 444 451 624 -133 -525 -493 -440 -130 325 735 389 359 -23 -509 -637 -299 121
4186 121 591 465 103 -71 -717 -787 -190 253 629 275 314 -115 -399 -746 -484 142 315 583 367 185 -361
4207 -361 -593 -304 -111 228 464 231 -29 -396 -624 -305 15 202 581 508 448 -285 -439 -392 -225 68 552
4228 552 716 367 -161 -418 -473 -332 146 338 167 389 204 -602 -560 -425 14 233 227 217 332 -120 -790 -370
4250 -370 -127 -20 259 293 66 -229 -314 -415 -367 180 228 329 514 37 -364 -476 -152 -54 612 348 322 -36
$$ packed form
4098B87J19p77Jk16Q91J68j82q6K07m84m65l7M59M98J48K19n68n75jP1j4O69K16
4121E48k1k7n86m06j82K70O06k10P05k18o97j72j72J29N64L78J37n17j42o8k81
4142c62K35l7K59N39k34j49m94lj68L59L3N20r2j32k57n88J17K5N54L22k99J06
4164B54l67k95N3J72J14N13PJ73p57l92L2N3L10M55M10l46l0l82m86j28L38M20
4186A21M70j26l62j74o46p0N97M43L76l54L9m29k84l47K62O26J73K68k16j82n46
4207c61k32K89J93L39K36k33k60l67k28L19L20J87L79p3o0p33j54M7J67K93M84
4228E52J64l49n28k57n5J41M78J92j71K22j85q06M2J35M39K19oj0J15m52o70M20
4250c70K43J07K79L4k27k95q5j01M8N47M8J01J85m77m01j12L24R8O66k64k6l58
$$ plain form
4272 -36 -277 -676 -629 152 392 276 392 403 -171 -385 -294 -127 389 658 656 348 -300 -520 -589 -242 212 633
4294 633 243 16 -175 -581 -860 -426 197 295 572 292 -259 -338 -429 -610 -302 528 406 306 348 -116 -429
4315 -429 -294 -167 289 447 367 301 -265 -404 -497 -57 141 659 544 118 -126 -361 -575 -221 -28 557 751
4336 751 260 113 -347 -241 -331 -86 340 455 216 102 -370 -368 -631 22 477 137 405 239 -222 -462 -408
4357 -408 -461 235 491 403 193 -31 -265 -403 -242 68 332 752 119 -9 -173 -774 -233 -83 240 360 213
4378 213 272 25 -359 -457 -449 563 857 425 210 -62 -496 -603 -499 190 674 445 159 -211 -242 -499 -364
4399 -364 -139 262 598 467 -202 -475 -516 -335 73 252 532 319 100 -369 -389 -474 -157 624 671 173 146 -53
4421 -53 -727 -523 -127 222 560 482 122 -357 -581 -773 -328 179 168 520 416 -69 -54 -386 -329 277 316 644
$$ packed form
4272c6k41l99M7P81K40j16J16J1n74k14R1J67N16K69kl08o48k20o9L47M54M21
4294F33l90k27j91m06k79M34O23R8K77k80n51p9r1j81L08Q30j22j00M2m64l13
4315d29J35J27M56J58q0o6n66j39r3M40J98N18j15m26k44k35k14L54J93N85J94
4336G51m91j47m60J06r0K45M26J15k39j14m72Kk63O53M55l40K68j66m61k40N4
4357d08n3O96K56q8k10k24k34j38J61L10K64M20o33j28j64o01N41J50L23J20j47
4378B13N9k47l84r8QJ012K94m32k15k72m34j07J04O89M84k29k86l70l1k57J35
4399c64K25M01L36j31o69k73m1J81M08J79K80k13k19m69k0q5L17P81M7m98k7j99
4421e3o74K04L96L49L38p8l60m79k24j92M45N07j1L52j04m85J5l32N7O06L9L28
$$ plain form
4443 644 611 -28 -383 -539 -628 73 429 403 166 109 -257 -289 -493 -155 62 877 373 315 91 -553 -710 -201
4465 -201 21 393 493 105 -131 -347 -628 -375 -75 314 588 358 219 -91 -263 -210 -29 340 607 516 291
4486 291 10 -211 -199 -422 -39 726 466 121 -217 -271 -472 -478 38 633 444 280 104 -406 -601 -158 -119 735
4508 735 430 123 -197 -374 -617 -221 145 305 447 168 -20 52 -231 -478 -182 331 629 617 -23 -80 -478
4529 -478 -134 -368 28 116 264 214 -103 -398 -467 -401 -33 190 492 173 -31 -419 -557 -334 37 513 459 628
4551 628 -224 -223 -180 -58 -240 109 354 176 319 16 -414 -527 -313 -142 684 231 224 -298 -313 -603 -258 44
4573 44 383 446 372 216 -450 -761 -321 210 290 380 301 -138 -428 -465 -393 34 128 470 505 -225 -69 -259 -542
4596 -542 -423 -52 231 426 37 80 -488 -363 -254 93 228 344 502 44 -231 -282 -67 94 252 415 697
$$ packed form
4443F44l3o39l55j56q9P01L56k6k37n7l66l2k04L38K17Q15n04n8k24o44j57N09
4465b01K22L72J00l88k36k16k81K53L00L89K74k30j39l10j72N3J81L69K67r1k25
4486B91k81k21J2k23L83P65k60l45l38n4k01oN16N95j89j64j76n10j95M43L9Q54
4508G35l05l07l20j77k43L96L66J60J42k79j88P2k83k47K96N13K98j2o40n7l98
4529d78L44k34L96Q8J48n0l17k95o9O6L68K23L02l19k04l88j38K23L71M76n4J69
4551F28q52JM3J22j82L49K45j78J43l03m30j13K14J71Q26m53pn22j5k90L45L02
4573D4L39O3p4j56o66l11M40N31Q0R0p9m39k90l7P2M27R4L42L5p30J56j90k83
4596e42J19L71K83J95l89M3n68J25J09L47J35J16J58m58k75n1K15J61J58J63K82
$$ plain form
4617 697 109 -234 -494 -436 -139 552 278 367 480 -425 -257 -185 5 212 459 517 370 -249 -331 -295 -380 19
4639 19 207 311 311 -270 -487 -374 -371 57 279 255 194 -192 -273 -285 -205 -343 513 424 223 34 -174 -532 -351 -219
4663 -219 216 230 157 186 -199 -212 -255 -23 -265 493 507 328 76 -188 -341 -311 -187 510 395 141 158 -197 -701
4686 -701 -406 50 85 371 357 -90 -117 -287 -223 -132 19 426 339 290 -162 -202 -378 -334 -186 223 264 361 61 -766
4710 -766 -373 -95 -28 89 574 148 -250 -294 -5 -402 -250 312 532 480 -33 -69 -308 -169 -58 33 390 416
4732 416 359 -60 -350 -246 -193 107 350 214 590 -109 -334 -530 -203 33 192 407 568 27 -558 -430 -303
4753 -303 10 248 701 128 55 -340 -499 -385 -110 317 50 632 223 -339 -209 -316 -290 287 405 510 136
4774 136 -252 -267 -400 -444 -44 381 432 163 254 -194 -200 66 -45 122 303 541 136 -438 -425 -445 12 -11 383
$$ packed form
4617F97n88l43k60N8K97O91k74Q9J13r05J68P2J90K07K47N8j47o19q2L6q5L99
4639A9J88J04%n81k17J13LM28K22k4o1l86q1j2Q0j38Q56q9k01j89k08l58J81J32
4663b19M35J4p3K9l85j3m3K32k42P58J4j79k52k64j53L0J24O97j15k54J7l55n04
4686g01K95M56L5K86j4m47k7j70O4R1J51M07q7m9m52m0j76M4J48M09M1R7l00q27
4710g66L93K78O7J17M85m26l98m4K89l97J52N62K20n2n13l6k39J39J11R1L57K6
4732D16n7m19k90J04N3L00K43j36L76o99k25j96L27K36J59K15J61n41n85J28J27
4753c03L13K38M53n73p3l95j59J14K75M27k67N82m09n62J30j07K6N77J18J05l74
4774A36l88j5j33m4M00M25N1k69R1m48oK66j11J67J81K38m05n74J3k0M57k3L94
$$ plain form
4797 383 334 356 -263 -187 -365 -419 455 94 307 -21 92 -255 -210 -82 119 260 294 341 -175 -223 -355 -113 23
4820 23 294 137 90 -228 -210 -426 -22 -56 -184 374 305 35 -229 -384 -513 -184 -303 400 566 166 -288 -590
4842 -590 -68 -57 98 -5 196 25 2 118 -395 -167 -69 180 222 152 0 -166 -533 -269 -160 -19 156 579
4864 579 230 -237 -388 -438 -34 263 206 324 69 -102 -109 -408 -133 192 156 232 85 -139 -157 -296 -107 23
4886 23 235 121 0 -65 101 -549 -441 112 270 162 165 215 -242 -462 -324 25 295 157 335 -147 -55 -441
4908 -441 202 -201 302 337 244 172 -102 -241 -263 -107 -127 259 325 68 -311 -173 -426 -380 138 142 240 480 -86
4931 -86 -319 -13 -197 286 125 59 501 316 89 -121 -232 -116 338 410 406 -2 70 5 -231 -34 155 300
4953 300 368 154 -47 -136 -248 -270 25 133 338 216 44 -273 -397 -429 53 441 78 238 39 47 -381 -630
$$ packed form
4797C83m9K2o19P6j78n4Q74l61K13l28J13l47M5J28K01J41L4M7n16m8j32K42J36
4820B3K71j57m7l18J8k16M04l4j28N58o9k70k64j55j29L29j19P03J66m00m54l02
4842e90N22J1J55j03K01j71k3J16n13K28R8K49M2p0j52j66l67K64J09J41J75M23
4864E79l49m67j51n0M04K97n7J18k55j71pk99K75L25l6P6j47k24j8j39J89J30
4886B3K12j14j21o5J66o50J08N53J58j08LN0m57k20J38L49K70j38J78m82R2l86
4908d41O43m03N03L5r3p2k74j39k2J56k0L86O6k57l79J38k53M6N18MR8K40n66
4931h6k33L06j84M83j61o6M42j85k27k10j11J16M54P2mm08P2o5k36J97J89J45
4953C00O8k14k01q9j12k2K95J08K05j22j72l17j24l2M82L88l63J60j99Qm28k49
$$ plain form
4975 -630 -311 240 381 303 437 67 -294 -406 -187 348 392 349 256 -98 -136 -336 -395 -126 527 240 203 237 -9
4998 -9 -423 58 -83 72 111 320 219 -229 -363 -188 176 219 181 280 -42 -43 -366 -23 34 407 140 -26 113
5021 113 -446 -40 -302 -240 163 194 352 36 300 -164 -213 -78 67 217 146 343 213 -224 -511 -44 -73 338
5043 338 241 61 -78 -165 -69 -197 34 256 582 50 -21 -226 -72 -363 -45 277 121 394 271 -117 -563
5064 -563 -255 -341 -119 470 187 135 -137 -83 -464 -385 -397 267 126 463 -145 -547 -99 -206 -271 365 24 284
5086 284 296 -168 -425 -444 -25 212 263 172 47 -327 -283 -410 -21 113 -8 144 156 5 -72 -224 -399 -35
5108 -35 289 482 611 -81 -53 -191 -258 -21 107 384 230 31 -165 -364 -502 -64 175 268 313 -63 -125 -45
5130 -45 -456 312 -80 168 189 24 241 -379 -26 -79 -333 95 189 249 -293 -22 23 -2 76 215 327 315 -119
$$ packed form
4975f30L19N51J41p8J34l70l61j12K19N35M4m3r3l54l8k00n9K69O53k87l7L4k46
4998im14M81j41J55L9K09j01m48j34J75L64M3l8R9l22jl23L43N7L73k67j66J39
5021A13n59M06k62O2M03L1J58l16K64m64m9J35J45J50p1J97j30m37k87M67k9M11
5043C38r7j80j39q7R6j28K31K22L26n32p1k05J54k91L18L22j56K73j23l88m46
5064e63L08q6K22N89k83n2k72N4l81P9j2O64j41L37o08m02M48j07o5O36l41K60
5086B84J2m64k57j9M19K37N1r1j25l74M4j27L89J34j21J52J2j51p7j52j75L64
5108c5L24J93J29o92K8j38o7K37J28K77j54j99j96j99j38M38K39R3M5l76o2Q0
5130d5m11P68l92K48K1j65K17o20L53n3k54M28R4O0n42K71M5k5P8J39J12j2m34
$$ plain form
5153 -119 143 -260 -221 -219 -5 89 79 93 356 -93 -635 -364 50 462 194 372 -97 -80 -216 -288 203 320 112
5176 112 206 -11 2 -281 -267 37 330 224 93 314 89 -191 -358 156 190 317 508 -29 -175 -474 -428 -80
5198 -80 -245 635 573 176 -69 -291 -413 -154 -81 126 78 69 98 9 -398 -75 -39 199 314 292 20 -97 -134 -288
5222 -288 39 270 593 364 -57 -31 -423 -394 1 310 116 394 281 -299 -136 -406 -47 -47 366 244 144
5243 144 -112 -166 -415 -107 -44 328 451 316 -98 -238 -384 -168 43 69 36 128 220 -110 -278 -420 137 444
5265 444 344 602 175 -314 -109 -328 -27 83 45 474 192 -57 -150 -450 -6 -26 531 19 519 -1 -125
5286 -125 -47 -219 -208 -43 373 165 64 -68 -74 119 -203 325 62 230 157 -53 -322 -360 -143 263 251 102
5308 102 394 206 -363 -168 -181 146 327 364 71 42 -189 -230 -230 -98 166 143 105 16 1 -335 -382 44 50 267
$$ packed form
5153a19K62m03L9KK14R4j0J4K63m49n42K71M14M12k68J78m69J7j36p2M91J17k08
5176A12R4k17J3k83J4L04K93j06j31K21k25k80j67N14L4J27J91n37j46k99M6L48
5198h0j65Q80o2l97k45k22j22K59P3K07m8rK9q9m07L23L6K38J15k2k72j17l7j54
5222b88L27K31L23k29m21K6l92K9L95L09j94K78j13n80J63k70L59%M13j22j00
5243A44k56n4k49L08O3L72J23j35m14j40j46K16K11K6l3R2R2l30j68j42N57L07
5265D44j00K58m27m89K05k19L01J10l8M29k82k49r3l00M44k0N57n12N00n20j24
5286a25P8j72J1J65M16k08j01j32oJ93l22N28k63J68p3k10k69l8K17M06j2j49
5308A02K92j88n69J95j3L27J81L7k93k9k31m1%J32K64k3l8q9j5l36m7M26OK17
$$ plain form
5332 267 393 78 25 -183 -261 -85 62 450 333 171 110 -232 -94 -418 -152 356 338 209 -75 -142 -5 -194
5354 -194 147 161 241 183 366 -170 -333 -55 -214 203 452 -60 78 -261 -68 -212 -133 -16 32 174 274 188
5376 188 -22 -408 -87 140 246 339 94 81 -213 -218 -257 -28 180 559 266 -169 -18 -152 -220 -142 156 457
5398 457 205 -17 -392 45 -257 -7 282 464 317 120 -14 -135 -283 -177 161 517 649 277 -246 -97
5418 -97 -284 -313 90 534 46 183 -234 -413 -190 -157 241 144 249 586 246 6 -303 -419 -49 35 598 669
5440 669 114 -37 -140 -312 -107 -31 270 459 182 -27 -134 -29 -43 -111 434 332 454 113 -140 -427 -583
5461 -583 120 59 265 245 100 57 -270 -49 -259 117 393 565 -100 -306 -177 -221 -132 138 287 331 372 -128
5483 -128 -249 -533 -104 99 370 307 36 78 12 -246 -512 -100 194 194 201 28 -51 -426 -69 56 151 563 38
$$ packed form
5332B67J26l15n3k08p8J76J47L88j17j62o1l42J38l24K66N08j8j29k84o7J37j89
5354a94L41J4Q0n8J83n36j63K78j59M17K49n12J38l39J93j44P9J17M8J42J00q6
5376A88k10l86L21K27J06R3k45j3k94nl9K29K08L79k93m35J51j34o8P8K98L01
5398D57k52k22l75M37l02K50K89J82j47j97j34j21j48J06L38L56J32l72n23J49
5418i7j87k9M03M44m88J37m17j79K23L3L98r7J05L37l40k40l09j16L70Q4N63P1
5440F69n55j51j03j72K05P6L01J89k77k09j07J05j4o8N45j02J22l41k53k87j56
5461e83P03o1K06k0j45m3l27K21k10L76K76J72o65k06J29m4Q9K70J49M4M1n00
5483a28j21k84M29K03K71o3k71M2o6k58k66M12K94%Pj73p9l75L57J25R5M12n25
$$ plain form
5506 38 -51 97 -239 -203 -203 202 542 242 457 173 91 -526 -154 35 84 381 171 55 -119 -111 -502 -179 174
5529 174 393 192 128 -155 -358 -425 -211 -48 376 184 133 -410 -160 -405 -250 21 -67 416 223 -215 -215 -434
5551 -434 -175 329 80 419 208 330 -400 10 -133 129 301 374 258 227 -11 -137 -289 -64 85 259 530
5572 530 -75 -7 -382 -503 -269 289 484 500 14 -63 -427 -543 -196 45 343 359 266 -396 -482 -386 -19 150
5594 150 286 490 161 103 -486 -274 -354 168 206 90 343 278 -89 -410 14 -280 -28 444 134 267 -69
5615 -69 -374 -399 58 -3 455 489 143 -95 -77 -116 -41 125 -90 410 484 280 -275 -316 -340 112 97 115 258 -127
5639 -127 -292 -341 -398 -90 380 464 484 154 -21 -273 -289 -472 -128 527 94 168 74 -163 -289 -283 -143 132 507
5662 507 90 41 -267 -405 -74 115 -62 50 310 119 -264 -257 -233 -37 -196 381 171 68 -35 -363 -274 -38
$$ packed form
5506C8q9J48l36L6%M05L40l00K15k84q2o17L72J89M9K97k10j16j74Ql91L23L53
5529A74K19k01o4k83k03o7K14J63M24j92n1n43K50k45J55K71q8M83j93m38%k19
5551d34K59N04k49L39k11J22p30M10j43K62J72P3j16l1k38j26j52K25J49J74K71
5572E30o05O8l75j21K34N58J95J6m86p7l64j16L47K41K98J6r3o62q6R6L67J69
5594A50J36K04l29n8n89K12q0N22L8j16K53o5l67l21M24k94K52M72l10J33l36
5615f9l05k5M57o1M58L4l46k38J8l9P5J66k15N00P4k04n55m1k4M52j5J8J43l85
5639a27j65m9n7L08M70Q4K0l30j75k52j6j83L44O55m33P4r4k37j26OJ40K75L75
5662E07m17m9l08j38L31J89j77J12K60j91l83PK4J96j59N77k10j03j03l28Q9K36
$$ plain form
5684 -38 209 296 285 174 443 52 -130 -5 -63 593 611 296 -23 -148 -773 -61 151 31 230 28 -16 -472
5706 -472 -208 -271 -316 -49 289 175 -77 -103 -461 -261 -114 23 430 391 377 -430 -540 -449 -493 -392 414 394 82
5729 82 47 -425 -196 -305 -82 55 327 332 52 -257 -479 -477 -23 160 218 213 40 24 -488 -319 -233 -106 228 163
5753 163 78 119 -328 -288 -217 109 85 485 247 -105 -335 -500 -357 -83 30 303 28 262 -25 -480 -344 -296
5775 -296 77 331 321 -138 -371 -335 -293 -298 426 185 175 331 73 -84 -404 -312 231 373 365 231 -32 -355 -438
5798 -438 -149 -173 281 325 201 181 -233 -224 -39 -407 394 326 384 -40 -127 -225 -303 -9 101 330 341 224 -198 -389
5822 -389 -467 -330 334 244 348 33 -313 -468 -239 -182 171 132 349 123 -294 -51 -674 -167 -100 157 529 -45
5844 -45 157 -355 -149 -91 -370 292 330 413 318 -39 -309 -604 -213 171 511 461 610 60 -106 -402 -253 275
$$ packed form
5684c8K47Q7j1j11K69l91j82J25n8O56J8l15l19j25o25P12K12j20J99k02m4m56
5706d72K64o3m5K67L38j14k52k6l58K00J47J37M07l9j4q07j10R1m4J01Q06k0l12
5729H2l5m72K29j09K23J37K72Nk80l09k22KM54J83N8nj73j6n12J69Q6J27L34o5
5753A63q5M1m47M0P1L26k4M00k38l52k30j65J43K74J13K73k75K34k87m55J36M8
5775b96L73K54j0m59k33L6M2nP24k41j0J56k58j57l20R2N43J42qj34k63l23q3
5798d38K89k4M54M4j24k0m14RJ85l68Q01o8N8m24q7r8p8K94J10K29J1j17m22j91
5822c89p8J37O64r0J04l15l46j55K29N7L53l9K17k26m17K43o23N07O7K57L72n74
5844d5K02n12K06N8k79O62L8Q3r5l57k70k95L91L84L40n0J49n50j66k96J49N28
$$ plain form
5866 275 375 423 -31 269 -116 -221 -122 -43 178 561 354 36 -130 -529 -265 -368 99 449 13 5 -255 -153
5888 -153 -321 -56 -26 113 409 177 -111 -79 -438 -366 -24 238 374 118 -57 -400 -331 -72 51 227 185 228
5910 228 91 -35 -123 -197 -172 147 553 208 209 -346 -251 -297 -524 267 204 526 100 -58 -245 -160 -340 -248 205
5933 205 394 -38 -168 -39 -544 -252 99 150 239 129 -70 -189 -205 -213 -22 207 158 124 266 -11 -295 -7
5955 -7 -327 -44 389 251 153 119 -234 -323 -34 189 438 475 85 207 -194 -251 -285 102 -1 547 158 66 -183
5978 -183 -266 -26 110 351 163 150 78 -94 -411 -272 32 260 302 194 210 -131 -280 -33 -302 272 304 409
6000 409 205 -69 -151 -349 -132 -113 143 505 187 110 -297 -231 -64 149 239 143 200 -181 -193 -233 -165 110 14 76
6024 76 11 39 -223 -228 -678 -241 370 310 396 163 237 -336 -334 -242 -131 111 431 68 -110 -108 -296 59 7 33 481
$$ packed form
5866B75J00M8m54L00l85j05R9P9K21L83k07l18j66l99K64j03M67L50m36qk60J02
5888a53j68K65L0J39K96k32k88L2l59P2L42K62J36k56j75l43O9K59J23J76m2M3
5910B28j37j26q8p4K5L19M06l45Jn55R5m6k27P91o3L22m26j58j87Q5j80R2M53
5933B05J89m32j30J29n05K92L51N1Q9j10j99j19j6qJ91K29m9l4J42k77k84K88
5955gl20K83M33j38r8l4l53q9K89K23K49L7l90J22m01n7l4L87j03N48l89r2k49
5978a83q3K40J36K41j88j3p2j72l17J39L04K28M2j08J6l41j49K47k69N74L2J05
6000D09k04k74q2j98K17J9K56L62l18p7m07O6J67K13R0r6N7l81j2m0O8K75r6O2
6024G6o5K8k62nm50M37O11o0Q6k33P4n73KR2J11K42L20l63j78Kj88L55n2K6M48
$$ plain form
6049 481 164 140 -192 -146 -729 -102 296 26 92 208 -241 -325 -253 -388 -47 199 441 289 247 -461 -215 -280
6071 -280 -112 131 542 251 281 38 -32 -238 85 116 59 271 84 -229 -267 -322 -366 63 246 742 0 -206
6093 -206 51 -198 -156 242 318 286 69 -36 -340 -404 -96 -64 280 236 164 -24 -61 -310 -336 132 9 356 136
6116 136 98 113 -205 83 64 155 367 583 213 -372 -149 -103 -430 294 448 -53 109 -167 -180 -553 -148 -118
6138 -118 167 50 145 -32 -447 -222 -379 -67 274 302 302 -117 10 -164 -264 -247 -78 305 133 278 -133 -35
6160 -35 -58 -79 212 509 208 61 -159 -182 -90 -78 -221 190 369 378 27 -103 -285 -256 -84 236 193 225 -39 -77
6184 -77 -202 -101 -292 7 270 171 195 -334 -293 -153 -84 162 190 192 25 -198 -251 -446 -67 7 335 283 162 146
6208 146 -195 -125 -368 16 499 250 82 229 -21 -279 -307 -80 382 160 264 395 -25 -194 -164 -263 51
$$ packed form
6049D81l17k4l32M6n83O27L98k70O6J16m49q4P2j35L41K46K42j52m2p08K46o5
6071b80J68K43M11k91L0k43p0k06L23L1n7K12j87l13l8n5m4M29J83M96p42k06
6093b06K57k49M2L98P6l2k17j05l04o4L08L2L44m4p2j88l7k49k6M68j23L47k20
6116A36l8J5l18K88j9R1K12K16l70n85K23M6l27P24J54n01J62k76j3l73M05L0
6138a18K85j17R5j77m15K25j57L12L41K8%m19J27j74j00J7J69L83j72J45m11R8
6160c5k3k1K91K97l01j47k20k3R2J2j43M11J79Rl51j30j82K9J72L20m3L2k64l8
6184g7j25J01j91K99K63r9K4n29M1J40O9K46K8Kj67k23n3j95L79P4L28n2j21j6
6208A46l41P0k43L84M83k49j68J47k50k58k8K27M62k22J04J31m20j69L0r9L14
$$ plain form
6229 51 188 355 -71 -32 -106 -268 -70 10 331 77 -26 -125 -272 -129 -46 119 -6 246 109 -239 -244 -201 72
6252 72 -91 43 148 43 91 -309 -295 113 132 -280 397 272 12 -105 -355 -385 -48 261 121 314 315 23
6274 23 -61 -279 124 -97 82 286 275 155 -224 -67 -132 -18 137 327 188 71 -311 -186 -85 -366 316
6295 316 333 109 244 -224 -382 -262 -53 -19 -44 -133 -11 359 -336 -24 -397 -136 389 368 150 -86 -362 -83
6317 -83 -217 -309 266 -27 170 -33 -77 -270 -403 -192 198 192 271 328 -60 -64 -319 -220 106 185 81 -90 -136 230
6341 230 -272 -227 -56 -59 68 -86 110 -121 -444 -196 77 146 51 62 54 -118 -341 -75 5 -75 360 182 343
6364 343 103 -179 -192 17 -225 119 95 233 -298 -312 44 -257 -48 360 107 -73 -90 -259 223 -83 -155 268
6386 268 212 -8 0 -13 -92 -216 178 192 266 88 213 -25 -47 -90 -187 -34 133 263 -143 -92 -182 -266 -129 -154 85
$$ packed form
6229E1J37J67m26L9p4j62J98Q0L21k54j03r9j47J43Q3J65j25K52j37l48nM3K73
6252G2j63J34J05j05M8m00J4M08J9m12O77j25k60j17k50l0L37L09j40J93Jk92
6274B3q4k18M03k21J79K04j1j20l79J57o5J14J55J90j39j17l82J25J01k81O82
6295C16J7k24J35m68j58J20K09L4k5q9J22L70o95L12l73K61N25k1k18k36k76K79
6317h3j34r2N75k93J97k03m4j93j33K11L90oP9N7l88mk55R9L26P9j04j71m6L66
6341B30n02M5J71lJ27j54J96k31l23K48K73O9r5J1qj72k23K66Q0q0M35j78J61
6364C43k40k82j3K09k42L44k4J38n31j4L56l01K09M08k53j80j7j69M82l06p2M23
6386B68n6k20Qj3p9j24L94J4P4j78J25k38k2m3r7J53J67J30m06N1r0q4J37k5K39
$$ plain form
6411 85 30 -76 -207 -244 -70 -38 90 442 275 236 -96 59 -133 -44 -243 288 211 152 127 -102 -129 -115 -58 12
6435 12 80 49 43 -57 -31 -424 -62 415 -57 152 124 11 -87 -301 -116 56 285 232 -33 -54 -116 -316 -136 -196
6459 -196 287 335 38 -219 -146 -168 -90 -155 41 216 183 120 -328 -57 17 -220 1 336 -28 0 -148 -214 -252 -78
6483 -78 -204 373 43 -1 -384 -26 -103 92 -23 352 163 85 126 -56 -157 -315 161 112 265 -171 -86 -221
6505 -221 164 -24 -35 108 87 236 8 -217 -208 12 142 212 188 77 109 -176 -26 -160 -342 110 130 250 32
6528 32 -256 -456 -103 5 135 13 265 75 212 -46 -374 -159 -174 -2 -25 9 198 -84 -205 105 -23
6549 -23 -39 191 165 103 -180 -274 -151 -258 73 460 119 180 -195 -190 -308 0 -84 -143 176 137 29 -100 -385 -146
6573 -146 -29 97 181 -22 98 -119 -39 -71 -82 153 -24 99 169 -157 -374 -342 -210 179 33 42 311 -10 24
$$ packed form
6411H5n5j06j31l7J74L2J28L52j67l9l32J55j92Q9j99N31p7n9k5k29k7J4N7P0
6435A2O8l1oj00K6l93L62M77m72K09k8j13r8k14J85J72K29n3k65k1o2k00J80o0
6459a96M83M8k97k57P3k2P8o5J96J75l3o3m48K71P4k37K21L35l64K8j48o6l8J74
6483g8j26N77l30m4l83L58p7J95j15L75j89p8M1j82j01j58M76m9J53m36Q5j35
6505b21L85j88j1J43k1J49k28k25RK20J30P0k4j11L2k85J50j34j82M52K0J20k18
6528C2k88k00L53J08J30j22K52j90J37k58l28K15j5J72k3L4J89k82j21L10j28
6549b3j6K30k6o2k83r4J23j07L31L87l41O1l75Nj18L08q4n9L19l9j08j29k85K39
6573a46J17J26Q4k03J20k17Q0l2j1K35j77J23P0l26k17L2J32L89j46RK69l21L4
$$ plain form
6596 24 -175 -49 23 408 189 53 -215 365 -412 71 -57 333 121 158 -123 30 186 -302 176 148 34
6617 34 151 -3 -59 -301 -169 -162 -74 175 384 -99 -45 61 -228 108 186 224 108 391 -123 20 -355 189 -128
6640 -128 117 158 24 190 -166 -82 1 90 318 126 190 272 -257 -4 -489 -142 13 130 238 111 -334 -37
6662 -37 -276 -122 221 82 -22 38 81 1 -167 -75 -349 372 326 26 -6 -57 -146 222 119 -130 306 -81 -99
6685 -99 -198 -176 -27 233 -222 -276 65 285 -84 -142 -5 -71 4 -13 77 97 -124 -213 -395 -63 -204 117 238 4
6709 4 -149 -207 -392 70 281 216 89 297 -76 -255 -420 -52 20 71 313 62 61 -149 -322 59 43 103 101 -96
6733 -96 228 -134 -158 -347 -93 -4 -40 60 212 164 -237 -328 -281 -70 205 394 260 -148 -201 -204 -99 67 315
6756 315 106 283 23 -280 -155 -269 26 164 300 197 6 -264 -34 -351 -300 -26 324 118 -75 -18 -310
$$ packed form
6596B4j99J26P2L85k19j36k68N80p77M83j28L90k12L7k81J53J56m88M78k8j14
6617C4J17j54n6k42J32PQ8K49K09m83N4J06k89L36P8L8j16K83n14J43l75N44l17
6640a28K45M1j34J66l56Q4Q3Q9K28j92O4Q2n29K53m85L47J55J17J08j27m45K97
6662c7k39J54L43j39j04O0M3q0j68R2k74P21m6l00l2n1q9L68j03k49M36l87j8
6685i9r9K2J49K60m55n4L41K20l69n8J37o6P5j7R0K0k21q9j82L32j41L21J21k34
6709Dj53n8j85M62K11o5j27K08l73j79j65L68P2N1K42k51jk10j73L81j6O0kj97
6733i6L24l62k4j89K54Q9l6J00J52m8m01r1M7K11K75J89j34m08n3lJ05J66K48
6756C15k09J77k60l03J25j14K95J38J36j03j91k70K30l17N1K74L50k06j93N7k92
$$ plain form
6777 -310 -503 -100 206 374 -34 218 22 -336 56 66 -100 99 137 -37 -169 -451 50 57 -40 -25 206 49
6799 49 -269 -30 -94 -113 110 75 403 435 194 -59 -235 -258 -346 206 278 105 260 10 -162 -338 -103 3 304
6822 304 377 6 -365 -257 -229 -329 -148 -36 226 -135 -233 -87 -186 -75 144 -38 24 40 0 -35 -11 -26 -200
6845 -200 140 429 0 39 -8 -502 -36 43 -41 375 403 -176 146 -151 -423 -67 23 12 212 365 -79 -28 -281
6868 -281 -14 -148 -24 214 242 232 185 92 102 -149 130 -15 118 94 40 178 -297 26 153 140 96 -108 52
6891 52 10 -193 -58 221 345 24 274 222 -180 -111 -40 157 379 222 354 157 -145 -162 -169 -61 185 385 -54
6914 -54 72 -133 -311 -29 105 380 80 199 192 57 -369 50 -82 101 -106 228 39 -63 -179 -172 -79 -135
6936 -135 271 2 321 126 -326 -27 97 -149 290 50 356 282 -284 -125 38 -223 219 153 192 21 10
$$ packed form
6777c10j93M03L06J68m08K52j96l58L92J0j66J99L8j74j32k82N01Pr7J5K31j57
6799D9l18K39o4j9K23l5L28L2k41k53j76k3q8N52P2j73J55k50j72j76K35J06L01
6822C04P3l71l71J08K8j00J81J12K62l61r8J46r9J11K19j82O2J6m0l5K4j5j74
6845b00L40K89m29L9m7m94M66P9q4M16K8n79L22k97k72L56R0j1K00J53m44N1k53
6868b81K67j34J24K38K8j0m7r3J0k51K79j45J33k4n4J38m75L23J27j3m4k04J60
6891E2m2k03J35K79J24l21K50n2m02O9P1J97K22j57J32j97l02j7pJ08K46K00m39
6914e4J26k05j78K82J34K75l00J19pj35m26M19j32J83k07L34j89j02j16PR3n6
6936a35M06k69L19j95m52K99J24k46M39k40L06p4n66J59J63k61M42o6L9j71j1
$$ plain form
6957 10 -176 48 -354 -176 96 175 249 69 -309 -104 -404 186 565 391 -6 -7 -2 -308 -346 9 205 183 120
6980 120 19 101 -229 -10 38 261 390 36 -138 -207 103 -242 -9 111 368 272 33 -86 -226 -250 -253 62
7002 62 57 123 157 -154 -45 -193 -449 105 252 1 183 1 -248 114 175 -13 161 344 124 -44 -133 36
7024 36 -355 -79 -153 702 193 83 -194 -313 5 -42 55 356 -5 167 -28 -162 -194 -439 23 134 128 190 239
7047 239 154 46 -203 27 85 211 284 256 -179 -62 39 -57 40 242 212 -131 -84 -377 -356 -209 15 459 483
7070 483 120 -104 -376 -390 -119 383 154 278 76 -62 -85 -380 -338 -107 197 199 497 -90 -8 -189 -121 175
7092 175 408 192 117 22 -558 62 -140 113 -161 -22 259 90 49 -193 -102 -2 -140 259 390 -59 151
7113 151 -136 -441 -346 100 129 192 124 -224 -345 -497 32 -77 33 76 173 -294 101 -232 -333 -17 -88 369
$$ packed form
6957A0j86K24m02J78K72P9P4j80l78K05l00N90L79j74l97jNl06l8L55J96k2o3
6980A20j01Q2l30K19M8K23J29l54j74o9L10l45K33J20K57r6k39j19j40k4lL15
7002F2nO6L4l11J09j48k56N54J47k51J82j82k49L62O1j88J74J83k20j68q9J69
7024C6l91K76p4Q55n09j10k77j19L18m7R7L01l61J72j95j34l2k45M62J11oO2M9
7047B39q5j08k49K30N8J26P3k8m35J17J01r6R7K02l0l43M7k93K1J47K24M44K4
7070D83l63k24k72j4K71N02k29J24k02j38k3k95M2K31L04KK98n87Q2j81O8K96
7092A75K33k16p5r5n80O20k02K53k74J39K81j69m1k42R1J00j38L99J31m49K10
7113A51k87l05R5M46K9O3o8l48j21j52N29j09J10M3R7m67L95l33j01L16p1M57
$$ plain form
7135 369 209 -183 -27 -334 -280 -137 4 72 207 40 175 -62 -151 -171 -306 188 48 176 -101 -196 99 -182
7157 -182 -117 -118 -33 155 85 422 -405 -278 -133 -86 117 277 198 -96 -75 105 -99 226 282 144 39 -269 -159
7180 -159 -402 -325 90 200 -199 164 85 58 -81 -335 -210 123 199 137 196 -283 18 111 42 -107 315 133 63
7203 63 35 -338 -333 -218 164 257 139 52 -11 -12 -104 -354 51 152 35 22 -358 -242 -98 -14 160 -181 131 103
7227 103 69 240 -33 -128 -93 218 18 57 362 -16 -47 -320 47 264 191 282 13 20 -201 -122 -496 65 281
7250 281 382 229 180 -63 -84 -311 61 -30 319 170 -59 -69 -276 -117 -15 70 43 141 -107 -113 -123 -417 -2
7273 -2 302 196 30 190 -94 -376 -317 -377 -194 131 -9 8 -126 -300 -252 -29 89 311 163 11 159 31
7295 31 -241 -33 -228 -86 215 129 319 -169 -112 -55 -248 232 137 -154 165 -175 -98 -203 17 -106 229 122
$$ packed form
7135C69j60l92J56l07N4J43J41O8J35j67J35k37q9k0j35M94j40J28k77r5K95k81
7157a82O5jQ5J88p0L37q27J27J45M7K03J60p9k94K1J80k04L25N6j38j05l08J10
7180a59k43P7M15J10l99L63p9k7j39k54J25L33P6o2N9m79L01R3o9j49M22j82p0
7203F3k8l73NJ15L82R3j18q7o3jr2k50M05J01j17j3l80J16J44Q4J74l41L12k8
7227A03l4J71k73r5L5L11k00L9L05l78l1k73L67K17p3R1k69Pk21P9l74N61K16
7250B81J01j53m9k43k1k27L72r1L49j49k29j0k07J59J02Q5k7R8k48oj0k94M15
7273bL04j06j66J60k84k82N9o0J83L25j40J7j34j74M8K23J18K22j48j52J48j28
7295C1k72K08j95J42L01q6J90m88N7N7j93M80r5k91L19l40P7j05K20j23L35j07
$$ plain form
7317 122 -6 -77 -287 -344 178 -381 421 448 339 121 119 -49 -124 -60 -144 84 -51 185 27 -12 -343 -63 408
7340 408 203 372 18 140 -178 -165 -127 -218 103 151 323 177 -229 -166 -391 -311 43 376 4 60 -250 -357
7362 -357 -65 -39 -102 319 -92 24 -12 -196 35 -216 160 1 344 112 -30 -274 -38 -430 -57 53 402
7383 402 286 -120 -123 -34 -15 -76 23 342 62 -53 -91 -433 -70 57 111 -189 250 -120 -31 -333 -5 -201 -6
7406 -6 73 -14 140 -209 -294 -40 173 -141 155 419 98 -38 -119 -224 -131 -21 157 412 -30 -31 -310 -177 -202
7429 -202 -157 55 -13 90 138 -11 -154 -90 -5 190 138 186 118 -14 90 113 -73 66 55 191 230 43 -155 -297
7453 -297 110 174 305 79 -5 12 -261 -165 -409 -64 237 95 216 -146 -160 -40 -210 -36 37 305 162 27
7475 27 -27 -176 -430 49 -135 -115 447 138 60 -66 -173 -386 -119 273 -5 122 61 51 -260 -293 44 -22 259
$$ packed form
7317A22j28p1k10n7N22n59Q02K7j09k18kj68p5O4q4K28j35K36j58l9l31K80M71
7340D08k05J69l54J22l18J3L8r1L21M8J72j46m06O3k25Q0L54L33l72N6l10j07
7362c57K92K6o3M21m11J16l6j84K31k51L76j59L43k32j42k44K36l92L73J10L49
7383D02j16m06lQ9J9o1R9L19k80j15l8l42L63J27N4l00M39l70Q9l02L28j96J95
7406fP9q7J54l49q5K54K13l14K96K64l21j36q1j05R3J10J78K55m42jk79J33k5
7429b02M5K12o8J03M8j49j43O4Q5J95n2M8o8j32J04K3j86J39j1J36L9j87j98j42
7453b97M07O4J31k26q4J7k73R6k44L45L01j42J21l62j4J20j70J74P3K68j43j35
7475B7n4j49k54M79j84K0N62l09p8j26j07k13K67L92k78J27o1j0l11l3L37o6K81
$$ plain form
7498 259 -31 -102 13 -73 -182 255 -63 78 -42 162 -174 -323 34 -258 264 -69 137 -286 -207 77 91
7519 91 -162 -189 253 -27 -49 -226 -124 60 96 115 124 105 54 54 -103 -293 -87 -295 455 320 111 152 46 -283
7543 -283 -178 -140 304 356 211 235 -32 -161 -498 -3 244 84 154 155 -51 51 -193 -352 -101 90 468 -186
7565 -186 98 -36 -83 182 29 169 -97 347 -46 -146 -73 11 102 237 252 16 251 -331 -513 -358 -154 76
7587 76 387 289 268 -103 28 -60 22 -183 -13 191 337 -70 -189 83 -217 -37 32 109 166 288 -113 -174 -234
7610 -234 -208 -125 227 -73 280 -155 210 -22 -269 64 103 -39 -45 76 -344 -255 -311 -140 132 33 -24 7 -15 -29
7634 -29 -195 -33 129 217 -12 -11 -146 -374 -149 20 270 360 265 40 -19 -233 -143 -143 160 430 344 258 267 -298 -131
7659 -131 -38 -39 139 202 -42 -83 -127 -117 -225 55 19 -125 24 104 -33 -111 -45 -28 256 195 133 -43 -198 -168 -508
$$ packed form
7498B59k90p1J15q6j09M37l18J41j20K04l36j49L57k92N22l33K06m23P9K84J4
7519I1k53k7M42k80k2j77J02J84L6J9Rj9n1%j57j90K06k08P50j35k09M1j06l29
7543b83J05L8M44N2j45K4k67j29l37M95K47j60P0Jk06J02k44j59K51J91L78o54
7565a86K84j34m7K65j53J40k66M44l93j00P3Q4R1J35J5k36K35n82j82J55K04K30
7587G6L11r8k1l71J31q8Q2k05J70K04J46m07j19K72l00J80O9P7N7J22m01o1o0
7610b34K6Q3L52l00L53m35L65k32k47L33L9j42oJ21m20Q9n6J71K72r9n7L1k2j4
7634b9j66J62J62Q8k29Jj35k28K25J69K50R0r5k25n9k14R0%L03K70q6q6Rn65J67
7659a31R3jJ78O3k44m1m4J0j08K80l6j44J49Q0j37p8O6J7K84o1o2j76j55L0l40
$$ plain form
7684 -508 -24 159 4 246 -333 -68 -73 -451 -326 -133 -294 101 293 140 57 -243 0 -38 68 121 -15 16
7706 16 -9 -280 21 -197 55 -155 192 35 42 -184 -451 -112 -118 297 368 25 -204 -263 -141 -182 85 -19 25
7729 25 -153 113 -255 -321 -81 -8 -107 91 319 122 -201 -254 -138 130 -20 201 -35 39 -27 -323 -174 -38
7751 -38 201 55 384 -177 66 -217 -292 199 -16 189 117 -78 76 -144 -9 -336 471 288 167 150 141 181
7773 181 -337 -133 -155 141 170 -6 126 -445 -360 -172 -30 -67 328 209 214 -125 -127 -355 232 273 -101 281 278 -186
7797 -186 -304 -244 -282 -238 -33 368 71 17 -312 -172 -146 58 106 451 635 39 71 98 -391 -7 152 -96 271
7820 271 77 -65 -358 -117 -179 -12 139 478 -28 -66 30 -517 -102 209 176 108 -135 172 -243 -182 -324 41
7842 41 -27 196 427 -195 -59 -25 144 125 196 -267 82 67 50 -115 -290 -151 -173 130 21 291 33 -96 -336
$$ packed form
7684e08M84J83j55K42n79K65nl78J25J93j61L95J92j53q3l00K43l8J06N3j36L1
7706A6k5k71L01k18K52k10L47j57Pk26k67L39oM15P1l43k29n9J22m1K67j04M4
7729B5j78K66l68o6K40P3r9J98K28j97l23n3J16K68j50K21k36P4o6k96J49J36
7751c8K39j46L29n61K43k83p5M91k15K05p2j95J54k20J35l27Q07j83j21j7rM0
7773A81n18K04k2K96K9j76J32n71Q5J88J42l7L95j19Nl39kk28N87M1l74L82lm64
7797a86j18O0l8M4K05M01k97n4l29J40K6K04M8L45J84n96L2K7m89L84J59k48L67
7820B71j94j42k93K41o2J67J51L39n06l8R6n47M15L11l3o8k43L07m15O1j42L65
7842D1o8K23K31o22J36L4J69j9P1m63L49j5j7j65j75J39k2L03j09K70k58j29k40
$$ plain form
7865 -336 -89 -338 133 99 68 35 84 -349 26 -16 -123 143 186 55 -154 -55 -351 -109 -169 233 310 17 -81
7888 -81 -91 -3 -39 219 -101 -161 104 207 -163 -242 83 74 183 106 247 102 -179 -314 -248 24 166 135 -115 114
7912 114 -140 -163 -195 -234 42 -104 228 -222 21 -193 -244 -213 543 179 299 -149 -344 100 -198 -59 170 197
7934 197 175 106 -303 29 -167 -314 174 -63 -123 165 -253 -240 -239 -161 -42 234 290 236 175 -363 -448 69 -1 141
7958 141 -131 158 53 -158 -171 -398 -160 121 258 -64 188 53 -361 188 -239 262 254 385 -72 58 -251
7979 -251 -348 -2 259 172 240 390 223 -68 -213 -341 -31 52 358 127 -60 -112 -367 -592 -5 213 -75 347
8001 347 -163 -215 -182 68 -163 -152 259 442 445 -50 -199 -367 -127 -41 256 164 413 121 -129 -190 -216 73 305
8024 305 249 23 -125 -314 94 84 -135 -78 297 156 -7 -305 -98 297 -76 -22 165 240 106 -308 -281 -207
$$ packed form
7865c36K47k49M71l4l1l3M9m33L75m2j07K66M3j31k09R9k96K42o0M02P7k93r8
7888h1j0Q8l6K58l20o0K65J03l70p9L25rJ09p7J41j45k81j35O6K72J42l1k50K29
7912A14k54k3l2l9K76j46L32m50K43k14n1L1P56l64J20m48j95M44k98J39K29K7
7934A97k2o9m09L32j96j47M88k37o0K88m18J3JP8J19K76N6n4o1n38q5N17p0J42
7958A41k72K89j05k11j3k27K38K81J37l22K52j35m14N49m27N01qJ31m57J30l09
7979b51r7L46K61q7O8J50j67k91j45j28L10Q3L06k31j87n2k55k25N87K18k88M22
8001C47n10n2L3K50k31J1M11J83Lm95j49j68K40Q6K97r2K49k92k50o1k6K89K32
8024C05n6k26j48j89M08j0k19N7L75j41j63k98K07L95l73N4J87P5j34m14K7P4
$$ plain form
8046 -207 -110 -25 175 380 29 -30 36 -360 -89 164 -286 202 232 -45 -306 -339 -91 95 69 225 30 89 -156
8069 -156 35 -164 142 170 333 112 -50 -28 -29 -514 -372 64 389 -11 194 65 129 -400 -115 -95 262 209
8091 209 -198 56 -132 -118 -299 37 -62 413 -90 189 22 12 -171 -18 50 297 -39 304 155 -36 -37 -201
8113 -201 -46 186 69 -97 -128 -105 -32 -225 7 -56 -17 229 121 -46 -116 -15 148 11 28 -97 -174 -312 -34
8136 -34 -90 -211 185 49 201 148 198 -104 -210 -225 -34 -54 194 134 -142 -13 -303 -50 -194 198 201 141 -17
8159 -17 -208 -528 76 214 -5 125 244 -230 -385 -240 -76 -111 95 122 -21 94 -40 -165 -400 -161 139
8180 139 173 375 -169 -155 -96 -370 79 97 105 311 190
$$ packed form
8046b07R7Q5K00K05l51n9O6l96K71K53m50M88L0k77k61l3K48J86k6J56j95N9k45
8069a56J91j99L06K8J63k21j62K2jm85J42M36L25m00K05j29O4n29K85K0L57n3
8091B09m07K54j88J4j81L36r9M75n03K79j67j0j83J53O8K47l36L43j49j91jj64
8113b01J55K32j17j66l1K3P3j93K32o3L9K46j08j67p0J01J63j37J7j25p7j38K78
8136c4n6j21L96j36J52n3N0l02j06j5J91k0K48o0k76J29k90K53j44L92Lo0j58
8159a7j91l20O04J38k19J30J19m74j55J45J64l5K06K7j43J15j34j25k35K39L00
8180A39L4K02n44J4N9k74M49J8QK06j21
8191A90
$$ Imaginary data points
##PAGE= N=2
##DATA TABLE= (X++(I..I)), XYDATA
$$ plain form
0 0 0 0 0 0 0 0 0 0 0 5 -8 8 -8 8 -14 16 -17 22 -24 30 -33 41 -47 51 -60 69 -79 90 -100 114 -130 144 -163
33 -163 182 -200 224 -250 277 -307 340 -378 419 -463 512 -567 630 -701 780 -875 983 -1111
51 -1111 1267 -1461 1708 -2033 2488 -3171 4298 -6511 12510 -64565 -185885 -64972 46776
64 46776 53060 19753 62673 80969 -532 -111698 -114361 -27492 49237 64884 63154 55916 14751
77 14751 -67987 -114533 -68276 26554 74218 69135 58758 31941 -52583 -126344 -85830 30178
89 30178 80274 48154 34319 49024 1443 -98239 -122994 -29768 73072 92648 55776 19583
101 19583 -13829 -58420 -89691 -65008 17118 94786 99030 34238 -33337 -62982 -67904 -53062
113 -53062 -3105 59831 83010 57557 11455 -42507 -92175 -87743 -9099 74937 87568 48702
$$ packed form
0@%%%%%%%%%Nj3J6j6J6k2L0l3L9m6N4o3P4q8R8j11J29j48J69j90K14k44K74l07
33a63L45l82M24m74N27n84O47p18P97q82R75j079J197j331J481j655J858k094
51a111K378k728L169l741M521n659P469j0809J9021p7075j21320J20913J11748
64D6776O284l3307M2920J8296q1501j11166k663Q6869P6729J5647j730p238m1165
77A4751q2738m6546M6257R4830M7664n083j0377k6817q4524p3761M0514J16008
89C0178N0096l2120j3835J4705m7581r9682k4755R3226J02840J9576l6872l6193
101A9583l3412m4591l1271K4683Q2126P7668M244o4792o7575k9645m922J4842
113e3062M9957O2936K3179k5453m6102n3962m9668M432P8644Q4036J2631l8866
$$ plain form
125 48702 9805 -28003 -72872 -83618 -31216 43099 81873 72475 29414 -30133 -73964 -72945
137 -72945 -33517 15327 58186 81152 58527 -7730 -74146 -92172 -51838 18431 71748 72730
149 72730 36484 -13 -31692 -70581 -81769 -21982 66252 93150 48293 -877 -26920 -56978
161 -56978 -77997 -41635 38465 88106 71310 20610 -29138 -66164 -73915 -38125 23951 70091
173 70091 71060 33640 -14708 -50335 -66489 -57435 -9353 62448 95323 50882 -20599 -53382 -52827
186 -52827 -51639 -30002 36811 94383 72945 -2812 -54651 -59476 -47476 -26218 18415 67772
198 67772 75588 30926 -30428 -68544 -65671 -31949 15886 58979 75173 44899 -18619 -66579
210 -66579 -65647 -33373 2351 40891 73343 61600 -2164 -61318 -67913 -38667 -7164 27654 65514
$$ packed form
125D8702l8897l7808m4869j0746N2402P4315L8774r398m3061n9547m3831J019
137g2945L9428M8844M2859K2966k2625o6257o6416j8026M0334P0269N3317R82
149G2730l6246l6497l1679l8889j1188N9787Q8234K6898m4857m9170k6043l0058
161e6978k1019L6362Q0100M9641j6796n0700m9748l7026p751L5790O2076M6140
173G0091R69l7420m8348l5627j6154R054M8082P1801L2875m4441p1481l2783N55
186e2827J188K1637O6813N7572k1438p5757n1839m825J2000K1258M4633M9357
198F7772P816m4662o1354l8116K873L3722M7835M3093J6194l0274o3518m7960
210f6579R32L2274L5724L8540L2452j1743o3764n9154o595K9246L1503L4818L7860
$$ plain form
223 65514 69273 19211 -45890 -74014 -55479 -13827 30579 61029 61533 27168 -24846 -63295 -64530
236 -64530 -28340 20594 54649 62754 39935 -9032 -58262 -69886 -36875 10369 45084 62018
248 62018 51618 4782 -52220 -72225 -43615 1574 37044 57426 54756 17129 -36165 -66365
260 -66365 -54534 -14614 28504 57886 58461 26115 -23092 -60328 -61798 -26931 21447 53824 57363
273 57363 33952 -8195 -51883 -66205 -36996 12324 46602 55024 41749 6507 -41340 -67819
285 -67819 -48078 78 40360 55842 47076 15008 -30886 -62242 -54517 -14068 30823 55051
297 55051 50824 22134 -19290 -53250 -58469 -28284 19734 52699 54002 28844 -8665 -44899 -60403
310 -60403 -39386 8511 48078 55713 34818 1148 -35792 -58430 -47050 -4242 39336 55934
$$ packed form
223F5514L759n0062o5101k8124J8535M1652M4406L0450N04l4365n2014l8449j235
236f4530L6190M8934L4055Q105k2819m8967m9230j1624L3011M7244L4715J6934
248F2018j0400m6836n7002k0005K8610M5189L5470K0382k670l7627n3294l0200
260f6365J1831L9920M3118K9382N75l2346m9207l7236j470L4867M8378L2377L539
273E7363k3411m2147m3688j4322K9209M9320L4278Q422j3275l5242m7847k6479
285f7819J9741M8156M0282J5482q766l2068m5894l1356P725M0449M4891K4228
297E5051m227k8690m1424l3960n219L0185M8018L2965J303k5158l7509l6234j5504
310f0403K1017M7897L9567P635k0895l3670l6940k2638J1380M2808M3578J6598
$$ plain form
322 55934 42212 10125 -27274 -54202 -51267 -16866 28541 54718 48732 18198 -19820 -48313
334 -48313 -53162 -27568 16620 50581 52851 25763 -11343 -41570 -52782 -36217 4665 44151
346 44151 55431 34152 -2029 -35101 -51564 -42140 -6632 35184 54995 41549 7290 -27670
358 -27670 -48939 -45716 -16659 24435 51808 47503 16989 -20144 -45002 -47694 -25425 13310 46371
371 46371 51116 25588 -11666 -40569 -47984 -32292 2685 38967 52624 34219 -2277 -34861
383 -34861 -47888 -37351 -6504 30246 51170 41295 7164 -27730 -46356 -41032 -15162 20968
395 20968 47440 46153 17086 -19913 -43251 -43688 -22043 11435 41624 48704 26059 -11370 -39750
408 -39750 -45007 -27941 3024 34638 48404 33630 -1415 -34256 -45793 -33279 -4861 27122
$$ packed form
322E5934j3722l2087l7399k6928K935L4401M5407K6177n986l0534l8018k8493
334d8313m849K5594M4188L3961K270k7088l7106l0227j1212J6565M0882L9486
346D4151J1280k1279l6181l3072j6463R424L5508M1816J9811j3446l4259l4960
358b7670k1269L223K9057M1094K7373m305l0514l7133k4858k692K2269L8735L3061
371D6371M745k5528l7254k8903p415J5692L4977L6282J3657j8405l6496l2584
383c4861j3027J0537L0847L6750K0924r875l4131l4894j8626N324K5870L6130
395B0968K6472j287k9067l6999k3338m37K1645L3478L0189P080k2645l7429k8380
408c9750n257J7066L0965L1614J3766j4774l5045l2841j1537J2514K8418L1983
$$ plain form
420 27122 46544 39314 8387 -26946 -44756 -37916 -12669 19367 42784 42734 17470 -18422 -42226
433 -42226 -41556 -19513 11805 37666 44273 25467 -9131 -37967 -43735 -25678 4057 31703 44082
446 44082 32154 -57 -32200 -44347 -31495 -3099 25599 41985 36233 8987 -23998 -43050
458 -43050 -36711 -10845 19274 39290 39096 16664 -15737 -39719 -40127 -18105 12329 34982 40275
471 40275 23860 -7248 -35199 -42102 -24160 4988 30190 39527 29465 1647 -29021 -42796
483 -42796 -30481 -2495 24598 38610 33162 9048 -21565 -40103 -35287 -10604 18787 37132
495 37132 35525 15451 -13590 -36369 -38703 -17853 12349 33905 36924 21474 -5152 -31648 -41199
508 -41199 -24759 6052 30349 36593 25248 1673 -25392 -39167 -30204 -2582 24661 37365
$$ packed form
420B7122J9422p230l0927l5333j7810O840K5247L2036K3417n0k5264l5892k3804
433d2226O70K2043L1318K5861O607j8806l4598k8836n768J8057K9735K7646J2379
446D4082j1928l2211l2143j2147J2852K8396K8698J6386n752k7246l2985j9052
458d3050O339K5866L0119K0016j94k2432l2401k3982m08K2022L0434K2653N293
471D0275j6415l1108k7951o903J7942K9148K5202R337j0062k7818l0668j3775
483d2796J2315K7986K7093J4012n448k4114l0613j8538M816K4683K9391J8345
495C7132j607k0074k9041k2779k334K0850L0202K1556L019j5450k6626k6496r551
508d1199J6440L0811K4297O244j1345k3575k7065j3775Q963K7622K7243J2704
$$ plain form
520 37365 30264 7418 -19707 -36621 -33244 -11160 17505 36312 33981 12911 -13917 -33301 -35165
533 -35165 -18152 11023 33691 35146 17717 -6605 -27724 -36235 -24714 3341 29571 36735 23864
546 23864 231 -23942 -36658 -28103 -2932 22584 35151 28712 7070 -19875 -35068 -29808 -9230
559 -9230 15323 32653 32772 13560 -13225 -31559 -32755 -17103 8715 31561 35224 17647 -8109
572 -8109 -27173 -32950 -22339 2561 27084 34572 21697 -129 -21726 -33415 -27064 -3725 21559
585 21559 32975 26645 7351 -17140 -33842 -30017 -8664 15755 31093 30588 12229 -13778 -30511
598 -30511 -28753 -13706 6742 27053 33443 19220 -7318 -26816 -30903 -20676 1241 25316 34504
611 34504 21673 -1852 -21750 -30572 -25280 -3506 21206 31823 23785 5638 -15006 -30121 -28311
$$ packed form
520C7365p101k2846k7125j6914L377K2084K8665J8807k331k1070k6828j9384j864
533c5165J7013K9175K2668J455j7429k4322k1119q511J1521K8055K6230P164j2871
546B3864k3633k4173j2716Q555K5171K5516J2567o439k1642k6945j5193N260K0578
559i230K4553J7330J19j9212k6785j8334j196J5652K5818K2846L663j7577k5756
572h109j9064n777J0611K4900K4523P488j2875k1826k1597j1689O351K3339K5284
585B1559J1416o330j9294k4491j6702L825K1353K4419J5338n05j8359k6007j6733
598c0511J758J5047K0448K0311O390j4223k6538j9498m087J0227K1917K4075R188
611C4504j2831k3525j9898q822N292K1774K4712J0617q038j8147k0644j5115J810
$$ plain form
624 -28311 -8709 13900 27739 29008 15177 -10735 -31609 -31240 -11705 10054 25199 29606 17720
637 17720 -6269 -25862 -28967 -17739 1158 22047 31848 21752 -1313 -20030 -27643 -23760 -6530
650 -6530 18599 33073 25321 4068 -16973 -28934 -26182 -7460 15311 26366 23880 11641 -7525
663 -7525 -26448 -29920 -13798 8169 24202 28008 18095 -5221 -25709 -29197 -16446 1710 19617
676 19617 30723 22734 -2263 -23499 -26854 -17271 -3164 13340 27067 24703 7090 -13416 -27895
689 -27895 -27747 -9738 15612 28495 23581 8791 -8098 -24346 -28962 -13161 10959 24521 23849
702 23849 14258 -2974 -22215 -28108 -15630 3226 17522 25644 22689 3616 -20761 -30425 -20570
715 -20570 -812 18072 27533 20315 2196 -14025 -22007 -22576 -11387 11073 28460 24697 5982
$$ packed form
624b8311J9602K2609J3839J269j3831k5912k0874L69J9535K1759J5145M407j1886
637A7720k3989j9593l105J1228J8897K0889R801j0096k3065j8717p613L883J7230
650f530K5129J4474p752k1253k1041j1961K752J8722K2771J1055k486j2239j9166
663g525j8923l472J6122K1967J6033L806r913k3316k0488l488J2751J8156J7907
676A9617J1106p989k4997k1236l355R583J4107J6504J3727k364j7613k0506j4479
689b7895J48J8009K5350J2883m914j4790j6889j6248m616J5801K4120J3562o72
702B3849r591j7232j9241n893J2478J8856J4296Q122k955j9073k4377r664R855
715b0570J9758J8884R461p218j8119j6221p982n69J1189K2460J7387l763j8715
$$ plain form
728 5982 -9898 -19625 -24284 -16565 5431 25112 27470 14191 -5752 -23189 -27383 -14049 5963
741 5963 18676 22301 17299 2369 -17060 -25973 -18578 -3187 13183 25840 24580 5147 -17388
754 -17388 -24958 -18995 -7594 8736 24746 26412 9120 -13037 -23374 -20822 -9388 6831 19703
767 19703 21829 13767 -501 -17923 -28869 -18981 5296 21980 22862 14728 1630 -15737 -26866
780 -26866 -19292 -68 15922 22052 19231 5446 -13701 -23959 -18881 -5625 8475 20745 23769
793 23769 11216 -9055 -22621 -23534 -12226 7437 23902 23232 8582 -6506 -15204 -20747 -17210
806 -17210 107 19795 24716 13959 -903 -14201 -22280 -18183 -2882 13839 22818 20659 6550
819 6550 -14592 -25920 -18671 -2435 10602 18367 20053 9660 -8595 -20667 -19753 -9872 3889
$$ packed form
728E982j5880r727m659P719K1996J9681K358j3279j9943j7437m194J3334K0012
741E963J2713L625n002j4930j9429q913P395J5391J6370J2657j260j9433k2535
754a7388p570N963J1401J6330J6010J666j7292k2157j0337K552J1434J6219J2872
767A9703K126q062j4268j7422j0946R888K4277J6684Q82q134j3098j7367j1129
780b6866P574J9224J5990O130k821j3785j9147j0258N078J3256J4100J2270L024
793B3769j2553k0271j3566r13J1308J9663J6465o70j4650j5088q698n543L537
806a7210J7317J9688M921j0757j4862j3298q079M097J5301J6721Q979k159j4109
819F550k1142j1328P249J6236J3037P765J686j0393j8255j2072R14R881J3761
$$ plain form
832 3889 18634 24537 13347 -6216 -19150 -20919 -13857 831 17355 23567 14523 -925 -15407
845 -15407 -22080 -16819 -318 14640 18698 15370 6664 -8066 -22742 -22535 -5430 12617 20296 18345
859 18345 8502 -7595 -20607 -20722 -8718 6391 18097 20849 11228 -5182 -17320 -18768 -12647
872 -12647 7 15463 22379 14512 -1199 -13809 -19981 -17394 -3176 15379 22713 14685 1321
885 1321 -9952 -17944 -18181 -6828 9765 19294 17942 7272 -6981 -18767 -19237 -8933 4787 16867
899 16867 20691 12543 -4879 -18541 -19450 -10613 2063 14147 20382 13988 -1070 -13937 -17871 -14251
913 -14251 -3513 11103 20576 16488 2695 -10867 -18440 -17178 -6021 9129 19160 17092 6634
926 6634 -7399 -17646 -18208 -8009 6065 15512 17552 10891 -2756 -16151 -19190 -11280 2004 13782
$$ packed form
832C889J4745N903j1190j9563j2934j769P062J4688J6524O212r044j5448j4482
845a5407o673N261J6501J4958M058l328q706j4730j4676K07J7105J8047P679j951
859A8345r843j6097j3012j15J2004J5109J1706K752r621j6410j2138j448O121
872a2647J2654J5456O916p867j5711j2610o172K587J4218J8555P334q028j3364
885A321j1273p992k37J1353J6593R529j352j0670j4253j1786m70J0304J3720J2080
899A6867L824q148j7422j3662r09Q837J2676J2084O235o394j5058j2867l934L620
913a4251J0738J4616R473m088j3793j3562p573J262J1157J5150J0031k068j0458
926F634j4033j0247n62J0199J4074R447K040o661j3647j3395l039P910J3284J1778
$$ plain form
940 13782 19401 13974 -530 -14354 -18742 -12671 -1660 10856 18711 15479 2877 -10941 -17118
953 -17118 -14940 -5815 8063 17462 16694 6472 -6881 -16730 -17414 -8189 6047 15953 17080 9415
967 9415 -3593 -15015 -18182 -10018 2828 12882 16966 12603 319 -13040 -18119 -12382 -890
980 -890 10440 17061 14760 3370 -10443 -17809 -14441 -3917 8176 16039 15481 6018 -6909 -15929
994 -15929 -16130 -7257 5651 14874 15945 8788 -3173 -14181 -17097 -9747 3022 13351 15881 11040
1008 11040 9 -12160 -17498 -12076 -204 10854 15679 12441 3113 -8925 -16700 -14446 -3541
1021 -3541 8367 15229 14278 5446 -6249 -14793 -15203 -6781 5602 14697 14944 7482 -3625 -12902 -15875
1036 -15875 -9653 2766 13180 15413 9656 -535 -10708 -15966 -12046 -431 11092 15431 11372
$$ packed form
940A3782N619n427j4504j3824m388O071J1011J2516P855l232j2602j3818o177
953a7118K178R125J3878R399p68j0222j3353r849o84R225J4236R906J127p665
967I415j3008j1422l167Q164J2846J0054M084m363j2284j3359n079N737J1492
980h90J1330O621k301j1390j3813p366L368J0524J2093P863n58r463j2927r020
994a5929k01Q873J2908R223J071p157j1961j1008k916P350J2769J0329K530m841
1008A1040j1031j2169n338N422J1872J1058M825l238r328j2038p775K254J0905
1021c541J1908O862r51q832j1695q544m10Q422J2383R095K47p462j1107r277k973
1036a5875O222J2419J0414K233n757j0191j0173n258L920J1615J1523M339m059
$$ plain form
1049 11372 1978 -8650 -14616 -13194 -3700 8027 15047 13412 4341 -6435 -13666 -14163 -6666 5210
1063 5210 14100 14520 6633 -4028 -12199 -14544 -9079 2097 12356 14852 8737 -1347 -10479 -14260
1077 -14260 -10772 -818 10544 15143 10826 892 -8852 -13698 -11863 -3359 7486 14352 12685 3861
1091 3861 -6247 -12990 -12339 -5779 4516 12988 13932 6363 -4294 -11796 -13086 -7398 1684 11292 14617
1106 14617 8537 -1831 -10659 -13090 -9111 -595 9104 14143 10500 766 -9038 -12904 -10311 -2658
1120 -2658 6751 13201 12069 3799 -6783 -12722 -11354 -4359 4458 11621 12990 6221 -4077 -11693
1134 -11693 -12239 -6555 2313 9915 12735 8148 -1617 -10577 -12663 -8262 4 8476 12224 10235 1151
1149 1151 -8659 -12638 -9640 -1760 6639 11569 10819 3738 -5715 -12399 -11111 -3422 4963 10924 11254
$$ packed form
1049A1372r394j0628n966J422R494J1727P020j635r071j0776p231m97P497J1876
1063E210Q890M20p887j0661q171k345N465J1176J0259K496o115j0084r132l781
1077a4260L488R954J1362M599m317r934r744m846J835Q504J0845O866j667q824
1091C861j0108o743O51O560J0295Q472R44p569j0657p502j290N688R082R608L325
1106A4617o080j0368q828k431L979Q516R699N039l643r734r804l866K593P653
1120b658R409O450j132q270j0582n939J368O995Q817P163J369o769j0298p616
1134a1693n46N684Q868P602K820m587r765q960k086M401Q266Q472L748j989r084
1149A151r810l979K998P880Q399M930p50p081r453o684J288P689Q385N961L30
$$ plain form
1164 11254 5577 -3179 -10806 -11770 -6183 2843 9701 11929 7504 -1219 -9457 -12102 -7287 820 8179
1179 8179 11285 9081 1072 -7941 -12408 -9201 -1169 6963 10460 9367 3369 -5098 -11276 -10707 -3471
1194 -3471 5215 10075 9802 4939 -3132 -10319 -11297 -5406 2999 9216 10386 6598 -1133 -8844 -11732
1209 -11732 -6787 1173 8533 10428 7292 1322 -6643 -11206 -9035 -1314 7112 10751 8272 1841 -4748
1224 -4748 -9425 -9688 -3960 4938 10740 9372 3178 -3375 -8864 -10252 -5230 2969 9005 9635 5362
1239 5362 -1445 -8077 -10705 -6935 1170 7890 10027 6912 -405 -6699 -9336 -7455 -1714 5733 10602
1254 10602 7963 1171 -5332 -9049 -7935 -3535 4059 10019 9300 3411 -3755 -8625 -9092 -4392 3136
1269 3136 8717 8873 4599 -1668 -7219 -9359 -5936 1221 7313 9188 6454 -187 -6509 -9068 -6863
$$ packed form
1164A1254n677q756p627r64N587R026O858K228m425q723q238k645M815Q107P359
1179H179L106k204q009r013m467L207Q032Q132L497j093n998q467o178N69P236
1194c471Q686M860k73m863q071p187r78N891Q405O217J170l788p731p711k888
1209a1732M945P960P360J895l136n970p965m563K171P721Q426L639k479o431o589
1224d748m677k63N728Q898N802j368o194o553n489j388N022Q199O036O30m273
1239E362o807o632k628L770Q105O720K137l115p317o294k637J881N741P447M869
1254A0602k639o792o503l717J114M400P594N960p19n889p166m870m67M700P528
1269C136N581J56m274o267n551k140L423P157O092J875k734o641o322k559K205
$$ plain form
1284 -6863 -605 5605 9420 7762 1312 -5654 -8585 -6843 -2402 3522 8726 8289 2725 -3740 -7683
1299 -7683 -8055 -4441 2228 8481 9285 3652 -2432 -7244 -8157 -5264 1180 6763 8262 5701 -462 -6253
1315 -6253 -8142 -5837 -158 4829 8072 7405 1603 -5444 -8616 -6248 -1071 3340 7559 8305 2460
1330 2460 -4001 -7544 -6214 -2852 2181 6871 7814 3950 -2014 -6368 -7553 -4202 1191 6525 7868
1345 7868 4941 -288 -6057 -8796 -5540 605 5481 6896 5392 1574 -4271 -8403 -6211 -856 3483
1360 3483 6467 6788 3224 -3635 -7999 -6799 -2487 2741 6775 7316 3349 -2323 -6477 -6729 -3770 1510
1376 1510 5787 7081 4111 -649 -4962 -7299 -5604 181 5500 6904 4994 697 -4372 -7656 -6231
1391 -6231 -447 4433 6049 5062 2050 -2985 -6802 -5976 -1807 2561 5867 6630 3393 -2112 -6276 -6386
$$ packed form
1284f863O258O210L815j658o450o966k931J742M441N924N204m37n564o465l943
1299g683l72L614O669O253Q04n633o084m812r13K893O444N583J499k561o163n791
1315f253j889K305N679M987L243o67n802p047l172K368N177M411M219P46n845
1330B460o461l543J330L362N033M690R43l864n964m354j185L351N393N334J343
1345G868k927n229n769k739L256O145M876J415j504l818n845m132K192N355M339
1360C483K984L21l564o859m364J200M312N228M034N41l967n672m154k52K959N280
1376A510M277J294k970m760m313k337J695N785N319J404j910m297n069l284J425
1391f231N784M880J616r87l012n035l817Q26M169M368L306P63l237n505m164j10
$$ plain form
1407 -6386 -3628 1323 5797 7236 3689 -1345 -4923 -6030 -4437 -9 5120 6337 4123 535 -3423
1422 -3423 -6124 -6277 -1364 4202 6433 5183 1310 -2997 -6369 -5891 -1950 2743 5452 5388 2490 -2145
1438 -2145 -5642 -5365 -2550 1249 4511 6182 3731 -1023 -4826 -5851 -4071 -125 4963 6649 4037
1453 4037 -790 -3955 -5201 -4686 -954 3717 5949 4372 909 -2382 -5131 -5529 -1823 2724 5066
1468 5066 5142 2524 -2083 -5723 -5418 -1928 2209 4199 5077 2849 -1301 -4620 -4727 -3322 -359 3920
1484 3920 6017 4250 -311 -4057 -4849 -4063 -1021 3650 5986 4426 164 -3000 -4875 -4398 -1583 2767
1500 2767 4749 4426 1500 -1247 -4472 -5364 -2104 1475 4390 5158 3250 -1242 -4889 -5038 -2537 676
1516 676 3442 4991 3934 -416 -4013 -4447 -2882 -542 2549 4782 4295 828 -2826 -4699 -4162 -1421
$$ packed form
1407f386K758M951M474J439l547n034l578j107J593M428N129J217k214l588l958
1422c423k701j53M913N566K231j250l873m307l372M78L941M693K709o4k898m635
1438b145l497K77K815L799L262J671k451m754l803j025J780L946N088J686k612
1453D037m827l165j246N15L732M671K232j577l463l291k749l98L706M547K342
1468E066P6k618m607l640L05L490M137J990Q78k228m150l319j07J405K963M279
1484C920K097j767m561l746p92P86L042M671K336j560m262l164j875M77K815M350
1500B767J982l23k926k747l225q92L260L579K915P68j908m492l647j49K501L213
1516F76K766J549j057m350l597m34J565K340L091K233m87l467l654j873N37K741
$$ plain form
1532 -1421 2550 5059 4355 1043 -1952 -4225 -4770 -1808 2060 4253 4240 2528 -1027 -3776 -5149 -2475
1548 -2475 852 3338 4379 3515 302 -3973 -4917 -2692 26 2963 4545 3548 288 -3149 -3937 -3433
1564 -3433 -959 2178 4426 4001 1067 -1947 -4038 -4048 -1811 2002 4225 3834 1833 -1068 -3618 -4161
1580 -4161 -2442 1173 3213 3493 2472 -304 -2804 -4327 -2727 238 2689 3915 3533 594 -2877
1595 -2877 -4248 -3090 -569 2229 4006 3464 824 -1933 -3464 -3482 -1525 1626 3523 3665 1727 -1190
1611 -1190 -3081 -4047 -2353 1178 3396 3430 2000 -675 -2909 -4126 -2463 410 3093 3691 2640 196
1627 196 -2299 -4042 -2959 -644 2162 3782 3319 928 -1936 -3515 -3096 -1208 1446 3572 3584 1263
1643 1263 -1373 -3266 -3157 -1788 659 3217 3780 1996 -441 -2440 -3313 -2183 106 2398 3309 2192
$$ packed form
1532a421L971K509p04l312k995k273n45K962L868K193j3j712l555k749j373K674
1548b475L327K486J041q64l213m275r44K225K718K937J582r97l260l437p88N04
1564c433K474L137K248m25k934l014k091j0K237L813K223l91k001k901k550n43
1580d161J719L615K040K80j021k776k500j523J600K965K451J226l82k939l471
1595b877j371J158K521K798J777n42k640k757j531j8J957L151J897J42j938k917
1611a190j891r66J694L531K218L4j430k675k234j217J663K873K683N98j051k444
1627A96k495j743J083K315K806J620m63k391k864j579M19J888K654K126J2k321
1643A263k636j893J09J369K447K558N63j784k437j999q73J130K289K292R11j117
$$ plain form
1659 2192 180 -2250 -3552 -2725 -321 1996 3218 2782 740 -2011 -3165 -2793 -927 1414 3218 3288
1675 3288 961 -1163 -3096 -3089 -1630 952 3195 3265 1723 -493 -2662 -3184 -1893 341 2543 3196 2023
1692 2023 301 -2196 -3139 -2491 -194 2167 3152 2658 510 -1728 -2995 -2583 -752 1511 3007 2837
1708 2837 1008 -1242 -2811 -2854 -1141 1072 2489 2875 1425 -1114 -2381 -3019 -1727 213 2272 2872
1724 2872 2072 -314 -1944 -2729 -1989 -45 2051 2912 2458 306 -1794 -2906 -2301 -743 1328 2535
1740 2535 2520 1054 -1170 -2448 -2528 -1133 1438 2633 2786 1587 -682 -2529 -2778 -1613 399 2339
1756 2339 2613 1862 -205 -1920 -2560 -1755 298 1846 2484 1889 219 -1479 -2768 -2015 -490 1504 2560
1773 2560 1975 680 -1161 -2760 -2525 -1235 805 2386 2212 1403 -813 -2495 -2509 -1180 411 2202
$$ packed form
1659B192k012k430j302Q27K404K317J222m36k042k751j154L72J866K341J804P0
1675C288k327k124j933PJ459K582K243P0j542k216k169n22J291K234K202O53j173
1692B023j722k497r43O48K297K361R85m94k148k238j267M12J831K263J496j70
1708B837j829k250j569m3J713K213J417L86j450k539j267o38J292J940K059O00
1724B872q00k386j630p85P40J944K096Q61m54k152k100j112O05J558K071J207
1740B535j5j466k224j278q0J395K571J195J53j199k269j847k49J165K012J940
1756B339K74p51k067j715o40Q05K053J548O38n95j670j698j289P53J525J994J056
1773B560n85j295j841j599K35J290K040J581j74q09k216j682j4J329J591J791
$$ plain form
1789 2202 2774 1331 -235 -1964 -2149 -1782 177 1860 2672 1819 -49 -1474 -2373 -2272 29 1541 2333
1806 2333 2130 580 -1310 -2439 -2125 -1118 1155 2361 2160 1017 -963 -2071 -2290 -1281 613 2207
1822 2207 2184 1226 -334 -2055 -2224 -1636 224 1883 2417 1499 -35 -1587 -2139 -1722 -8 1205 2219
1839 2219 2010 448 -1257 -2225 -1834 -590 1240 2089 1988 665 -813 -2209 -2282 -1048 670 1784 2010
1856 2010 1038 -496 -2034 -1985 -1001 433 1980 2268 1163 -65 -1425 -2264 -1357 -168 1835 2578 1518
1873 1518 211 -1398 -2077 -1733 -601 931 2233 2143 533 -1081 -1918 -1848 -786 684 1753 1938 772
1890 772 -526 -1926 -2442 -1271 537 1810 1797 1322 -323 -1683 -2174 -1371 84 1496 2126 1273 138
$$ packed form
1789B202N72j443j566j729j85L67J959J683Q12q53j868j425q99J01K301J512P92
1806B333k03j550j890j129L14J007K273J206k01j143j980j108k19J009J894J594
1822B207k3r58j560j721j69N88J860J659N34r18j534j552n52M17J714J213J014
1839B219k09j562j705r68L91J244J830Q49j01j323j478j396p3J234J718J114K26
1856B010r72j534j538M9R84J434J547K88j105j228j360q39R07J189K003P43j060
1873A518j307j609o79L44J132J532J302r0j610j614q37P0J062J470J069J85j166
1890G72j298j400n16J171J808J273j3m75j645j360m91Q03J455J412O30q53j135
$$ [...]
8191b80
##END NTUPLES=NMR FID
##END=
