##TITLE=1H_PR177rm_E
 D2O, 8 sc, 
 28.8.2019
##JCAMPDX= 6.0         $$ Bruker NMR JCAMP-DX V2.0
##DATA TYPE= NMR FID
##DATA CLASS= NTUPLES
##ORIGIN= UXNMR, Bruker Analytische Messtechnik GmbH
##OWNER= root
$$ XWIN-NMR		Version 3.5
$$ Wed Aug 28 13:54:57 2019 Russian Standard Time (UT+4h)  she@DPX200
##.OBSERVE FREQUENCY= 200.13155
##.OBSERVE NUCLEUS= ^1H
##.DELAY= (6, 6)
##.ACQUISITION MODE= SIMULTANEOUS
##.ACQUISITION SCHEME= undefined
##.AVERAGES= 8
##.DIGITISER RES= 18
##SPECTROMETER/DATA SYSTEM= spect
##.PULSE SEQUENCE= zg30
##.SOLVENT NAME= D2O
##.SHIFT REFERENCE= (INTERNAL, D2O, 0, 15.7039)
##AUDIT TRAIL= $$ (NUMBER, WHEN, WHO, WHERE, WHAT)
$$ ##TITLE= Audit trail, XWIN-NMR		Version 3.5
$$ ##JCAMPDX= 5.01
$$ ##ORIGIN= Bruker BioSpin GmbH
$$ ##OWNER= she
$$ F:/spectra/data/she/nmr/H-F/1/audita.txt
$$ ##AUDIT TRAIL=  $$ (NUMBER, WHEN, WHO, WHERE, WHAT)
(   1,<2019-08-28 13:53:38.70 +0400>,<she>,<DPX200>,
      <created by zg, POWCHK disabled, PULCHK disabled
       configuration hash MD5:
       00 E9 B6 7A A2 85 ED C7 34 08 36 98 17 FE 4E 26
       data hash MD5: 16K
       FB 7E F0 FF EE D8 19 EE 9B 07 51 03 21 AC 2D A6>)
$$ ##END=
$$ 
$$ hash MD5
$$ 41 14 96 3E 21 00 F3 3D 0E 2A 2F C1 2F 0F CF FF
##$RELAX= 
##$RELAX= 
##$RELAX= 
##$RELAX= 
##$RELAX= 
##$RELAX= 
$$ Bruker specific parameters
$$ --------------------------
##$DU= <F:/spectra>
##$EXPNO= 1
##$NAME= <H-F>
##$PROCNO= 1
##$TYPE= <nmr>
##$USER= <she>
##$AMP= (0..31)
100 100 100 100 100 100 100 100 100 100 100 100 100 100 100 100 100 100 
100 100 100 100 100 100 100 100 100 100 100 100 100 100 
##$AQSEQ= 0
##$AQ_mod= 1
##$AUNM= <au_zg>
##$AUTOPOS= <>
##$BF1= 200.13
##$BF2= 200.13
##$BF3= 200.13
##$BF4= 200.13
##$BF5= 200.13
##$BF6= 200.13
##$BF7= 200.13
##$BF8= 200.13
##$BYTORDA= 1
##$CFDGTYP= 0
##$CFRGTYP= 5
##$CHEMSTR= <none>
##$CNST= (0..31)
1 1 145 1 1 1 1 1 1 1 1 1 1 1 1 1 1 1 1 1 1 1 1 1 1 1 1 1 1 1 1 1 
##$CPDPRG= <>
##$CPDPRG1= <>
##$CPDPRG2= <>
##$CPDPRG3= <>
##$CPDPRG4= <mlev>
##$CPDPRG5= <mlev>
##$CPDPRG6= <mlev>
##$CPDPRG7= <mlev>
##$CPDPRG8= <mlev>
##$CPDPRGB= <>
##$CPDPRGT= <>
##$D= (0..31)
0 1.2 0 0 0 0 0 0 0 0 0 0.03 0 0 0 0 0 0 0 0 0 0 0 0 0 0 0 0 0 0 0 0 
##$DATE= 1566986017
##$DBL= (0..7)
120 120 120 120 120 120 120 120 
##$DBP= (0..7)
150 150 150 150 150 150 150 150 
##$DBP07= 0
##$DBPNAM0= <>
##$DBPNAM1= <>
##$DBPNAM2= <>
##$DBPNAM3= <>
##$DBPNAM4= <>
##$DBPNAM5= <>
##$DBPNAM6= <>
##$DBPNAM7= <>
##$DBPOAL= (0..7)
0.5 0.5 0.5 0.5 0.5 0.5 0.5 0.5 
##$DBPOFFS= (0..7)
0 0 0 0 0 0 0 0 
##$DE= 6
##$DECBNUC= <off>
##$DECIM= 24
##$DECNUC= <off>
##$DECSTAT= 4
##$DIGMOD= 1
##$DIGTYP= 9
##$DL= (0..7)
0 120 120 120 120 120 120 120 
##$DP= (0..7)
150 150 150 150 150 150 150 150 
##$DP07= 0
##$DPNAME0= <>
##$DPNAME1= <>
##$DPNAME2= <>
##$DPNAME3= <>
##$DPNAME4= <>
##$DPNAME5= <>
##$DPNAME6= <>
##$DPNAME7= <>
##$DPOAL= (0..7)
0.5 0.5 0.5 0.5 0.5 0.5 0.5 0.5 
##$DPOFFS= (0..7)
0 0 0 0 0 0 0 0 
##$DQDMODE= 0
##$DR= 18
##$DS= 0
##$DSLIST= <SSSSSSSSSSSSSSS>
##$DSPFIRM= 0
$$ [...]
##$SUBNAM2= <"">
##$SUBNAM3= <"">
##$SUBNAM4= <"">
##$SUBNAM5= <"">
##$SUBNAM6= <"">
##$SUBNAM7= <"">
##$SUBNAM8= <"">
##$SUBNAM9= <"">
##$SW= 24.9336996594482
##$SWIBOX= (0..15)
0 0 2 0 0 0 0 0 0 0 0 0 0 0 0 0 
##$SW_h= 4990.01996007984
##$TD= 16384
##$TD0= 1
##$TE= 0
##$TE2= 300
##$TE3= 300
##$TEG= 300
##$TL= (0..7)
0 120 120 120 120 120 120 120 
##$TP= (0..7)
150 150 150 150 150 150 150 150 
##$TP07= 0
##$TPNAME0= <>
##$TPNAME1= <>
##$TPNAME2= <>
##$TPNAME3= <>
##$TPNAME4= <>
##$TPNAME5= <>
##$TPNAME6= <>
##$TPNAME7= <>
##$TPOAL= (0..7)
0.5 0.5 0.5 0.5 0.5 0.5 0.5 0.5 
##$TPOFFS= (0..7)
0 0 0 0 0 0 0 0 
##$TUNHIN= 0
##$TUNHOUT= 0
##$TUNXOUT= 0
##$USERA1= <user>
##$USERA2= <user>
##$USERA3= <user>
##$USERA4= <user>
##$USERA5= <user>
##$V9= 5
##$VALIST= <valist>
##$VCLIST= <CCCCCCCCCCCCCCC>
##$VD= 0
##$VDLIST= <DDDDDDDDDDDDDDD>
##$VPLIST= <PPPPPPPPPPPPPPP>
##$VTLIST= <TTTTTTTTTTTTTTT>
##$WBST= 1024
##$WBSW= 4
##$XGAIN= (0..3)
0 0 0 0 
##$XL= 0
##$YL= 0
##$YMAX_a= 686764
##$YMIN_a= -949093
##$ZGOPTNS= <>
##$ZL1= 120
##$ZL2= 120
##$ZL3= 120
##$ZL4= 120
##$ABSF1= 10
##$ABSF2= 0
##$ABSG= 5
##$ABSL= 3
##$ALPHA= 0
##$AQORDER= 0
##$ASSFAC= 0
##$ASSFACI= 0
##$ASSFACX= 0
##$ASSWID= 0
##$AUNMP= <proc_1d>
##$AZFE= 0.1
##$AZFW= 0.1
##$BCFW= 1
##$BC_mod= 2
##$BYTORDP= 1
##$COROFFS= 0
##$CY= 11.3945322036743
##$DATMOD= 1
##$DC= 2
##$DFILT= <>
##$DTYPP= 0
##$F1P= 20.1720416913024
##$F2P= 0.152960286110954
##$FCOR= 0.5
##$FTSIZE= 0
##$FT_mod= 4
##$GAMMA= 1
##$GB= 0.15
##$INTBC= 1
##$INTSCL= 1
##$ISEN= 128
##$LB= 0.24
##$LEV0= 0
##$LPBIN= 0
##$MAXI= 10000
##$MC2= 0
##$MEAN= 0
##$ME_mod= 0
##$MI= 1.114404
##$NCOEF= 0
##$NC_proc= 0
##$NLEV= 6
##$NOISF1= 3.799351
##$NOISF2= 2.8
##$NSP= 1
##$NTH_PI= 0
##$NZP= 0
##$OFFSET= 15.70392
##$PC= 1
##$PHC0= -9219.786
##$PHC1= 15.60096
##$PH_mod= 1
##$PKNL= yes
##$PPARMOD= 0
##$PSCAL= 0
##$PSIGN= 0
##$REVERSE= no
##$SF= 200.130013532006
##$SI= 16384
##$SIGF1= 3
##$SIGF2= 2
##$SINO= 400
##$SIOLD= 16384
##$SREGLST= <1H.CDCl3>
##$SSB= 0
##$STSI= 0
##$STSR= 0
##$SW_p= 3612.71676300578
##$SYMM= 0
##$S_DEV= 0
##$TDeff= 0
##$TDoff= 0
##$TI= <>
##$TILT= no
##$TM1= 0
##$TM2= 0
##$TOPLEV= 0
##$USERP1= <user>
##$USERP2= <user>
##$USERP3= <user>
##$USERP4= <user>
##$USERP5= <user>
##$WDW= 1
##$XDIM= 8192
##$YMAX_p= 0
##$YMIN_p= 0
$$ End of Bruker specific parameters
$$ ---------------------------------
##NTUPLES= NMR FID
##VAR_NAME=  TIME,          FID/REAL,        FID/IMAG
##SYMBOL=    X,             R,               I
##VAR_TYPE=  INDEPENDENT,   DEPENDENT,       DEPENDENT
##VAR_FORM=  AFFN,          ASDF,            ASDF
##VAR_DIM=   8192,          8192,            8192
##UNITS=     SECONDS,       ARBITRARY UNITS, ARBITRARY UNITS
##FACTOR=    0.0002004,     1,               1
##FIRST=     0,             0,               0
##LAST=      1.6414764,     0,               0
##MIN=       0,             -949093,         0
##MAX=       1.6414764,     686764,          0
$$ Real data points
##PAGE= N=1
##DATA TABLE= (X++(R..R)), XYDATA
$$ [...]
3832B343N45j345j678k167r19J306K117J727J167r04k094k012r02L67J720K333
$$ 2343 2888 1543 -135 -2302 -3221 -1915 202 1929 3096 2192 98 -1914 -2816 -2449 -729 1604
3848A604J397k23k239k137j261Q4J703K183J924j03j669k365j580k78J084K466
$$ 1604 3001 2778 539 -1598 -2859 -2775 -1072 1111 3035 2932 1263 -1102 -2682 -2960 -1876 590
3864E90K185L76j538j697k144p79O49K283K195J250r18k162k216j337O94J708
$$ 590 2775 3151 1613 -84 -2228 -3007 -2358 -75 2120 3370 2452 290 -1926 -3263 -2569 -861
3880h61K576J716p67k044k378j587M12J722K528J802k0j307k938j694l57J317
$$ -861 1715 3431 2664 620 -1758 -3345 -2933 -1211 1317 3119 3099 1792 -1146 -2840 -3197 -1880
3896a880K500J785Q14j262k147j977j090J000K262K390J059j041k027k349j417
$$ -1880 620 2405 3219 1957 -190 -2167 -3257 -2257 5 2395 3454 2413 386 -1963 -3380
3911c380O44K038K262J831k93k182k381j520r5J882K209K224K8j374l039j873
$$ -3380 -2736 -698 1564 3395 3102 920 -1461 -2981 -3076 -1194 1015 3239 3267 1893 -1146 -3019
3927c019m24J328K630K220Q52j297k375k154j620J461K332K359J150l99k847k364
$$ -3019 -3443 -2115 515 2735 3587 2290 -85 -2239 -3859 -2398 -66 2293 3443 3044 197 -2167
3943b167j677N08K377K762J995m60k068k811j828j72K197K288K357J73j798k800
$$ -2167 -3844 -3336 -959 1803 3798 3338 1270 -1541 -3369 -3541 -1344 944 3301 3474 1676 -1124
3959a124j996m60J155K876K542M75j415k163k427j023P11K568K906J069r21k351
$$ -1124 -3120 -3580 -2425 451 2993 3468 2053 -110 -2537 -3560 -2849 -281 2625 3694 2773 422
3975D22k628j451L81K201K916J899l55k372k630j622l20J689L296J782L42j442
$$ 422 -2206 -3657 -3276 -1075 1841 3740 3385 1013 -1617 -3239 -3559 -1870 1426 3208 3550 2108
3991B108k640k989l66J590K725K506J161j294l127k657j094J148K436K731J628
$$ 2108 -532 -3521 -3887 -2297 428 2934 4095 2801 -326 -2983 -4077 -2929 -493 2238 3866
4006C866p54k701k526j747M70K399K528K127k1k058k740k456k98K014K934K233
$$ 3866 3112 411 -2115 -3862 -3392 -993 1535 3662 3641 1583 -1157 -3613 -3911 -1897 1037 3270
4022C270N55j608l005k403q76J583K778K699J237j226k987k842j214J065K646
$$ 3270 3825 2217 -788 -3191 -4067 -2484 294 2993 4230 3004 17 -2825 -4039 -2974 -328
4037c28K779J653q29k238l105j863L17K425K970J834K53j938l395k296j52J805
$$ -328 2451 4104 3275 1037 -2068 -3931 -3614 -1189 1781 3615 3868 1930 -1465 -3761 -3913 -2108
4053b108K980K446N86j448k919k886j050J476L058L046Q63j183k661l029j606
$$ -2108 872 3318 3904 2456 -463 -3349 -4399 -2923 135 3181 4044 2861 200 -2829 -4435
4068d435J126K800K882J675m38k681l021k059L39K291L140K460J90k496l181k172
$$ -4435 -3309 -509 2373 4048 3610 929 -2092 -4151 -3812 -1521 1619 4079 4269 1773 -1408 -3580
4084c580o79K093K820K944L96j603k930k868q90J388L221K659J452j362k615l393
$$ -3580 -4259 -2166 654 3598 3994 2391 -539 -3407 -4297 -2909 312 2971 4423 3061 446 -2947
4100b947j493P91K824L114J871m63k739k840k086j7K488L037K431J77k196l218
$$ -2947 -4440 -3649 -825 2289 4160 3697 958 -1882 -3968 -3985 -1497 1540 3971 4148 1952 -1266
4116a266k671j44J934K951K779J007j887l058l017q76P71L330L384J305j397k684
$$ -1266 -3937 -4081 -2147 804 3583 4590 2703 -355 -3372 -4248 -3477 -147 3237 4542 3145 461
4132D61l093j533K82L152L283K145o13k672l408k321p3K756L314K298K26k078
$$ 461 -2632 -4165 -3883 -731 2552 4697 4084 1412 -1996 -4317 -4390 -1634 1680 3978 4204 2126
4148B126l222k803o64K230L138L292M20j768k813l142j202J521L021K654K178
$$ 2126 -1096 -3899 -4563 -2333 805 4097 4517 2749 -64 -3206 -4408 -2887 134 2788 4966
4163D966j356k954l160j981O25L039L271J773j96k546l360k741L02K402L537K673
$$ 4966 3610 656 -2504 -4485 -3860 -821 2450 4223 4027 1481 -1879 -4620 -4318 -1916 1621 4294
4179D294Q6j914l585k730o42J804L440K849R26j700l063k893j562J341K906L570
$$ 4294 4380 2466 -1119 -3849 -4491 -2687 753 3602 4528 2828 -235 -3128 -4690 -3349 -443 3127
4195C127J485p18l166l432j945P25K557L932J869l36k566l224k665j73K352L433
$$ 3127 4612 3894 728 -2704 -4649 -3924 -1367 2565 4434 4098 1532 -1692 -4357 -4530 -2178 1255
4211A255K541N92j752l577k899j070K025L324L248J168j790l018l417j313J128
$$ 1255 3796 4388 2636 -941 -3840 -4910 -2885 439 3687 4855 3065 47 -3370 -4683 -3555
4226c555L124L553J758r45l108l321k146Q20K241L430K716k38k367l823k366m23
$$ -3555 -431 3122 4880 3935 827 -2494 -4640 -3820 -1579 1851 4567 4329 1962 -1861 -4227 -4650
4242d650K425L334L003P04k210l439k926j039J653L359L204J344j301l064l746
$$ -4650 -2225 1109 4112 4816 2606 -833 -3759 -4798 -3145 214 3418 4762 3461 397 -3349
4257c349j344J117L005L702J380m70k834l704k102K95K968L511K422J07k654l768
$$ -3349 -4693 -3576 -571 3131 4511 4041 1207 -2497 -4599 -4304 -1336 2175 4597 4704 2050 -1718
4273a718k802l2K049L354L256P68j784l605l478r82J834L231L257J650j377l021
$$ -1718 -4520 -4552 -2503 851 4107 4875 3091 -514 -3992 -4974 -3140 91 3348 4998 3621 600
4289F00l687j822J075K835L593K237n79k689m003k181J2K975L174K920Q5k424
$$ 600 -3087 -4909 -3834 -999 2594 4831 4252 1563 -2440 -4621 -4609 -1634 1540 4460 4545 2121
4305B121l405k929l29J916L275L359Q03j887l260l379j026J203L327L478J679
$$ 2121 -1284 -4213 -4542 -2626 649 4008 4811 2924 -336 -3715 -4741 -3538 -211 3267 4946
4320D946j236l270l645j766J026K942L638K154l73k647m145k226N0K829L429K982
$$ 4946 3710 440 -3205 -4971 -3945 -1003 2635 4789 4416 1769 -2376 -4602 -4552 -1723 1706 4688
4336D688o2k146l509l284o67K175L817L140N56j482l485l358j194J088L827L014
$$ 4688 4626 2480 -1029 -4313 -4980 -2805 1012 4152 4708 3226 -259 -3617 -4811 -3723 104 3118
4352C118J806q37l217l908j537L63L068L837K287o51l017l356k630j1K651L681
$$ 3118 4924 4087 870 -3038 -4575 -4212 -1144 2693 4980 4329 1312 -2044 -4674 -4685 -2034 1647
4368A647K973j75j786l924l219l58J865L555L231J304k023l384l264j357J263
$$ 1647 4620 4445 2659 -1265 -4484 -4842 -2977 578 3809 5113 3090 -294 -3558 -4915 -3652
4383c652L281L721J744j163l478l202k275O06L054L963K246l41k564l860k501
$$ -3652 -371 3350 5094 3931 453 -2749 -5024 -4418 -1364 2599 4845 4504 1940 -1920 -4421
4398d421l05K651L595L100K24k038l860l028j040J685L977L459Q52j375l335l797
$$ -4421 -4726 -2075 1520 4620 4844 2806 -1054 -4082 -5122 -3437 540 3999 4851 3476 141 -3656
4414c656j519J586L221L596J751o15l497l851k247Q30K816L852K797k95k954l818
$$ -3656 -5175 -3589 -368 3228 4979 4364 867 -2984 -5231 -4401 -1585 2267 5064 4769 1815 -2003
4430b003k882j4K515L762K938R48k423l933k998j093K252L231L573J411j842l099
$$ -2003 -4885 -4899 -2384 1378 4316 5264 2841 -1092 -4090 -5183 -2931 300 3873 5284 3442 343
4446C43l682k025J511L181M104J721q10l135l684k268L88K681L751K803O5k838
$$ 343 -3339 -5364 -3853 -672 3432 5153 4343 1208 -2476 -4744 -4356 -1675 2076 4879 4944 2106
4462B106m178k528l18K106L801L382O39j971l618l467j115J509M165L558J610
$$ 2106 -2072 -4600 -4918 -2812 989 4371 5010 3039 -579 -4046 -5161 -3652 513 4071 5681
4477E681j835l469l643j845J152L042M217J768p45l123l874k430K61L105L928
$$ 5681 3846 377 -3266 -5111 -3959 -917 3300 5068 4323 1200 -2674 -5104 -4843 -1738 2190
4492B190K789j64k494m247k665k68K074M056L013Q73j933l959l621j169K092L180
$$ 2190 4979 4815 2321 -1926 -4591 -4859 -2785 1271 4284 5157 3224 -735 -4356 -5525 -3433 -253
4508b53L943J598j452l300m083j717O84L673L853K388o65k984m313k241k8K986
$$ -253 3690 5288 3836 536 -3547 -5264 -4580 -907 2946 5334 4669 1685 -2628 -4869 -4897 -1911
4524a911L923K953K06k885l941l208l25K209L886L486J027k225l705l830j194
$$ -1911 2012 4965 5171 2286 -1655 -4863 -5188 -2979 907 4393 5420 3195 -510 -4340 -5534
4539e534J613L867L861J898j589l244m225k078P68L256M136K217k56l126l976
$$ -5534 -3921 -54 3807 5705 4116 872 -3353 -5431 -4663 -1407 2729 4946 4690 1564 -2412
4554b412k672J3K859L853L397n4k290l795l651n87J944M130L720J102j741m204
$$ -2412 -5084 -5071 -2212 1641 5038 4984 2694 -1101 -4752 -5339 -3395 735 4455 5557 3816 -388
4570c88l713j297J226M194L460K126j278l405m178k268P79L216M053K726j92l053
$$ -388 -4101 -5398 -4172 22 3482 5608 4330 925 -3253 -5521 -4742 -1526 2527 5253 5061 2008
4586B008m200k948k43K791M171L263N35k166m190l716q33K202L968L151J799j654
$$ 2008 -2192 -5140 -5383 -2592 1579 4842 5377 3211 -979 -4695 -5528 -3326 642 3793 5592 3938
4602C938m091l695j940J761L444L872K173r56l276m259k328L85L294L833L016
$$ 3938 -153 -3848 -5788 -4027 -583 3289 5462 4506 1230 -3029 -5357 -4972 -1678 2155 5171
4617E171J1l096l897l107m01K308M474L228P49k360m064l553j416K374L893L923
$$ 5171 5182 2086 -1811 -4918 -5319 -3011 1463 4691 5440 3080 -984 -4537 -5953 -3579 314 4237
4633D237J403j591l585m074j923J015L946L771K224j033l135m053k527M33L017
$$ 4237 5640 4049 464 -3610 -5533 -4518 -572 3199 5423 4390 1255 -2798 -5325 -4892 -1875
4648a875M134K815L01l031m189l213l52K617M009L368J142k631m026l777p54J371
$$ -1875 2259 5074 5375 2344 -1845 -5058 -5410 -2793 1216 4584 5726 3095 -931 -4708 -5462 -4091
4664d091M429L810J657j439m207l615k021R92L518M347K320r76l459l908k772
$$ -4091 338 4148 5805 4366 159 -3456 -5477 -4485 -967 3380 5700 4724 1265 -2643 -5415
4679e415N87K836M014L331Q3k999l935l692m15K623M018L470J089j915m133l733
$$ -5415 -4828 -1992 2022 5353 5436 2437 -1498 -5190 -5605 -2982 1036 4506 5595 3680 -453 -4186
4695d186j506J794M016L728J939j534l715m074k264J199L720L960K371m46l207
$$ -4186 -5692 -3898 118 3846 5785 4251 536 -3538 -5802 -4603 -883 3077 5448 5002 1795
4710A795m408k799o7L235M365L094P7k340m505l440o93K228M480L514J142j734
$$ 1795 -2613 -5412 -5479 -2244 2121 5215 5292 2952 -1553 -4993 -5686 -3458 1022 4536 5678 3944
4726C944m189m090j350J476L876M144J694r25l475m320k421O74L734M275K339
$$ 3944 -245 -4335 -5685 -4209 -333 3811 5505 4580 1105 -3215 -5636 -4962 -1228 3047 5386
4741E386k9l393m466k965L7L144M084L009P37k302m357l412j052K228M185L459
$$ 5386 5357 1964 -2502 -5467 -5430 -2286 1798 4807 5544 3242 -1115 -4527 -5579 -3351 834 4293
4757D293J521j800l988l742j859J329L614M363J954r41l652m128k901Q90L333
$$ 4293 5814 4014 26 -3716 -5575 -4246 -632 3731 5685 4744 1092 -3036 -5937 -5047 -1714
4772a714M098K799L51l127m723k726m65K663M517L337O70k296m308l933p86J823
$$ -1714 2384 5183 5534 2407 -2316 -5042 -5507 -2844 1673 5010 5680 3384 -924 -4857 -5643 -3820
4788c820M006M302J301j801l684m042j994J068L771M302K410j111l232m143k855
$$ -3820 186 4488 5789 3988 304 -3738 -5732 -4664 -893 3409 5819 4708 1476 -2667 -5522
4803e522N6L472M309K940M37l022m178l829k94K684M228L438J272k450l984l975
$$ -5522 -5466 -1994 2315 5255 5692 2670 -1508 -5337 -5631 -2947 1281 4719 5991 3541 -443 -4418
4819d418j475J620M370M066J390q64m317l962k145Q71L566M496K466n31l418m392
$$ -4418 -5893 -4273 97 4163 5553 4689 372 -3590 -5735 -4864 -1298 3198 5664 5133 1715 -2677
4835b677k847r5L404M488L373J07l101m178l565r04K531M540L479J353k031m377
$$ -2677 -5524 -5619 -2215 2273 5646 5753 2652 -1526 -5091 -5995 -3464 1076 4555 5908 3877 -500
4851e00l779j526J774L972L695J958r50l983m287k122P01L677M342K786m90l442
$$ -500 -4279 -5805 -4031 -59 3636 5594 4644 661 -3626 -5748 -5047 -1370 2972 5758 5268 1826
4867A826m157l008k48L312M035L148O36k518m015l964q82K318M333L855J031j342
$$ 1826 -2331 -5339 -5587 -2275 1760 4908 5544 3026 -989 -4953 -5835 -3517 816 4671 5702 4360
4883D360m848l929j536J356M392L924K109r33l754m579k229N53L585M096K942
$$ 4360 -488 -4417 -5953 -4597 -205 3719 5828 4895 1141 -3438 -5667 -5114 -1529 2567 5509
4898E509j96l157m517k809l73K546M473L429O46k350m454l596j303K271M278M017
$$ 5509 5313 2156 -2361 -5170 -5543 -2997 1476 4905 5551 3201 -1253 -4849 -6152 -3881 397 4414
4914D414J289j449l940m346j825J358L728M269K335n65m091m081k882M95L552
$$ 4414 5703 4254 314 -4032 -5857 -4499 -771 3498 5833 5268 1177 -2904 -5786 -5291 -1739
4929a739M176L080k29k711m798k868o24K853M122L555R68k105m758l643j112J997
$$ -1739 2437 5517 5288 2577 -2221 -5089 -5713 -2860 1262 4817 5785 3680 -1078 -4721 -5833 -3836
4945c836M154M087J544j459m518l990j960J198L703M542K375j070l288m294l054
$$ -3836 318 4405 5949 4490 -28 -4018 -5978 -4780 -1077 3465 5840 4770 1482 -2812 -5866
4960e866L25L466M005L497J39k731m646l574m03K846L877M231R04k296m489m064
$$ -5866 -5541 -2075 1930 5427 5566 2835 -1811 -5385 -5788 -2942 935 5166 6070 3774 -715 -4779
4976d779j177J886M141M347J604j729l483m493k061P77L695M579K620r98l069
$$ -4779 -5956 -4070 71 4418 6022 4293 810 -3683 -5744 -4967 -1272 3307 5927 4929 1860
4991A860m622k915K88L318L985L268O91l059m233l634p89K479M483L460J349k112
$$ 1860 -2762 -5677 -5389 -2071 1914 5182 5873 2814 -1419 -5053 -5842 -3363 1120 4580 5929 3817
5007C817m012m521j305J607M227M060K161j239l899m571k134Q92L107M759K696
$$ 3817 -195 -4716 -6021 -4414 -187 3873 6034 4795 896 -3675 -5809 -4917 -1810 2949 5645
5022E645m60l288m359l016k45L116M511L523L74l039m104l548j121K430M449L777
$$ 5645 5185 1897 -2462 -5478 -5723 -2607 1904 5427 5801 2762 -1342 -4890 -6011 -3581 868 4645
5038D645J380k021m420l875j599J455L801M006K825j103m084m284k750R03L875
$$ 4645 6025 4004 -416 -4291 -5890 -4435 -634 3372 6197 5094 1010 -3274 -6024 -5121 -1246
5053a246M142K721j40l090m870k996l99L339M570L168O80k518m698l567q26K155
$$ -1246 2896 5617 5477 2387 -2483 -5479 -5878 -2539 2031 5199 5879 3361 -1337 -4904 -5730 -3575
5069c575M087L877J688k042m137m014j713J219M185M074K369j202l693m088k644
$$ -3575 512 4389 6077 4035 -102 -4116 -5829 -4610 -425 3649 6018 4816 1123 -2965 -5609
5084e609N26L210M350L123k47l027m510l505M6K972M385L739N43k631m529l732
$$ -5609 -5083 -1873 2477 5600 5353 2326 -2184 -5689 -5643 -2671 1714 5453 5996 3365 -1164 -4896
5100d896j186J963M661L916J797j953m228m201k041J617M024M338K045q14l945
$$ -4896 -6082 -4119 542 4458 6255 4302 74 -4127 -6168 -4551 -527 3811 5856 5042 1097
5115A097m292k510K54L464M510L288j64l125m893k845o19K669N048L201R92k561
$$ 1097 -3195 -5705 -5451 -1987 2523 5811 5647 2522 -2371 -5216 -5835 -3166 1882 5083 6075 3514
5131C514m404l996j106J928M292M156J722j887l960m187k191R99M024M622K571
$$ 3514 -890 -4886 -5992 -4064 228 4384 6106 4219 259 -3928 -6119 -5120 -1096 3526 6097
5146F097j081l386m704k474M5L643M022L249K91l012m507l458l80K830L858L948
$$ 6097 5016 1630 -3074 -5548 -5503 -1860 2162 5411 5702 2690 -1817 -5275 -5655 -2825 1033 4981
5162D981Q42j908m986l201j703J844M129M087K007j559m408m263j730Q76L907
$$ 4981 5823 3915 -1071 -4272 -5975 -4131 -2 4085 6092 4533 125 -4138 -5868 -4992 -1085
5177a085M384K502m59l320m628l150P4L552M057L866L7l101m426l463o91K585
$$ -1085 3299 5801 5342 2022 -2606 -5756 -5682 -2130 1927 5793 5830 2729 -1697 -5160 -5851 -3266
5193c266M389L891J040k565l949m166j403J798L997M336J671j211l770m635k046
$$ -3266 1123 5014 6054 3489 -460 -4626 -6029 -4231 -234 4102 5773 4562 792 -3843 -5889
5208e889Q45L619M605K646o02l093m810l140L42L076M309L393O68k830m949l284
$$ -5889 -5044 -1425 3180 5826 5224 2131 -2679 -5819 -5477 -2401 1908 5301 5969 3139 -1810 -5094
5224e094j090K503M482L814J629k381m532l748j645J667M024M119K157j289l497
$$ -5094 -6184 -3681 801 4615 6244 3863 -669 -4417 -6062 -4395 -371 3748 5905 4616 1119
5239A119m521k533P30L533M496K938l55l554m221l327J77L150M250L584N69l042
$$ 1119 -3402 -5935 -5205 -1672 2824 5762 5407 1853 -2368 -5695 -5518 -2368 1882 5466 6035 2993
5255B993m275l780r36K295M731L521J553k117m269l782j637J160M145M163K272
$$ 2993 -1282 -5062 -5998 -3703 1028 4549 6102 3985 -284 -4066 -5703 -4543 -398 3765 6037
5270F037j139l590m844k389O11L783M338L261n49l470m341l360O4K617M800L597
$$ 6037 4898 1308 -3536 -5925 -5314 -1531 2807 6068 5519 2049 -2292 -5652 -5588 -2971 1829 5426
5286E426Q64l013m570l716j151K323M235M132J509j411m471m049k092J464L702
$$ 5426 6290 3277 -1293 -5009 -6160 -3837 398 4530 6039 4628 157 -3892 -5984 -4520 -818
5301h18M302K440o56l896m625k546K93L716M239L358k59l017m679l362j16K761
$$ -818 3484 5924 5268 1372 -3253 -5799 -5506 -1790 2449 5807 5548 2531 -2148 -5510 -5626 -2865
5317b865M221L583Q78k178m734l782q25J947L735M117J991j584m371l896k307
$$ -2865 1356 4939 5817 3639 -1095 -4877 -5702 -3755 -20 4097 6088 4504 133 -3763 -6070
5332f070J285L765M383K658q05l686m500k982M83L289M403L329p3k916m142l707
$$ -6070 -4785 -1020 3363 6021 5216 1530 -2970 -5952 -5469 -2180 2223 5552 5479 2563 -1579 -5286
5348e286p89K422N080L489Q87k333m115m098j433K196M123M040K018j698m030
$$ -5286 -6075 -3653 1427 4916 5803 3470 -645 -4743 -6176 -3980 143 4183 6201 4503 473
5363D73m523k061J493L500M279K906q10l372n008k559M81L137M380L424j26k926
$$ 473 -4050 -6111 -4618 -1118 3161 6067 5257 1885 -3123 -5682 -5201 -2064 2316 5740 5614 2688
5379B688m363l567n10K507M650L576J012k508m336l658j257J692L819M782J681
$$ 2688 -1675 -5242 -5752 -3245 1405 4981 5993 3485 -851 -4509 -5766 -4074 -255 4527 6208
5394F208j782m024m294k055Q97M221M098K517p68l058m534l227L07K775N190K913
$$ 6208 4426 402 -3892 -5947 -5050 -829 3269 5786 5018 1960 -2574 -5801 -5494 -2719 2471 5384
5410E384L60l086m479l422p02K813M391L365J444k205m252m095j827J913M472
$$ 5384 5744 2658 -1821 -5243 -5945 -3132 1259 4624 6068 3863 -389 -4484 -6311 -4398 74
5425G4M236J609j160m299l889k653Q42L813M772K645q22l177m160l260l33L240
$$ 74 4310 5919 4759 460 -3429 -6082 -5240 -1427 3345 5990 5168 1991 -2169 -5429 -5762 -2522
5441b522M411L614J28k326m373l783j190K477M443L775J590k138m392m090j594
$$ -2522 1889 5503 5631 3305 -1068 -4851 -6041 -3564 879 4654 6244 4106 -286 -4376 -5970
5456e970J447M198M162K157j261l689m530k534R52L338M385L021J3l521m338l135
$$ -5970 -4523 -325 3837 5994 4733 1044 -3486 -6020 -5068 -1730 2655 5676 5689 2168 -2170 -5305
5472e305k4K819M438L325N73k687m401l553j241K500M372L876J455k065l854m091
$$ -5305 -5329 -2510 1928 5253 5826 3139 -1262 -4815 -6056 -3556 816 4692 6147 4082 228 -3863
5488c863k123J436M157M266K217j148l702m121k759N01L444M347K894L7l285m683
$$ -3863 -5986 -4550 -393 3873 6090 4942 1240 -2881 -5640 -5139 -1695 2652 5546 5583 2298 -2385
5504b385k881j30K693M304L512Q11k282m578l751j162J997M411L696J733j695
$$ -2385 -5266 -5396 -2703 1601 5113 5924 3642 -936 -4687 -5849 -3852 559 4255 5988 4293
5519D293m157m404j912J561L779M286K585r63l659m386l066N46L844M119L099
$$ 4293 136 -4268 -6180 -4619 -840 3446 6031 5068 1409 -2977 -6043 -5497 -1653 2466 5565
5534E565P8l001m469l479o20L072M207L745Q82k486m615l615j088J758M443L897
$$ 5565 5643 2642 -1827 -5306 -5926 -2854 1353 5098 5980 3494 -1121 -4736 -5824 -4066 377 4274
5550D274J807j309m261m767j823J371L676M465K320l91l791m324k861L59L136
$$ 4274 6081 4772 511 -4256 -6079 -4708 -1032 3433 5753 5362 1571 -2753 -5614 -5255 -2119
5565b119M283L234K52k880m593l803k77K672M439L730J049k057m345m144j619
$$ -2119 2164 5398 5650 2770 -1823 -5626 -5903 -3231 1208 4938 5987 3930 -415 -4559 -6178
5580f178J683M462M108J715j049m165m381k092R49L777M645K342m73l453m633
$$ -6178 -4495 -33 4075 5790 4741 576 -3805 -5897 -4948 -1171 3474 5816 5343 1890 -2743
5595b743k866O5L398M271L426J01k878m165l728q70K916L946L899R72j868l915
$$ -2743 -5609 -5544 -2146 2125 5551 5652 2774 -1391 -5119 -5989 -3073 873 4772 5744 3876 -39
5611c9m303j466J588L842M356J839j075l564m914j898P89L452M259K869m0l897
$$ -39 -4342 -5808 -4220 -378 3978 5817 4742 1178 -3736 -5634 -4845 -1393 2866 5735 5695 1798
5627A798m199l126k2L299M209L083P98k964m247l465q06K111M240M047J159j929
$$ 1798 -2401 -5527 -5549 -2250 1959 5042 5840 2876 -1371 -4836 -5642 -3531 709 4756 5915 3986
5643C986m206l956j839J569L963M193K113j204m143l682k590Q44L376M622K781
$$ 3986 -220 -4176 -6015 -4446 -483 3710 5823 4619 476 -3206 -5796 -4952 -1576 3046 5827
5658E827o11k990m415l362j60K854M830L149M77k461m174l553j552K364M368M025
$$ 5827 5216 2226 -2189 -5551 -5711 -2857 1973 5122 5599 3138 -1036 -4589 -6141 -3777 591 4616
5674D616J312j797m135l896k268J700L720M274K360p53m011m321k322K79L417
$$ 4616 5928 4131 -4 -3900 -6168 -4468 -748 3526 5886 5133 1122 -3199 -5521 -5242 -1825
5689a825M132L260k91k989m218l330k86K620M478L558P98k286m552l853q34J936
$$ -1825 2307 5567 5276 2287 -1931 -5261 -5547 -2927 1551 5109 5907 3621 -931 -4784 -5618 -3682
5705c682M080L901J668j790l914m325j769J219L783M279K378r72l749l820k714
$$ -3682 398 4299 5967 4177 263 -4062 -5831 -4612 -829 3450 5828 4856 1107 -2713 -5427
5720e427M35L065M400L031j2l164m088l343o41K811M157L613R28k275m099l898
$$ -5427 -4992 -1927 2473 5504 5492 2328 -1760 -5103 -5744 -2933 1224 4837 5765 3490 -609 -4507
5736d507j665K241M096M130J734j751l587m545k077J183L541M391K692q66l230
$$ -4507 -6172 -3931 165 4295 6029 4278 691 -3854 -5931 -4748 -1207 3184 5876 5010 1780
5751A780m382l141M80L042M333L297p0k794m135l491m40K435M158L621J226k376
$$ 1780 -2602 -5743 -5263 -2221 2112 5409 5339 2545 -1590 -5081 -5521 -3086 1072 4693 5919 3543
5767C543l874m080j381J857L687M175K150j620m040m140k047J081L427M687K289
$$ 3543 -331 -4411 -5792 -3935 -248 3927 6077 4457 417 -3723 -5770 -4689 -1262 3425 5714
5782E714l85l339m382k727j32L110M027L236K07k358m432l109j166K314M245L817
$$ 5714 5329 1990 -2392 -5119 -5251 -2141 1886 5122 5329 2971 -1461 -4570 -5736 -3422 823 4640
5798D640J056j960m126l875j773J593M220L857K151r86m187l783k361O06L637
$$ 4640 5696 3736 -390 -4265 -6038 -4445 -225 3632 5783 4797 610 -3173 -5534 -4928 -1291
5813a291L912L149k91l709l882l082j98K933M217L384L90k456m079l592j107K136
$$ -1291 2621 5770 5479 1770 -2112 -5194 -5392 -2459 1758 5142 5532 3076 -1003 -4595 -5702 -3566
5829c566M094L866J332j655m088l864k097J382M228L856K054q51l762m065k131
$$ -3566 528 4394 5726 4071 -17 -3881 -5978 -4596 -368 3488 5542 4691 929 -3136 -5267
5844e267O73K937M133K941k36k983m486k900m30L077M167L385O72k522m292l461
$$ -5267 -4594 -1657 2476 5417 5181 2198 -2288 -5188 -5618 -2541 1626 5011 5683 3161 -1131 -4592
5860d592q97J799M025M118J281j760l758l916k047J244L878M153J986j129l046
$$ -4592 -5489 -3690 335 4453 5734 3974 216 -3700 -5747 -4503 -625 3528 5514 4385 1339
5875A339m267k730P12L230M419K673j05k955m280l527j61K768M456L203P99k342
$$ 1339 -2928 -5658 -4946 -1716 2703 5376 5271 2316 -1964 -5491 -5652 -2884 1572 4775 5574 3232
5891C232m058l427j393K001L778M093J534j989l571m043j739J032L683M185K558
$$ 3232 -826 -4253 -5646 -3645 133 4226 5760 3771 200 -3843 -5582 -4550 -867 3318 5876
5906E876r52l607m468k199O09K832M316K832P6k728m256l369j95K316M057L570
$$ 5876 4924 1317 -3151 -5350 -4741 -1909 2407 5239 5315 2587 -1669 -5038 -5233 -2917 1140 4710
5922D710N27j815m276l609r89J284M321L716J756j217l771l968k391R69L573M139
$$ 4710 5237 3422 -854 -4463 -5452 -4168 153 3869 5625 4408 637 -3331 -5722 -4753 -1180 2959
5938B959K620q38l103l945k668L8K482M333L099N00l330l928l139o49K203M250
$$ 2959 5579 4741 1638 -2307 -4975 -4937 -2455 1878 4977 5477 2147 -1781 -4920 -5569 -3366 884
5954H84L705J056k040m082l474j404J163L950L765J958j072l547l925k125L61
$$ 884 4589 5645 3605 -477 -3951 -5355 -4192 -242 3523 5481 4409 862 -3063 -5188 -4827
5969d827L009M687K824p52l058m308k492k07K816M123L378K4k438m034l258q68
$$ -4827 -1818 2869 5693 4941 1883 -2425 -4917 -5124 -2308 1815 5193 5217 2779 -1255 -4513 -5381
5985e381J919M506L070J483k054l774l667j630J382L657M208J895r77l709l914
$$ -5381 -3462 1044 4114 5597 3543 -231 -3898 -5528 -4146 -489 3719 5614 4637 928 -2986
6000b986k652Q27L293L993K963m33l367l768k781m82L076M143L016O56k687m081
$$ -2986 -5638 -4811 -1518 2475 5438 5005 1638 -2130 -4911 -5393 -2317 1826 4842 5498 2811 -1270
6016a270l621o62K025L974L751J248j747l685l806j630J524L660L487K039q20
$$ -1270 -4891 -5553 -3528 446 4197 5445 3698 13 -3793 -5423 -3899 -239 3248 5287 4467
6031D467l523l877k491O50L189M373K413k20l096l878l125j19K424M221L476N97
$$ 4467 944 -2933 -5424 -4774 -1585 2788 5201 4981 1885 -1993 -5118 -5237 -2813 1408 4884 5481
6047E481k828l737l295j237K095M041L351J466j414l675l839j824J226L669M131
$$ 5481 2653 -1084 -4379 -5616 -3521 520 3871 5337 3923 248 -3591 -5415 -4189 -520 3611
6062C611J709q72l438l784k128M9L200M173K445K1k959m007k703n71K644M421
$$ 3611 5320 4448 1010 -2774 -4902 -4853 -1653 2520 4965 4986 2027 -1980 -4683 -5254 -2610 1811
6078A811L041L32j974m074l311j152J871L814L543J327j370l625l803j533J098
$$ 1811 4852 5184 3210 -864 -4175 -5327 -3456 358 3901 5228 3858 233 -3570 -5103 -4005
6093d005L272L807K090n14l251l747k933L51L106L834L014J6k760l915l420l3
$$ -4005 -733 3074 5164 4650 1399 -2348 -5281 -4930 -1824 2010 5024 5040 2280 -1635 -5055 -5088
6109e088K251L853L573R80k290m030l539j067J745L610L781J450j276l449l841
$$ -5088 -2837 1016 4589 5569 3279 -751 -4290 -5357 -3612 -2 3779 5229 3953 504 -3337
6124c337k027J002L297L838K214o80k952l909k713J23K893M139K840L48k659l810
$$ -3337 -5364 -4362 -1065 2773 4987 4307 1355 -2554 -5267 -5144 -2251 1888 4728 5076 2417 -1393
6140a393l100o68K131L970L225J210k249l839l348j390J873L474L674K018j470
$$ -1393 -4493 -5161 -3030 940 4165 5375 3126 -713 -4061 -5451 -3578 -104 3570 5588 4118
6155D118l446l808k134Q28L301L965K478k80l503l759k808K27K640L563L160P69
$$ 4118 672 -3136 -5270 -4442 -1141 2824 5302 5022 1519 -2240 -5048 -4821 -2181 1382 4542 5311
6171E311k797l837l360o45K437L715L090J296j731l626l621j562J449L467L907
$$ 5311 2514 -1323 -4683 -5328 -2891 824 3914 5210 3479 -147 -3768 -5330 -3881 -414 3493
6186C493J589r59l253l912k072N55K963M280K301Q9l689l631k247m86K791L785
$$ 3493 5082 4123 870 -3042 -5114 -4559 -1596 2684 4985 5074 1385 -2246 -4493 -4979 -2188 1597
6202A597K892L57k178l759l115j024K107L573L607J085j366l610l842j256Q10
$$ 1597 4489 4846 2668 -1091 -4206 -5230 -3123 450 4057 5142 3776 166 -3676 -4932 -4122
6217d122L318M149J860l79l894m184j651P1L204L841K937N8l017l842k949l29
$$ -4122 -804 3345 5205 4826 932 -3252 -4903 -4832 -1628 2213 5150 5208 2191 -1651 -4600 -4929
6233d929K438L636L380O86k101m126l039j042J717L763L450J543j605l559l661
$$ -4929 -2491 1145 4525 5211 3110 -1016 -4055 -5097 -3380 383 3833 5376 3771 212 -3449
6248c449j695R03L472L869K022q73k968m026k281L75K662M237K652J09k394m145
$$ -3449 -5144 -4241 -769 3100 5122 4249 1281 -2745 -5026 -4651 -1989 2248 4900 5009 2615 -1530
6264a530l177l71K552L559L254J020k361l491l486j051J413L597L748J471j627
$$ -1530 -4707 -5078 -2526 1033 4287 5307 2946 -545 -4031 -5082 -3669 -72 3676 5147 3520
6279C520l020l829j855R24L185L889K170o03l127l620k702M55K659L909K957k33
$$ 3520 500 -3329 -5184 -4260 -1075 2814 4984 4381 1254 -2366 -5068 -4613 -1954 1955 4912 4679
6295D679k234l989k713j057K636L373L330J222j991l909l373j182J380L589L849
$$ 4679 2445 -1544 -4257 -5314 -2678 695 4025 5247 3256 -653 -4026 -5208 -3828 -239 3610
6310C610J590j453k868m385j682J061L161L811J975m68k918l580k779L27K602
$$ 3610 5200 3747 879 -3506 -5188 -4127 -966 2845 4820 4352 1434 -2146 -4925 -4598 -1996
6325a996L882K653L72k430l833l102m43K151L402L376J134j737l840l612j302
$$ -1996 1886 4539 4911 2481 -1352 -4454 -4897 -2746 656 4032 5166 3429 -411 -4023 -5325
6340e325K051L016L792J338j074l320l597j937Q91L259L709J982j14k994l792
$$ -5325 -3274 -258 3534 4872 3798 478 -3119 -5056 -4165 -906 2803 4785 4671 1677 -2115
6355b115k742m8K731L895K906k7k187l600k892r33K131L468L441Q80j451l773
$$ -2115 -4857 -4905 -2174 1721 4627 4600 2413 -1187 -4079 -5012 -2881 587 4028 4908 3457 -316
6371c16l282j214R93L462L921J621r85l332l729k183M93L534L739K444n45l154
$$ -316 -3598 -4812 -3819 -357 3564 5185 4200 868 -2861 -5044 -4551 -1017 2722 5166 4621 1467
6387A467l897k342j4K653L865K547M67k148l769l021q69J883L819L440O42j260
$$ 1467 -2430 -4772 -4786 -2133 1732 4279 4746 2598 -1171 -4192 -5061 -3178 641 4081 4723 3463
6403C463l426l605j473J138L415L761K001j040l187l631k406N32L137L842J870
$$ 3463 37 -3568 -5041 -3903 -488 3273 5274 4234 1047 -2584 -4990 -4458 -1321 2521 4391
6418D391J37k738l490k981k07K583L858K818O85k304l803k778j006J641L604L452
$$ 4391 4528 1790 -1700 -4681 -4888 -2305 1553 4371 5056 2752 -1051 -3829 -4835 -3194 410 3862
6434C862J218j730l421l565j291J181L065L872J951j188k849l605k327N74K700
$$ 3862 5080 3350 -71 -3636 -4927 -3746 -681 3191 5142 3954 1105 -2500 -4827 -4253 -1553
6449a553L495K615K94k614l820k777m31K094L749K908R50k209l582l007r65J488
$$ -1553 1942 4557 4851 2237 -1583 -4360 -4791 -2697 1052 3960 4910 2701 -881 -3888 -4853 -3365
6465c365L673L346J234j439l192l453k150J089L568L472J616l54k912l478k261
$$ -3365 308 3654 4888 3449 257 -3196 -5346 -4257 -689 2783 4399 4045 1133 -2345 -4606
6480d606K00K577L953K674M6k371l566l189o26K038L700L129Q91j804l410l475
$$ -4606 -4406 -1829 2124 4798 4844 2473 -1093 -4282 -4908 -2870 830 3959 4850 3046 -364 -3839
6496c839r04J345L436L543J141q59l480l165j991R54K812L379K496n75k888l578
$$ -3839 -4743 -3398 38 3581 4722 3863 383 -2782 -4773 -3819 -1007 2372 4868 4293 1405 -2173
6512b173k352n2K780L525K579M07k468l424l118l67J837L831K878P31j864k899
$$ -2173 -4525 -4577 -1797 1728 4307 4714 2246 -1178 -4296 -4663 -2826 1005 3883 4614 2750 -149
6528a49l528j256J423L436L381J682j175l148l524j909Q95K857L366K391m19k682
$$ -149 -3677 -4933 -3510 -74 3307 4989 3814 666 -2858 -4767 -3872 -1015 2351 4742 4323 1641
6544A641l762k202m02K863L297K738N66k523l454l032o37K269L412K981Q10j223
$$ 1641 -2121 -4323 -4725 -1862 1435 4173 4739 2216 -1238 -4270 -4907 -2638 774 3755 4565 3342
6560C342l492l274j394J340L038L523J396n50l103l733k003M79L103L545K270
$$ 3342 -150 -3424 -4818 -3478 -440 3083 4479 3929 826 -2907 -4910 -4431 -1328 2217 4487
6575D487j33k419l803k379m96K461L611K817K01j660l335l147j070J960L314L231
$$ 4487 4354 1935 -1868 -4247 -4743 -2282 1329 4146 4347 2687 -648 -3795 -4865 -2905 409 3640
6591C640J285j519l341l370j650J442L172L382J885q80l070l271k376M54K452
$$ 3640 4925 3406 65 -3305 -4955 -3513 -341 3041 4926 4046 976 -2295 -4671 -4217 -1765
6606a765L963K496j41k704l840k332OK248L308K703N52j676l479k920j197J749
$$ -1765 2198 4694 4553 1849 -1991 -4323 -4317 -2069 1239 3942 4494 2818 -661 -3581 -4778 -3029
6622c029L472K872J305j215l233l209j867J083L073L499K059r78k649l395k039
$$ -3029 443 3315 4620 3405 172 -3037 -4904 -3821 -748 2751 4810 3832 1183 -2212 -4251
6637d251k12K759L364K906O4k651l361k751m28J972L545K899Q17j761l396l396
$$ -4251 -4463 -1704 1660 4566 4630 1979 -1382 -4133 -4561 -2589 956 3855 4672 2911 -485 -3881
6653c881o23J249L525L102J344j273k914l530j493R91K707L146K369o82k501l941
$$ -3881 -4504 -3255 270 3372 4716 3443 529 -3001 -4494 -3503 -796 2350 4719 4037 1536 -2405
6669b405j997K85K453L589K317L73k435l159k995l71J904L232L049Q07j827l154
$$ -2405 -4402 -4117 -1664 1925 4242 4615 2180 -979 -3974 -4345 -2441 791 3840 4647 2820 -334
6685c34l363p87J049L307L385J304q72k881l492j880N13K819L738J710K41k962
$$ -334 -3697 -4484 -3435 -128 3257 4561 3689 808 -2684 -4564 -4051 -1232 2506 4216 4457 1495
6701A495l508k471Q8K370L806K393J29j943l452k520q68J798L125L355P68j484
$$ 1495 -2013 -4484 -4396 -2026 1780 4173 4302 2359 -1093 -3613 -4481 -2683 442 3797 4565 3081
6717C081l192l290j313J213L172L291J696j077l103l454j480Q37J909L772K104
$$ 3081 -111 -3401 -4714 -3501 -329 2962 4658 3581 478 -2976 -4456 -3619 -1710 2062 4166
6732D166m7k318l388k973K18K397L426K270R36k237l318k809j010K115K854L426
$$ 4166 4119 1801 -1587 -4560 -4342 -1945 1481 3751 4687 2450 -868 -3677 -4687 -2572 282 3708
6748C708J097j490l450l023j340J054K887L330J861n57l243l023k048K28K824
$$ 3708 4805 3315 -135 -3158 -4498 -3444 -557 2773 4634 4077 834 -2189 -4237 -4009 -1185
6763a185L644J948m76k301l350k383n5J998L184K678N48j778l233k917o17J434
$$ -1185 2459 4407 3931 1630 -1720 -4103 -4158 -2160 1024 3702 4250 2472 -761 -3678 -4295 -2861
6779b861L256K740J294j226l251k933j917J485L013L245J618p76k661l664j315
$$ -2861 395 3135 4429 3203 -48 -2981 -4898 -3413 -400 2845 4463 3687 1026 -2638 -3953
6794c953n8K952L171K120j32k341l450k555j16K079L747K347N75j906l413k496
$$ -3953 -4011 -1059 2112 4232 4100 1759 -1691 -4246 -4362 -2283 1464 3811 4386 2480 -933 -3429
6810c429q06J531K888L227J234j553l006l258j080O43K966L473J548r10k651l108
$$ -3429 -4235 -2704 184 3411 4645 3092 86 -3172 -4252 -3609 -643 2830 4378 3468 817 -2291
6826b291k075O23K158L679K316j47k698l244k420k78K190K898K602J056k091l107
$$ -2291 -4366 -3743 -1585 2094 4410 4263 1565 -1679 -4099 -4377 -2187 711 3313 4369 2278 -829
6842h29k814o76J686K738K959J368j006l236l242j145P64L105K786K269j229k361
$$ -829 -3643 -4319 -2633 105 3064 4432 3426 190 -3052 -4197 -3433 -328 2458 4727 3498 1137
6858A137l230k112L59K454K941K466K93k592l012k569j03J727L282K894K54j380
$$ 1137 -2093 -4205 -3846 -1392 1549 4015 4308 1716 -1296 -3865 -3968 -2241 1041 3935 4189 2809
6874B809l363k928r01J532L328K800J201j447k965k709j894J232K588L219J697
$$ 2809 -554 -3482 -4383 -2851 477 3277 4478 3031 66 -2643 -4537 -3305 -717 2502 4199
6889D199m69k376l029k130m5K413L082K620j48k021l892k194l59K135L174K553
$$ 4199 3730 1354 -1675 -3805 -3850 -1437 1645 4265 4117 2096 -1796 -3990 -4349 -2214 960 3513
6905C513R73j925l175k702r50J340K988K772J613j200k534l529j345N00K962L083
$$ 3513 4486 2561 -614 -3316 -4266 -2926 62 2834 4447 3247 713 -2816 -4161 -3661 -699 2384
6921B384J885m42k752k981k377N45K389L003K364j6j850l549k406k91J654L134
$$ 2384 4269 3827 1075 -1906 -4283 -3738 -1349 1654 4018 4002 2152 -1397 -3803 -4094 -2440 694
6937F94K843O85j441l286k847j162J461K840L266J038m23l171l095j776O87K766
$$ 694 3537 4222 2781 -505 -3352 -4514 -3053 -213 3053 4091 3668 497 -2598 -4374 -3687 -921
6953i21K881K005j6k581l165k234p9K286L039K526K53j954k953k750q06J834L345
$$ -921 1960 3965 3949 1368 -1797 -4031 -4110 -1824 1215 3741 3994 2040 -913 -3663 -4469 -2635 710
6970G10K662R95j229l382k402j828J350K656L488J048q73k338l199j915M74K639
$$ 710 3372 4367 3138 -244 -2646 -4474 -3124 -468 3020 4068 3195 857 -2342 -4257 -3783 -1144
6986a144L023K152j65k189l336k380j64K524K721K743L63j566l375k710n69J407
$$ -1144 1879 4031 3866 1677 -1659 -4039 -4203 -1679 1042 3785 4148 2582 -793 -3503 -4072 -2665
7002b665L107K850Q95j278k663l254j191J353K571K702K081r88k841k674j854
$$ -2665 442 3292 4187 2909 246 -3008 -4199 -2846 -275 2427 4508 3520 679 -1995 -3849
7017c849l9K350L484J835J77k116l135k448k43J822L050K512O72j581l126k681
$$ -3849 -3888 -1538 1946 3781 3958 1842 -1293 -3741 -3984 -2162 888 3400 4072 2491 -635 -3316
7033c316o99J019L121L045J237j407k714l091j283R09K288L269J744n66k398l203
$$ -3316 -4015 -2996 125 3170 4407 3000 286 -2805 -4088 -3179 -891 2378 4122 3556 1158 -2045
7049b045j899K56K296L097K253j32k232k840k433m34J941L160K365N41j288l228
$$ -2045 -3944 -3688 -1392 1705 3958 3826 1594 -1246 -3679 -4113 -2172 988 3353 3894 2606 -622
7065f22k806o31J281K934L007Q25q98k779k802j489L89K619K992J934j03k714
$$ -622 -3428 -4059 -2778 156 3163 3988 3090 311 -2491 -3980 -3591 -972 2020 3954 3851 1137
7081A137l055k204J71K577K980K396j84k057k974k400l90J736L072K538R23j775
$$ 1137 -1918 -4122 -3951 -1374 1606 4002 3818 1761 -1213 -3613 -4003 -2267 805 3343 4266 2491
7097B491k875k520j235J458K530K986J140q09k974k536j740Q86K454K802K082
$$ 2491 -384 -2904 -4139 -2681 -151 2835 3975 3166 192 -2344 -4084 -3198 -744 2058 4140
7112D140o44k074l141k028j25K167L156K336k61j096l561k489n07J460L281K748
$$ 4140 3496 1422 -1719 -3747 -3872 -1705 1451 3787 3526 2430 -1131 -3620 -4127 -2667 614 3362
7128C362P68j338k744l163j242R84L228K792J358r20k555k927j639O24K342L182
$$ 3362 4130 2792 48 -3115 -4357 -3373 -145 2647 4005 3085 530 -2397 -4036 -3412 -1070 2112
7144B112J681m3k217l287k153p1K219L054K332M01k049k682k903o40J925K750
$$ 2112 3793 3750 1533 -1754 -3907 -3978 -1759 1295 3627 4028 1979 -703 -3606 -4246 -2321 429
7160D29K733J066j404k964k650j294Q55L004K668J524p52k274k967j852L76K112
$$ 429 3162 4228 2824 -140 -2790 -4084 -3229 -225 2443 3967 3215 941 -2026 -3878 -3502 -1390
7176a390L290J959m81j881k965k414pK054K757K499P86k073l011k629n97J271
$$ -1390 1900 3859 3378 1497 -1468 -3882 -3889 -1835 922 3421 4207 2134 -877 -3506 -4103 -2832
7192b832L113K458J335j010k970k777j022M39K625L065J567p67k535k802j836
$$ -2832 281 2739 4074 3064 94 -2683 -3705 -3266 -641 2424 3991 3224 689 -2113 -3949
7207c949K07K804K639K135J9j995l141k347k34J732L053K628N29j762k774k524
$$ -3949 -3742 -938 1701 3836 3855 1860 -1281 -3628 -3862 -2130 923 3551 4080 2318 -456 -2980
7223b980j072J422K785K773J235j241k485l088j318P66K523K837J973n81k437
$$ -2980 -4052 -2630 155 2928 4163 2922 437 -2651 -3969 -3203 -680 2157 4130 3549 1112
7238A112l117j792J92K338K881J831J14j668k940k712q5J671K626K660P65j452
$$ 1112 -2005 -3797 -3605 -1267 1614 3445 3559 1891 -1049 -3761 -3846 -2175 451 3111 3876 2424
7254B424k718k714j229J346K752K800J492j158k580k897j418O90K309L030J672
$$ 2424 -294 -3008 -4237 -2891 -139 2661 4153 2995 415 -2482 -3900 -3210 -901 2129 3801
7269C801q9k577k965j847p3K503K548K237J71j640l046k431n16J728K899K337
$$ 3801 3712 1135 -1830 -3677 -3750 -1247 1301 3538 3709 2069 -977 -3408 -3924 -2196 703 3040
7285C040P58j372k496k928p60Q29K715K904J250o93k850k376j932O11K382K713
$$ 3040 3798 2426 -70 -2998 -3758 -2929 -214 2690 3940 3247 397 -1979 -3911 -3300 -918 1795
7301A795J648K5k310k829k009J09J733L232K027L00j811k644k625l18J354K674
$$ 1795 3443 3468 1158 -1671 -3680 -3571 -1838 1394 3421 3721 1910 -734 -3359 -3677 -2323 351
7317C51K767M05r57k381k814j519J315K699K771R59l28k646k910j525O51K098
$$ 351 3118 3523 2566 185 -2629 -4148 -2833 -134 2637 3596 3268 622 -2288 -3813 -3162 -1064
7333a064K645K089j94k040k654k400K66J679K673K192O11j506l080k441m74J161
$$ -1064 1581 3670 3476 1436 -1218 -3618 -3352 -1673 1000 3192 3803 2297 -783 -3224 -3698 -2537
7349b537K629K546J191j082k812k511j071L59K719L087J719j149k580k522j814
$$ -2537 92 2638 3829 2747 -65 -2576 -3647 -3288 -569 2518 4237 3088 508 -2014 -3828
7364c828P91J910K729K174m82j798k698k158l28J882K707K475L64j494k909k409
$$ -3828 -3037 -1127 1602 3776 3294 1496 -1202 -3360 -3688 -1806 901 3376 3740 2246 -663 -3072
7380c072o20J143K730K337J121n18k981k486j349O05K577K310J899m91k105k949
$$ -3072 -3692 -2549 181 2518 3639 3121 140 -2346 -3695 -3090 -513 1797 3696 3205 1100 -1849
7396a849j998O83J849K944J889J37k159k598k269k0J512K599K280R62j695k855
$$ -1849 -3847 -3164 -1315 1629 3518 3655 1496 -1102 -3371 -3391 -1879 720 3000 3962 2267 -588
7412e88k367q41J196K539L062O17p88k884k268j487O76K347L250J160k91k322
$$ -588 -2955 -3796 -2600 -61 3001 3618 2830 -54 -2322 -3809 -3133 -786 2464 3624 3333 1011
7428A011k903j948M67J990K787J953K21j548k926k227m91J632K774K072O89j219
$$ 1011 -1892 -3840 -3373 -1383 1404 3357 3578 2030 -896 -3123 -3614 -1982 792 2864 3553 2334
7444B334k967k126j025J236K374K648J048n44k611k532j602O48K641K316J487
$$ 2334 -633 -2759 -3784 -2548 -174 2474 3522 2978 367 -2165 -3767 -3119 -478 1838 3325
7459C325K69k518k559j859j31K012K582K549j13j724k926j798m67J527K122K458
$$ 3325 3594 1076 -1483 -3342 -3473 -1461 1121 3670 3557 1833 -1093 -2891 -3358 -1831 291 2749
7475B749R00j166k535k471j284J272K082K675J346n84k215k697j467L9K360K639
$$ 2749 3649 2483 -52 -2523 -3807 -2535 -453 2222 3568 2984 769 -1928 -3395 -3356 -996 1643
7491A643J725r6j786l349j090l61J740K565K239K43j498k758k312k25J306K681
$$ 1643 3368 3272 1486 -1863 -2953 -3314 -1574 991 3230 3473 1975 -783 -3095 -3320 -2014 667
7507F67J968P47j052k114k689j197J093K093K876J187n74k252k471j634L77J638
$$ 667 2635 3382 2330 216 -2473 -3670 -2577 -484 2392 3579 3005 753 -1718 -3352 -2975 -1337
7523a337K953J668P0j896k445k025m08J741K343K300J96r71k733k309o10J359
$$ -1337 1616 3284 3354 1458 -987 -3012 -3420 -1679 664 2964 3160 2189 -544 -2853 -3463 -2104
7539b104K280K483P85r46k414k149j464O35K619K318J169m25j715l094j584L44
$$ -2104 176 2659 3444 2498 84 -2065 -3529 -2894 -275 2043 3212 2787 1072 -2022 -3606 -3262
7555c262J900K661K093n0j854k668j874k76J181K905K021O64j271k460k370p74
$$ -3262 -1362 1299 3392 3342 1488 -1180 -3054 -3330 -2149 756 2777 3441 2170 -290 -2660 -3434
7571c434R03K090K545J247n77k329k652j287N19K132K643J846q23j796k806j394
$$ -3434 -2531 -441 2104 3351 2774 445 -2207 -3494 -2975 -843 1800 3646 2823 1027 -1779 -3173
7587c173k7J747K808J722J23j423k493k380n21J435K858K151O22j241k370k336
$$ -3173 -3200 -1453 1355 3077 3200 1777 -716 -3096 -3617 -2182 676 2827 3449 2208 -162 -2498
7603b498r91J120K242K568J050p93k439k431j204N50K284K147J492j36j739k544
$$ -2498 -3489 -2369 -127 2441 3491 2698 259 -2172 -3376 -2826 -542 1605 3097 2961 1222 -1322
7619a322j959L60J737K275J925J82j582k525k075l55J422K376K060P78r95k678
$$ -1322 -3281 -2921 -1184 1091 3016 3198 1616 -909 -2984 -3339 -1917 459 2519 3297 2302 -376
7635c76j832j291J175J992K366J395p05k229k373j400P04J603K532J642j41j732
$$ -376 -2208 -3499 -2324 -332 2034 3429 2724 495 -1878 -3278 -2574 -971 1561 3203 3062 1330
7651A330l024j360l1J606K640J741M64j600k563j878o44J125K414K261O75j027
$$ 1330 -1694 -3054 -3085 -1479 1161 2902 3366 1766 -797 -2675 -3319 -2194 220 2481 3156 2129
7667B129k209j805j249O41K309K190J051m15k162k303j617N77K023K377J454j97
$$ 2129 -80 -1885 -3134 -2493 -184 2006 3057 2642 480 -1823 -3440 -2863 -840 1537 2991 2794
7683B794j495k434j684k07J408K590J893K82j250k442k072o30J593J815K297R42
$$ 2794 1299 -1135 -2819 -3026 -1618 972 2865 3147 1897 -545 -2617 -3247 -1654 161 2458 3400
7699C400q48k195k329j211Q42K066K251J354o66j594k832j391K34K053K174J750
$$ 3400 2552 357 -1972 -3183 -2341 -275 1976 3330 2664 1070 -1762 -3153 -2919 -866 1308 3058
7715C058j08j770k214j661k31J231K671J546P00j611k034k198m41J050J758K455
$$ 3058 2950 1180 -1034 -2695 -2926 -1695 976 2522 3222 1611 -423 -2621 -3062 -2012 -254 2201
7731B201R97n99k301k349j406R59K082K556Q38n45j391k735j913P07J974K283
$$ 2201 3198 2599 298 -2051 -3457 -2498 -416 2140 2978 2433 1042 -1693 -3606 -2899 -925 1358
7747A358J708j89j603k373j708m46J227K678J601Q00j123k192j958q13J066K175
$$ 1358 3066 2877 1274 -1099 -2807 -3253 -2026 652 2253 3053 1930 -262 -2220 -3033 -1967 208
7763B08J886P41n20k251k346q77O40J862K379J061J93k204k184j548J82K050J832
$$ 208 2094 2835 2315 64 -2282 -3159 -2519 -657 1722 2783 2976 772 -1412 -2960 -2778 -728 1104
7780A104J607L20j469k555j667m93J462K381J859M16j000k429j808p38P81K237
$$ 1104 2711 3031 1562 -993 -2660 -3153 -1691 690 2549 2965 1965 -464 -2272 -3010 -2229 8
7796HJ883J184n28k333j947j211L81K034K334J410m70j785k139j663K13J265K525
$$ 8 1891 3075 2547 214 -1733 -2944 -2563 -529 1805 3215 2745 960 -1179 -2842 -2629 -1364 1161
7813A161J015O54j288k306j727n08J597J768J676Q30q01j894k570o11Q13J893
$$ 1161 2176 2830 1542 -764 -2491 -2999 -1402 366 2042 2872 2071 177 -2393 -3004 -2191 -298
7829b98K138J217n85j707k248j464O18J778J908J395K74j993k218j519o0J500
$$ -298 1840 3057 2472 765 -1483 -2947 -2329 -551 1357 2752 3026 1033 -1185 -2704 -2764 -1264
7845a264J977J857L81j310k587j572n43J146K217J873Q56q05j971k223r74J005
$$ -1264 713 2570 2951 1641 -946 -2518 -3061 -1915 302 2175 3031 2226 255 -1968 -2942 -1937
7861a937J758J939R90l70j708k432j081K01J884K423J007j02j392k450j060m93
$$ -1937 -179 1760 2750 2380 672 -1760 -2841 -2640 -756 1667 2674 2572 1180 -1270 -2330 -2823
7877b823J744J996J690J07j148k131j769p43J451J728J789J264j259j966j879
$$ -2823 -1079 917 2607 2714 1566 -565 -2334 -3077 -1626 102 1891 3155 1896 -70 -1949
7892a949p44M84J854J777J262l40j482k026j287J2J756J729J737k44j636j821
$$ -1949 -2693 -2209 -355 1422 2684 2344 862 -1164 -2451 -2439 -683 1046 2783 2539 903 -918
7908i18j630j79J398K284J464K74j018j982k229n49J364K072J429J225j103j845
$$ -918 -2548 -2727 -1329 955 2419 2693 1675 -307 -2536 -3085 -1721 351 1780 3005 1902 57
7924E7k090j029R89J661J892J232n08j563k002j168j68J720J781J625J38j393
$$ 57 -2033 -3062 -2073 -412 1480 2712 2204 641 -1361 -2529 -2697 -977 804 2429 2567 1174
7940A174k261j512j68J449J701J913N41j386j617k142k87R46J590K021J011j064
$$ 1174 -1087 -2599 -2767 -1318 383 2296 2837 1451 -166 -2308 -2595 -1649 -59 1962 2973 1909
7956A909j727j957p86L34J673K223J020n04j400j757j544r9J820J897J576K2j510
$$ 1909 182 -1775 -2561 -2227 -554 1669 2689 2185 785 -972 -2516 -2615 -795 1102 2678 2700 1190
7973A190j867j662m16J402J982J540N91r09k285j459o79N74K048J863P87r84j425
$$ 1190 -677 -2339 -2755 -1353 629 2169 2760 1851 -434 -1893 -2572 -1998 50 1913 2700 1716 291
7990B91k033p21M27J534K193Q87l11j438j825j490N5R79K401J290L17j136k185
$$ 291 -1742 -2463 -2036 -502 1691 2578 2267 829 -996 -2486 -2431 -1452 949 2239 2556 1420 -765
8007g65j322o54J052K169J485Q09j132j729k170m96J173J510J842Q71o06j643
$$ -765 -2087 -2741 -1689 480 1965 2774 1642 -87 -2257 -2753 -1580 -70 1772 2643 2037 394
8023C94j731j032J10J547J989J445j09j862j846j661L61J278J926J513J18j130
$$ 394 -1337 -2369 -2259 -712 1277 2722 2613 751 -1095 -2756 -2395 -1117 809 2322 2440 1310
8039A310k153j377l69J321J605J525O18p30j747j715j039R20J781J770Q24l56
$$ 1310 -843 -2220 -2589 -1268 337 1862 2480 1750 3 -1712 -2751 -1831 -50 1720 2544 2188
8055B188j714j986r69J36J509K062J398k11j490j855j263N1R35J891J414L72r65
$$ 2188 474 -1512 -2481 -2345 -836 1226 2624 2413 923 -932 -2195 -2144 -1209 682 2096 2468 1503
8072A503k047j488m94Q15K213J458M94p88j999j396r90P74J658J636J308m02j999
$$ 1503 -544 -2032 -2526 -1711 502 1960 2454 1666 -333 -1729 -2719 -1945 -287 1349 2657 2255 256
8089B56j739r83L16J563J676J496k44j161j751j900K24R96J787J707R0j011j985
$$ 256 -1483 -2466 -2150 -587 1089 2585 2341 1180 -571 -2471 -2247 -1251 536 2243 2333 1322 -663
8106f63j269k77N59J848J865L82o00j959j779p09P39J619J699J042m33j340k041
$$ -663 -1932 -2209 -1650 198 2063 2445 1845 -114 -1893 -2602 -1863 -244 1455 2497 2064 724 -1317
8123a317r63N5J631J770J042R9j551j650j351K54Q35J709J433M09p47j650k026
$$ -1317 -2280 -2225 -594 1176 2218 2317 766 -884 -2235 -1981 -1146 563 1996 2405 1658 8 -2018
8140b018m05R03J414J798O31n72j583j708j078P72J648J486J039j33j409j973
$$ -2018 -2423 -1520 -106 1692 2323 1751 168 -1540 -2618 -1846 -198 1288 2327 2194 785 -1188
8156a188j142K52J005J997J515j83j247j836j397k32J244J541J374N60q33j579
$$ -1188 -2330 -2078 -1073 924 2439 2256 1009 -827 -2224 -2456 -1212 329 1703 2263 1430 -149
8172a49j677n25Q86J695J405P60n86j428j921o38N83J043K049M63J18j307k055
$$ -149 -1826 -2351 -1465 230 1635 2395 1809 381 -1540 -2178 -1595 -552 1497 1960 2078 771 -1284
8189a284r22M6
$$ -1284 -2206 -2160
8191b160
$$ -2160
$$ Imaginary data points
##PAGE= N=2
##DATA TABLE= (X++(I..I)), XYDATA
0@%%%Qj6QqJ6k4L2l2M6o2P2r1J07j28J56j79K13k50K87l38L89m47N15n83O66p55
$$ 0 0 0 0 8 -8 0 -8 8 -16 16 -16 30 -32 40 -51 56 -72 84 -95 118 -132 155 -183 206 -241 274 -309 357 -398
29c98Q50r62J077j208J357j511J687j875K080k314K562k837L143l478L854m268
$$ -398 452 -510 567 -641 716 -795 892 -983 1097 -1217 1345 -1492 1651 -1827 2027 -2241
45b241M734n267N861o548P347q284R417j0799J2541j4816J7916k2440K9673m3123
$$ -2241 2493 -2774 3087 -3461 3886 -4398 5019 -5780 6761 -8055 9861 -12579 17094 -26029
59b6029P6602l09745o89921K66031N36369M15692J05778L6993j30410l83514n08569
$$ -26029 50573 -259172 -949093 -683062 -146693 268999 374777 411770 281360 -102154 -610723
70f10723j80264K85979N38508M19480J48760j87873m44950m79207j70413K36835
$$ -610723 -790987 -505008 33500 452980 601740 413867 -31083 -510290 -680703 -443868
80d43868M56092L90933K01264n6105l37002m88748l03915J04979M06003M11764
$$ -443868 12224 403157 604421 548316 211314 -277434 -581349 -476370 -70367 341397
90C41397K52919L6665k51638n14255m52365j0781M31042M75602K07508l5721j60892
$$ 341397 594316 630981 379343 -134912 -587277 -598058 -167016 308586 516094 480373 319481
101C19481l09367m24774k58472J84874N17575M39704Q3543k32650l74764l66424
$$ 319481 10114 -414660 -673132 -488258 29317 469021 552564 319914 -54850 -421274
111d21274k03467J05102L85087M24911K09091q9661l14078l93226k77115K5475
$$ -421274 -624741 -519639 -134552 290359 499450 409789 95711 -297515 -574630 -549155
121e49155L42292M44334K81154k912k52469l93523l47345o7241L03014M69367
$$ -549155 -206863 237471 518625 515713 263244 -130279 -477624 -544865 -241851 227516
131B27516L04609l993k14069k93997l11722k07194R2880M19521M62550J52300
$$ 227516 532125 528132 314063 20066 -291656 -498850 -405970 13551 476101 628401
141F28401k34990m02424l24301j39986P0886K76145L72283K50668m5450l21186
$$ 628401 393411 -9013 -333314 -473300 -402414 -126269 246014 496682 451232 130046
151A30046m06422k65655J9064K95506M02655K70737p079k55207l54527k83273
$$ 130046 -276376 -542031 -522967 -227461 175194 445931 438852 183645 -170882 -454155
161d54155p2595K03451L91171L47769Q7233k05249l49140l01866j21890J21494
$$ -454155 -526750 -323299 67872 415641 502874 297625 -51515 -353381 -475271 -353777
171c53777L33576L82194J92380j28375l55868l52069j60329Q5696K79926L45410
$$ -353777 -20201 361993 554373 425998 70130 -281939 -442268 -356572 -76646 268764
181B68764K32262k8973k88299l78632k49902P742K49005L53959K67197K6196k35244
$$ 268764 501026 472053 183754 -194878 -444780 -437038 -188033 165926 433123 459319 224075
192B24075l63297k88040o2100J90277L40629L06278R8503j68492l36130l12868
$$ 224075 -139222 -427262 -489362 -299085 41544 347822 446325 277833 -58297 -371165
202c71165j22478J28013L12769L35761J74683r1941l09689l40311j73599P9666
$$ -371165 -493643 -365630 -52861 282900 457583 365642 55953 -284358 -457957 -378291
212c78291K78160L27622K16209j0568k43772l48383k50716k318K42371L42340
$$ -378291 -100131 227491 443700 433132 189360 -159023 -409739 -412057 -169686 172654
222A72654K52378L3701j98675l27629k81048q0309J67402L21101K93299J00901
$$ 172654 425032 458733 260058 -67571 -348619 -428928 -261526 59575 352874 453775
232D53775j45611l10989l06734j39106J01056K84965L13187J69407p2416k78029
$$ 453775 308164 -2825 -309559 -448665 -347609 -62644 250543 419950 347534 69505
242F9505l28734j94935M5780K57788L23450K12924r240k22733l13865k35957k6420
$$ 69505 -259229 -454164 -408384 -150596 172854 385778 376538 153805 -160060 -396017 -422437
253d22437K01648L22870K65756O2695j74069l11298k74545q3220J53537L02879
$$ -422437 -220789 102081 367837 430532 256463 -54835 -329380 -412600 -259063 43816
263D3816K82552J10945j14042k75706k93159j54008P4670K67355L10852J75301
$$ 43816 326368 437313 323271 47565 -245594 -399602 -324932 -57577 253275 428576
273D28576o0113k59373l10706j93711K4563K24989L00073K11365Q327j98551k99822
$$ 428576 368463 109090 -201616 -395327 -370764 -145775 154298 365663 373990 175439 -124383
284a24383k40908n1552J71153L04113K67130P5014j62275l01161k64453q4644
$$ -124383 -365291 -416843 -245690 58423 325553 400567 238292 -62869 -327322 -411966
294d11966J32705K71482K68125J26379q1424k49607k86369j64479N6826K54469
$$ -411966 -279261 -7779 260346 386725 305301 55694 -230675 -395154 -338328 -83859
304h3859L08423J83149m4743k39064k91241j84601J3099J97571K78602K15353
$$ -83859 224564 407713 362970 123906 -167335 -351936 -338837 -141266 137336 352689
314C52689L4686j72979k93545k50294o1054J64676K92096K48340O8820j42931
$$ 352689 387375 214396 -79149 -329443 -390497 -225821 66275 314615 383435 240504
324B40504k69466k52547j04538R8094K50359K69517J38859p1433k45813k82315
$$ 240504 -28962 -281509 -386047 -287953 -37594 231923 370782 299349 53536 -228779
334b28779j59725N1782K32443K83320J79123k2982k09471k77699j92427l236J84946
$$ -228779 -388504 -336722 -104279 179041 358164 335182 125711 -151988 -344415 -347651 -162705
345a62705K72227K14516M2225j54851k69502k36793p0865J38057K72492K52877
$$ -162705 109522 324038 366263 211412 -58090 -294883 -365748 -227691 44801 297678
355B97678Q9157j24538k62310k50067j02870R0798K29886K47280J38591m6722
$$ 297678 386835 262297 -13 -250080 -352950 -262152 -32266 215014 353605 306883
365C06883k16663k75853j79176K7527K21425K82277J75385k5168j97916k55924
$$ 306883 90220 -185633 -364809 -337282 -115857 166420 341805 316637 118721 -137203
375a37203j81744j9875J51737K50795K20149O5843j36282k67978k43922p1147
$$ -137203 -318947 -338822 -187085 63710 283859 349702 213420 -54558 -298480 -369627
385c69627J40157K61930K31817Q0046j01278k23087k29429j19464N7482K13662
$$ -369627 -229470 32460 264277 344323 243045 19958 -209471 -328935 -271453 -57791
395e7791K58723J56098m1378k18866k67549j60830L2766J99525K50322J67346
$$ -57791 200932 357030 315652 96786 -170763 -331593 -298827 -99302 151020 318366
405C18366k522j69046k47075j94701l5008J47803K50615K11323N2311j34632k44805
$$ 318366 315844 146798 -100277 -294978 -329986 -182183 68432 279755 332066 197434 -47371
416d7371k21087p7362J08567K36137K31939R7203r0439k22813k30253j14934N9893
$$ -47371 -268458 -345820 -237253 -1116 230823 328026 237587 14774 -215479 -330413 -270520
427b70520K01680K39068J48448k6365j92422k52365j65700J8390J88802K46808
$$ -270520 -68840 170228 318676 292311 99889 -152476 -318176 -299786 -110984 135824
437A35824J67697L628j54637k28781j83861m3365J24389K31404K13822P2057j17009
$$ 135824 303521 307149 152512 -76269 -260130 -303495 -179106 52298 266120 338177 221168
448B21168k43323k25766p6859J08992K20268K07160Q9475o5906j89782k22576
$$ 221168 -22155 -247921 -324780 -215788 4480 211640 301115 235209 45427 -177149
458a77149j37950L1713J93692K46383J51310l1486j89271k34306j50195Q906J58403
$$ -177149 -315099 -283386 -89694 156689 307999 276513 87242 -147064 -297259 -288353 -129950
469a29950K22737J70574K9760j30620k25044j97870n3794J27844K34918K02364
$$ -129950 92787 263361 293121 162501 -62543 -260413 -314207 -186363 48555 250919
479B50919N7794j07228k06324j99065r0567P0487K01092K21737J13806n9713j95803
$$ 250919 308713 201485 -4839 -203904 -294471 -223984 -22892 198845 312651 252938 57135
490E7135k21325j26973L4677J76981K21866J43545j3341j61629k21816j62506
$$ 57135 -164190 -291163 -256486 -79505 142361 285906 272565 110936 -110880 -273386
500b73386j4950J44236K24153J75602K7523j30477k11542j79637n6375R7884K07195
$$ -273386 -288336 -144100 80053 255655 283178 152701 -58841 -238478 -294853 -196969 10226
511A0226K04652Q2031q9992k07137k02394q9275O7827J88235K08030J14163m4056
$$ 10226 214878 296909 206917 -220 -202614 -291889 -224062 -35827 172203 286366 242310
522B42310j74000k07344j30114J4705J57125K20163J56655k238j58257k14694
$$ 242310 68310 -139034 -269148 -254443 -97318 122845 279500 277262 119005 -95689
532i5689j50681j4551J20938J97019J76044N4316j08586k13191j91485n9631R8646
$$ -95689 -246370 -260921 -139983 57036 233080 287396 178810 -34381 -225866 -285497 -186851
543a86851J95188J86197Q0032o9457j84553j97432j02518M8019J72770K04319
$$ -186851 8337 194534 274566 205109 20556 -176876 -279394 -231375 -58605 145714
553A45714J23835k8881j67753k08274j28688J5502J45249J97274J49615J9684
$$ 145714 269549 240668 72915 -135359 -264047 -248545 -103296 93978 243593 263277
563B63277j28686k08132j65232k6580J20323J95664J67471N2650r2868j90607
$$ 263277 134591 -73541 -238773 -265353 -145030 50634 218105 270755 177887 -12720
573a2720j83258p0409P9968J81038J83359Q9534n1784j71573k00293j11554M2649
$$ -12720 -195978 -266387 -186419 -5381 177978 267512 215728 44155 -156138 -267692 -225043
584b25043J68270J93489J13528k0660j42734j91420j40185o403J33273J97477
$$ -225043 -56773 136716 250244 229584 86850 -104570 -244755 -251158 -117885 79592
594G9592J49996K1403j17614j93533j61841l9150J04731J86818J64161N7783p6423
$$ 79592 229588 250991 133377 -60156 -221997 -261147 -156416 30402 194563 252346 175923
605A75923j73591j80528q4466O4745J78860J85802Q8921n0803j56731j80548j10873
$$ 175923 2332 -178196 -262662 -197917 -19057 166745 255666 204863 48132 -132416 -243289
616b43289K3061J48918J91772J23611j2601j35671j82547j34739j6349J15335
$$ -243289 -220228 -71310 120462 244073 231472 95801 -86746 -221485 -237834 -122499
626a22499J88681J53896K9100j11402j85438j54931m2706Q9825J72413J61863
$$ -122499 66182 220078 249178 137776 -47662 -202593 -245299 -155474 16939 178802
636A78802O3068o9750j63644j70941q5992M9355J62366J84294R7218m4174j53656
$$ 178802 241870 172120 8476 -162465 -248457 -199102 -36736 147558 244776 200602 46946
647D6946j73691j02901J8001J31164J78386J28359K111j27414j81773j33131j3775
$$ 46946 -126745 -229646 -211645 -80481 97905 226264 228375 100961 -80812 -213943 -227718
658b27718J10137J74729J45837L5804r7235j75129j52315m6005P9966J60698J56912
$$ -227718 -117581 57148 202985 238789 141554 -33575 -185890 -231895 -151929 8769 165681
669A65681P0488n9055j59955j69305q3569M7878J49837J70768R7983l1403j45051
$$ 165681 236169 177114 17159 -152146 -235715 -187837 -38000 132768 230751 199348 54297
680E4297j73791j02875J9939J24323J61679J19668J3246j08095j76089j41807
$$ 54297 -119494 -222369 -202430 -78107 83572 203240 216486 108391 -67698 -209505
690b09505k0395J11430J72946J35489L0077q6525j57447j45839n4458O9929J56248
$$ -209505 -229900 -118470 54476 189965 220042 133517 -23930 -169769 -224227 -154298 1950
701A950J55058O9676n3340j49437j64840q5733M5193J46357J61537Q8718k5926
$$ 1950 157008 226684 173344 23907 -140933 -226666 -181473 -35116 126421 215139 189213
712A89213j25505j60774j10841L788J19137J67102J19478P981j06551j64237j32220
$$ 189213 63708 -97066 -207907 -204119 -84982 82120 201598 209579 103028 -61209 -193429
723a93429k5247R8390J64636J34582L2039q0288j46795j40086o1435N7219J50199
$$ -193429 -218676 -120286 44350 178932 210971 130683 -16112 -156198 -217633 -160414 -10215
734a0215J58470P2078n3822j43129j51347q2303L0399J28924J59576J00345j7624
$$ -10215 148255 220333 166511 23382 -127965 -210268 -179869 -50945 108631 208976 191352
745A91352j22968j57663j06973L96J07761J56871J19154J5629r4792j52261j29250
$$ 191352 68384 -89279 -196252 -195856 -88095 68776 187930 203559 108767 -43494 -172744
756a72744l7203P9736J57425J43031M2214p9005j46284j30484n4416M4050J26786
$$ -172744 -209947 -130211 27214 170245 212459 133454 -12830 -143314 -197730 -153680 -26894
767b6894J50773Q8756l5738j43277j59806q0205L6048J22339J41443R2808m278
$$ -26894 123879 212635 176897 33620 -126186 -206391 -170343 -48004 93439 186247 181969
778A81969j03527j50943j14413j0605J00847J55607J22547J8638r3858j49357
$$ 181969 78442 -72501 -186914 -197519 -96672 58935 181482 200120 106262 -43095
788d3095j20290l0744P1208J36787J33688N6160n8720j42753j40895o0049M9678
$$ -43095 -163385 -194129 -122921 13866 147554 203714 144994 2241 -138654 -198703 -149025
799a49025J26454J38862P8861k7314j22991j49919q8581K1032J14051J42352R6121
$$ -149025 -22571 116291 195152 167838 44847 -105072 -193653 -172621 -58570 83782 179903
810A79903J210r8807j48047j12749j1261R5428J43694J13785K3973p6264j37296
$$ 179903 181113 82306 -65741 -178490 -189751 -94323 49371 163156 187129 110865 -26431
821b6431j24493m2079O4224J35548J31330N5604n2314j31194j35434o3102L9822
$$ -26431 -150924 -193003 -128779 6769 138099 193703 141389 10195 -125239 -188341 -148519
832a48519J17486J32993Q1408j5611j11418j47813r5598J5035J12402J37954Q9248
$$ -148519 -31033 101960 183368 167757 56339 -91474 -187072 -172037 -59635 78319 167567
843A67567J213q4041j30559j12672k8260Q0478J44824J21103K6537p7954j32660
$$ 167567 168780 84739 -45820 -158492 -186752 -106274 38550 159653 186190 108236 -24424
854b4424j14729m0170N4133J21454J25713O2390m0882j23655j35821o9307L6480
$$ -24424 -139153 -179323 -125190 -3736 121977 184367 143485 19830 -115991 -185298 -148818
865a48818J16789J29729P4044j7214r8329j31281r3498j301R6209J38521J00170
$$ -148818 -32029 97700 171744 154530 56201 -75080 -168578 -169879 -73670 64851 165021
876A65021O685q7203j31297j04345k1516P2548J27870J13043L5291o0526j24343
$$ 165021 171706 84503 -46794 -151139 -172655 -100107 27763 140806 176097 115571 -8772
887h772j19801m8800M9724J20913J23380N8095l7472j11836j24919p0208K1796
$$ -8772 -128573 -177373 -127649 -6736 116644 174739 137267 25431 -99488 -169696 -147900
898a47900J02708J28224Q3450q165r7066j31261r1613j121Q8171J27930R5989
$$ -147900 -45192 83032 166482 158317 61251 -70010 -161623 -162744 -74573 53357 149346
909A49346J3627p3559j21060j05474l3386O1162J23712J16558M2249n6298j18501
$$ 149346 162973 89414 -31646 -137120 -170506 -109344 14368 130926 173175 116877 -1624
920a624j15326m9996L9309J07697J19391O6133k4368j02987j25410p6429J5939
$$ -1624 -116950 -166946 -127637 -19940 99451 165584 141216 38229 -87181 -163610 -147671
931a47671R7221J23213Q1837k365q3949j21154r3441j3397P5843J23336J01572
$$ -147671 -50450 72763 154600 152235 68286 -52868 -146309 -159706 -83863 39473 141045
942A41045K2301o8565j19216j04108l3316N4583J13765J10315M6723m4347j10345
$$ 141045 163346 94781 -24435 -128543 -161859 -107276 6489 116804 163527 119180 8835
953H835j14651n6310L3027J03417J17032O5524k1111r4974j16587p5453N463Q5176
$$ 8835 -105816 -162126 -129099 -25682 91350 156874 135763 40789 -75798 -151251 -145788 -60612
965f0612J20127Q7931N318q1318j20610r0964j2254P0786J12778R5477K7590n5839
$$ -60612 59515 147446 152764 71446 -49164 -140128 -152382 -81596 31182 126659 154249 98410
977I8410j10378j05367m0458M7970J10086J09536M7285l8973j02888j09915n6813
$$ 98410 -11968 -117335 -157793 -109823 263 109799 157084 118111 15223 -94692 -151505
988a51505K5708R4887J12216O8671j4497q9512j14896p5979L963Q1901J13331
$$ -151505 -125797 -30910 81306 149977 135480 45968 -68928 -144907 -140944 -59043 54288
999E4288Q3612P131p3724j12618q9377j6806O3170J08131R4503L0245n1380j06470
$$ 54288 137900 145031 71307 -41311 -130688 -147494 -84324 23807 118310 148555 97175 -9295
1011i295j02357m0997M4509J04161J05294M7997l4068r6475j05726n7300K1097
$$ -9295 -111652 -152649 -108140 -3979 101315 149312 115244 18769 -86957 -144257 -123160
1022a23160Q8117J08272O8262q796q1452j10680p7465o78P5957J10115Q2148J0032
$$ -123160 -35043 73229 141491 132695 51243 -59437 -136902 -137580 -61623 48492 130640 140672
1034A40672o6182j06623q8346k2371N6620J03203R4189L2880m6343j00515r9389
$$ 140672 74490 -32133 -120479 -142850 -86230 16973 111162 144042 97699 -2816 -102205
1045a02205m3208L7316R6757J01714N0656k7062q9332j02365o0520J4960Q2491
$$ -102205 -145413 -108097 -11340 90374 141030 113968 24636 -77729 -138249 -123289 -40798
1056d0798J05057O9916m771p6351j05938p5669m695O9122J03909Q2410J4294o0563
$$ -40798 64259 134175 129404 53053 -52885 -128554 -133249 -64127 39782 122192 136486 75923
1068G5923j01563q6237k3952M9902R7045R1936L5905l9851r4737r8111m5744L2721
$$ 75923 -25640 -111877 -135829 -85927 11118 103054 138959 99108 4371 -93740 -139484 -106763
1080a06763R2517R9275N0109k4080q3512r7509o0233R886P5717J00833P0497J24
$$ -106763 -14246 85029 135138 111058 27546 -69963 -130196 -120310 -44593 56240 126737 126861
1092A26861p1205j02276p6279p299O4273R8800P9536J7496n2288r5117q5323l0249
$$ 126861 55656 -46620 -122899 -130198 -65925 32875 112411 129907 77619 -17498 -102821 -133070
1104a33070M3037R3528R2562L9228l7279r1413r3036m3485K7249Q1986R2911N4745
$$ -133070 -90033 3495 96057 135285 98006 6593 -86443 -129928 -102679 -20693 72218 126963
1116A26963j3921p7162r7309o3501O261P2276R7226O8747K355o4309r4639p4313
$$ 126963 113042 35880 -61429 -124930 -118669 -46393 50833 119580 121935 57626 -37013 -111326
1128a11326j3871N4651R3894Q1661K3059m8433r1993q4104l0036L8422Q5416Q7012
$$ -111326 -125197 -70546 23348 105009 128068 79635 -12358 -96462 -126498 -88076 -2660 84352
1140H4352M1835k7304q3172r2306m9729K1586P8738R2002N5340j1688p1664r2556
$$ 84352 126187 98883 15711 -76595 -126324 -104738 -26000 66002 121342 109654 37990 -54566
1152e4566o1918K428O4414R0893O9348R259n8120r3497p5334j4158N3046Q8219
$$ -54566 -116484 -114056 -49642 41251 110599 119858 61738 -31759 -107093 -121251 -68205 20014
1164B0014P5556K4824l9885q4644q3918l5485L3506Q3560Q6263M2529k5303p8712
$$ 20014 95570 120394 80509 -4135 -88053 -123538 -90032 -6472 79791 122320 97017 18305
1176A8305q8537m8507J8298P2158Q5017N4610l311o1862r0926o7965k922O4585
$$ 18305 -70232 -118739 -100441 -28283 56734 111344 108033 46171 -44755 -112720 -115642 -51057
1188e1057R0532O4379P435m9959q2037p3972k4152M3291Q6815P9707K6912l7956
$$ -51057 39475 103854 111289 61330 -20707 -94679 -118831 -75540 11275 90982 117894 79938
1200G9938q1070p9653l6018K8652P6445Q1009M2970j6966o8242q6033n5592R983
$$ 79938 -1132 -80785 -116803 -88151 -11706 69303 112273 95307 27065 -58968 -114560 -104577
1212a04577P1389Q8251N3184o355n8119q0176o3579j0581N3348Q8261O9288J0545
$$ -104577 -33188 55063 108247 101892 43773 -36403 -99982 -110563 -57215 31046 100334 110879
1224A10879m8803p9674o9887k4536L7229Q1556P8049K7973l4937p4667p4646l8645
$$ 110879 62076 -17598 -87485 -112021 -74792 6764 84813 112786 77849 3182 -71464 -110109
1236a10109J9732P2262Q4552M5372j9261o9829p9557m8420O803O0972Q3316N6956
$$ -110109 -90377 -18115 66437 111809 92548 22719 -56838 -105258 -98455 -37483 45833 102789
1248A02789j386n7237p9272o0486j0473M8511Q3765O9053J2689m7745p6673o4474
$$ 102789 101403 44166 -35106 -95592 -106065 -57554 26211 95264 107953 60208 -16465 -80939
1260h0939k4049L0997P4779P9355L4082l4622p8284p3282l0712K1960O3193P5069
$$ -80939 -104988 -73991 788 80143 114225 79603 1319 -71963 -102675 -80715 -17522 57547
1272E7547M7754j1322o6228q1591m9690Q252N9079P8955N5321Q8n4663p6983n7302
$$ 57547 105301 93979 27751 -53840 -103530 -95278 -36199 42756 98077 98165 43502 -33481 -90783
1285i0783j0026M2965P6314O9369J9613m4679q0181o5627j7710L3643O6869O9728
$$ -90783 -100809 -57844 18470 87839 107452 62773 -17408 -83035 -100745 -67102 -233 69495
1297F9495L5019k4010p1821p6198l4778K1439O3169P2562M5548q630o2236p8955
$$ 69495 104514 80504 8683 -67515 -102293 -80854 -17685 54877 100425 91795 29559 -49396
1309d9396m9314Q596N6092P2173N2149N187m6936p6382o1630j0225M5576P4018
$$ -49396 -98710 -90114 -34022 38151 90300 95487 48551 -27831 -89461 -99686 -54110 19908
1321A9908O1998J7526l7375p2518o6420k3201L1284O6969O7827L3382k1839o7109
$$ 19908 81906 99432 62057 -10461 -76881 -100082 -68798 -1829 65998 99380 77541 10432
1333A0432p4147l6500K0579O2340O8572M1689o628n4835p4303n1448L118N5473
$$ 10432 -63715 -100215 -79636 -17296 51276 92965 86337 31502 -42801 -94249 -91131 -35658
1345c5658P2909N0201L051m3371o9012n8889j5535L9649P2922O3556J7191l5992
$$ -35658 37251 87452 90503 47132 -21880 -80769 -96304 -56655 16267 79823 97014 61022
1357F1022o7962o2784k4858K6731O3388O5619L2711j8029o0279p0112m0328J2952
$$ 61022 -6940 -69724 -94582 -67851 -4463 61156 93867 75838 15559 -54553 -94881 -81929
1369h1929N8277O9992M3054o005n1211o8502n0158k582M6720P0472N3724P594
$$ -81929 -23652 46340 89394 83389 32178 -36324 -86482 -89064 -42344 28128 81852 89446
1381H9446m0850o6536n6890j7237L4079O7764O3017K1194l1867o4210o0956k6111
$$ 89446 48596 -17940 -74830 -92067 -57988 9776 72793 93987 62120 -2090 -63046 -89157
1393h9157K1226N7926O5838L6297j5089n9120o8364l9094J1576N3413O5874M3240
$$ -89157 -67931 -10005 55833 92130 77041 17921 -50443 -89537 -77961 -24548 41326 84566
1405H4566k561m7433o6685m8954m811M2625O6310N3537J0703l7709o4676n6332
$$ 84566 82005 34572 -32113 -81067 -85878 -43253 23057 76594 87297 49588 -15088 -71420
1417g1420j7396L0899O2707O0296K3910k6012o1411o1010k7244J9590N4548O1906
$$ -71420 -88816 -57917 4790 65086 88996 62984 1573 -59437 -86681 -67091 -12543 49363
1429D9363L6551j0257n4099o6905l9696R029N0147O2018M2556J650m2343o4560
$$ 49363 85914 75657 21558 -45347 -85043 -76014 -25867 36151 78707 80357 38014 -26546
1441b6546n0327p025M0250O3946N2328J2097l4485o1736n4733j8493K8179N8541
$$ -26546 -76873 -83898 -43648 20298 72626 84723 50238 -11498 -66231 -84724 -56545 1996
1453A996N8159K4969k1799n7785o1040k9110J7898N3081N9012L4893p972m8260
$$ 1996 60155 85124 63325 5540 -55500 -84610 -66712 -13631 45381 80274 72302 24042
1465B4042o3539m2155M924M7640O2487M2018J287l9493n9910m8334r257L5220
$$ 24042 -39497 -81652 -76728 -29088 33399 75417 76704 37211 -22699 -71033 -80290 -45070
1477d5070O0594N1984J4349l0222n8556n4652k0155K5145N5969N5587K5939j8621
$$ -45070 15524 67508 81857 51635 -6921 -61573 -81728 -56583 -614 54973 80912 62291
1489F2291n2067n8624l2111J3123N1059N9258L4775p791m5473n8740m0597Q40
$$ 62291 10224 -48400 -80511 -67388 -16329 42929 77704 69913 24440 -34300 -74897 -74057
1501g4057M1943N9263M3195M762l6094n8211m8366j1718L3144N8722N0895J4532
$$ -74057 -32114 27149 70344 75106 39012 -19199 -67565 -79283 -46139 12583 63478 78010
1513G8010k8130n4365n2052k1618K1397N3156N5533K6408j7038n0651n5619l0989
$$ 78010 49880 -4485 -56537 -78155 -56758 -3602 51931 78339 61301 10650 -44969 -75958
1525g5958J1497M7306N6332L4718n623m2239n6503m0951j102M0147N8731M2938
$$ -75958 -64461 -17155 39177 73895 68272 26033 -30470 -71421 -72523 -32376 26355 69293
1537F9293L544l6104n4827m4465j0957K7889N3871N0047J7535k5199n3623n1595
$$ 69293 72837 36733 -18094 -62559 -73516 -45627 8244 58291 75826 50627 -2996 -54591
1549e4591k1041K0557M9849N2395K6045j4131m6831n3098l1894Q324M4560N5897
$$ -54591 -75632 -55075 -5226 47169 73214 59083 12252 -40846 -72740 -64416 -19856 36041
1561C6041L5643n347m1147n4153l7048j633L4613N3646M3347Q102l1504n4229
$$ 36041 71684 66337 25190 -28963 -66011 -67644 -33031 20615 63962 72064 40560 -13669
1573a3669m5956j2243K7603N1740M7377J7480k2024m8826m9787k3365J5777M6757
$$ -13669 -59625 -71868 -44265 7475 54852 72332 50308 1482 -48305 -71670 -55893 -9136
1585i136N2497K8013j2529m4724n2335l0842O858L9696N1274L6243L97l6221n3321
$$ -9136 43361 71374 58845 14121 -38214 -69056 -62198 -22502 28772 65015 65412 29191 -24130
1598b4130m0082m468L4164N3055M1436Q394k9181m9839m3514j3953K3039M8201
$$ -24130 -64212 -68680 -34516 18539 59975 68369 39188 -10651 -54165 -68118 -45079 3122
1610C122M7761K0121j9629m8311m8959k2784J6006M4588M8837K6406r487m0474
$$ 3122 50883 71004 51375 3064 -45895 -68679 -52673 -8085 40752 67158 57671 17197
1622A7197n0218l2872M075L8742N1661L5238n94l5381m9821l7859n515K9875M9182
$$ 17197 -33021 -65893 -61818 -23076 28585 63823 63229 27848 -21973 -59832 -65347 -35472 13710
1635A3710M1049J0901k5480m7615m4523j6142K1761M7015M6094J9870j7181m3925
$$ 13710 54759 65660 40180 -7435 -51958 -68100 -46339 676 46770 66640 49459 5534
1647E534m6492k4375J1627M1316M9125K8690p842l8637m8947l0962K334L4606
$$ 5534 -40958 -65333 -53706 -12390 36735 65425 57583 18946 -30001 -60963 -58629 -24023
1659b4023M7835L5807L257l1771m8881l8168p686K8196M7320M0776J1169k4226
$$ -24023 23812 59619 62876 31105 -17776 -55944 -63630 -35434 11886 52662 63831 39605
1671C9605m5237m1975j6609J8217M3298M5578K1376j5537m2882m5684k3105J0851
$$ 39605 -5632 -47607 -64216 -45999 -2701 42877 64253 48716 5834 -39850 -62955 -52104
1683e2104L8261M5651K8070m587l5654m6393l2571O36L3660M7468L4889K931l0137
$$ -52104 -13843 31808 59878 55291 19637 -26756 -59327 -58691 -25031 22437 57326 60257 30120
1696C0120m6249l6360o918K4974M4042L9441J3161k0765m4216m2433j6602J7968
$$ 30120 -16129 -52489 -59407 -34433 9609 49050 62211 41446 -2770 -45203 -61805 -43837
1708d3837M2175M2694K0159j3620l9588m4161k4190R102L6393M4899K7915m445
$$ -43837 -1662 41032 61191 47571 7983 -36178 -60368 -51266 -14873 30026 57941 53496
1720E3496l4527m5097l1303J041L1270M4316L3674M172k7096m3423l6815r027
$$ 53496 18969 -26128 -57431 -56390 -25120 19196 52870 57042 29946 -13477 -50292 -59319
1732e9319K4069M3574L8604J2494j9626m1574m0197j6682J5635M0067M2029K0277
$$ -59319 -35250 8324 46928 59422 39796 -1778 -41975 -58657 -43022 -2955 39074 59351
1744E9351j2170l7728m2221k4016P339L4435M2697K7615k189l1555m3904l1880
$$ 59351 47181 9453 -32768 -56784 -49445 -15010 27687 55302 53113 21558 -22346 -54226
1756e4226j424K9353M3309L3204N036k5328m1715l5599r679K0704M0848L8424
$$ -54226 -55650 -26297 17012 50216 55252 29924 -11791 -47390 -57069 -36365 4483 42907
1768D2907J4053j7096l9794l9575j7495J3646L7076M0596K1906r170l4765m1593
$$ 42907 56960 39864 70 -39505 -57000 -43354 -6278 34318 56224 47054 12289 -29304
1780b9304k4548M745L2169M1588K8516p65k9143m2155l1105l115K6284M0361L3310
$$ -29304 -53852 -49107 -16938 24650 53166 52401 23258 -18897 -50002 -53117 -26833 13528 46838
1793D6838P729k2356l9654l5909j1999J8326L8678L7500J5514j4848l6965l8808
$$ 46838 54567 32211 -7443 -43352 -55351 -37025 1653 39153 54667 39819 2854 -35954
1805c5954j9328J1231L5247L9241K2309o722l2231m0201k5602L062K9693M0471
$$ -35954 -55282 -44051 -8804 30437 52746 46024 13793 -26408 -52010 -48948 -19255 21216
1817B1216K8215J106k6290m0119l1485m657K4208L9331L2878Q510k0106l7602
$$ 21216 49431 50537 24247 -15872 -47357 -52014 -27806 11525 44403 52913 32807 -4795
1829d795l5693j3082J7390L7564L6502J5223j4152l4562l6729j9677Q909L2675
$$ -4795 -40488 -53570 -36180 1384 37886 53109 38957 4395 -32334 -52011 -43102 -10427
1841a0427L8909K2871o080l0935l8621k5327J815K7466L8723K8345J932k4703
$$ -10427 28482 51353 45273 14338 -24283 -49610 -47795 -20329 18394 46739 48671 23968
1853B3968l7870l0750o454K1679L8848L2721Q561j8936l5783l2717j3807J4019
$$ 23968 -13902 -44652 -51106 -29427 9421 42142 50703 31767 -4016 -36733 -50540 -36521
1865c6521L4974L6233J7069j1926l3577l6109j9181P311L0453L7320K3016l970
$$ -36521 -1547 34686 51755 39829 6252 -29857 -49038 -41727 -11274 26046 49062 45092
1877D5092k8981l7276k5359L34K5298L7142K8547L350k4080l7065k8884o465J9115
$$ 45092 16111 -21165 -46524 -46190 -20892 16250 44797 48147 24067 -12998 -41882 -48347 -29232
1890b9232L4965L2650J1255j7125l5099l3411j3272J2800L3061L4838J7334j0268
$$ -29232 5733 38383 49638 32513 -2586 -35997 -49269 -36469 -3408 31430 48764 38496
1902C8496l1391l4237j9871N646K8052L6172K3974k188k7552l6885k4312J39K3744
$$ 38496 7105 -27132 -47003 -41357 -13305 22867 46841 44653 17101 -19784 -44096 -43957 -20213
1915b0213L3785K8085N753k0729l6218l0637p321J9031L4357L0481J0733j4551
$$ -20213 13572 41657 47410 26681 -9537 -40174 -47495 -28464 5893 36374 47107 32556
1927C2556l2803l2428j4446J1595L0443L3314J8552p780l0022l4900k0015N017
$$ 32556 -247 -32675 -47121 -35526 -5083 28231 46783 39003 8981 -25919 -45934 -40917
1939d0917K7286L3978K2820o50k4253l5074k5658j595K2181L4184K7167N761j8962
$$ -40917 -13631 20347 43167 42517 18264 -16810 -42468 -44063 -21882 12302 39469 45230 26268
1952B6268l3812k9658q191J6777L2577K9523J1690j2137l0540l2853j6000J0883
$$ 26268 -7544 -37202 -45393 -28616 3961 33484 45174 33037 2497 -30356 -46356 -35473
1964c5473L0949L2405J6467p341k6968l2220k0782L007K5111L3295K3270l37k2975
$$ -35473 -4524 27881 44348 37007 10039 -22181 -42963 -39956 -14845 18450 41720 41383 18408
1977A8408l3447k4826k255J9934L1778K6551O810j6220l2002k9611j0238J5414
$$ 18408 -15039 -39865 -42120 -22186 9592 36143 42953 26733 -5269 -34880 -45118 -29704
1989b9704L1716K9147J1792j1375k8020l0070j6139O782K7264L2681J8826m808
$$ -29704 2012 31159 42951 31576 3556 -26514 -42653 -35871 -8607 24074 42900 38092
2001C8092k5989l1811k0371J387K2465L1835K3252K326k0765l1314k5339n606
$$ 38092 12103 -19708 -40079 -38692 -16227 15608 38860 41186 20421 -10893 -36232 -41838
2013d1838J8267L0838K7024P606j5249k9561k7837j1653J1988K8547K9175J4216
$$ -41838 -23571 7267 34291 41897 26648 -2913 -30750 -42403 -30415 -1868 27307 41523
2025D1523r079k6816k9881j7645O114K5858L1127J8896l735k3454k9952k0401
$$ 41523 32444 5628 -24253 -41898 -35784 -9926 21201 40097 36362 12908 -17044 -37445
2037c7445m22K0068L0416K3627L791j8927l0568k4407n926J5845K8542K6524R154
$$ -37445 -37867 -17799 12617 36244 40035 21108 -9460 -33867 -39793 -23948 4594 31118 40272
2050D0272j2319k8328k7898j2143J0434K7074K8467J3950p881k4394k8787j6829
$$ 40272 27953 -375 -28273 -40416 -29982 -2908 25559 39509 31628 7234 -21553 -38382
2062c8382L658K2765L0004J9706j631k1913k9623k0302j167J8724K8550K2656
$$ -38382 -34724 -11959 18045 37751 36120 14207 -15416 -35718 -36885 -18161 10389 33045
2074C3045N346j6284k9092k5177o672J4746K7942K5412R107j1410k6120k6592
$$ 33045 38391 22107 -6985 -32162 -38834 -24088 3854 29266 38373 26963 843 -25749
2086b5749j2498Q804K5013K7362J4877n753k3827k7873j6950L438K1469K8069
$$ -25749 -38247 -29443 -4430 22932 37809 32056 8229 -19644 -36594 -33156 -11687 16382
2098A6382J9263o38j9685k8019k0813k295J7528K7213K2348N164j4841k7112k3977
$$ 16382 35645 35007 15322 -12697 -33510 -35805 -18277 8936 31284 36448 21607 -5505 -29482
2111b9482p622J2604K6140K4435J0414r609k4369k6145j3395P345K3680K6685
$$ -29482 -37104 -24500 1640 26075 36489 26880 2511 -23634 -37029 -29684 -6004 20681
2123B0681J5019m898k1311k6515j7485K056J9312K7391J8752P00j7511k6742k0422
$$ 20681 35700 30802 9491 -17024 -34509 -32453 -13141 14250 33002 33702 16191 -10551 -30973
2136c0973l657J5968K5769K2070N957j3020k5125k3961q788J1236K4639K4566
$$ -30973 -34630 -18662 7107 29177 35134 22114 -3011 -26972 -35760 -24524 115 24681
2148B4681J0294q542k3070k4422j3624N966K1573K5614J5329l622j9942k5780
$$ 24681 34975 26433 3363 -21059 -34683 -28717 -7144 18470 33799 30177 10235 -15545
2160a5545j7007R38J7809K5595J9196K038j6623k5471j9957m614J4116K5042K1882
$$ -15545 -32552 -31614 -13805 11790 30986 33024 16401 -9070 -29027 -33641 -19525 5517 27399
2173B7399O711j2591k3753k2461r174R411K2792K4051J1382p338k1954k3955j3229
$$ 27399 34110 21519 -2234 -24695 -33869 -24458 -1666 22385 33767 26429 4475 -19480 -32709
2186c2709M454K0180K4543J5938k321j8966k4739j7029j79J7000K4211J9104K330
$$ -32709 -28255 -8075 16468 32406 30085 11119 -13620 -30649 -30828 -13828 10383 29487 31817
2199C1817j4936k3974k0162n120J2886K3479K1349P494j1016k3061k2005r263
$$ 31817 16881 -7093 -27255 -32375 -19489 3990 25339 32833 21817 -1244 -23249 -32512
2211c2512Q413K1660K3411J1241o393k0563k3581j3224M043J9361K3110J5510
$$ -32512 -24099 -2439 20972 32213 25820 5257 -18324 -31548 -27505 -8144 14966 30476
2223C0476j678j7275k3977j6510j172J5942K3604J8381K882j3795k3359j9351
$$ 30476 28798 11523 -12454 -28964 -30136 -14194 9410 27791 30673 16878 -6481 -25832
2235b5832n031J1497K2650K0608P508r571k2292k1266r672Q174K0546K2285J1282
$$ -25832 -30863 -19366 3284 23892 31400 21829 -463 -21729 -31401 -23227 -2681 19604 30886
2248C0886o051j9034k2405j3054K904J8159K2835J4269p23j6168k3465j6113r27
$$ 30886 24835 5801 -16604 -29658 -26754 -8595 14240 28509 27786 11618 -11847 -27960 -28887
2261b8887J5100K2639J7428L069j3124k1795j8957n234J0669K1669J9794Q073
$$ -28887 -13787 8852 26280 29349 16225 -5570 -24527 -29761 -19092 2577 22371 30444
2273C0444r628k0939k0592r122P395J9311K1112J1477m685j8619k1871j3087L121
$$ 30444 20816 -123 -20715 -29837 -22442 -3131 17981 29458 24773 6154 -15717 -28804 -25683
2286b5683J7373K1513J4143l90j5132k1943j5830k162J3787K1822J7330L874j2364
$$ -25683 -8310 13203 27346 26956 11824 -10119 -25949 -28111 -14324 7498 24828 28702 16338
2299A6338k1163j8395n151R676K0372J9113P640p456j9895k0311r657O482J8515
$$ 16338 -4825 -23220 -28371 -18695 1677 20790 28430 20974 1079 -19232 -28889 -22407 -3892
2312c892K0695J0761l837j7595k0519j2645J854J6077K1052J4167M37j4517k1168
$$ -3892 16803 27564 23727 6132 -14387 -27032 -25178 -9101 11951 26118 26555 12038 -9130
2325i130j5618k283J3758K0345J6419L731j0885j9688j7999o192R146J9623J8805
$$ -9130 -24748 -27031 -13273 7072 23491 27222 16337 -3351 -21350 -27542 -18396 1227 20032
2338B0032P621p555j8913j8666r635N257J7270J9564J0950k914j5931k0271j3053
$$ 20032 27653 20098 1185 -17481 -27116 -21859 -4589 14975 25925 23011 7080 -13191 -26244
2351b6244J639J5211K0088J3894L5j2974j9317j5585k919J1598J9800J6640M857
$$ -26244 -24605 -9394 10694 24588 24623 11649 -7668 -23253 -26172 -14574 5226 21866 26723
2364B6723j0106j9133j7257o334P724J8149J8446Q400o247j7501j8772r619M017
$$ 26723 16617 -2516 -19773 -26107 -18383 -234 18212 26612 20365 2864 -15908 -25527 -21510
2377b1510J6713J8754J1248k816j4679j8978j2756J16J3216J9472J4340J222j1767
$$ -21510 -4797 13957 25205 22389 7710 -11268 -24024 -23908 -10692 8780 23120 24342 12575
2390A2575j9381j5184l148J0391J8720J6131M905q697j7754j7120o608P057J7095
$$ 12575 -6806 -21990 -25138 -14747 3973 20104 25009 16312 -1442 -18562 -25170 -18113 -1018
2403a018J7691Q517n207j6477j7687r918L460J4120J8575J1833j168j3468j9145
$$ -1018 16673 25190 19983 3506 -14181 -24099 -20639 -6519 12056 23889 22721 9253 -9892
2416i892j2935P5J2344J7899J4138K098j0664j8054j4894m228R349J7052J5993
$$ -9892 -22827 -22752 -10408 7491 21629 23727 13063 -4991 -19885 -24113 -14764 2288 18281
2429A8281N941p373j7230j6488p210O322J5497J6646Q960l693j4964j7839j0149
$$ 18281 24222 16849 -381 -16869 -24079 -17757 -2260 14386 23346 19653 4689 -13150 -23299
2442b3299K188J4320J7497J1364n27j2478j7459j2940j274J1667J7158J3606L508
$$ -23299 -21111 -6791 10706 22070 21543 9065 -8394 -21334 -22608 -10941 6217 19823 23331
2455B3331r949j6895j5272m408Q393J6602J5392N928o792j5268j6134q222N355
$$ 23331 13382 -3513 -18785 -23193 -14800 1802 17194 23122 16330 1062 -15072 -23294 -17939
2468a7939J4894J6544Q654l406j3499j6596j0746J221J3020J7172J1443L51j1823
$$ -17939 -3045 13499 22153 18747 5248 -11348 -22094 -20873 -7853 9319 20762 21113 9290
2481I290j6501j2744k060J0521J6381J3900K795q497j5628j4207n521P078J5700
$$ 9290 -7211 -19955 -22015 -11494 4887 18787 21582 13085 -2543 -16750 -22271 -15193 507
2494E07J5351O189n693j4870j5146p945L955J3499J6093R545k604j2592j6086
$$ 507 15858 22047 16354 1484 -13662 -21607 -17652 -4153 11940 21485 18881 6289 -9797
2507i797j0755Q66J1312J6546J1313Q70j0273j5622j2463l092Q902J5426J3523
$$ -9797 -20552 -19686 -8374 8172 19485 20355 10082 -5540 -18003 -21095 -12193 3233 16756
2520A6756M519p752j4847j3970n508N455J4113J4838P504m462j3611j5098q377
$$ 16756 21275 13523 -1324 -15294 -20802 -15347 -1234 13604 21108 16646 3035 -12063 -20440
2533b0440K933J2430J5056R758p42j1926j5094j0783n56J0303J5501J1311K067
$$ -20440 -17507 -5077 9979 19737 18995 7069 -8025 -18808 -19364 -9061 6440 17751 19818
2546A9818r244j4552j2845l272P508J4621J3332N096o241j4299j3650o252M542
$$ 19818 10574 -3978 -16823 -20095 -12587 2034 15366 20462 14221 -78 -13728 -19980 -15438
2559a5438J3038J4468P517l432j2112j4731q619J860J1440J4425R860j62j0498
$$ -15438 -2400 12068 19585 16153 4041 -10690 -19309 -17449 -6009 8416 18276 18114 7616
2572G616j4566j0973j192R621J4198J2001K238p823j4087j2162m233O953J3568
$$ 7616 -6950 -17923 -19115 -9494 4704 16705 18943 11120 -2967 -15129 -19362 -12409 1159
2585A159J2806N465n600j2922j3127o550L555J2360J4020P896l164j1348j3650
$$ 1159 13965 19430 13830 908 -12219 -18769 -15214 -2854 11166 19062 15898 4550 -9100
2598i100q790R37J0539J4014R569j20q939j3765j0414j892Q349J3505J1278K833
$$ -9100 -17890 -16953 -6414 7600 17169 17049 8110 -5655 -16069 -17961 -9612 3893 15171 18004
2612A8004p217j3083j1628m336N693J2555J2653N703m722j2032j2712o892L490
$$ 18004 10787 -2296 -13924 -18260 -12567 -12 12641 18344 13622 1590 -11122 -18014 -14524
2625a4524J1262J2966P725k032j0155j3181q546N14R078J3447R666M20q499j2575
$$ -14524 -3262 9704 17429 15397 5242 -7939 -16485 -15971 -6893 6554 16220 16640 8141 -4434
2639d434j0203k376O991J2652J1181L515o183j2562j1214m695M990J1547J2108
$$ -4434 -14637 -17013 -10022 2630 13811 17326 11143 -1419 -12633 -17328 -12338 -791 11317
2652A1317N437l534j1399j1985o439K322J0269J2506P679j428r474j2744p902
$$ 11317 16754 13220 1821 -10164 -16603 -14281 -4012 8494 16173 14745 5271 -7473 -15375
2665a5375J36Q044J2581R333J554p798j2124j0127k218O434J1859J0648L354n130
$$ -15375 -15239 -7195 5386 14719 16273 8475 -3649 -13776 -15994 -9560 2299 12947 16301 11171
2679A1171j1532j0838m664M032J0313J1567O178l085j0226j1926o764K296R018
$$ 11171 -361 -11199 -15863 -11831 -1518 10049 16227 13142 2916 -9010 -15774 -13478 -4460
2692d460J1801P202l60q536j1695q564k95P518J1756Q771J992o708j1173r790
$$ -4460 7341 14543 14183 5647 -6048 -14612 -14907 -7389 4367 13138 15130 8422 -2751 -12541
2706a2541k845N608J0740J0586M027m443j0716j0979m442L583J0003J0539N908
$$ -12541 -15386 -9778 962 11548 15575 11132 416 -10563 -15005 -11422 -1419 9120 15028
2719A5028k426q809j1559p008J691Q606J1139P153l7p891j0918q329p19O684J0580
$$ 15028 12602 3793 -7766 -14774 -13083 -4477 6662 13815 13778 5887 -5031 -13360 -14079 -7395 3185
2734C185Q855K704o119j0735r847k825N416J0288R183M042l643r766j0016n289
$$ 3185 12040 14744 8625 -2110 -11957 -14782 -9366 922 10105 14147 10504 738 -9278 -14567
2748a4567L222R399J0359N745j995q851j0307o748J164P928J0329P312q1o235
$$ -14567 -11345 -1946 8413 14158 12163 3312 -6995 -13743 -12579 -4651 5678 12990 12909 6674
2762F674j0974q239p87O195J0276Q001K234n016r819r245l122M384R739R213M008
$$ 6674 -4300 -12539 -13326 -7131 3145 11146 13380 8364 -1455 -10700 -13822 -9438 301 9514 13522
2777A3522l785q833r821m605K715Q686R367N667j826p511r610o863R62O979J0333
$$ 13522 9737 904 -8917 -13522 -10807 -2121 7246 12913 11087 3576 -6034 -12897 -11935 -4956 5377
2792E377O486N12o523r157q006j095N255R552Q262K065m585r024q941k852L784
$$ 5377 11863 12375 5852 -3305 -11311 -12406 -7151 2401 10663 12728 8143 -881 -9822 -12674 -8890
2807h890R158Q114M251k967q102q811n266K029P663R329N421r16p234q879o633
$$ -8890 268 8382 12633 9666 1564 -7247 -12513 -10484 -2821 6508 11929 11013 3779 -5100 -11733
2822a1733K40O367R096O687J074n556r240p344j773N135Q785P911K162l899q407
$$ -11733 -11493 -5126 3970 10657 11731 6175 -3065 -10409 -12182 -7047 1738 9649 11811 7912 -495
2837d95p777l548L319P915Q437M040k300p901q489m631J434P200Q673N326q71
$$ -495 -8272 -11820 -8501 -586 7851 11891 9591 1690 -6799 -11430 -9996 -2796 5877 11203 10332
2852A0332o119q441o107j19N340Q717O579N03m573q432p313j525M293P952P415
$$ 10332 4213 -4228 -10335 -10454 -5114 3603 10182 10685 6112 -2320 -9633 -11158 -6865 1087 8502
2867H502K894l741p806p589l640L075P510P612L804k093o394q098m690J448O005
$$ 8502 11396 7655 -151 -7740 -11380 -8305 -795 6817 10621 8528 2134 -5964 -10654 -9206 -3201
2882c201Q208N140j80n974p751n443r89N030Q252O163J193m616p965o074j959
$$ -3201 5007 10147 9967 3993 -3758 -9201 -10190 -5160 3092 9255 10448 5832 -2133 -8207 -10166
2897a0166L452P281P181K797k882p374p263l241K251O956O910M126j696o128p492
$$ -10166 -6714 567 7748 10545 7663 289 -6974 -10215 -7964 -1008 5902 10028 8332 2204 -5288
2912e288m527O46O063P253N353k37n079p603n251q31M648P397N758J313l760p334
$$ -5288 -9815 -9169 -3106 4147 9500 9263 4184 -3419 -8670 -9501 -4853 2544 8302 9615 5855 -1479
2928a479o265j850L513O488O136L075k214o442p269l058J584O369O874L731j166
$$ -1479 -7744 -9594 -6081 407 6543 9618 7404 962 -6307 -9365 -7781 -1412 5462 9193 8027
2943H027n519o803m457K64N298O781M834L41m761o646n470m88L740O363N832J377
$$ 8027 2508 -4295 -8752 -8488 -3190 3591 8425 8766 4005 -2641 -8111 -8599 -4859 1504 7336 8713
2959H713l262o167o191k058K657O647N940K459k190n408o514l364J600N471O401
$$ 8713 5451 -716 -6907 -8965 -6308 339 6279 8738 6548 1140 -5374 -8738 -7138 -1667 4734
2974D734L653p68m944o201m535J83M139O741M615K00l785o078n069j107L428N990
$$ 4734 8387 7619 2675 -3526 -8061 -7878 -3739 3002 7617 7817 4032 -2046 -7115 -8222 -4794 1196
2990A196N555J433k781n525n782k365K307N455N711K832j722n168n563l215N65
$$ 1196 6751 8184 5403 -122 -5904 -8269 -5962 -507 5204 8036 6314 1146 -4417 -7632 -7067
3005g067N010O069L498o86m187n605m223O9L633N755M391R87l766n574m380j427
$$ -7067 -2057 4012 7510 6824 2637 -2968 -7191 -7122 -3489 2266 6657 7644 3878 -1696 -6076 -7503
3021g503K992N166N075J795k539n057n360k120K115M794N255K944j665m564n302
$$ -7503 -4511 655 5730 7525 4986 -71 -5431 -7551 -5436 -642 4613 7557 5892 1328 -3974
3036c974l049R51M133M957L719k34m035n197l919j14L233N572M126O76k937n053
$$ -3974 -7023 -6072 -1939 3018 6737 6503 2468 -2729 -6648 -6762 -3529 2043 6169 6845 3908 -1145
3052a145m628j017K526M502M730J929j773m527n336k087J554M477M675K699q17
$$ -1145 -5773 -6790 -4264 238 4968 6897 5124 597 -4739 -6826 -5272 -795 3880 6579 5762
3067E762m143m739l310Q24L469M794L438j85l095n173l542l97L279M214M123R78
$$ 5762 1619 -3120 -6430 -5606 -2137 2657 6095 5910 2815 -2358 -5900 -6297 -3018 1196 5319 6297
3083F297k435m702m083j638K154M382M317J995j643m377m242k222J219L771M636
$$ 6297 3862 -840 -4923 -6561 -4407 -25 4292 6287 4644 267 -3975 -6197 -4978 -1207 3429
3098C429K449o27l430m736k864K16L402M094L531K38k809m393l623r17K742M526
$$ 3429 5878 5251 1821 -2915 -5779 -5563 -2161 1933 5464 5702 2893 -1500 -5123 -6040 -3298 1228
3114A228L679J213k402l915m031j776J817M049L889K233j687l891l954k470J266
$$ 1228 4907 6120 3718 -197 -4228 -6004 -4187 -138 3751 5984 4297 406 -3548 -6018 -4752
3129d752L586M207K365o65l209l728k494k22K368M636K834K11k419m314l053o88
$$ -4752 -1166 3041 5406 4741 1532 -2196 -4690 -4912 -2544 2092 4926 5137 2718 -1596 -4649 -5337
3145e337K365L816L459P24j588l792l387j441J496L459L662J778j189l450l641
$$ -5337 -2972 844 4303 5027 3439 -353 -3740 -5181 -3685 -226 3436 5214 4025 575 -3066
3160c066k153P20L516L307K568m46k963l595k574K26K441L765K748Qk198l365
$$ -3066 -5219 -4499 -983 2324 4892 4446 1483 -2112 -4686 -4460 -2019 1746 4494 4502 2304 -1061
3176a061l301j68J837L073L455J251k289l213k951j231J272L075L360J266p61
$$ -1061 -4362 -4530 -2693 380 3835 5086 2797 -416 -3367 -4598 -3326 -251 3109 4375 3614
3191C614l181l287j607O39K840L379J911l66k512l185k283J67K349K923K669o4
$$ 3614 433 -2854 -4461 -3822 -982 2397 4308 3942 1430 -1755 -4038 -3871 -1522 1401 4070 4006
3207D006j896l367k357o75J551L343K839Q31j383l211l092r83J333K585L179J364
$$ 4006 2110 -1257 -3614 -4289 -2738 605 3444 4275 2892 -319 -3411 -4394 -3061 -476 2703 4067
3223D067p51k582l138j570Q16K172K863K172l40k331l277j792L6K057L012J985
$$ 4067 3316 734 -2404 -3974 -3158 -986 1877 4049 3709 1378 -1899 -3691 -3655 -1598 1414 3399
3239C399J30j845k279k595m62J344K894K154R81j149k544k587j263J122K190K698
$$ 3399 3529 1684 -595 -3190 -3652 -2308 586 2740 3721 2572 28 -2559 -3822 -2700 -510 2188
3255B188J050k19k470k528j471Q94J484K363K137l46j700k729j651m35J779K626
$$ 2188 3238 3019 549 -1979 -3450 -2556 -1072 1291 3428 3082 1382 -1347 -2998 -3433 -1654 972
3271I72K098K28j990k047k093k42J019K408K122P94q89k408k154j055J062J943
$$ 972 3070 3298 1308 -739 -2832 -3074 -2055 353 2475 3269 2380 -28 -2182 -3237 -2175 -232
3287b32J887J085k41j500k690j207J20J543K454J543k06j454k005j844r4J400
$$ -232 1655 2740 2499 999 -1691 -2898 -2778 -1235 1219 2762 2556 1102 -903 -2747 -2841 -1441
3303a441K449J304L43j302j892j629l63Q82J963J827N01r26j573j982q08P80J501
$$ -1441 1008 2312 2655 1353 -539 -2168 -2531 -1649 314 2141 2642 1716 143 -1839 -2647 -1867 -366
3320c66J660J153k28j370k112j193K40J597J744J009J94j041k043j352o0J049
$$ -366 1294 2447 2219 849 -1263 -2456 -2216 -619 1125 2134 2328 1287 -756 -2108 -2168 -1119
3336a119J458J488J47n60j805j558j10O15J669J165P40q29r76j713n46J20J430
$$ -1119 339 1827 1974 1414 -391 -1949 -2059 -1444 225 1390 2130 1301 325 -1388 -1934 -1814 -384
3353c84J907M96n29j035j562p68j04J092J708J242j68r44j536j310J16P19J470
$$ -384 1523 2019 1490 455 -1107 -1875 -1979 -887 821 2063 1895 951 -585 -1895 -1779 -1060 410
3370D10J216N7q39j064j396L0K19J366J362L58q48j115q30o81N46J223J016M51
$$ 410 1626 1683 844 -220 -1616 -1586 -1367 -1 1361 1719 871 -244 -1074 -1755 -1209 14 1030 1481
3388A481m40n87j101j040J18J145J444N86l03p40j009j075M3Q01J412N91J42n23
$$ 1481 1041 454 -647 -1687 -1569 -424 1020 1606 1303 563 -446 -1521 -1478 -677 735 1326 1468 945
3406I45j229p10m16N41J058J102l0m02o67j017m65J63P96J082N42l31r08q17k32
$$ 945 -284 -994 -1410 -869 189 1291 1261 859 192 -825 -1290 -1127 -331 751 1293 962 54 -763 -995
3425i95o5R48O50M36J0m95q62o20P7Q00M42N21J92m52r05p53P7O44P69M82R6m16
$$ -995 -1060 -112 538 974 984 489 -373 -993 -916 -116 326 847 1039 587 -318 -1071 -994 -350 419 901 997 581
3447E81p50o53K59j76P88O84k8j59n38k48o60K29N97M31K20m5k44r09k7o0N13
$$ 581 -169 -822 -563 -739 49 733 705 546 8 -240 -900 -671 -74 357 577 532 288 -621 -648 -708 -195
3468a95O19K94k18m68l94j65j0L51L03N19m10m0m93l54r5K88O24L20j25k08j09
$$ -195 424 718 500 32 -362 -527 -537 -186 117 636 226 186 -307 -661 -756 -468 156 476 351 143 34
3489C4n59K4L13L59L93j98j0k41p92n1M92K99K18K75n37j4m97K87K01j69M97l9
$$ 34 -525 -501 -188 171 564 366 356 115 -677 -728 -236 63 281 556 19 5 -492 -205 -4 -173 324 285
3511B85m66p4kK3J11K20L12l2N3o52l24J32K77K71P6J67jl50l91j40L14N29J1
$$ 285 -181 -255 -257 -234 -123 97 409 377 430 -222 -546 -414 -137 134 210 377 376 26 -365 -505 -191 338 349
3534C49j2r1m00j34j96K51L18M73J1n11k37j61j12P9K58N73k48k0k31l50O7J73
$$ 349 337 246 -154 -288 -484 -233 85 558 569 58 -179 -340 -452 -373 -115 458 210 190 -41 -391 -324 -151
3556a51L80J27L80n40j20p03Q2K27O68K75J15j31o71o98K01O29j48N08K90o06
$$ -151 229 356 736 196 76 -627 -545 -318 350 625 740 609 -62 -760 -559 70 -78 430 720 114
3576A14o6n04l64j17Q69J41Q22l32k14j011k18OR07J97K84M32p13n88l89J6L24
$$ 114 48 -456 -820 -937 -68 73 895 563 349 -662 -880 -874 33 230 514 946 233 -355 -744 -728 -404
3597d04R16K71K34o57k50r13jJ32J213K16L43n41m46r89m37L61R63P07O61o19
$$ -404 512 783 1017 360 110 -803 -804 -672 541 757 1100 559 113 -876 -1313 -952 11 718 1379 760
3617G60r02q82J82K6P00Q12J62J9n04r28o69J76M27J365N91k52p18q86q42K27
$$ 760 -142 -1024 -842 -816 -116 696 858 877 373 -555 -1224 -1048 -621 744 1335 1083 365 -521 -1363 -1136
3637a136M97Q47R50J91n56r90q00m14M86P67J279L24m50j114p77n18M88Q44R01
$$ -1136 -639 208 1158 1349 793 -197 -997 -1411 -925 -158 1121 1445 995 -119 -896 -1414 -926 -82 819
3656H19P15o6j115j021r64K64R68J176L76J22n31j337r42J54N25J123J101j21
$$ 819 1534 1468 353 -668 -1632 -1368 -400 776 1152 1274 743 -594 -1536 -1382 -857 266 1367 1246
3674A246p4j413j039l67P55Q65J310J58n25q32j220o27K08J528Q40P06J4j322
$$ 1246 1172 -241 -1280 -1647 -892 -27 1283 1441 916 84 -1136 -1763 -1555 -27 813 1519 1533 211
3692B11j491l50j70J160J186J057L67j146j747r09qR15J343J140M70p66j588j147
$$ 211 -1280 -1630 -1800 -640 546 1603 1970 824 -923 -1832 -1840 -925 418 1558 2028 1262 -326 -1473
3710a473o75N68J506J469L83j43j509j494q46L68J485J764Q30p48p09j908j095
$$ -1473 -2148 -1580 -74 1395 1778 1635 126 -1368 -2214 -1846 -361 1403 2233 1485 776 -1132 -2227
3727b227N97M38J996J462m21p79j834r87l35J104J074J712K59o35j672j429n77
$$ -2227 -1630 -1192 804 2266 1845 1066 -768 -1755 -2090 -986 88 1800 2059 1424 -248 -1677 -2254
3744b254P24J165K243K45l17j628j505j151O43J444J458J411p54p12k210j002
$$ -2254 -1530 -365 1878 2123 1806 178 -1327 -2478 -1835 -391 1067 2478 1724 1012 -1198 -2200
3760b200L4J375J566J152N48j213j815j234n95P07K184J653K37q88j777j808j89
$$ -2200 -2166 -791 775 1927 2475 1262 -553 -1787 -2382 -1675 509 2162 2399 1511 -266 -2074 -2263
3777b263M06J856J703R13n41j811j440j325K68J890J790J147m26j300j751j632
$$ -2263 -1857 -1 1702 2615 2074 263 -1177 -2502 -2234 -344 1446 2593 2167 867 -884 -2516
3793b516n6J562J842J388L63j146j645k142l51J195K154J460N66j050k014j784
$$ -2516 -2572 -1010 832 2220 2583 1437 -208 -2350 -2701 -1506 648 2108 2674 1624 -390 -2174
3809b174o00O41J762K276J135r15j781j966j269K12K180J909J463j94j836k078
$$ -2174 -2774 -2133 -371 1905 3040 2125 344 -1622 -2891 -2679 -499 1410 2873 2679 843 -1235
3825a235j512J22J366K214J632J21j350k113j490o44J130K143J702R42r75j844
$$ -1235 -2747 -2625 -1259 955 2587 2708 1358 -755 -2245 -2889 -1759 384 2086 3028 2053 209
3841B09k193r15O78J973K344O67l01k130j874j538K41J691K286J741M9j852j985
$$ 209 -1984 -2899 -2221 -248 2096 2763 2462 332 -1542 -3080 -2839 -1148 1138 2879 2928 1076 -909
3858i09j722k37J506K389J470P94j445k555j847o53P79K677K070P21l68k524k262
$$ -909 -2631 -2868 -1362 1027 2497 3291 1846 -709 -2556 -3209 -2430 247 2317 3038 2670 146 -2116
3875b116j372Q54K209K359J199m07j706k465j421k32K004K354J646K26j609k386
$$ -2116 -3488 -2634 -425 1934 3133 2726 1020 -1445 -2866 -3098 -1094 1260 2906 3132 1523 -863
3891h63k146k65J723K304K100L86j082k709k131q85J490K229K044J006q00k027
$$ -863 -3009 -3274 -1551 753 2853 3239 2157 -552 -2683 -3568 -2078 151 2195 3201 2401 374
3907C74k710q96M95K498K507R95n70j825k569j375K18J626K500J579N24j515k691
$$ 374 -2336 -3232 -2737 -239 2268 3263 2693 868 -1701 -3076 -2858 -1232 1268 2847 3371 1856 -835
3924h35j980m33J048K688K442Q05j514k673k244p25J496J886K398J333j158k183
$$ -835 -2815 -3248 -2200 488 2930 3735 2221 -452 -2696 -3421 -1925 -39 2359 3692 2534 351
3940C51k873j080P19J990K887J502l38k158k442j669l33K189K703K091J03j684
$$ 351 -2522 -3602 -2883 -893 1994 3496 3158 1000 -1442 -3111 -3444 -1255 1448 3539 3642 1958
$$ [...]
##END NTUPLES=NMR FID
##END=
