##TITLE=1H_PR177rm-A
 D2O, 8 sc, 
 20.8.2019
##JCAMPDX= 6.0         $$ Bruker NMR JCAMP-DX V2.0
##DATA TYPE= NMR FID
##DATA CLASS= NTUPLES
##ORIGIN= UXNMR, Bruker Analytische Messtechnik GmbH
##OWNER= root
$$ XWIN-NMR		Version 3.5
$$ Tue Aug 20 14:39:58 2019 Russian Standard Time (UT+4h)  she@DPX200
##.OBSERVE FREQUENCY= 200.13155
##.OBSERVE NUCLEUS= ^1H
##.DELAY= (6, 6)
##.ACQUISITION MODE= SIMULTANEOUS
##.ACQUISITION SCHEME= undefined
##.AVERAGES= 8
##.DIGITISER RES= 18
##SPECTROMETER/DATA SYSTEM= spect
##.PULSE SEQUENCE= zg30
##.SOLVENT NAME= D2O
##.SHIFT REFERENCE= (INTERNAL, D2O, 0, 15.7039)
##AUDIT TRAIL= $$ (NUMBER, WHEN, WHO, WHERE, WHAT)
$$ ##TITLE= Audit trail, XWIN-NMR		Version 3.5
$$ ##JCAMPDX= 5.01
$$ ##ORIGIN= Bruker BioSpin GmbH
$$ ##OWNER= she
$$ F:/spectra/data/she/nmr/H-F/1/audita.txt
$$ ##AUDIT TRAIL=  $$ (NUMBER, WHEN, WHO, WHERE, WHAT)
(   1,<2019-08-20 14:38:40.92 +0400>,<she>,<DPX200>,
      <created by zg, POWCHK disabled, PULCHK disabled
       configuration hash MD5:
       00 E9 B6 7A A2 85 ED C7 34 08 36 98 17 FE 4E 26
       data hash MD5: 16K
       EF 1E 23 CF FD 8B 57 BB BD 91 1A B5 C5 3A AF 1C>)
$$ ##END=
$$ 
$$ hash MD5
$$ 83 BD 0E 25 AA 18 DD AD A0 90 B6 FB A5 A6 29 23
##$RELAX= 
##$RELAX= 
##$RELAX= 
##$RELAX= 
##$RELAX= 
##$RELAX= 
$$ Bruker specific parameters
$$ --------------------------
##$DU= <F:/spectra>
##$EXPNO= 1
##$NAME= <H-F>
##$PROCNO= 1
##$TYPE= <nmr>
##$USER= <she>
##$AMP= (0..31)
100 100 100 100 100 100 100 100 100 100 100 100 100 100 100 100 100 100 
100 100 100 100 100 100 100 100 100 100 100 100 100 100 
##$AQSEQ= 0
##$AQ_mod= 1
##$AUNM= <au_zg>
##$AUTOPOS= <>
##$BF1= 200.13
##$BF2= 200.13
##$BF3= 200.13
##$BF4= 200.13
##$BF5= 200.13
##$BF6= 200.13
##$BF7= 200.13
##$BF8= 200.13
##$BYTORDA= 1
##$CFDGTYP= 0
##$CFRGTYP= 5
##$CHEMSTR= <none>
##$CNST= (0..31)
1 1 145 1 1 1 1 1 1 1 1 1 1 1 1 1 1 1 1 1 1 1 1 1 1 1 1 1 1 1 1 1 
##$CPDPRG= <>
##$CPDPRG1= <>
##$CPDPRG2= <>
##$CPDPRG3= <>
##$CPDPRG4= <mlev>
##$CPDPRG5= <mlev>
##$CPDPRG6= <mlev>
##$CPDPRG7= <mlev>
##$CPDPRG8= <mlev>
##$CPDPRGB= <>
##$CPDPRGT= <>
##$D= (0..31)
0 1.2 0 0 0 0 0 0 0 0 0 0.03 0 0 0 0 0 0 0 0 0 0 0 0 0 0 0 0 0 0 0 0 
##$DATE= 1566297520
##$DBL= (0..7)
120 120 120 120 120 120 120 120 
##$DBP= (0..7)
150 150 150 150 150 150 150 150 
##$DBP07= 0
##$DBPNAM0= <>
##$DBPNAM1= <>
##$DBPNAM2= <>
##$DBPNAM3= <>
##$DBPNAM4= <>
##$DBPNAM5= <>
##$DBPNAM6= <>
##$DBPNAM7= <>
##$DBPOAL= (0..7)
0.5 0.5 0.5 0.5 0.5 0.5 0.5 0.5 
##$DBPOFFS= (0..7)
0 0 0 0 0 0 0 0 
##$DE= 6
##$DECBNUC= <off>
##$DECIM= 24
##$DECNUC= <off>
##$DECSTAT= 4
##$DIGMOD= 1
##$DIGTYP= 9
##$DL= (0..7)
0 120 120 120 120 120 120 120 
##$DP= (0..7)
150 150 150 150 150 150 150 150 
##$DP07= 0
##$DPNAME0= <>
##$DPNAME1= <>
##$DPNAME2= <>
##$DPNAME3= <>
##$DPNAME4= <>
##$DPNAME5= <>
##$DPNAME6= <>
##$DPNAME7= <>
##$DPOAL= (0..7)
0.5 0.5 0.5 0.5 0.5 0.5 0.5 0.5 
##$DPOFFS= (0..7)
0 0 0 0 0 0 0 0 
##$DQDMODE= 0
##$DR= 18
##$DS= 0
##$DSLIST= <SSSSSSSSSSSSSSS>
##$DSPFIRM= 0
$$ [...]
##$SUBNAM2= <"">
##$SUBNAM3= <"">
##$SUBNAM4= <"">
##$SUBNAM5= <"">
##$SUBNAM6= <"">
##$SUBNAM7= <"">
##$SUBNAM8= <"">
##$SUBNAM9= <"">
##$SW= 24.9336996594482
##$SWIBOX= (0..15)
0 0 2 0 0 0 0 0 0 0 0 0 0 0 0 0 
##$SW_h= 4990.01996007984
##$TD= 16384
##$TD0= 1
##$TE= 0
##$TE2= 300
##$TE3= 300
##$TEG= 300
##$TL= (0..7)
0 120 120 120 120 120 120 120 
##$TP= (0..7)
150 150 150 150 150 150 150 150 
##$TP07= 0
##$TPNAME0= <>
##$TPNAME1= <>
##$TPNAME2= <>
##$TPNAME3= <>
##$TPNAME4= <>
##$TPNAME5= <>
##$TPNAME6= <>
##$TPNAME7= <>
##$TPOAL= (0..7)
0.5 0.5 0.5 0.5 0.5 0.5 0.5 0.5 
##$TPOFFS= (0..7)
0 0 0 0 0 0 0 0 
##$TUNHIN= 0
##$TUNHOUT= 0
##$TUNXOUT= 0
##$USERA1= <user>
##$USERA2= <user>
##$USERA3= <user>
##$USERA4= <user>
##$USERA5= <user>
##$V9= 5
##$VALIST= <valist>
##$VCLIST= <CCCCCCCCCCCCCCC>
##$VD= 0
##$VDLIST= <DDDDDDDDDDDDDDD>
##$VPLIST= <PPPPPPPPPPPPPPP>
##$VTLIST= <TTTTTTTTTTTTTTT>
##$WBST= 1024
##$WBSW= 4
##$XGAIN= (0..3)
0 0 0 0 
##$XL= 0
##$YL= 0
##$YMAX_a= 633198
##$YMIN_a= -978216
##$ZGOPTNS= <>
##$ZL1= 120
##$ZL2= 120
##$ZL3= 120
##$ZL4= 120
##$ABSF1= 10
##$ABSF2= 0
##$ABSG= 5
##$ABSL= 3
##$ALPHA= 0
##$AQORDER= 0
##$ASSFAC= 0
##$ASSFACI= 0
##$ASSFACX= 0
##$ASSWID= 0
##$AUNMP= <proc_1d>
##$AZFE= 0.1
##$AZFW= 0.1
##$BCFW= 1
##$BC_mod= 2
##$BYTORDP= 1
##$COROFFS= 0
##$CY= 11.3945322036743
##$DATMOD= 1
##$DC= 2
##$DFILT= <>
##$DTYPP= 0
##$F1P= 20.1720416913024
##$F2P= 0.152960286110954
##$FCOR= 0.5
##$FTSIZE= 0
##$FT_mod= 4
##$GAMMA= 1
##$GB= 0.15
##$INTBC= 1
##$INTSCL= 1
##$ISEN= 128
##$LB= 0.24
##$LEV0= 0
##$LPBIN= 0
##$MAXI= 10000
##$MC2= 0
##$MEAN= 0
##$ME_mod= 0
##$MI= 1.114404
##$NCOEF= 0
##$NC_proc= 0
##$NLEV= 6
##$NOISF1= 3.799351
##$NOISF2= 2.8
##$NSP= 1
##$NTH_PI= 0
##$NZP= 0
##$OFFSET= 15.70392
##$PC= 1
##$PHC0= -9218.427
##$PHC1= 15.20096
##$PH_mod= 1
##$PKNL= yes
##$PPARMOD= 0
##$PSCAL= 0
##$PSIGN= 0
##$REVERSE= no
##$SF= 200.130013532006
##$SI= 16384
##$SIGF1= 3
##$SIGF2= 2
##$SINO= 400
##$SIOLD= 16384
##$SREGLST= <1H.CDCl3>
##$SSB= 0
##$STSI= 0
##$STSR= 0
##$SW_p= 3612.71676300578
##$SYMM= 0
##$S_DEV= 0
##$TDeff= 0
##$TDoff= 0
##$TI= <>
##$TILT= no
##$TM1= 0
##$TM2= 0
##$TOPLEV= 0
##$USERP1= <user>
##$USERP2= <user>
##$USERP3= <user>
##$USERP4= <user>
##$USERP5= <user>
##$WDW= 1
##$XDIM= 8192
##$YMAX_p= 0
##$YMIN_p= 0
$$ End of Bruker specific parameters
$$ ---------------------------------
##NTUPLES= NMR FID
##VAR_NAME=  TIME,          FID/REAL,        FID/IMAG
##SYMBOL=    X,             R,               I
##VAR_TYPE=  INDEPENDENT,   DEPENDENT,       DEPENDENT
##VAR_FORM=  AFFN,          ASDF,            ASDF
##VAR_DIM=   8192,          8192,            8192
##UNITS=     SECONDS,       ARBITRARY UNITS, ARBITRARY UNITS
##FACTOR=    0.0002004,     1,               1
##FIRST=     0,             0,               0
##LAST=      1.6414764,     0,               0
##MIN=       0,             -978216,         0
##MAX=       1.6414764,     633198,          0
$$ Real data points
##PAGE= N=1
##DATA TABLE= (X++(R..R)), XYDATA
$$ [...]
$$ plain form
3006 -4614 6431 14269 14382 6944 -4841 -13789 -15093 -7676 4068 13188 14912 8697 -2164 -11983
3020 -11983 -15316 -10024 1161 11332 15464 10596 107 -10352 -15343 -11820 -1728 9217 14781
3033 14781 12241 2914 -7767 -15112 -13691 -4466 7121 14577 13702 5679 -5642 -13368 -14356 -6991
3047 -6991 4192 13286 14914 7917 -3338 -12360 -14667 -8771 1524 11350 14971 10194 -297 -10555
3061 -10555 -14966 -10875 -941 9716 14701 11991 2275 -8704 -14284 -12472 -3710 7397 13958 13282
3075 13282 5005 -5875 -14011 -13998 -6201 5004 13351 13815 7100 -3715 -12312 -14212 -8322 2088
3089 2088 11626 14633 9066 -1455 -10948 -14417 -9741 -161 9667 14270 11070 1255 -8855 -14190
3103 -14190 -11630 -2956 8089 14207 12341 3451 -6729 -13439 -13064 -5334 5439 13307 13966 6023
$$ packed form
3006d614J1045P838J13p438j1785q948j304P417J1744R120J724o215j0861r819
3020a1983l333N292J1185J0171M132m868j0489j0459m991L523J0092J0945N564
3033A4781k540r327j0681p345J421R225J1587P456q75q023j1321p726r88P365
3047f991J1183R094J628o997j1255r022k307N896J0295R826L621m777j0491j0258
3061a0555m411M091R934J0657M985k710r716j0979n580J812Q762J1107O561o76
3075A3282q277j0880q136J3P797J1205Q347M64o715j0815q597j900N890J0410
3089B088R538L007n567j0521r493l469M676R580R828M603l200r815j0110n335
3103a4190K560Q674J1045O118j866q890j0180o710L75P730J0773P868O59p943
$$ plain form
3117 6023 -4394 -12469 -13510 -7125 3183 11562 14021 8715 -1510 -11057 -14259 -9010 607 9842
3131 9842 13907 10095 621 -9446 -13844 -10781 -1698 8167 13433 11909 3222 -7150 -13494 -12000
3145 -12000 -3644 6430 12842 12661 5067 -4654 -12490 -13114 -6470 3846 12103 13163 7372 -2817
3159 -2817 -11289 -13716 -8449 1465 10595 13485 8984 -1 -9623 -13810 -10279 -855 8893 13535 10572
3174 10572 2110 -7656 -13018 -11752 -3495 6412 12934 12100 4275 -5589 -12573 -12555 -5495 4311 11912
3189 11912 12628 6954 -3062 -11229 -13194 -7647 2128 10643 13252 8367 -999 -9395 -13346 -9476 -602
3204 -602 8791 12987 9979 1493 -7962 -13241 -10696 -2357 6936 12272 11217 4204 -5302 -12260 -12513
3219 -12513 -4970 5124 12128 11987 5559 -3667 -10892 -12651 -7453 2450 10981 13121 7975 -1526 -10023
$$ packed form
3117F023j0417q075j041O385J0308Q379K459n306j0225r547l202N249R617R235
3131I842M065l812r474j0067m398L063R083R865N266j524q687j0372o344J494
3145a2000Q356J0074O412j81p594r721p836o24O644J0316Q257J060n791j0189
3159b817q472k427N267R914R130K890m501q985r622m187L531R424R748M642k963
3174A0572q462r766n362J266Q257R907O522q34p825r864o984J8P060R806P601
3189A1912P16n674j0016q167j965N547R775Q515K609m885r366q396l951L870Q874
3204f02R393M196l008q486r455n279K545Q339R293N336j055p013r506o958k53
3219a2513P543J0094P004j41o428r226p225j759N198R903Q531K140n146r501q497
$$ plain form
3234 -10023 -12971 -8655 282 9207 12757 9317 1156 -8187 -12881 -10021 -2131 7225 12373 10882 3067
3249 3067 -6276 -12022 -11310 -4390 5310 11827 11737 5180 -4144 -11123 -12116 -6562 2775 10734 12361 6941
3265 6941 -2319 -9745 -12350 -7698 834 8801 12316 8476 145 -8408 -12638 -9453 -1152 8121 12322
3280 12322 9672 2245 -5913 -11833 -11046 -3821 5754 12145 11009 4131 -4631 -10510 -11367 -6159 3236
3295 3236 10635 12002 6095 -2948 -9996 -11986 -7289 949 9312 11902 7891 -593 -8399 -11900 -8764
3310 -8764 -663 7700 12052 9553 1519 -6854 -11060 -9934 -3056 5519 11822 11007 3530 -5452 -10540
3325 -10540 -10258 -4643 3573 10226 11544 6273 -3046 -10365 -11355 -6346 1761 9310 11165 7018 -834
3340 -834 -8393 -11474 -8380 -463 8106 11598 8970 979 -6856 -11125 -9256 -2516 5995 11227 10196
$$ packed form
3234a0023k948M316Q937Q925L550l440q161r343m694K860P890R356N148j491p815
3249C067r343n746P12O920R700O517r0o557r324o979r93N554R337P959J627n420
3265F941r260p426k605M652Q532P967L515l840q331q553m230L185Q301R273M201
3280A2322k650p427q158n920P87P225R575O391j136o878q762n879q57N208R395
3295C236P399J367n907r043p048j990M697Q238Q363K590m011q484p806l501L136
3310h764Q101Q363M352k499q034q373m206J126O878Q575O303q15p477q982n088
3325a0540K82N615Q216O653J318n271r319p319r90N009Q107P549J855m147p852
3340h34p559l081L094P917Q569L492k628p991p835m269J869O740Q511N232j031
$$ plain form
3355 10196 3172 -5464 -10902 -10319 -3897 4330 10209 10725 5207 -3351 -9784 -10897 -5748 2503 9298
3370 9298 10953 6718 -1172 -8442 -10970 -7337 10 7907 11028 8355 538 -7241 -10911 -8465 -1565
3385 -1565 6183 10374 9289 2637 -5748 -10581 -9385 -3040 4836 9873 10090 4716 -3404 -9903 -10576
3400 -10576 -5146 3208 9224 10393 6117 -1796 -8554 -10871 -6544 971 8173 10782 7538 220 -7294
3415 -7294 -10721 -8089 -557 6510 10253 8506 1972 -5672 -10549 -9342 -3034 5385 9897 9309 3580
3430 3580 -3981 -8977 -9968 -4988 3030 9263 10297 5698 -2303 -8655 -9898 -6138 988 7754 10457
3445 10457 7172 -9 -7541 -10279 -7413 -562 6647 9934 7935 1617 -5832 -10228 -8571 -2542 4876
3460 4876 9447 9025 3467 -4267 -9611 -9541 -4120 3402 8866 9554 5047 -2182 -8614 -9779 -5609 2016
$$ packed form
3355A0196p024q636n438N83O422Q227N879N16n518q558o433j113N149Q251O795
3370I298J655m235p890p270k528L633P347P897L121k673p817p779l670K446O900
3385a565P748M191j085o652q385m833J196O345P876N037K17n374q120o499o73
3400a0576N430Q354O016J169m276p913o758k317M327P515P202K609l244p318p514
3415g294l427K632P532P067L743j747o534p644m877J207O308Q419M512n88n729
3430C580p561m996r91M980Q018O233J034m599q001o352j243L760P126O766K703
3445A0457l285p181p532k738K866O851P209L287j999o318p449m396J657O029P418
3460D876M571m22n558p734n344P0N421P522N464O88m507p229o432j165M170P625
$$ plain form
3476 2016 8023 10096 6310 -776 -7573 -9844 -6827 -198 6959 9902 7411 1105 -6004 -9690 -8329
3491 -8329 -1916 5362 9628 8335 2420 -4543 -9249 -8684 -3638 3525 9024 9338 4256 -3079 -8509
3506 -8509 -9407 -4909 1650 7644 9590 5726 -1112 -7598 -9497 -6321 367 6808 9421 6934 425
3521 425 -6183 -9060 -7683 -1352 5595 9472 8332 2289 -5004 -9118 -8415 -2632 4404 9142 8601 3769
3537 3769 -3014 -8653 -9010 -4263 2698 8004 8878 4804 -1583 -7201 -8919 -5781 814 7002 9261
3552 9261 6293 264 -6449 -9283 -7449 -926 6087 8752 7173 1601 -5128 -8642 -8092 -2758 4505
3567 4505 9052 8258 3023 -3757 -8449 -8419 -3897 2683 8140 8933 4812 -2006 -7360 -9057 -5271 1097
3583 1097 7085 9033 5910 -359 -6332 -9150 -6287 -763 5763 8909 7022 1334 -5387 -8816 -7462
$$ packed form
3476B016O007K073l786p086o797k271L017O629P157K943k491o306p109l686J361
3491h329O413P278M266j293n915o963m706N65N046P163N499L14n082p335n430
3506h509q98M498O559N994J946l864o838o486j899L176O688O441K613k487o509
3521D25o608k877J377O331O947L877j140o043p293m114P03N783P036M738n41m832
3537C769o783n639l57M747O961N306Q74m074o387n618j718L138O595O188K259
3552I261k968o029o713k834J834O523P013K665j579n572o729l514N50N334P263
3567D505M547p94n235o780m692L0M522O580N457P93m121o818n354j697L786O368
3583A097N988J948l123o269n973k818K863N524O526L146j887n688o721l429J354
$$ plain form
3598 -7462 -1940 4646 8162 7643 2464 -4189 -8310 -8039 -3411 3093 7996 8371 3937 -2153 -7191 -8752
3614 -8752 -4997 1514 7345 8647 5248 -1045 -6272 -8666 -6265 295 5872 8393 6550 603 -5430
3629 -5430 -8521 -6609 -1770 4558 8354 7432 2422 -4319 -8278 -7528 -2888 3316 7426 7634 3582 -2618
3645 -2618 -7080 -8292 -4305 1767 7043 8228 5178 -938 -6167 -8629 -5461 339 6012 8366 6204
3660 6204 499 -5559 -8257 -6377 -912 4719 7915 6797 1625 -4031 -7859 -7437 -2650 3644 7639
3675 7639 7548 3145 -2838 -7560 -8065 -4085 2247 7037 8166 4263 -1654 -6341 -7822 -5116 584 6459
3691 6459 7910 5775 -80 -5162 -7926 -5857 -763 4653 8045 6902 1731 -4774 -7677 -6986 -2130
3706 -2130 3971 7516 7101 2654 -3170 -7277 -7436 -3491 2388 7222 7643 4048 -1747 -6928 -7660 -4451
$$ packed form
3598g462N522O586L516n19n179o653m121K71M628O504M903L75m434o090n038j561
3614h752L755O511N831J302l399o293n227k394K401O560N577K521j843n947o033
3629e430l091J912M839O328L796r22n010o741l959P50M640O204M110K08m052o200
3645b618m462j212L987O072N276J185l050o116n229k462L168N800N673K354k162
3660F204n705o058k698J880N465N631L196j118n172n656l828M22M787O294L995
3675G639r1m403n983m722n05L980O332M790J129l903n917m687j481K706N700N875
3691F459J451k135n855n082k764K069N094N416L392j143n171o505k903O91M856
3706b130O101L545m15m447n824m107j59L945N879M834M21l595n795n181p32L209
$$ plain form
3722 -4451 1071 6013 7733 5534 -527 -5908 -8194 -5665 -497 4973 7742 6024 1145 -4308 -7731
3737 -7731 -6269 -1690 4175 7316 6781 2882 -3112 -7347 -7136 -3201 2752 7159 7262 3534 -2082 -6358
3753 -6358 -7604 -4439 1247 5857 7689 4791 -788 -5604 -7420 -5296 50 5135 7617 5820 760
3768 760 -4641 -7430 -6031 -1551 4154 7520 6704 2041 -3749 -7213 -6721 -2660 2659 6647 6991 3247
3784 3247 -2109 -6874 -7314 -3884 1537 6414 7129 4559 -1020 -6161 -7836 -4967 170 5347 7452
3799 7452 5632 278 -4894 -7371 -5666 -792 4175 7273 5795 1690 -3841 -6889 -6656 -2377 3075
3814 3075 6880 6816 2658 -2463 -6280 -6788 -3332 1812 6395 7190 3915 -1165 -5488 -7303 -4800 541
3830 541 5522 7246 5027 72 -4814 -7104 -5511 -740 4484 7091 5836 1414 -4181 -6811 -6000
$$ packed form
3722d451N522M942J720k199o061n381k286K529N168N470K769j718m879n453l423
3737g731J462M579N865L141n35l899n994m235K11L935N953M407J03l728n616m276
3753f358j246L165N686M610J832k898n579m816j816K124N346N085K482j797n060
3768G60n401k789J399M480N705L366q16m663n790l464M92M061N319L988L44l744
3784C247n356m765m40L430N421M877P15k570n579n141j675K869N137N177K105
3799G452j820n354n172k477J705M874M967L098j478m105n531l048K33M279N452
3814C075L805o4m158n121l817n08L456N144M583P95l275n080m323j815K503N341
3830E41M981J724k219m955m886k290J593M771N224K607j255m422n595k630Q11
$$ plain form
3845 -6000 -1904 3194 6562 6451 2898 -2778 -6527 -6560 -3305 2266 5975 6660 3841 -1293 -5355 -7051
3861 -7051 -4078 842 5584 7149 4958 -130 -5013 -6948 -5249 -417 4349 6705 5518 1028 -3773
3876 -3773 -6674 -6255 -1940 3614 6573 6215 2004 -3017 -6318 -6337 -3029 2115 6175 6676 3288 -1967
3892 -1967 -5483 -6697 -3802 1149 5328 6689 4545 -551 -5349 -6606 -4933 -204 4431 7171 5025
3907 5025 884 -4049 -6756 -5598 -1446 3599 6645 5911 1853 -3031 -6338 -5996 -2440 2357 6073
3922 6073 6101 2999 -1647 -5464 -6367 -3518 1054 5342 6693 3710 -668 -5031 -6918 -4518 -91 4672
3938 4672 6456 4813 518 -4061 -6594 -5490 -1348 3370 6380 5401 1599 -3199 -5765 -5542 -2447
3953 -2447 2309 5969 6188 2943 -2141 -5628 -6339 -3139 1615 5343 6305 3637 -734 -5394 -6628 -4018
$$ packed form
3845f000M096N098L368j11l553n676l749l3L255N571L709O85k819n134m062j696
3861g051K973M920M742J565k191n088m883j935J699M832M766K356j187m490m801
3876c773k901M19M315N554K959l58m211n021l301j9L308N144M060N01l388n255
3892a967l516j214K895M951M179J361k144n096m798j257J673M729M635K740k146
3907E025m141m933k707J158M152N045L046p34m058m884l307L42L556M797L716
3922F073K8l102m646l817r03K849M572M288J351k983m378m363j887K400M427M763
3938D672J784j643m295m579k533J104M142M718L010r79l802m798k566K23L095
3953b447M756L660K19l245n084l487p11L200M754L728R62k668m371m660j234K610
$$ plain form
3969 -4018 391 4868 6427 4456 156 -4555 -6521 -4916 -751 3621 6423 5351 1421 -3599 -6326
3984 -6326 -5366 -1790 3039 5754 5954 2674 -2214 -6000 -6119 -2706 1932 5434 5707 3254 -1367 -5065
4000 -5065 -5866 -3760 612 4660 6133 4182 -252 -4044 -5951 -4337 -522 4175 6297 4669 786
4015 786 -3389 -6169 -5371 -1616 2911 5750 5348 1746 -2505 -5819 -5668 -2683 2062 5242 5615 2683
4031 2683 -1344 -4908 -5740 -3445 898 4844 5727 3795 -240 -4656 -5998 -3852 65 3797 5697
4046 5697 4485 905 -3221 -5872 -4976 -1230 3485 5867 5189 1862 -2510 -5849 -5762 -2293 2301 5280
4062 5280 5466 2719 -1566 -5102 -5681 -2980 1084 4919 5853 3759 -676 -4373 -5732 -4139 240 3994
4078 3994 5750 4144 448 -3395 -5680 -4569 -1129 3178 5741 4995 1283 -2917 -5193 -5226 -1755 2331
$$ packed form
3969d018M409M477J559j971m300m711j966J605M165M372K802j072l930n020k727
3984f326R60L576M829K715K00l280m888l786j19L413M638L502K73k453m621l698
4000e065q01K106M372M048J473j951m434l792j907J614L815M697K122j628l883
4015G86m175k780P98L755M527K839m02l602m251l314J51K985M745L180L73k932
4031B683m027l564q32K295M343L946Q83j932m035m416j342K146L917L732J900
4046E697j212l580m126k651Q96L746M715K382o78l327m372l339Q7L469M594K979
4062E280J86k747m285l536n79K701M064L835R34k094m435l697j359J593M379L754
4078C994J756j606l696l843k285J111L440M307K563p46l712m200k276l3L471M086
$$ plain form
4094 2331 5299 5067 2569 -2018 -5203 -5282 -2650 1088 4454 5369 3295 -485 -4518 -5785 -3559 285
4110 285 4051 5626 4470 310 -3498 -5712 -4282 -619 3391 5409 4692 1460 -2896 -5252 -4805 -1794
4126 -1794 2556 5027 5135 2139 -1681 -5243 -5238 -2682 1449 5017 5110 2915 -968 -4237 -5577 -3605
4142 -3605 494 4171 5718 3733 53 -3642 -5059 -4020 -414 3087 5366 4212 1109 -3249 -5056
4157 -5056 -4526 -1165 2587 4814 4809 1766 -2120 -4864 -4981 -2264 1708 4420 5116 2622 -1195 -4386
4173 -4386 -5193 -3107 671 4159 5166 3732 -442 -3862 -5178 -3745 -78 3447 5258 3827 541
4188 541 -3231 -5557 -4264 -1022 2566 4969 4459 1484 -2331 -4696 -4565 -1996 1845 4663 4720 1974
4204 1974 -1667 -4216 -4784 -2784 833 4246 5374 3045 -879 -3644 -5060 -3222 20 3350 5056
$$ packed form
4094B331K968k32k498m587l185p9K632L738L366R15k074l780m033j267K226L844
4110B85L766J575j156m160l808k214J430L663M010K018p17l232m356k356M47L011
4126a794M350K471J08k996l820l562NK556M131L568R3k195l883l269j340J972
4142c605M099L677J547j985l680l695j417J039L606L501K279j154l103m358j807
4157e056N30L361L752K227nl043l886k744j17K717L972K712O96k494l817l191
4173d386q07K086L778L488J007j434m174l420j316J433L667L525J811j431l286
4188E41l772k326J293L242L588K403n10k975l815k365J31K569L841K818N7k746
4204A974l641k549n68K000L617L413J128k329l924k765j416J838L242L330J706
$$ plain form
4219 5056 3467 466 -3388 -4996 -4109 -619 3018 4785 4423 957 -2610 -4583 -4390 -1734 2076 4620
4235 4620 4915 2187 -1634 -4289 -4619 -2348 1160 4157 4876 2956 -692 -3853 -4941 -2860 318 3558
4251 3558 4644 3360 341 -3423 -5105 -3459 -485 2834 4720 3872 960 -2651 -4565 -4295 -1551
4266 -1551 2195 4487 4294 1519 -1918 -4189 -4443 -2082 1472 4163 4481 2502 -1119 -4093 -4536 -2979
4282 -2979 474 3513 4911 3115 53 -3197 -4354 -3426 -481 2744 4758 3575 905 -2874 -4359
4297 -4359 -3754 -1184 2186 4057 4236 1517 -1843 -4225 -4420 -1567 1708 4085 4451 1980 -1006 -3691
4313 -3691 -4346 -2349 754 3528 4484 3013 -131 -3075 -4577 -3139 -76 3025 4521 3369 432
4328 432 -2669 -4087 -3773 -882 2374 4902 3778 1099 -1896 -4098 -3885 -1485 1575 4294 4412 1887
$$ packed form
4219E056j589l001l854j608Q87L490L637J767l62l466l567j973J93K656L810K544
4235D620K95k728l821k655l30K271L508K997P19j920l648l161j088K081L178L240
4251C558J086j284l019l764j682J646K974L319J886q48k912l611j914K70K744
4266a551L746K292j93k775l437k271k54K361L554K691L18j979l621k974m43J557
4282b979L453L039J398j796l062l250j157R28K945L225K014j183k670l779j485
4297d359O05K570L370J871J79k719l360k382j95K853L275K377L66k471k986k685
4313c691o55J997L103K774R56j471l144k944j502J438L063L101J496j152k937
4328D32l101j418L14K891L256K528j124k679k995k202K13K400L060K719J18k525
$$ plain form
4344 1887 -1172 -3786 -4419 -2227 765 3471 4207 2695 -495 -3463 -4396 -3201 20 3056 4001 3069
4360 3069 84 -2580 -4205 -3341 -683 2337 4288 3302 1270 -2277 -4263 -3661 -1157 1430 3774 3854
4376 3854 1987 -1410 -3526 -3950 -2062 833 3499 4127 2411 -535 -3346 -4418 -2962 411 3225
4391 3225 4087 2780 -259 -2756 -3673 -3178 -430 3189 4563 3209 671 -2204 -3507 -3653 -1362 1798
4407 1798 3950 3727 1231 -1638 -3844 -3762 -1852 981 3653 4084 1981 -1238 -3488 -4016 -2201 754
4423 754 3045 3993 2635 -360 -2791 -4126 -2920 -92 2671 4163 2913 821 -2475 -3553 -3290 -854
4439 -854 2052 3735 3800 1330 -1827 -3889 -3267 -1381 1094 3538 3501 1852 -1265 -3376 -4091 -1988 615
4456 615 2956 3717 2289 -220 -2668 -3760 -2525 -283 2477 3977 2950 175 -2358 -3723 -2900 -835
$$ packed form
4344A887l059k614o33K192K992K706P36j512l190k968r33J195L221L036R45r32
4360C069k985k664j625Q64K658L020J951r86k032l547j986O02K504K587K344Q0
4376C854j867l397k116m24J888K895K666O28j716k946k811j072J456L373K814
4391C225Q62j307l039k497r17M95K748L619J374j354k538k875j303j46K291L160
4407A798K152k23k496k869k206Q2J910K833K672M31k103l219k250n28J815K955
4423G54K291R48j358k995k431j335J206K828K763J492j250k092l296j078K63K436
4439h54K906J683O5k470l157k062O22J886K475K444l7j649l117k111p15K103K603
4456F15K341P61j428k509k448j092J235K242K760J500j027k775k533j365Q23K065
$$ plain form
4472 -835 1905 3700 3367 1095 -2013 -3605 -3211 -1603 1439 3376 3446 1576 -971 -3169 -3589 -2074
4488 -2074 1143 2780 3867 2065 -357 -2560 -3498 -2559 198 2658 3745 2716 261 -2674 -3552 -2768
4504 -2768 -383 1864 3480 3305 1027 -1991 -3694 -3174 -1076 1712 3402 3457 1315 -1287 -3224 -3784
4520 -3784 -2067 857 3057 3578 1644 -458 -2680 -3284 -2406 -40 2591 3525 2503 159 -2301 -3233
4536 -3233 -2527 -323 2124 3461 2918 841 -1632 -3491 -2923 -837 1761 3485 2792 1372 -1450 -3285
4552 -3285 -3013 -1921 1062 2821 3511 1912 -847 -2836 -3487 -1958 634 2617 3743 2556 -2 -2344
4568 -2344 -3575 -2136 -153 2103 3382 2787 813 -1919 -3386 -2996 -738 1635 3055 3202 1116 -1162
4584 -1162 -3164 -3131 -1313 994 3116 3503 1597 -897 -3081 -3086 -1545 439 2667 3323 2164 -5 -1970
$$ packed form
4472h35K740J795l33k272l108j592L94J608L042J937P0j870k547k198m20J515
4488b074L217J637J087j802k422k203r38R39K757K460J087j029k455k935q78P84
4504b768K385K247J616j75k278l018j703N20K098K788J690N5k142k602j937n60
4520c784J717K924K200N21j934k102k222o04Q78K366K631R34j022k344k460r32
4536c233P06K204K447J337n43k077k473j859N68K086K598J724o93j420k822j835
4552c285K72J092K983J759O90j599k759j989o51J529K592J983J126j187k558k342
4568b344j231J439J983K256J279n95j974k732j467L90K258K373J420J47k086k278
4584a162k002L3J818K307K122L87j906k494k184nJ541J984K228O56j159k169j965
$$ plain form
4601 -1970 -3486 -2166 -39 1971 3172 2526 186 -1787 -3379 -2616 -621 1733 2993 2697 929 -1421
4617 -1421 -2991 -2803 -1053 1210 2984 2998 1545 -1089 -2712 -2973 -1663 561 2322 3048 2006 -261
4633 -261 -2090 -3089 -2310 10 2183 2996 2287 251 -2028 -3102 -2188 -552 1519 3151 2298 794 -1410
4650 -1410 -2930 -2824 -1233 1427 2806 2894 1320 -921 -2681 -2827 -1653 765 2413 3176 1299 -482
4666 -482 -2330 -3041 -1984 381 1805 2629 1978 105 -1788 -3098 -2100 -289 1873 2929 2553 540
4682 540 -1565 -2770 -2704 -637 1393 3014 2739 1116 -1118 -2673 -2338 -1470 950 2594 3021 1745 -258
4699 -258 -2156 -2891 -1765 290 2011 2614 2030 284 -1940 -2916 -2033 -370 1758 2948 2605 541 -1351
4716 -1351 -2776 -2360 -544 1175 2770 2537 1073 -876 -2295 -2681 -1290 971 2825 2643 1343 -683
$$ packed form
4601a970j516J320K127K010J201o46k340j973j592P63J995K354J260k96j768k350
4617a421j570J88J750K263J774J4j453k634j623k61J310K224J761P26j042k267
4633b61j829r99P79K320K173Q13p09k036k279j074R14J636K071J632q53j504k204
4650a410j520J06J591K660J379Q8j574k241j760j46J174K418J648P63j877j781
4666d82j848p11J057K365J424Q24o51j873j893j310R98J811K162J056l76k013
4682E40k105j205O6K067K030J621k75j623k234j555L35Q68K420J644M27j276k003
4699b58j898p35J126K055J721O03n84j746k224r76Q83J663K128J190l43k064j892
4716a351j425M16J816J719J595k33j464j949j419l86J391K261J854j82j300k026
$$ plain form
4732 -683 -2142 -2835 -1811 344 2223 2657 1825 -210 -2062 -2657 -1672 -77 1629 3054 1918 434
4748 434 -1615 -2564 -2325 -757 1170 2625 2778 1248 -1089 -2445 -2188 -1118 894 2414 2706 1204
4764 1204 -618 -2102 -2504 -1373 494 2333 2463 1635 2 -1939 -2797 -1953 120 1852 2741 2346 282
4781 282 -1541 -2546 -2126 -661 1437 2512 2258 508 -961 -2091 -2642 -864 953 2601 2413 1273
4797 1273 -986 -2118 -2325 -1444 221 2073 2547 1426 49 -1649 -2536 -1744 -363 1971 2856 1972 86
4814 86 -1777 -2257 -1883 -81 1247 2432 1949 655 -1240 -2377 -2345 -826 1140 2143 2117 741 -749
4831 -749 -2206 -2507 -1053 594 2143 2380 1305 -249 -1927 -2361 -1774 103 1742 2501 1440 131
4847 131 -1579 -2484 -1964 -153 1602 2470 2002 325 -1388 -2276 -2386 -965 1300 2046 2175 625 -802
$$ packed form
4732f83j459o93J024K155J879M34q32k035j852n95R85J595J706J425j136j484
4748D34k049r49K39J568J927J455J53j530k337j356K57J070K012J520K92j502
4764A204j822j484m02J131J867J839J30q28j633j941q58Q44K073J732Q89l95k064
4781B82j823j005M20J465K098J075k54j750j469j130n51J778J817J648j88j140
4797A273k259j132k07Q81J665J852M74j121j377j698q87P92J381K334Q85q84j886
4814H6j863m80L74J802J328J185m83j294j895j137L2J519J966J003k6j376j490
4831g49j457l01J454J647J549K37j075j554j678m34N87J877J639P59j061j309
4847A31j710r05N20J811J755Q68m68j677j713q88j10J421K265P46J29j550j427
$$ plain form
4864 -802 -2341 -2314 -1032 925 2258 2402 1257 -267 -2371 -2464 -1528 287 1934 2162 1891 -3 -1606
4881 -1606 -2134 -1540 -271 1162 2285 2000 724 -1326 -2463 -2351 -722 1093 2168 2289 887 -969
4897 -969 -2059 -2078 -985 886 1894 2382 1332 -459 -1909 -2028 -1353 509 1716 2266 1621 16 -1465
4914 -1465 -2134 -1791 -14 1530 2315 1670 459 -1489 -2184 -2101 -478 1030 2248 2098 456 -926 -1975
4931 -1975 -2088 -890 549 2046 1967 1293 -607 -1964 -2067 -867 457 1502 2465 1361 -206 -1894
4947 -1894 -2142 -1462 116 1607 2304 1363 222 -1533 -2349 -1905 -395 1171 2112 1840 740 -1370 -1921
4964 -1921 -1826 -617 806 1902 2136 1307 -687 -1693 -2264 -1076 465 1569 2096 1204 -194 -1884 -2132
4981 -2132 -1377 115 1567 2208 1492 167 -1301 -2343 -1813 -567 1198 2270 1575 558 -1236 -1877
$$ packed form
4864h02j539K7J282J957J333J44j145j524k104r3R36J815J647K28k71j894j603
4881a606n28N94J269J433J123k85j276k050j137J12J629J815J075J21j402j856
4897i69j090j9J093J871J008M88j050j791j450j19O75J862J207N50o45j605j481
4914a465o69L43J777J544P85o45j211j948o95Q3J623J508J218j50j642j382j049
4931a975j13J198J439J497p9o74j900j357j03J200J324J045R63j104j567j688
4947a894k48O80J578J491O97r41j141j755q16M44J510J566R41k72j100k110n51
4964a921R5J209J423J096K34q29j994j006n71J188J541J104N27q92j398j690k48
4981b132P55J492J452O41p16j325j468j042N30J246J765J072o95j017j794o41
$$ plain form
4997 -1877 -1856 -967 934 2148 1877 716 -867 -1952 -1864 -722 868 2183 2122 1349 -460 -1865 -2241
5014 -2241 -1103 254 1623 2087 1436 105 -1336 -2107 -1728 -121 1287 1968 1812 17 -1068 -1911 -1699
5031 -1699 -620 1016 1954 1759 549 -1200 -2023 -1959 -697 598 2028 2115 1060 -641 -1560 -1985 -1198
5048 -1198 -3 1758 2237 1433 -220 -1627 -2168 -1403 -51 1342 2204 1708 246 -942 -1847 -1734 -349
5065 -349 1095 2088 2081 395 -725 -1788 -2054 -686 670 1851 2049 782 -709 -2036 -2142 -1029 353
5082 353 1563 1952 1301 -490 -1764 -1995 -1301 85 1425 2176 1235 202 -1470 -2138 -1476 -289 1032
5099 1032 2090 1556 685 -1126 -1854 -1882 -541 985 1781 2158 518 -804 -1941 -1968 -952 377 1568
5116 1568 1785 897 -374 -1791 -1957 -1080 460 1546 2047 1322 -134 -1317 -1940 -1735 -161 1073 1773
$$ packed form
4997a877K1Q89J901J214k71j161j583j085Q8J142J590J315o1p73j809j405l76
5014b241J138J357J369M64o51j331j441p71L79J607J408O81j56j795j085q43K12
5031a699J079J636R38j95j210j749q23O4J262J295J430Q7j055j701r19m25P87
5048a198J195J761M79q04j653j407n41P65J352J393Q62m96j462j188r05J13J385
5065c49J444R93pj686j120j063k66J368J356J181J98j267j491j327j06J113J382
5082C53J210L89o51j791j274k31O94J386J340P51r41j033j672o68O62J187J321
5099A032J058n34q71j811p28k8J341J526P96L77j640j322j137k7J016J329J191
5116A568K17q88j271j417j66Q77J540J086N01p25j456j183o23K05J574J234P00
$$ plain form
5133 1773 1550 187 -862 -2027 -1519 -492 926 1815 1899 840 -667 -1615 -1751 -406 763 1984 1775
5150 1775 969 -376 -1321 -1854 -953 498 1583 1747 1110 -189 -1432 -1696 -1319 -49 1208 2025 1528
5167 1528 122 -1299 -1856 -1578 -702 1063 2175 1903 487 -1080 -1543 -1588 -956 679 1773 1804 652
5184 652 -662 -1886 -1718 -950 562 1620 1605 1000 -284 -1388 -1585 -1205 -53 1257 1762 1251 -158
5201 -158 -1232 -1430 -1746 -178 961 1776 1455 692 -710 -1765 -1645 -681 751 1469 1943 791 -551
5218 -551 -1807 -1796 -1152 588 1552 1693 1288 -246 -1455 -1755 -859 -121 1403 1649 1496 309 -1141 -1694
5236 -1694 -1205 14 1288 1625 1427 315 -841 -1913 -1686 -518 542 1695 1645 729 -987 -1406 -1285
5253 -1285 -545 444 1615 1566 793 -642 -1193 -1588 -1244 81 1529 1843 1379 64 -1418 -1639 -1305 -258
$$ packed form
5133A773k23j363j049j165N08J027J418Q89Q4j059j507r48j36J345J169J221k09
5150A775q06j345r45n33R01J451J085J64o37j299j243k64L77J270J257Q17m97
5167A528j406j421n57K78Q76J765J112k72j416j567m63m5O32J635J094L1j152
5184F52j314j224J68P68J512J058j5o05j284j104j97L80J152J310N05n11j409
5201a58j074j98l16J568J139Q15l21p63j402j055J20R64J432P18M74j152j342
5218e51j256J1O44J740R64J41m05j534j209l00Q96P38J524K46j53j187j450n53
5236a694M89J219J274L37j98j112j156j072K27J168J060J153n0r16j716m19J21
5253a285P40R89J171m9p73j435n51l95L44J325J448L14m64j315j482k21L34J047
$$ plain form
5271 -258 1045 1634 1451 -56 -981 -1362 -1565 -382 770 1804 1549 261 -928 -1616 -1639 -496 616
5288 616 1273 1326 1068 -465 -1628 -1598 -954 563 1162 1495 1234 -282 -1122 -1665 -909 69 865 1632 797
5307 797 -10 -1364 -1494 -1482 -213 799 1648 1515 264 -680 -1591 -1473 -485 731 1826 1537 485 -522
5325 -522 -1579 -1253 -785 334 1554 1246 568 -202 -1229 -1503 -1116 107 715 1302 1047 137 -1182 -1548
5343 -1548 -844 -197 1087 1622 800 268 -1031 -1463 -1042 -378 642 1540 1199 748 -562 -1364 -1378 -601 1027
5362 1027 1642 1141 739 -223 -1008 -1378 -785 419 1080 1599 778 -349 -1528 -1424 -941 107 1162 1608
5380 1608 1038 362 -798 -1307 -1275 -233 878 1343 961 23 -468 -1354 -1066 -299 770 1447 1170 758 -771
5399 -771 -1244 -1279 -529 244 1336 1208 738 -123 -973 -1513 -988 112 1121 1441 869 -155 -1004 -1348 -1220
$$ packed form
5271b58J303N89j83j507r25l81k03J183J152J034k55j288j189o88k3J143J112
5288F16O57N3k58j533j163L0O44J517N99L33k61j516q40n43P56R78P96P67q35
5307G97q07j354j30J2J269J012Q49j33j251r44r11J18R88J216J095k89j052j007
5325e22j057L26M68J119J220l08o78p70j027k74L87J223O08N87k55r10j319l66
5343a548P04O47J284N35q22n32j299m32M21O64J020Q98l41m51j310q02j4P77J628
5362A027O15n01m02r62p85l70N93J204O61N19q21j127j179J04M83J048J055M46
5380A608n70o76j160n09L2J042J111M65l82r38m91q86K88P67J069O77k77m12j529
5399g71m73l5P50P73J092j28m70q61q50n40N25J100J009L20n72j024q49l44J28
$$ plain form
5418 -1220 -128 728 1273 1170 449 -722 -1272 -1440 -518 339 1383 1203 407 -501 -1422 -1213 -797 295
5436 295 1248 1421 669 -132 -908 -1453 -844 12 1238 1255 707 -284 -1072 -1361 -1049 -284 1030 1340 1039 34
5456 34 -702 -1314 -951 -243 788 1247 1061 249 -526 -1158 -1112 -161 714 1253 988 738 -495 -1181 -1401 -460
5476 -460 344 1016 1022 813 44 -1194 -1343 -842 -5 960 1110 1018 -44 -1045 -1397 -777 -230 619 1317 1183
5496 1183 181 -496 -1444 -1355 -358 615 1046 806 592 -565 -1181 -968 -368 506 1170 834 657 88 -1073
5515 -1073 -1251 -668 84 981 1214 559 20 -918 -1006 -809 84 735 994 680 420 -978 -1040 -917 -134 464
5535 464 1148 1323 325 -233 -1116 -656 -340 429 1119 1236 378 -359 -1059 -1080 -618 329 700 946 874 -171
5555 -171 -946 -1186 -713 100 803 1291 718 25 -623 -882 -840 -258 709 769 456 139 -730 -696 -1028 -559 620
$$ packed form
5418a220J092Q56N45j03p21j171n50j68R22Q57J044j80p96r08r21K09M16J092
5436B95R53J73p52q01p76n45O09Q56J226J7n48r91p88k89L12P65J314L10l01j005
5456C4p36o12L63P08J031M59j86q12p75o32M6R51Q75N39k65k50j233o86k20R41
5476d60Q04O72Ok09p69j238j49N01Q37R65J50r2j062j001l52O20N47Q49O98j34
5496A183j002o77r48Q9R97R73M31k40k14j157o16K13O00Q74O64l36j77n69j161
5515a073j78N83P52Q97K33o55n39r38q8J97Q93O51K59l14k60j398o2J23P83N98
5535D64O84J75r98n58q83M60L16P69O90J17q58p37p00k1M62R47L71K46p2j045
5555a71p75k40M73Q13P03M88n73o93o48k59M2N82R67O0l13l17q69L4l32M69J179
$$ plain form
5576 620 980 1218 265 -214 -1112 -1313 -608 103 600 955 241 -170 -797 -935 -387 -81 911 870 917 -154
5596 -154 -521 -935 -737 121 689 1106 882 -148 -553 -991 -833 -533 646 1182 835 575 -557 -1176 -527
5615 -527 -324 98 971 816 390 -164 -700 -939 -433 40 760 1376 525 -320 -438 -923 -684 124 848 878
5635 878 733 129 -416 -1064 -747 153 569 785 920 -100 -468 -868 -738 -241 153 777 812 600 -293 -534
5655 -534 -660 -680 199 679 809 744 -162 -763 -673 -674 104 875 776 684 8 -361 -712 -551 -402 613 977 602
5677 602 75 -606 -633 -774 -173 358 655 825 464 -275 -737 -711 -409 289 419 884 463 -27 -624 -518 -461
5698 -461 139 723 1062 650 -96 -808 -1044 -629 -15 524 861 794 -104 -642 -953 -512 -186 270 846 780 428
5719 428 -348 -790 -793 -35 174 800 638 213 -172 -887 -858 -436 -56 585 616 487 -64 -736 -758 -493 61 443
$$ packed form
5576F20L60K38r53m79q98k01P05P11M97L55p14m11o27j38N48L06R92m1M7j071
5596a54l67m14J98Q58N68M17k24j030m05m38J58L00J179N36l47k60j132o19O49
5615e27K03M22Q73j55m26n54n36k39N06M73P20O16q51q45j18m85K39Q08P24L0
5635H78j45o04n45o48L17R00M16K16J35j020l68m00J30M97L94O24L5k12q93k41
5655e34j26k0Q79M80J30o5r06o01R0jP78P71r9r2o76l69l51J61J49J015L64l75
5677F02n27o81k7j41O01N31K97J70l61p39m62K6L02O98J30M65m21m90n97J06N7
5698d61O00N84L39m12p46p12k36M15O14N39L37o7q98n38l11M41L26M56N76o6l52
5719D28p76m42lP58K09O26j62m25l85p15K9M22L80O41L1j29n51o72k2K65N54L82
$$ plain form
5741 443 874 468 53 -353 -703 -480 75 578 535 556 129 -269 -734 -393 -222 286 563 527 398 -242 -839
5762 -839 -724 -359 -35 742 615 389 -205 -416 -349 -332 108 514 874 467 272 -755 -774 -544 -226 483 774
5783 774 478 -53 -110 -817 -419 135 380 679 666 95 -144 -540 -442 -91 425 894 521 328 -78 -534 -576
5804 -576 -482 16 318 809 182 -352 -752 -646 -386 82 439 407 427 92 -401 -489 -345 -232 465 438 327 192
5826 192 -500 -440 -761 -167 -4 701 309 278 23 -401 -596 -242 -7 465 640 81 -249 -537 -246 -181 -94
5847 -94 470 465 359 -70 -682 -642 -462 75 401 700 501 346 -268 -1154 -642 124 276 497 521 224 -82 -599
5869 -599 -711 -344 173 311 654 411 100 -550 -390 78 20 854 736 88 -115 -401 -631 -249 -13 571
5889 571 603 180 59 -306 -305 -165 -108 394 547 561 -57 -242 -416 -456 47 168 402 490 135 -116 -311 -536
$$ packed form
5741D43M31m06m15m06l50K23N55N03m3K1m27l98m65L41J71N08K77l6j29o40n97
5762h39J15L65L24P77j27k26n94k11O7J7M40M06L60m07j95j027j9K30L18P09K91
5783G74k96n31n7p07L98N54K45K99j3n71k39l96R8L51N16M69l73j93m06m56m2
5804e76R4M98L02M91o27n34m00J06K60M68L57l2K0l35m93q8J44J13O97k7j11j35
5826A92o92O0l21N94J63P05l92l1k55m24j95L54K35M72J75n59l30k88K91O5Q7
5847i4N64nj06m29o12M0J80N37L26K99j99j55o14q86N12P66J52K21K4k97l06n17
5869e99j12L67N17J38L43k43l11o50J60M68n8Q34j18o48k03k86k30L82K36N84
5889E71L2m23j21l65JJ40N7N02J53J4o18j85j74m0N03J21K34Q8l55k51j95k25
$$ plain form
5911 -536 -378 56 425 419 193 10 -407 -577 -807 -40 523 440 423 -6 -182 -384 -117 -514 383 558 486 381
5933 381 -222 -624 -485 -111 145 573 325 153 -59 -520 -220 -339 286 620 309 372 -4 -415 -426 -317 137
5954 137 540 540 401 -56 -295 -567 -110 -253 110 438 512 193 -204 -468 -185 -141 280 33 317 46 -140
5975 -140 -173 -395 -159 253 435 468 449 -100 -500 -284 -254 4 -132 445 282 -414 -736 -340 -296 26 287 284
5997 284 664 43 -160 -610 -422 -101 485 725 733 415 -334 -294 -36 -202 316 345 508 336 -108 -735 -172
6018 -172 -276 -167 450 581 352 75 -239 -778 -100 -43 446 313 259 -102 -323 -290 -233 1 280 437 308
6039 308 19 -238 -576 -434 -247 467 173 488 62 -659 -319 -401 -185 42 198 100 363 -40 -215 -392 -331
6060 -331 63 299 280 34 -32 -474 -418 -197 -4 263 352 -5 212 -308 -580 -359 63 323 290 243 -31 -90
$$ packed form
5911e36J58M34L69ok26j83m17j70k30P67N63q3j7m29j76k02K67l97Q97J75p2j05
5933C81o03m02J39L74K56M28k48j72k12m61L00j19O25L34l11O3l76m11j1J09M54
5954A37M03%j39m57k39k72M57j43L63L28P4l19l97k64K83M4M21k47K84k71j86
5975a40l3k22K36M12J82L3j9n49m00K16L0K58j36N77j63o96l22L96M4L22K61l
5997B84L80o21k03m50J88L21N86K40Ql18p49M0K58j66N18K9J63j72m44o27N63
6018a72j04J09O17J31k29k77l14n39O78N7M89j33n4l61k21L3N7K34K79J57j29
6039C08k89k57l38J42J87P14k94L15m26p21L40q2K16K27J56r8K63m03j75j77O1
6060c31L94K36j9k46o6m42N6K21J93K67Q9l57K17n20k72K21M22K60l3m7k74n9
$$ plain form
6082 -90 -238 -532 -168 241 188 609 77 -50 -643 -156 -9 129 255 427 100 3 -420 -366 -47 132 23
6103 23 158 365 -14 -212 -153 -100 -11 85 -15 462 269 -45 -133 -251 -79 260 304 76 43 -232 -178 -295 -487
6126 -487 -101 312 601 9 -19 -230 -368 -85 362 264 289 458 -193 -101 -382 15 74 97 365 266 11 -470
6148 -470 -89 -448 -150 149 192 146 488 -165 -85 -172 -327 45 191 294 15 -46 -584 -501 -146 -19 272 195
6170 195 334 12 -139 97 -63 -16 192 338 298 24 -337 -237 -7 36 341 -67 32 -334 -178 -174 -338 -97
6192 -97 263 83 -165 77 -81 -183 -244 -182 6 134 342 425 -321 19 -298 -206 96 100 136 195 128 -262 -315 -465
6216 -465 -3 244 579 465 -174 -242 -254 -489 -100 54 217 210 61 -299 -412 -546 -302 260 116 220 11
6237 11 159 -433 -387 -24 198 186 463 290 -65 100 -252 218 -60 360 333 133 71 -258 -228 -372 125 206
$$ packed form
6082i0j48k94L64M09n3M21n32j27n93M87J47J38J26J72l27r7m23N4L19J79j09
6103B3J35K07l79j98N9N3Q9R6j00M77j93l14q8j18J72L39M4k28l3k75N4j17j92
6126d87L86M13K89n92k8k11j38K83M47r8K5J69o51R2k81L97N9K3K68r9k55m81
6148d70L81l59K98K99M3m6L42o53Q0q7j55L72J46J03k79o1n38Q3L55J27K91p7
6170A95J39l22j51K36j60M7K08J46m0k74l61J00K30M3L05m08R9l66J56Mj64K41
6192i7L60j80k48K42j58j02o1O2J88J28K08Q3p46L40l17R2L02ML6N9o7l90n3j50
6216d65M62K47L35j14o39o8j2k35L89J54J63pj49l60j13j34K44N62j44J04k09
6237A1J48n92M6L63K22j2K77j73l55J65l52M70k78M20k7k00o2l29L0j44M97Q1
$$ plain form
6259 206 348 98 -188 79 -111 -262 172 160 59 662 -73 -199 -197 -282 -9 -3 336 123 0 -272 -168 -155
6281 -155 -211 193 370 394 -288 -106 -310 -287 -74 -33 442 594 248 47 -369 -330 -4 68 149 212 30 369 49
6304 49 -140 218 -155 -136 118 -48 1 -143 -115 -253 -119 203 -32 353 106 -169 -215 -171 -58 449 7 3 248
6327 248 -220 -95 -275 -53 333 233 267 -51 -22 67 -60 109 202 471 107 36 12 -190 -232 -146 -348 145 -157
6350 -157 412 -79 -252 -233 -301 244 332 346 224 127 84 -53 -524 -44 -146 281 267 115 -60 -461 -394 -185 -24
6373 -24 212 378 114 -2 -418 95 172 65 249 382 320 -39 -243 -405 -136 -31 293 214 16 68 -536 8
6395 8 -252 367 23 55 220 29 -55 -176 -109 -83 11 175 -29 79 92 -174 -131 -482 70 249 -22 -50 -184
6418 -184 -205 -83 -16 -99 -35 73 147 -204 -168 -352 -282 -166 305 447 105 163 -136 -436 -350 238 31 434 161
$$ packed form
6259B06J42k50k86K67j90j51M34j2j01O03p35j26Kq5K73OL39k13j23k72J04J3
6281a55n6M04J77K4o82J82k04K3K13M1M75J52l46k01m16L9L26P2Q1O3j82L39l20
6304D9j89L58l73J9K54j66M9j44K8j38J34L22k35L85k47k75m6M4J13N07m42mK45
6327B48m68J25j80K22L86j00L4l18K9Q9j27J69R3K69l64p1k4k02m2Q6k02M93l02
6350a57N69m91j73J9o8N45Q8J4j22r7m3j37m71M80j02M27j4j52j75m01O7K09J61
6373b4K36J66k64j16m16N13P7j07J84J33o2l59k04j62K69J05L24p9j98N2o04N44
6395Hk60O19l44L2J65j91q4j21O7K6R4J64k04J08J3k66M3l51N52J79k71k8j34
6418a84k1J22O7q3O4J08P4l51L6j84P0J16M71J42l42N8k99l00Q6N88k07M03k73
$$ plain form
6441 161 295 -155 -331 -321 -357 129 400 339 120 -149 -207 -118 -331 -40 225 207 144 129 -50 -105 -387 -250 165
6464 165 324 142 -218 -471 -16 -192 -45 48 168 268 81 27 -351 -317 -310 348 149 272 4 -46 -151 -459
6486 -459 -273 -57 232 142 -154 124 -168 -52 -83 217 218 306 89 -428 -46 -436 -21 -28 331 354 410 -270 -274 -374
6510 -374 -137 -52 89 395 472 246 -242 -433 -132 17 378 244 343 -5 -19 -605 -88 -360 158 615 43
6531 43 90 -49 -209 -298 -17 49 161 446 16 86 -496 -156 12 -22 305 215 124 -68 -384 -228 -171 -106 46
6554 46 164 305 -184 -423 -392 -158 117 347 135 313 155 -382 -290 -278 49 199 179 431 198 96 -328 -224
6576 -224 -273 229 391 484 110 113 -156 -88 -134 86 30 243 171 -73 -382 -265 -74 127 354 241 105 -314 -294
6599 -294 47 -454 110 223 387 356 106 -281 -300 -52 -217 110 314 221 96 -62 -293 -464 -254 197 72
$$ packed form
6441A61J34m50j76J0l6M86K71o1k19k69n8Q9k13K91K65j8o3j5j79n5k82J37M15
6464A65J59j82l60k53M55j76J47R3J20J00j87n4l78L4PO58j99J23k68n0j05l08
6486d59J86K16K89r0k96K78k92J16l1L00JQ8k17n17L82l90M15pL59K3N6o80mj00
6510c74K37Q5J41L06P7k26m88j91L01J49L61j34R9l48j4n86N17k72N18M57n72
6531D3M7j39j60q9K81O6J12K85m30P0n82L40J68l4L27r0r1j92l16J56N7O5J52
6554D6J18J41m89k39L1K34K75K30k12J78j58n37R2J2L27J50k0K52k33j02m24J04
6576b24m9N02J62R3l74Lk69O8m6K20n6K13p2k44l09J17J91K01K27j13j36m19K0
6599b94L41n01N64J13J64l1k50l87j9K48j65L27K04r3j25j58k31j71K10M51j25
$$ plain form
6620 72 247 295 -117 -225 -231 -410 166 451 304 188 -303 -353 -458 -340 -169 125 273 274 -273 -87 -255 -288 -391
6643 -391 247 372 426 -115 -283 -216 -623 -144 170 334 289 159 63 -61 -329 -278 -203 404 392 -128 24 -272
6665 -272 -307 -92 322 175 362 215 -26 -195 -444 -191 -70 89 486 411 157 -191 -220 -570 -220 17 682
6686 682 322 247 -70 -726 -89 -159 325 311 609 329 -100 -170 -373 -16 -20 363 482 442 -85 -557 -534 -232 2
6709 2 -87 495 253 -2 -42 -352 -290 -236 421 447 350 -69 -416 -366 -128 -240 432 747 249 22 -22 -607 -555 -99
6733 -99 197 207 500 104 -149 -157 -195 -242 143 260 174 514 -49 -366 -512 -367 216 430 434 791 -316 -252 -715
6756 -715 -149 230 -193 435 420 64 -385 -333 -319 25 194 223 465 235 -227 -557 -315 92 300 411 461 490
6778 490 -162 -463 -425 -187 78 253 336 634 0 34 -515 -276 149 305 403 263 176 -140 -34 -206 -64 276
$$ packed form
6620G2J75M8m12j08oj79N76K85j47j16m91n0j05J18J71K94J48Jn47J86j68l3j03
6643c91O38J25N4n41j68O7m07M79L14J64m5j30r6j24k68N1P5O07j2n20J52k96
6665b72l5K15M14j47J87j47k41j69k49K53J21J59L97p5k54l48k9l50L50K37O65
6686F82l60p5l17o56O37p0M84j4K98k80m29p0k03L57mL83J19m0n27m72K3L02K34
6709Bq9N82k42k55m0l10O2N4O57K6r7m19l47N0K38j12O72L15m98k27m4n85N2M56
6733i9K96J0K93l96k53ql8m7L85J17q6L40n63l17j46J45N83K14ML57j107O4m63
6756g15N66L79m23O28j5l56m49N2J4L44J69K9K42k30m62l30K42M07K08J11N0K9
6778D90o52l01L8K38K65J75Q3K98o34L4n49K39M25J56R8j40q7l16J06j72J42L40
$$ plain form
6800 276 491 228 -243 -163 -524 -295 -237 254 469 244 292 66 -457 -577 -252 -73 780 388 220 -207 -318
6821 -318 -660 -93 -126 678 367 414 -277 -436 -418 -394 -128 293 468 488 219 -327 -435 -548 51 280 371 201
6843 201 532 43 -613 -425 -448 104 576 526 270 -50 -459 -467 -119 114 625 480 271 -280 -561 -245 -110
6864 -110 131 311 376 177 -39 -369 -565 -503 90 367 314 400 296 -438 -534 -417 -344 270 698 395 185 -142
6886 -142 -492 -581 -233 81 271 538 303 -56 -471 -461 -384 65 535 469 428 63 -380 -393 -285 168 83 311
6908 311 213 286 -271 -528 -625 -218 270 385 534 87 -117 -172 -558 130 104 312 409 472 -377 -251 -447 -154
6930 -154 -135 323 786 -148 169 -421 -475 -476 12 117 547 152 -48 -398 -450 -394 -490 322 193 349 192 -82
6952 -82 -379 -527 -19 251 560 460 -80 -220 -520 -809 -264 292 460 479 144 -230 -274 -446 -199 423 101
$$ packed form
6800B76K15k63m71Q0l61K29N8M91K15k25M8k26n23j20L25J79Q53l92j68m27j11
6821c18l42N67l3Q04l11M7o91j59J8K4K66M21J75K0k69n46j08j13N99K29R1j70
6843B01L31m89o56J88k3N52M72n0k56l20m09qL48K33N11j45k09n51k81L16J35
6864a10K41J80O5j99k16l30j96O2N93K77n3Q6j04p34r6J17P3O14M28l03k10l27
6886a42l50q9L48L14J90K67k35l59m15J0P7M49M70o6m1l65m43j3J08M53q5K28
6908C11r8P3n57k57r7M07M88J15J49m47k04n5l86O88k6K08R7O3q49J26j96K93
6930a54J9M58M63r34L17n90n4jM88J05M30l95k00l50n2N6r6Q12j29J56j57k74
6952h2k97j48N08K70L09j00n40j40l00k89N45N56J68J9l35l74m4j72K47O22l22
$$ plain form
6973 101 528 559 190 -343 -797 -155 74 313 557 428 101 -202 -672 -499 -9 555 375 220 107 -57
6993 -57 -556 -359 75 484 562 390 132 -176 -704 -326 -305 -96 601 565 452 -66 -287 -348 -261 -129 472 290
7015 290 566 -14 -463 -338 -420 72 559 323 587 53 -147 -376 -753 -526 362 746 645 3 -361 -506
7035 -506 -449 -135 165 460 427 168 -89 -470 -593 -192 188 324 452 400 -188 -381 -474 -404 206 311 338 286
7057 286 -79 -306 -362 -546 68 343 321 606 144 -484 -339 -524 -189 -64 521 486 209 -88 -200 -795 -492
7078 -492 35 361 711 172 141 -205 -506 -198 -113 255 507 187 1 -461 -56 -249 -57 387 652 451 -60
7099 -60 -284 -556 -214 -25 338 602 595 -17 40 -644 -545 -243 255 616 538 110 -209 -136 -550 -568 15 448 507
7122 507 369 10 -334 -524 -202 84 175 591 102 192 -182 -478 -382 -109 -183 504 469 143 9 -559 -464 -407
$$ packed form
6973A01M27L1l69n33m54O42K29K39K44j29l27l03m70J73M90N64j80j55j13j64
6993e7m99J97M34M09P8j72k58l08n28L78K1K09O97l6j13n18k21o1Q7J32O01j82
7015B90K76n80m49J25q2M92M87k36K64n34k00k29l77K27Q88L84j01o42l64j45
7035e06N7L14L00K95l3k59k57l81j23M01L80J36J28n2n88j93r3P0O10J05K7n2
7057B86l65k27n6j84O14K75k2K85m62o28J45j85L35J25N85l5k77k97j12n95L03
7078d92N27L26L50n39l1l46l01L08Q5L68K52l20j86m62M05j93J92M44K65k01n11
7099f0k24k72L42J89L63K64po12N7o84R9L02M98L61p8m28l19P3m14j8N83M33N9
7122E07j38l59l44j90L22K86R1M16m89R0l74k96R6K73p4O87l5l26j34n68R5N7
$$ plain form
7144 -407 509 800 629 221 -155 -466 -447 -249 155 391 120 196 86 -134 -258 -348 -189 333 502 208 43
7165 43 -303 -585 -498 -105 358 330 103 96 -340 -605 -547 -120 307 600 500 194 171 -550 -534 -88 238 229 194 234
7189 234 -120 -415 -481 -313 203 152 235 690 45 -141 -530 -327 -318 430 369 51 396 -218 -434 -478 -60 4 480
7212 480 368 -343 -53 -528 -302 -120 115 519 534 212 -9 -651 -444 -28 142 327 466 472 -186 -404 -587
7233 -587 -298 -74 131 592 452 66 -144 -285 -327 -173 206 422 517 139 -185 -253 -344 -471 -38 354 543
7254 543 -107 60 -411 -228 -353 146 428 483 498 -19 -270 -330 -488 -5 303 309 353 -124 -289 -405 -335 41
7276 41 194 208 379 40 16 -434 -678 -64 375 236 512 50 -218 -359 -283 -338 2 341 372 314 50 -224
7298 -224 -351 -363 -103 354 531 482 131 -151 -116 -534 59 352 213 352 58 -57 -330 -389 314 197 213 612
$$ packed form
7144d07R16K91j71m08l76l11J9J98M04K36k71P6j10k20j24r0J59N22J69k94j65
7165D3l46k82Q7L93M63k8k27pm36k65N8M27M27K93j00l06k3p21J6M46L26rl5M0
7189B34l54k95o6J68N16n1Q3M55o45j86l89K03RP48o1l18L45o14k16m4M18O4M76
7212D80j12p11K90m75K26J82K35M04J5l22k21o42K07M16J70J85J39Oo58k18j83
7233e87K89K24K05M61j40l86k10j41m2J54L79K16R5l78l24o8r1j27M33L92J89
7254E43o50J67m71J83j25M99K82N5J5n17k51o0j58M83L08OM4m77j65j16P0L76
7276D1J53J4J71l39k4m50k44O14M39j39K76m62k68j41P6n5L40L39L1n8k64k74
7298b24j27j2K60M57J77m9l51k82L5m18N93K93j39J39k94j15k73n9P03j17J6L99
$$ plain form
7320 612 616 31 -343 -180 -28 301 71 313 260 -12 -455 -273 -169 44 276 324 99 75 -487 -570 -358 166
7342 166 200 449 547 -79 -223 -96 -417 -240 131 609 565 376 -377 -627 -456 -46 -96 346 211 7 -227
7363 -227 -349 -407 -224 96 387 318 110 -100 -240 -420 -433 -36 127 144 621 -73 -473 -224 -82 -170 268 415
7385 415 -69 271 -160 -460 -182 -284 415 369 176 180 -294 -353 -357 -210 163 367 84 306 -2 -406 -379 -541
7407 -541 -191 449 447 428 1 -213 -224 -391 -246 385 529 499 126 -278 -253 -397 -297 334 381 507 338 -340
7429 -340 -299 -470 -102 358 399 334 220 293 -588 -698 -354 -23 374 379 154 -195 -165 -755 -371 -34 211 257 292
7452 292 92 -310 -199 -71 -152 196 261 508 78 -103 -299 -354 -252 52 535 279 -67 -165 -233 -377 -430 210
7474 210 650 328 444 -146 21 -438 -182 -48 497 640 436 15 -232 -257 -521 -171 261 294 267 -42 -181
$$ packed form
7320F12Mn85l74J63J52L29k30K42n3k72m43J82J04K13K32M8k25k4n62q3K12N24
7342A66L4K49R8o26j44J27l21J77L71M78m4j89p53k50J71M10n0M42j35k04k34
7363b27j22n8J83L20K91o9k08k10j40j80j3L97J63J7M77o94m00K49J42q8M38J47
7385D15m84L40m31l00K78j02O99m6j93Mm74n9mJ47L73K04k83K22l08m04K7j62
7407e41L50O40kj9m27k14j1j67J45O31J44l0l73m04K5j44J00O31M7J26j69o78
7429c40M1j71L68M60M1o5j14P3q81j10L44L31L97Nk25l49L0n90L84L37K45M6L5
7452B92k00m02J11J28q1L48O5K47m30j81j96n5J02L04M83k56l46r8o8j44n3O40
7474B10M40l22J16n90J67m59K56J34N45J43k04m21k47k5k64L50M32L3k7l09j39
$$ plain form
7495 -181 -357 -431 -406 -115 396 309 -116 -39 -345 -376 -354 -116 20 415 47 -327 -587 -419 -311 -160 270 222
7517 222 367 251 -352 -487 -636 -23 316 416 542 -119 49 -358 -427 46 -89 513 565 107 -106 -242 -405
7538 -405 -383 261 357 339 340 11 -171 -526 -445 143 280 262 410 254 -475 -524 -317 397 212 280 429 15 -494
7561 -494 -294 -284 -527 -3 189 499 225 -120 -370 -405 -170 -107 395 467 374 -121 -280 -368 -536 56 316 563
7583 563 379 153 -253 -406 -415 -147 196 533 105 -78 -223 -470 -435 -306 -48 199 456 199 36 -587 -441
7604 -441 -331 27 461 223 463 -56 -545 -848 -271 48 241 409 459 327 -229 -368 -221 -1 195 267 127
7625 127 438 -61 -444 -446 -47 222 217 645 305 78 -383 -537 -242 -174 499 432 216 -53 -274 -322 -603 -54
7647 -54 -82 332 378 255 -343 -472 -449 -69 273 699 281 18 -235 -315 -339 -114 294 356 242 86 -97 -506
$$ packed form
7495a81j76p4K5K91N11q7m25P7l06l1K2K38J36L95l68l74k60J68J08J51M30m8
7517B22J45j16o03j35j49O13L39J00J26o61J68m07o9M73j35O02N2m58k13j36j63
7538d05K2O44R6j8Jl29j82l55Q1N88J37j8J48j56p29m9K07P14j85O8J49m14n09
7561d94K00J0k43N24J92L10k74l45k50l5K35O3N02P2r3m95j59q8j68N92K60K47
7583E63j84k26m06j53rK68L43L37m28j83j45k47L5J29K58K47K57k57j63o23J46
7604d41J10L58M34k38K40n19m89l03N77L19J93J68N0j32n56j39J47K20J96P2j40
7625A27L11m99l83kL99K69nM28l40k27m61j54K95O8O73o7k16k69k21m8k81N49
7647e4k8M14M6j23n98j29K3L80L42M26m18k63k53q0k4K25M08O2j14j56j83m09
$$ plain form
7669 -506 -216 -190 268 492 709 -32 -223 -333 -246 -467 301 240 291 145 68 -235 -548 -244 -45 391 496 268
7691 268 267 -513 -370 -371 -253 221 438 320 192 -127 -381 -324 -235 250 517 410 314 -517 -592 -205 -146 122 345
7714 345 441 127 -272 -229 -457 -86 78 132 494 387 204 -178 -556 -405 18 387 267 187 -144 -269 -465
7735 -465 -181 111 521 238 332 283 -108 -259 -410 -283 -158 239 387 -25 -43 -219 -381 -289 -72 297 807
7756 807 254 65 -424 -78 -55 84 448 82 402 177 -196 -349 -189 -87 -55 442 367 300 -228 -34 -356
7777 -356 -289 74 524 343 19 -59 -682 -478 -255 55 639 481 531 1 -259 -424 -345 -140 36 504 360
7798 360 -37 -464 -336 -380 -122 355 200 324 74 198 -224 -363 -98 76 361 494 136 -138 -548 -671
7818 -671 -460 -56 119 292 148 -104 -179 -590 -355 176 374 511 347 108 -284 -207 -221 -244 54 541 345
$$ packed form
7669e06K90K6M58K24K17p41j91j10Q7k21P68o1N1j46p7l03l13L04J99M36J05k28
7691B68jp80J43jJ18M74K17j18j28l19k54N7Q9M85K67j07r6q31p5L87N9K68K23
7714C45R6l14l99M3k28L71J64N4L62j07j83l82l78J51M23L69j20q0l31j25j96
7735d65K84K92M10k83R4m9l91j51j51J27J25L97J48m12j8j76j62R2K17L69N10
7756H07n53j89m89L46K3J39L64l66L20k25l73j53J60J02L2M97p5o7n28J94l22
7777c56O7L63M50j81l24p8o23K04K23L10N84j58N0n30k60j65P9K05J76M68j44
7798C60l97m27J28m4K58M77j55J24k50J24m22j39K65J74K85J33l58k74m10j23
7818f71K11M04J75J73j44k52p5m11K35N31J98J37j64k39l92P7j4k3K98M87j96
$$ plain form
7839 345 -231 -290 -588 -353 120 306 148 530 146 -195 -427 -674 -332 201 442 581 129 -226 -365 -304 8
7860 8 114 600 471 202 -142 -130 -76 -214 -109 327 503 270 114 -169 -271 -501 -28 55 42 260 179 -3
7882 -3 -383 -413 -227 69 249 144 -48 -301 -553 -594 -324 -39 320 287 343 -72 138 -208 -323 -13 276 350
7904 350 213 59 -40 -284 -415 17 316 428 599 -106 -164 -432 -276 -191 246 135 182 193 168 129 -278 -338 240
7927 240 153 508 288 6 -290 -441 -145 51 55 502 195 58 -167 -472 -299 -178 414 184 205 -156 -29
7948 -29 -332 -220 1 -83 475 297 117 -293 -352 -204 -17 -6 605 514 452 123 -307 -540 -118 -49 398 501
7970 501 162 119 -302 -461 -94 -79 308 418 441 208 25 -282 -252 129 -109 411 349 191 -179 -337 -295 -318
7992 -318 -38 404 530 277 -99 -419 -546 -231 274 500 524 -218 117 -309 -299 -49 -123 468 101 252 382
$$ packed form
7839C45n76n9k98K35M73J86j58L82l84l41k32k47L42N33K41J39m52l55j39O1L12
7860HJ06M86j29k69l44J2N4j38J05M36J76k33j56k83j02k30M73Q3j3K18q1j82
7882cl80l0J86K96J80j05j92k53k52m1K70K85L59l3N6m15K10l46j15L10K89P4
7904C50j37j54r9k44j31M32K99J12J71p05n8k68J56Q5M37j11M7J1k5l9m07o0N78
7927B40q7L55k20k82k96j51K96J96MM47l07j37k25l05J73J21N92k30K1l61J27
7948b9l03J12K21q4N58j78j80m10n9J48J87J1O11r1o2l29m30k33M22O9M47J03
7970E01l39m3m21j59L67J5L87J10K3k33j83l07L0L81k38N20o2j58l70j58M2k3
7992c18K80M42J26k53l76l20j27L15N05K26K4p42L35m26J0K50p4N91l67J51J30
$$ plain form
8013 382 21 -471 -436 -284 217 271 497 10 101 -315 -379 -177 -62 343 708 115 -379 -309 -293 -187 151 102
8035 102 403 -106 39 -99 -346 -269 114 170 432 -8 -232 -460 -495 -161 -351 355 552 603 78 -519 -118
8056 -118 -250 -78 210 120 207 240 -265 -38 -362 64 -12 473 236 306 -236 -339 -316 -296 91 184 566 188 -124
8079 -124 -555 -345 110 -268 268 514 263 -144 -44 -147 -535 -56 230 6 309 273 -37 -181 -410 42
8099 42 -94 137 464 499 -21 -359 -341 -299 97 419 270 -38 116 -96 -82 -217 32 167 343 265 185 -464
8121 -464 -443 -205 -342 392 263 259 159 -12 -425 -616 239 298 266 303 78 -443 -24 -334 -241 190 372 500
8143 500 268 206 -217 -403 -333 352 155 795 173 431 -325 -461 -212 109 -81 92 250 48 -170 -517 55
8164 55 186 120 -93 453 108 259 -134 -277 -126 -62 173 370 94 -110 -486 -103 -106 -38 761 680 402 162
$$ packed form
8013C82l61m92L5J52N01N4K26m87R1m16o4K02J15M05L65n93m94P0J6J06L38m9
8035A02L01n09J45j38k47P7L83N6K62m40k24k28l5L34j90P06J97N1n25n97M01
8056a18j32J72K88r0Q7L3n05K27l24M26p6M85k37P0n42j03K3K0L87R3L82l78l12
8079a24m31K10M55l78N36K46k51m07J00j03l88M79K86k24L03l6l10j44k29M52
8099D2j36K31L27L5n20l38J8M2L96L22j49l08J54k12J4j35K49J35J76p8q0o49
8121d64K1K38j37P34j29mj00j71m13j91Q55N9l2L7k25n21M19l10R3M31J82J28
8143E00k32o2m23j86P0O85j97O40o22K58p56j36K49L21j90J73J58k02k18l47N72
8164E5J31o6k13N46l45J51l93j43J51O4K35J97k76k04l76L83lO8P99q1k78k40
$$ plain form
8186 162 -263 -683 -445 -90 448
$$ packed form
8186A62m25m20K38L55N38
8191D48
$$ Imaginary data points
##PAGE= N=2
##DATA TABLE= (X++(I..I)), XYDATA
$$ plain form
0 0 0 0 0 8 -8 0 -8 8 -16 16 -24 32 -32 40 -56 57 -74 88 -101 122 -140 162 -191 215 -249 285 -324 372 -414
29 -414 470 -531 592 -667 745 -828 925 -1025 1140 -1266 1398 -1550 1716 -1898 2105 -2331
45 -2331 2590 -2879 3207 -3596 4041 -4574 5220 -6019 7041 -8399 10293 -13149 17907 -27340
59 -27340 53304 -275004 -978216 -587409 6833 240446 104094 122749 178839 -49204 -535869
70 -535869 -734920 -460001 19350 333365 427484 287127 -64797 -452832 -538242 -264458
80 -264458 114374 351848 463939 451263 218051 -187831 -425615 -275637 85152 354660
90 354660 493905 539253 354608 -123479 -532726 -443951 35906 380189 364857 245361 192823
101 192823 13184 -382295 -640575 -414714 102567 418000 343870 77999 -186898 -414879
$$ packed form
0@%%%Qj6QqJ6k4L2m0N6o4P2r6J13j31J62j89K23k62L02l53M06m64N34o09O96p86
29d14Q84j001J123j259J412j573J753j950K165k406K664k948L266l614M003m436
45b331M921n469O086o803P637q615R794j1239J3060j5440J8692k3442L1056m5247
59b7340Q0644l28308p03212L90807N94242K33613j36352J8655N6090k28043m86665
70e35869j99051K74919M79351L14015R4119j40357l51924l88035q5410K73784
80b64458L78832K37474J12091j2676k33212m05882k37784J49978L60789K69508
90C54660J39245M5348j84645m78087m09247Q8775M79857L44283j5332j19496n2538
101A92823j79639l95479k58280K25861N17281L15433p4130k65871k64897k27981
$$ plain form
111 -414879 -535011 -408121 -61347 262647 363074 239427 -13844 -301490 -475143 -377618
121 -377618 -37514 308780 460291 399528 182425 -136893 -397184 -360157 1670 384063
131 384063 488172 352614 187557 24339 -219583 -414564 -283948 163566 527743 480125
141 480125 130109 -189947 -332778 -355213 -277812 -57300 230714 374187 245534 -71265
151 -71265 -377150 -503181 -380234 -70180 239462 357365 242258 -475 -243544 -395341
161 -395341 -367702 -121392 225864 436076 372738 120923 -137249 -290929 -301260 -135835
171 -135835 173190 449183 477107 229957 -97009 -290957 -292127 -149544 80894 317542
181 317542 416884 276459 -36357 -318669 -406385 -277710 -21363 228608 339014 237954
$$ packed form
111d14879j20132J26890L46774L23994J00427j23647k53271k87646j73653R7525
121c77618L40104L46294J51511o0763k17103l19318k60291L7027L61827L82393
131C84063J04109j35558j65057j63218k43922j94981J30616M47514L64177m7618
141D80125l50016l20056j42831k2435P7401K20512K88014J43473j28653l16799
151g1265l05885j26031J22947L10054L09642J17903j15107k42733k43069j51797
161c95341K7639K46310L47256K10212o3338k51815k58172j53680j0331J65425
171a35835L09025K75993K7924k47150l26966j93948j170J42583K30438K36648
181C17542R9342j40425l12816k82312q7716J28675K56347K49971J10406j01060
$$ plain form
191 237954 -25758 -300538 -430374 -351957 -112117 161729 320594 274693 53297 -212511
201 -212511 -373096 -344566 -139282 143659 355729 370849 173855 -112531 -306767 -300383 -118121
212 -118121 132224 333196 392211 265703 1548 -252030 -333334 -191135 75305 301283
222 301283 368153 252485 15860 -227372 -351737 -283879 -55655 199313 325979 250763
232 250763 22627 -227058 -368969 -335077 -142541 111178 286148 279890 91826 -168202
242 -168202 -345823 -340331 -159248 96334 289285 321131 179317 -55632 -254103 -304947 -174697
253 -174697 68996 293674 372744 259664 18991 -209909 -296790 -195721 25915 239461
263 239461 333041 264079 66057 -167736 -313686 -282274 -84826 159832 303737 264253 70247
$$ packed form
191B37954k63712k74780j29836P8417K39840K73846J58865m5901k21396k65808
201b12511j60585K8530K05284K82941K12070J5120j96994k86386j94236O384J82262
212a18121K50345K00972N9015j26508k64155k53578q1304J42199K66440K25978
222C01283O6870j15668k36625k43232j24365O7858K28224K54968J26666p5216
232B50763k28136k49685j41911L3892J92536K53719J74970o258j88064k60028
242a68202j77621N492J81083K55582J92951L1846j41814k34949j98471n0844J30250
253a74697K43693K24678P9070j13080k40673k28900q6881J01069K21636K13546
263B39461R3580o8962j98022k33793j45950L1412J97448K44658J43905l9484j94006
$$ plain form
274 70247 -168815 -324784 -315371 -146763 84694 249607 261249 118768 -99787 -280980 -327090
285 -327090 -201209 38133 254399 315736 186855 -43927 -235231 -285716 -180467 21311
295 21311 219010 312788 251353 62623 -154764 -279650 -233937 -34463 203848 331800 271981
306 271981 70356 -146143 -263217 -238083 -94793 99034 250509 271601 132131 -101082
316 -101082 -289967 -315902 -164695 63885 233298 255431 130620 -68388 -237032 -290291
326 -290291 -199113 -5806 189610 280182 209099 13433 -192769 -285534 -211304 -16225 186596
337 186596 288680 239348 69818 -127462 -245371 -220256 -63917 137641 272651 265470 119309
348 119309 -86005 -238991 -256692 -125363 83130 245356 263294 128729 -74951 -230998
$$ packed form
274G0247k39062j55969R413J68608K31457J64913J1642j42481k18555j81193m6110
285c27090J25881K39342K16266O1337j28881k30782j91304n0485J05249K01778
295B1311J97699R3778o1435j88730k17387j24886M5713J99474K38311J27952n9819
306B71981k01625k16499j17074K5134J43290J93827J51475K1092j39470k33213
316a01082j88885k5935J51207K28580J69413K2133j24811j99008j68644n3259
326b90291R1178J93307J95416R0572p1083j95666k06202r2765P4230J95079K02821
337A86596J02084m9332j69530j97280j17909K5115J56339K01558J35010p181j46161
348A19309k05314j52986j7701J31329K08493J62226J7938j34565k03680j56047
$$ plain form
358 -230998 -262665 -164405 9961 172506 241170 172822 -7599 -204381 -297923 -221774 -19798
369 -19798 180425 258183 181249 13066 -148796 -229756 -200426 -69017 112616 253152 263363
380 263363 117423 -100924 -249223 -231123 -68554 126332 242714 233810 119490 -42497
390 -42497 -181144 -229188 -151337 25031 202104 266210 167834 -34085 -212599 -261951 -167347
401 -167347 1495 150166 210687 160330 20556 -146266 -252259 -225838 -69802 124428
411 124428 236352 202194 53638 -120266 -226411 -212084 -83233 94143 221757 228955 112983
422 112983 -56610 -187019 -210987 -114122 54931 205339 251261 161769 -15529 -176760 -228082
433 -228082 -143076 21892 171160 225305 159712 11849 -141481 -223912 -191632 -58195 110075
$$ packed form
358b30998l1667R8260J74366J62545O8664o8348j80421j96782r3542P6149K01976
369a9798K00223P7758p6934j68183j61862q0960K9330J31409J81633J40536J0211
380B63363j45940k18347j48299J8100J62569J94886J16382q904j14320j61987
390d2497j38647m8044P7851J76368J77073O4106r8376k01919j78514m9352R4604
401a67347J68842J48671O0521n0357j39774j66822j05993K6421J56036J94230
411A24428J11924l4158j48556j73904j06145J4327J28851J77376J27614P198j15972
422A12983j69593j30409k3968R6865J69053J50408M5922q9492j77298j61231n1322
433b28082Q5006J64968J49268N4145o5593j47863j53330q2431L2280J33437J68270
$$ plain form
444 110075 218949 195679 45427 -141071 -244335 -206082 -64972 88453 179660 178935 89837
455 89837 -56071 -190384 -227794 -127966 56292 207851 231852 123457 -42211 -169161 -194966
466 -194966 -114844 26209 157653 215478 169356 33294 -128830 -220264 -173407 -12123 154843
477 154843 219621 160068 29228 -106079 -191555 -187374 -79743 81598 197944 189954 65893
488 65893 -93653 -200602 -203636 -103938 49153 171597 191805 99995 -48115 -170341 -203828
499 -203828 -129388 19546 161687 210066 137462 -6240 -135182 -186566 -139326 -12203 134005
510 134005 215167 174453 35846 -112009 -186166 -154756 -39336 101082 191040 176766 65235
521 65235 -79249 -177938 -183262 -91296 55827 175838 189587 84504 -68583 -174258 -183874
$$ packed form
444A10075J08874k3270j50252j86498j03264L8253J41110J53425R1207p25q9098
455H9837j45908j34313l7410R9828J84258J51559K4001j08395j65668j26950k5805
466a94966Q0122J41053J31444N7825m6122j36062j62124r1434M6857J61284J66966
477A54843O4778n9553j30840j35307q5476M181J07631J61341J16346p990j24061
488F5893j59546j06949l034R9698J53091J22444K0208r1810j48110j22226l3487
499b03828P4440J48934J42141M8379p2604j43702j28942n1384M7240J27123J46208
510A34005Q1162m0714j38607j47855p4157L1410J15420J40418Q9958j4274j11531
521F5235j44484r8689n324R1966J47123J20011J3749j05083j53087j05675r616
$$ plain form
532 -183874 -107865 14218 131960 185095 129196 -14685 -155555 -202322 -132681 2574 128081
543 128081 183521 142659 24453 -107563 -178458 -148802 -35271 102902 191465 175921 59524
554 59524 -86189 -171653 -153306 -54303 69794 163366 178733 95094 -49365 -166310 -181687
565 -181687 -92772 41122 145620 170543 104074 -24348 -145300 -187321 -125435 -25 118151
576 118151 169100 127984 10600 -122212 -189368 -145569 -20659 105120 165924 139868 44167
587 44167 -77880 -164656 -158132 -55486 80687 170012 165643 75043 -53890 -151916 -160652 -73778
599 -73778 54540 148382 163683 98018 -16825 -128571 -174875 -116977 15883 136450 169799
610 169799 106468 -6355 -112665 -166073 -136038 -28249 99460 165242 129068 21161 -93079
$$ packed form
532a83874P6009J22083J17742N3135n5899j43881j40870m6767O9641J35255J25507
543A28081N5440m0862j18206j32016p0895K9656J13531J38173Q8563j5544j16397
554E9524j45713q5464J8347R9003J24097R3572J5367q3639j44459j16945j5377
565a81687Q8915J33894J04498K4923o6469j28422j20952m2021O1886J25410J18176
576A18151N0949m1116j17384j32812o7156M3799J24910J25779O0804k6056r5701
587D4167j22047q6776O524J02646J36173Q9325m369r0600j28933r8026q736Q6874
599g3778J28318R3842J5301o5665j14843j11746m6304N7898J32860J20567L3349
610A69799o3331j12823j06310n3408L0035J07789J27709O5782l6174j07907j14240
$$ plain form
621 -93079 -159207 -147210 -57455 69880 160292 153988 55638 -69285 -148299 -146064 -68785 46054
633 46054 140751 160979 92145 -25998 -127152 -156210 -96566 21612 132876 168680 107409
644 107409 -8272 -110471 -148444 -110593 -15632 93534 158161 132691 25521 -97117 -160336
655 -160336 -132587 -37585 72020 142287 134936 50043 -67198 -148217 -147032 -66999 45954 132504
667 132504 146036 77203 -36795 -130383 -151017 -88505 22815 123862 157297 100438 -12222
678 -12222 -110425 -141958 -97502 -4447 94245 151848 128494 28566 -91091 -153741 -122540 -22394
690 -22394 82798 139751 124520 44581 -61840 -137347 -137077 -60584 47630 127821 138602 69982
702 69982 -42832 -134695 -148466 -77524 30145 113751 134638 84836 -12450 -106718 -144090 -100205
$$ packed form
621i3079o6128J1997Q9755J27335R0412o304r8350j24923p9014K235P7279J14839
633D6054R4697K0228o8834j18143j01154k9058N9644J18178J11264L5804o1271
644A07409j15681j02199l7973L7851R4961J09166O4627k5470j07170j22638o3219
655a60336K7749R5002J09605P0267p351q4893j17241q1019J185Q0033J12953Q6550
667A32504J3532o8833j13998r3588k0634O2512J11320J01047L3435n6859j12660
678a2222r8203l1533M4456R3055R8692N7603k3354r9928j19657o2650L1201J00146
690b2394J05192N6953j5231p9939j06421p5507K70P6493J08214Q0191J0781o8620
702F9982j12814r1863j3771P0942J07669Q3606K0887m9802r7286r4268l7372M3885
$$ plain form
714 -100205 -986 98292 143996 111710 15614 -90798 -143751 -109938 -14421 84586 133568 115446
726 115446 42162 -54755 -128688 -132028 -52524 62376 138418 130518 51868 -47960 -118257 -127273
738 -127273 -70859 25560 110573 135164 81627 -20877 -113436 -140776 -89140 8248 95317 128089
750 128089 93506 8550 -85676 -138457 -112524 -18629 85749 135477 105705 23320 -63862 -116715
762 -116715 -112853 -48762 51420 130719 134730 56320 -53028 -123590 -117557 -49751 37610 104189
774 104189 120887 76914 -12718 -101826 -134661 -87152 11517 100614 129174 84529 -4701 -89043
786 -89043 -125784 -96687 -16455 72736 121939 102895 25446 -67908 -126427 -114211 -37135 61209
798 61209 122554 112771 41796 -49042 -110252 -112475 -54073 34176 106758 123179 72329 -20956
$$ packed form
714a00205R9219R9278M5704l2286r6096j06412n2953L3813R5517R9007M8982j8122
726A15446p3284r6917p3933l340P9504J14900P6042p900p8650r9828p0297r016
738a27273N6414R6419Q5013K4591n3537j02504r2559k7340N1636R7388Q7069L2772
750A28089l4583q4956r4226n2781K5933R3895J04378M9728k9772q2385q7182n2853
762a16715L862O4091J00182P9299M011p8410j09348p0562O033O7806Q7361O6579
774A04189J6698m3973q9632q9108l2835M7509R8669Q9097K8560m4645q9230q4342
786h9043l6741K9097Q0232Q9191M9203j9044p7449r3354n8519J2216P7076R8344
798F1209O1345r783p0975r0838o1210k223N8402Q8249P2582J6421n0850r3285
$$ plain form
810 -20956 -103417 -125068 -71946 21586 98504 118640 77655 19 -77936 -119418 -97007 -15081
822 -15081 80229 128180 96597 9726 -74305 -113123 -96065 -34581 47584 111560 114182 43992
834 43992 -55923 -120037 -110713 -41737 42953 99259 104945 59197 -19978 -94587 -119508 -73588
846 -73588 19819 102166 121344 71209 -12713 -82905 -107265 -77575 -6682 73165 117639 96251
858 96251 16720 -73335 -118190 -93228 -17846 61842 106522 95542 32517 -48834 -106492 -106654
870 -106654 -47005 39833 103134 106732 48967 -35452 -98893 -108020 -59167 20145 88421 109369
882 109369 69292 -10072 -84746 -111479 -75303 3036 80003 112776 82632 7448 -69205 -104789
894 -104789 -83319 -17631 58556 106530 97683 32123 -54229 -107986 -96586 -31032 47522 95960
$$ packed form
810b0956q2461k1651N3122R3532P6918K0136m0985p7636p7955m1482K2411Q1926
822a5081R5310M7951l1583q6871q4031l8818J7058O1484Q2165O3976K622p0190
834D3992r9915o4114R324O8976Q4690N6306N686m5748p9175p4609k4921M5920
846g3588R3407Q2347J9178n0135q3922p0192k4360K9690P0893P9847M4474k1388
858I6251p9531r0055m4855K4962P5382P9688M4680j0980o3025q1351n7658j62
870a06654N9649Q6838O3301L598n7765q4419o3441r127M8853P9312O8276K0948
882A09369m0077p9364p4674k6733L6176P8339P6967L2773l0144p5184p6653l5584
894a04789K1470O5688P6187M7974q847o5560q6352n3757J1400O5554P8554M8438
$$ plain form
906 95960 93641 44145 -30174 -92837 -106898 -59510 24123 92206 104934 57040 -21285 -86167
918 -86167 -103779 -66748 4771 73329 102902 76045 4900 -71186 -107390 -81380 -9219 65766
930 65766 102789 84255 21741 -51674 -97229 -89201 -30201 47531 100301 96166 39595 -37158
942 -37158 -91406 -94805 -46446 28465 88428 99741 55205 -19828 -83672 -101219 -63063 9956
954 9956 76678 98813 65320 -4101 -70482 -99655 -76343 -11079 61229 99739 80030 13698
966 13698 -60278 -98154 -80976 -21485 47306 90803 87448 35873 -37478 -91262 -92160 -38816 35993
979 35993 90108 94733 48080 -23506 -80558 -91712 -51708 16630 76167 95666 63203 -4626
991 -4626 -71253 -98300 -68754 -538 66568 93978 69066 6937 -58272 -93368 -78840 -21610
$$ packed form
906I5960k319m9496p4319o2663j4061M7388Q3633O8083J2728m7894p8325o4882
918h6167j7612L7031P1519O8558K9573k6857p1145p6086l6204K6010P2161P4985
930F5766L7023j8534o2514p3415m5555Q028N9000P7732N2770m135n6571p6753
942c7158n4248l399M8359P4911N9963J1313m4536p5033o3844j7547L8156P3019
954I956O6722K2135l3493o9421o6381k9173K3312O5264P2308L8510j9709o6332
966A3698p3976l7876J7178N9491O8791M3497l355n1575p3351n3784q98N3344P4809
979C5993N4115M625m6653p1586n7052j1154M0004O8338N9537J9499l2463o7829
991d626o6627k7047K9546O8216O7106K7410k4912o2129o5209l5096J4528N7230
$$ plain form
1003 -21610 47749 90043 81032 26101 -44397 -90958 -87712 -35184 36134 85779 86784 40064
1015 40064 -26318 -77945 -87095 -48681 18096 77237 94310 58457 -9660 -70203 -90082 -58679
1027 -58679 4959 65968 91597 67260 6616 -57315 -88934 -71096 -14597 49954 87869 76545
1039 76545 21676 -47128 -89481 -81014 -28765 36831 80187 79188 34988 -29708 -80444 -87618 -45227
1052 -45227 22198 75902 86146 48469 -14912 -70003 -86230 -54699 7765 66543 88491 62026
1064 62026 2603 -57360 -84553 -65097 -8145 54681 87222 71963 17475 -45560 -82988 -74162
1076 -74162 -23751 39770 80897 76433 29347 -33422 -77597 -80083 -40136 21463 72169 82047
1088 82047 44644 -20161 -73391 -84740 -49171 11461 63399 80855 54687 -886 -57483 -83137
$$ packed form
1003b1610O9359M2294r011n4931p0498m6561L246N2528P1318M9645J005m6720
1015D0064o6382n1627r150L8414O6777N9141J7073l5853o8117o0543j9879L1403
1027e8679O3638O1009K5629k4337o0644o3931l1619J7838N6499O4551L7915j1324
1039G6545n4869o8804m2353Q467N2249O5596M3356r99m4200o4696n0736p174M2391
1052d5227O7425N3704J0244l7677o3381n5091j6227L1531O2464N8778K1948k6465
1064F2026n9423n9963k7193J9456N6952O2826L2541j5259n4488o3035l7428Q826
1076g4162N0411O3521M1127m464m7086o2769m4175k486L9947O1599N0706R878
1088H2047l7403o4805n3230j1349L5569O0632N1938J7456k6168n5573n6597k5654
$$ plain form
1100 -83137 -62507 -5501 55822 86173 67413 11195 -48616 -78989 -64864 -17392 39932 77005
1112 77005 74269 30618 -31843 -77512 -78288 -33311 29610 73951 75737 36376 -20803 -67120 -78639
1125 -78639 -47607 9815 62755 80375 51285 -7716 -61903 -80780 -55287 -614 53174 77921
1137 77921 60066 9026 -47329 -77868 -64969 -15328 43072 78297 69073 21253 -36800 -72493
1149 -72493 -67674 -27434 27623 69444 75917 37822 -23624 -71422 -75682 -37466 18517 61636
1161 61636 72493 45167 -7387 -57855 -77977 -53911 1481 55788 77652 55245 1236 -51711
1173 -51711 -74101 -56113 -10009 40302 71174 65847 22488 -37209 -76781 -68772 -19317 37097
1185 37097 68337 63774 29433 -20005 -63292 -73562 -39419 20156 66436 72404 38934 -13869
$$ packed form
1100h3137K0630N7006O1323L0351j8760n6218n9811l0373J4125M7472N7324L7073
1112G7005k736m3651o2461m5669p76M4977O2921M4341J786l9361n7179m6317j1519
1125g8639L1032N7422N2940J7620k9090n9001n4187j8877K5493N4673N3788K4747
1137G7921j7855n1040n6355l0539J2899M9641N8400L5225r224m7820n8053l5693
1149g2493M819M0240N5057M1821O473l8095o1446m7798m260L8216N5983M3119
1161F1636J0857k7326n2554n0468k0122K4066N5392N4307K1864k2407n4009n2947
1173e1711k2390J7988M6104N0311L0872n327m3359n9697l9572Q009M9455N6414
1185C7097L1240m563l4341m9438m3287j0270L4143N9575M6280N968l3470n2803
$$ plain form
1197 -13869 -58206 -72231 -46868 4798 53559 72390 50439 1390 -49592 -73595 -56732 -7434
1209 -7434 45634 72018 57961 12769 -38667 -69053 -61554 -19708 33742 67684 64736 27189
1221 27189 -25290 -65342 -68860 -31612 25115 65270 66397 32711 -14148 -53583 -67912 -46307
1233 -46307 5350 56793 74648 46316 -7676 -53522 -67852 -47162 -3721 40985 65837 55870
1245 55870 13262 -40162 -72654 -60977 -13073 40270 66167 55356 18732 -25465 -58704 -64394
1257 -64394 -31672 24236 67589 68340 28393 -22293 -55343 -59640 -35829 7813 52531 70447
1269 70447 45608 -7666 -54761 -67415 -43211 2358 44637 63246 48486 6948 -40510 -67185
1281 -67185 -56095 -12677 38010 65099 54548 14387 -31802 -60788 -58188 -24390 25104 61739
$$ packed form
1197a3869m4337j4025K5363N1666M8761J8831k1951m9049n0982k4003J6863M9298
1209g434N3068K6384j4057m5192n1436l0386P499M1846N3450L3942k948l7547
1221B7189n2479m0052l518L7248N6727M0155J127l3686m6859l9435j4329K1605
1233d6307N1657N1443J7855k8332n3992m5846j4330K0690M3441M4706K4852r967
1245E5870m2608n3424l2492J1677M7904N3343K5897j0811l6624m4197l3239n690
1257f4394L2722N5908M3353P51l9947n0686l3050m297K3811M3642M4718J7916
1269G0447k4839n3274m7095j2654K4204M5569M2279J8609j4760m1538m7458k6675
1281f7185J1090M3418N0687K7089j0551m0161m6189k8986K600L3798M9494L6635
$$ plain form
1293 61739 62137 27036 -21227 -55479 -59582 -33086 12300 54362 67472 40525 -10333 -53465
1305 -53465 -62684 -36809 5498 43146 59847 48048 8460 -40349 -67964 -54314 -6793 42439
1317 42439 63033 46847 8850 -29684 -55509 -56086 -26102 23802 61983 61145 22095 -26911 -56387
1330 -56387 -55531 -27857 13676 51128 61641 36547 -11107 -51730 -61231 -36199 8144 46548
1342 46548 59983 42140 2332 -39274 -60744 -47675 -5753 41015 63131 47666 7325 -33727
1354 -33727 -55000 -49404 -19145 24292 58166 57947 20941 -28381 -57592 -53506 -23674 16037 48250
1367 48250 57270 32633 -13323 -51860 -59267 -33130 8310 44440 56681 39244 -643 -41561
1379 -41561 -59569 -43127 -1393 40317 58605 44400 6858 -32272 -53430 -46929 -15290 27677
$$ packed form
1293F1739L98l5101m8263l4252m103K6496M5386M2062J3110k6947n0858m3132
1305e3465r219K5875M2307L7648J6701j1799l9588m8809k7615J3650M7521M9232
1317D2439K0594j6186l7997l8534k5825n77K9984M9904L8181q38l9050m9006k9476
1330e6387Q56K7674M1533L7452J0513k5094m7654m0623r501K5032M4343L8404
1342D6548J3435j7843l9808m1606k1470J3069M1922M6768K2116j5465m0341m1052
1354c3727k1273N596L0259M3437L3874k19l7006m9322k9211M086K9832L9711L2213
1367D8250R020k4637m5956l8537p407K6137M1440L6130J2241j7437l9887m0918
1379d1561j8008J6442M1734M1710J8288j4205l7542l9130k1158O501L1639M2967
$$ plain form
1391 27677 57001 54462 18505 -27894 -54668 -49895 -19958 18297 47940 53515 29229 -13587
1403 -13587 -50679 -57402 -30836 10607 44428 54035 34705 -4204 -41841 -56727 -39734 -771
1415 -771 38233 55259 41683 5056 -34324 -53846 -43966 -10985 28231 54270 50352 16673 -26999
1428 -26999 -53515 -47391 -16444 20698 47090 51191 27862 -13361 -48875 -55295 -28209 14035
1440 14035 45354 51129 30565 -5672 -39824 -53669 -37724 133 38265 53712 38869 2276
1452 2276 -35266 -53181 -41742 -8062 29179 50294 44819 13715 -26398 -51858 -46968 -16076
1464 -16076 22715 47771 48272 22503 -16302 -46374 -49946 -24812 13729 44208 51131 30081 -7532
1477 -7532 -40638 -51304 -32085 4040 37972 50931 36039 1300 -34573 -51447 -39780 -6132
$$ packed form
1391B7677K9324k539l5957m6399k6774M773K9937L8255K9643N575k4286m2816
1403a3587l7092o723K6566M1443L3821R607j9330l8909l7637j4886J6993L8963
1415g71L9004J7026j3576l6627l9380j9522R880L2981L9216K6039l918l3679m3672
1428b6999k6516O124L0947L7142K6392M101k3329m1223l5514o420K7086M2244
1440A4035L1319N775k0564l6237l4152j3845J5945L7857L8132J5447j4843l6593
1452B276l7542j7915J1439L3680L7241K1115n475l1104m0113k5460M890L0892
1464a6076L8791K5056N01k5769l8805l0072l572K5134L8541L0479O923k1050l7613
1477g532l3106j0666J9219L6125L3932J2959j4892l4739l5873j6874J1667L3648
$$ plain form
1489 -6132 29939 49646 41859 10211 -28357 -50654 -43860 -13540 22129 44690 44133 20690 -16710
1502 -16710 -47256 -50433 -22934 16863 44255 46133 24990 -7900 -37603 -48497 -31398 4972
1514 4972 38926 50375 33960 -178 -33876 -48487 -36058 -2608 31047 47175 38656 9614
1526 9614 -25392 -48075 -43683 -13004 24647 46393 41343 14104 -19310 -43095 -45051 -23129 13124
1539 13124 42333 46604 23286 -12258 -40420 -47181 -27825 6622 37092 46999 30932 -1482
1551 -1482 -32741 -46045 -34344 -2421 32488 48886 37830 6068 -27786 -44760 -37408 -9497
1563 -9497 23590 44443 41468 15868 -19308 -44340 -44111 -18586 16845 41225 42345 20080 -12586
1576 -12586 -38566 -45041 -27364 6023 36405 45724 28611 -5008 -35198 -45579 -30986 -733
$$ packed form
1489f132L6071J9707p787l1648l8568k2297O794L0320L5669K2561n57k3443l7400
1502a6710l0546l177K7499L9797K7392J878k1143l2890k9703j0894J7099L6370
1514D972L3954J1449j6415l4138l3698j4611J2429L3450L3655J6128q519k9042
1526I614l5006k2683M392L0679L7651K1746n050k7239l3414k3785j956K1922L6253
1539A3124K9209M271k3318l5544k8162o761J9356L4447L0470R907j6067l2414
1551a482l1259j3304J1701L1923L4909J6398j1056l1762l3854j6974P352K7911
1563i497L3087K0853k975k5600l5176k5032K29K5525L5431K4380J120k2265l2666
1576a2586k5980o475J7677L3387L0382R319j7113l3619l0190j0381J4593L0253
$$ plain form
1588 -733 30318 45027 34956 5723 -26715 -44747 -36495 -7738 26559 45416 39220 11972 -19698
1601 -19698 -40351 -39006 -16794 16016 41654 43587 20605 -14019 -40183 -42882 -22107 9094
1613 9094 34787 41935 26378 -4308 -34105 -45815 -31934 8 31235 44120 31439 1205
1625 1205 -29074 -42991 -33887 -6791 23420 41614 37992 12906 -20572 -42737 -38875 -12781 20287
1638 20287 41260 39665 17716 -12393 -36119 -40383 -21797 9748 36962 43119 24563 -7167
1650 -7167 -34423 -42424 -27766 2171 30360 41193 29201 315 -28885 -43090 -34199 -6393
1662 -6393 24812 41217 33439 7462 -22472 -40076 -36491 -13476 17929 39771 39622 16587 -15371
1675 -15371 -37765 -37982 -17747 12042 35759 41051 24515 -5952 -33211 -41000 -24900 5041 32013
$$ packed form
1588g33L1051J4709j0071k9233l2438j8032Q252K8757L4297J8857o196k7248l1670
1601a9698k0653J345K2212L2810K5638J933k2982l4624k6164k699K0775L1201
1613I094K5693P148j5557l0686k9797j1710J3881L1942L1227J2885j2681l0234
1625A205l0279j3917R104K7096L0211J8194l622k5086l3478k2165L862K6094L3068
1638B0287K0973j595k1949l0109k3726m264J8586L1545K7214O157j8556l1730
1650g167k7256q001J4658K9937K8189J0833j1992k8886k9200j4205Q891K7806
1662f393L1205J6405p778k5977k9934j7604L585K3015L1405K1842j49k3035l1958
1675a5371k2394k17K0235K9789K3717N292j6536l0467k7259p789J6100K9941K6972
$$ plain form
1688 32013 41760 28151 -729 -28386 -40743 -30752 -4921 24007 39783 33398 7100 -24418
1700 -24418 -42339 -36045 -10578 18965 37381 34811 13709 -15320 -36757 -38850 -19048 12362
1712 12362 36168 39539 20951 -8606 -33034 -38515 -22392 6131 31899 40287 26924 -519
1724 -519 -27348 -39332 -29117 -1381 27007 40654 31064 4546 -23334 -38889 -33399 -9625 19388
1737 19388 37390 34469 11899 -18628 -37986 -36947 -16184 12241 34681 37390 18375 -11222
1749 -11222 -34580 -38252 -21601 6693 31224 38997 25018 -2636 -28893 -38703 -26618 531
1761 531 27728 39801 30312 4649 -23446 -37876 -31040 -6536 21361 37391 33628 11085 -17651
1774 -17651 -37145 -35864 -14023 14832 34851 35438 16289 -12006 -34066 -37831 -20842 7409 30993
$$ packed form
1688C2013R747j3609k8880k7657j2357R991K5831K8928J5776o385k6298l1518
1700b4418j7921O294K5467K9543J8416k570k1102k9029k1437k093J9802L1410
1712A2362K3806L371j8588k9557k4428n481J6123K8523K5768Q388j3363k7443
1724e19k6829j1984J0215K7736K8388J3647r590k6518k7880j5555N490K3774K9013
1737A9388J8002k921k2570l0527j9358J039K0763K8425K2440K709j9015k9597
1749a1222k3358l672J6651K8294K4531P773j3979k7654k6257r810J2085K7149
1761E31K7197J2073r489k5663k8095j4430O836K4504K7897J6030l763k2543k8736
1774a7651j9494J281K1841K8855K0019N87j9149k8295k2060l765J6989K8251K3584
$$ plain form
1787 30993 37208 22456 -4613 -29793 -38703 -25748 1015 27366 38216 28176 2374 -24288
1799 -24288 -37382 -29032 -4907 21989 37676 33060 10223 -18258 -35986 -33268 -11386 16126
1811 16126 35065 34744 15578 -12464 -33723 -36406 -19070 9183 30848 35746 21050 -5497 -30251
1824 -30251 -38967 -25050 2853 27620 36016 25342 879 -24312 -37262 -29505 -4595 23012
1836 23012 37020 30334 8199 -18588 -35567 -32408 -10009 17563 35347 33202 14441 -11656
1848 -11656 -32572 -35385 -17605 11073 33224 35872 18468 -7240 -28910 -35691 -23701 2358
1860 2358 28116 37297 24617 -1544 -26158 -36615 -27756 -3567 22658 35974 28338 5192 -20063
1873 -20063 -35221 -31414 -10371 17908 35757 33020 11606 -14637 -32235 -32711 -15521 10866 32174
$$ packed form
1787C0993O215j4752k7069k5180q910J2955K6763K6351J0850j0040k5802k6662
1799b4288j3094Q350K4125K6896J5687m616k2837k8481j7728K718K1882K7512
1811A6126J8939l21j9166k8042k1259k683J7336K8253K1665M898j4696k6547k4754
1824c0251q716J3917K7903K4767Q396j0674k4463k5191j2950P757K4910K7607
1836B3012J4008o686k2135k6787j6979L159K2399K7572J7784k145j8761k6097
1848a1656k0916k813J7780K8678K2151K648j7404k5708k1670o781J1990K6059
1860B358K5758R181j2680k6161k4614j0457Q859K4189K6225J3316p636k3146k5255
1873b0063j5158L807K1043K8279J7849k737k1414k6243j7598m76J7190K6387K1308
$$ plain form
1886 32174 35742 19090 -8311 -29718 -35386 -21023 5365 29210 36043 23022 -1979 -25226
1898 -25226 -35159 -26317 -2741 23103 36344 27794 3807 -21794 -34979 -30056 -9032 17544 34421
1911 34421 31122 10275 -15754 -32703 -32955 -15528 11767 33117 34678 16258 -10633 -29405 -32266
1924 -32266 -19502 4119 28085 37382 24138 -3623 -27355 -34495 -23089 45 23254 34984
1936 34984 27563 4298 -21169 -34193 -29046 -7657 18479 35066 31104 8426 -18174 -32615
1948 -32615 -29778 -12566 10465 30233 34250 17305 -11411 -32551 -33661 -16500 7286 27044
1960 27044 33297 21531 -3641 -27273 -34599 -22649 909 23912 35016 26640 2666 -22795
1972 -22795 -34845 -26168 -4196 19305 33325 30105 9580 -17216 -33169 -30534 -10552 14073
$$ packed form
1886C2174L568j6652k7401k1407n668J4363K6388K3845O833j3021k5001k3247
1898b5226r933Q842K3576K5844J3241q550k3987k5601j3185M923K1024K6576J6877
1911C4421l299k0847k6029j6949k52J7427K7295K1350J561j8420k6891j8772k861
1924c2266J2764K3621K3966R297j3244k7761k3732p140J1406K3134K3209J1730
1936C4984p421k3265k5467j3024N147K1389K6136J6587l962k2678k6600j4441
1948c2615K837J7212K3031J9768M017j6945k8716k1140j110J7161K3786J9758
1960B7044O253j1766k5172k3632p326J1950K3558K3003J1104q376k3974k5461
1972b2795j2050Q677K1972K3501J4020l220k0525k6796j5953K635J9982K4625
$$ plain form
1984 14073 31296 31955 14917 -11915 -31681 -32723 -15480 8267 27081 32918 20654 -4943 -29113
1997 -29113 -35337 -21100 3842 24574 32042 23822 1958 -22205 -34801 -26680 -3195 21694 33262
2010 33262 27317 6816 -18027 -32275 -28265 -8628 15336 30913 31156 14406 -12158 -32731 -32800
2023 -32800 -13147 12136 28580 29672 16923 -4652 -26510 -34761 -21904 4446 27300 32689
2035 32689 20170 -1503 -22906 -33255 -25159 -2527 21679 32943 25623 4600 -18627 -32460
2047 -32460 -28350 -7803 17271 32138 29063 10364 -13499 -29816 -30480 -13449 11927 30164 31402
2060 31402 15537 -8118 -27313 -31903 -18850 5909 27177 32539 19739 -3302 -24107 -31977
2072 -31977 -22896 -1474 21933 33093 24762 2469 -21161 -31894 -25662 -5863 16747 31196
$$ packed form
1984A4073J7223O59j7038k6832j9766j042J7243K3747J8814N837j2264k5597k4170
1997b9113o224J4237K4942K0732P468q220k1864k4163j2596Q121K3485K4889J1568
2010C3262n945k0501k4843j4248M010J9637K3964J5577K43j6750k6564k0573o9
2023c2800J9653K5283J6444J092j2749k1575k1858q251J2857K6350K2854N389
2035C2689j2519k1673k1403j0349Q096K2632K4206J1264p320k1023k3227j3833
2047c2460M110K0547K5074J4867l075j8699k3863j6317o64J7031K5376J8237J238
2060C1402j5865k3655j9195m590J3053K4759K1268N362j2800k3041k0805p870
2072c1977R081K1422K3407J1160q331k2293k3630j0733O232J9799K2610J4449
$$ plain form
2084 31196 28311 9418 -15633 -31604 -29420 -10439 13623 29321 29030 14019 -8732 -27414 -31502
2097 -31502 -17438 7464 28429 32139 18137 -5082 -24719 -31043 -20349 1140 22521 31880
2109 31880 23484 1486 -21814 -32576 -24644 -3724 18971 30958 25936 7113 -16428 -30439
2121 -30439 -28449 -9867 13931 29738 29132 12106 -11421 -28518 -29745 -14932 8246 27372 30465
2134 30465 17105 -6083 -25286 -30797 -19216 2893 23341 31306 21855 -65 -22030 -31470 -23145
2147 -23145 -2188 19604 30246 24747 5800 -16675 -30769 -27111 -7921 15263 29261 27184
2159 27184 10157 -11687 -28252 -29385 -13534 9912 27793 29592 15028 -7397 -25225 -29913
2171 -29913 -18030 4449 24538 30671 19841 -1523 -22153 -30508 -22007 -1349 20292 30561
$$ packed form
2084C1196k885j8893k5051j5971K184J8981K4062J5698k91j5011k2751j8682m088
2097c1502J4064K4902K0965L710j4002k3219j9637o324J0694K1489K1381R359
2109C1880q396k1998k3300j0762P932K0920K2695J1987n022j8823k3541j4011
2121c0439J990J8582K3798J5807o06j7026k3527j7097j227J4813K3178J9126L093
2134C0465j3360k3188j9203n511J1581K2109K0448P965r451k1920k1965r440Q325
2147b3145K0957K1792J0642n499j8947k2475j4094L658J9190K3184J3998k077
2159B7184j7027k1844j6565j133J5851K3446J7881J799j4564k2425j7828m688
2171b9913J1883K2479K0089O133j0830k1364k0630q355Q501K0658K1641J0269
$$ plain form
2183 30561 23747 3734 -18267 -29775 -25365 -6581 15838 29634 26578 8753 -13524 -28216
2195 -28216 -27429 -11962 10695 27773 29099 13694 -8636 -26109 -28829 -15873 5509 24350 29854
2208 29854 18716 -3068 -23057 -30391 -19942 708 21172 29455 21908 2476 -18673 -29415
2220 -29415 -23898 -4396 17008 28972 25101 7200 -14737 -28650 -26495 -9606 12507 27289
2232 27289 26597 12148 -9675 -26180 -28337 -14932 7694 25270 28743 16221 -4745 -22750 -28304
2245 -28304 -18629 1757 21405 29699 20864 238 -20120 -28968 -22072 -2729 17735 28501 23754
2258 23754 5814 -15333 -28249 -25649 -8472 13291 27713 26356 9887 -11746 -26030 -26736 -12801
2271 -12801 7844 24339 27665 15516 -5796 -24393 -28604 -16526 4415 22434 28167 18608 -683
$$ packed form
2183C0561o814k0013k2001j1508M410J8784K2419J3796l056j7825k2277j4692
2195b8216P87J5467K2657J7078J326j5405k2330j7473k720J2956K1382J8841N504
2208B9854j1138k1784j9989p334J0449K0650K0464Q283p547j9432k1149j0742
2220b9415N517J9502K1404J1964l871j7901k1937j3913K155J6889K2113J4782
2232B7289o92j4449k1823j6505k157J3405K2626J7576L473j2522k0966j8005n554
2245b8304R675K0386J9648Q294q835k0626k0358q848O896J9343K0464J0766m747
2258B3754j7940k1147j2916K600J7177K1763J4422j357j6469k1633j4284p06J3935
2271a2801K0645J6495L326j2149k1312j8597m211J2078K0941J8019N733r559j9291
$$ plain form
2284 -683 -19789 -28504 -20575 -1160 19311 28717 22214 3419 -16838 -28012 -23477 -5962 14542
2297 14542 27058 24304 8434 -12128 -26008 -26484 -11723 10198 25611 26734 12375 -8027 -23556
2310 -23556 -26740 -15550 4280 22576 28098 17678 -2877 -21139 -27192 -18552 294 19020 27755
2323 27755 21090 2793 -17153 -27035 -22132 -4529 15394 27204 23584 7032 -13604 -25775 -23831
2336 -23831 -9070 10547 24638 25816 12197 -9021 -25158 -26803 -13336 6351 22059 26332
2348 26332 15166 -3658 -21458 -27225 -17826 1125 19974 27645 19756 767 -18239 -26873 -20152
2361 -20152 -2487 16140 26318 22588 6298 -13577 -26101 -23528 -7659 12961 25991 24044
2373 24044 9532 -9767 -23426 -24934 -12260 6910 22692 26211 14233 -5749 -22478 -26412
$$ packed form
2284f83j9106q715P929J9415K0471R406o503j8795k0257j1174M535J7515K0504
2297A4542J2516k754j5870k0562j3880m76J4761K1921J5413J123j4359k0402j5529
2310b3556l184J1190J9830J8296N522j0420k0555j8262o053Q640J8846J8726Q735
2323B7755o665j8297j9946r882M903J7603J9923J1810l620j6552k0636j2171J944
2336b3831J4761J9617J4091J178j3619k1218j6137j645J3467J9687J5708M273
2348B6332j1166j8824j7800n767R399J8951J8849P671p889j8989j9006q634O721
2361b0152J7665J8627J0178l730j6290j9875j2524K573J5869K0620J3030j947
2373B4044j4512j9299j3659j508J2674J9170J5782L519j1978j9982j6729l934
$$ plain form
2385 -26412 -15818 2853 19586 25867 17628 -609 -18813 -26990 -19677 -1587 17003 25987 20297
2398 20297 3638 -14832 -25141 -21306 -6073 12822 25185 23633 9195 -10966 -24269 -23909 -9390
2411 -9390 9326 23391 24144 12413 -5951 -21688 -25435 -14905 4689 20936 25313 15886 -2357
2424 -2357 -19146 -25874 -18273 -367 17361 24932 18661 2561 -15300 -25548 -21837 -5071 14774
2437 14774 25307 21183 6235 -11830 -23103 -22422 -9443 9313 23800 24585 10960 -8260 -22210
2450 -22210 -23640 -12292 5507 20497 24790 15387 -3094 -19809 -24732 -16426 970 17544 25014
2463 25014 17870 819 -16409 -24897 -19540 -3674 14138 24268 20690 5149 -13002 -23853 -21704
2476 -21704 -7343 10302 22596 22591 9887 -8740 -22425 -23281 -11479 6678 20926 23775 13913
$$ packed form
2385b6412J0594J8671J6733O281q239j8237j8204q177P313J8090J8590Q984n690
2398B0297j6659j8470j0309L835J5233J8895J2363j552j4438k0161j3303L60J4519
2411i390J8716J4065P53j1731j8364j5737l747J0530J9594J6247M377r427j8243
2424b357j6789o728P601J7906J7728P571o271j6100j7861j0248L711J6766J9845
2437A4774J0533m124j4948j8065j1273O81J2979J8756J4487P85j3625j9220j3950
2450b2210j430J1348J7799J4990M293r403j8481j6715m923Q306J7396J6574P470
2463B5014p144j7051j7228q488N357J5866J7812J0130l578j5541j8151j0851K149
2476b1704J4361J7645J2294nj2704j8627j3685q56J1802J8157J4248K849r862
$$ plain form
2489 13913 -3782 -19639 -24131 -14892 2607 18870 24317 16836 173 -16246 -24477 -18500 -2051
2502 -2051 15741 24537 19479 3703 -13435 -22908 -20328 -6711 10802 22712 22128 8186 -10263
2515 -10263 -22789 -22196 -9526 7371 20414 22619 12281 -5238 -20471 -23753 -13645 4123 18913
2528 18913 23280 14873 -894 -16624 -23594 -16922 -904 16318 24068 18093 2711 -14114 -22572
2541 -22572 -18636 -4647 12337 22425 20521 7168 -10495 -22420 -21168 -8172 8612 20624
2553 20624 21121 10587 -5834 -19765 -23034 -12886 4952 19731 22464 12842 -2979 -17162 -22340
2566 -22340 -16261 -190 16437 23447 16649 583 -14809 -21913 -17419 -3659 12553 22563 19684
2579 19684 5718 -11202 -21639 -19981 -7097 9396 20951 20699 9250 -7507 -19764 -21412 -11159
$$ packed form
2489A3913j7695j5857m492R239J7499J6263N447p481j6663j6419q231N977J6449
2502b051J7792Q796n058j5776j7138r473K580J3617J7513J1910n84j3942j8449
2515a0263j2526N93J2670J6897J3043K205j0338j7519j5233l282J0108J7768J4790
2528A8913M367q407j5767j5730o970O672J6018J7222P750n975j5382j6825q458
2541b2572L936J3989J6984J0088j904j3353j7663j1925J252J2996J6784J2012
2553B0624M97j0534j6421j3931l269J0148J7838J4779K733r622j5821j4183n178
2566b2340O079J6071J6627P010o798j6066j5392p104M494J3760J6212J0010k879
2579A9684j3966j6920j0437J658J2884J6493J1555k52j1449j6757j2257j648J0253
$$ plain form
2592 -11159 5518 19121 22023 12344 -3996 -17919 -21911 -14120 1247 16235 22586 15737 -185
2605 -185 -15730 -22110 -16491 -1788 13132 21431 17855 4946 -11875 -21965 -19078 -5235 10919
2618 10919 20585 19503 8333 -7353 -19509 -20969 -10098 6849 20046 21363 10467 -5289 -17460
2631 -17460 -20726 -12914 2371 16782 22127 14145 -1386 -16134 -21744 -15476 -1228 13829 20963
2644 20963 17027 2712 -12709 -21393 -18146 -4915 11163 20943 18732 6355 -9425 -19668 -18928
2657 -18928 -8249 7289 19078 20612 10302 -5708 -18128 -20361 -11025 4086 17098 20969 13171
2670 13171 -1581 -15681 -21356 -14216 266 14388 20552 15172 1768 -12907 -21160 -16957 -3566
2683 -3566 11472 20169 17285 5030 -9598 -19457 -18837 -7632 8268 19343 19264 8516 -6714 -17438
$$ packed form
2592a1159J6677J3603K902r679j6340j3923l992P791J5367J4988O351o849j5922
2605a85j5545o380N619J4703J4920Q299l576j2909j6821j0090K887J3843J6154
2618A0919R666j082j1170j5686j2156j460J0871J6947J3197J317j0896j5756j2171
2631a7460l266P812J5285J4411N345p982j5531j4748n610O268J4248J5057P134
2644B0963l936j4315j5421q684L247J3231J6078R780k211j2377j5780j0243P40
2657a8928J0679J5538J1789J534j0310j6010j2420k233R336J5111J3012L871p798
2670A3171j4752j4100n675P140J4482J4122O164n380j3404j4675q253M203J3391
2683c566J5038Q697k884j2255j4628r859O20J1205J5900J1075p9j0748j5230j0724
$$ plain form
2697 -17438 -19202 -10192 4540 17124 20726 12490 -2898 -16121 -20459 -12319 1335 14630 20031
2710 20031 15011 810 -13134 -20271 -16053 -2805 11776 19861 17035 4264 -11020 -19616 -17169
2723 -17169 -5995 8271 18272 18260 7927 -7216 -18840 -18919 -8684 5615 16414 18926 11030
2736 11030 -3149 -15931 -19855 -12531 1862 15124 19755 13790 -306 -13494 -19473 -14320 -1133
2749 -1133 12477 19108 15729 3640 -10445 -19242 -17116 -5351 9561 18348 16790 6286 -7581
2762 -7581 -17702 -18131 -8975 5679 16858 18732 9833 -4725 -16418 -18770 -10981 2444 15054
2775 15054 19033 12618 -560 -13072 -19018 -13835 -1055 12753 19529 14878 2339 -11329 -18462
2788 -18462 -15275 -3969 9627 18070 17068 5986 -8214 -17785 -17099 -7060 6970 16520 17433 8844
$$ packed form
2697a7438j764R010J4732J2584L602q236j5388j3223m338Q140J3654J3295N401
2710B0031n020j4201j3944p137M218J3248J4581Q085k826j2771j5284q596K447
2723a7169J1174J4266J0001j2j0333j5143j1624p9J0235J4299J0799K512p896
2736A1030j4179j2782l924P324J4393J3262M631n965j4096j3188n979N153J3187
2749a133J3610O631l379j2089j4085q797K126J1765J4912Q787j558j0504j3867
2762g581j0121m29R156J4654J1179J874q899j4558j1693k352P789J3425J2610
2775A5054L979o415j3178j2512n946N183J2780J3808O776m651j2539j3668p133
2788a8462L187J1306J3596Q443j002j1082j4200r571O86J0039J4030R550R13q589
$$ plain form
2802 8844 -4699 -16110 -18429 -10508 3315 15048 17945 11023 -2014 -13792 -18376 -12883 -141
2815 -141 12722 18139 13682 1700 -11076 -18164 -14900 -3448 10532 18027 15545 4530 -8589
2828 -8589 -16652 -16228 -6547 7205 17031 17362 7857 -6151 -16100 -16984 -8871 3936 14891 17668 10745
2843 10745 -2745 -14292 -18213 -11647 704 12887 17855 12960 621 -11891 -17938 -13631 -2174
2856 -2174 10438 17617 14730 3926 -9341 -17391 -15296 -5199 7678 16207 16278 6959 -6423 -16358
2870 -16358 -16685 -7954 5041 15282 16837 9527 -3425 -14300 -17277 -10458 2028 13309 17274
2883 17274 12030 -381 -12149 -17292 -13011 -1267 11254 17445 13434 2655 -9703 -16719 -14377
2896 -14377 -4601 8264 16290 15547 5364 -7091 -16163 -16021 -7044 5608 15078 16089 8363 -4043
$$ packed form
2802H844j3543j1411k319P921J3823J1733K897o922j3037j1778m584N493J2742
2815a41J2863N417m457j1982j2776p088L264J1452J3980P495k482j1015j3119
2828h589q063M24R681J3752R826L31r505j4008r949q84Q113J2807J0955K777o923
2843A0745j3490j1547l921O566J2351J2183M968m895j2339j2512o047M307J1457
2856b174J2612P179k887j0804j3267q050K095J0097J2877Q529P1r319j3382r935
2870a6358l27Q731J2995J0241J555p310j2952j0875k977O819J2486J1281L965
2883A7274n244j2411j1768n143M281J1744J2521O191m011j0779j2358p016K342
2896a4377R776J2865Q026p43j0183j2455r072J42Q977J2652R470J011p726j2406
$$ plain form
2910 -4043 -14590 -16776 -9383 2603 13486 16788 10978 -799 -12199 -16621 -12007 -262 11197
2923 11197 16976 13128 1992 -9691 -16703 -13716 -3405 9243 16169 14572 5108 -7167 -16138
2936 -16138 -15443 -6107 6426 14612 15493 7673 -4420 -14224 -16266 -8884 3473 13616 15743 9776
2950 9776 -1765 -12165 -16553 -11572 -1 11856 16603 11996 1096 -10018 -15932 -13042 -2547
2963 -2547 9085 16029 13880 3846 -8073 -15207 -14095 -5529 6392 15160 14997 6619 -5297 -14099
2977 -14099 -15452 -8232 3543 13426 15636 9167 -2484 -12695 -15796 -10046 1139 11197 15787
2990 15787 11310 492 -10855 -15950 -12154 -1848 9152 15424 12938 3306 -8413 -15321 -13742
3003 -13742 -4319 7232 14667 14148 5804 -5397 -13767 -15093 -7247 4620 13950 15351 8129 -3241
$$ packed form
2910d043j0547k186P393J1986J0883L302n810j1777j1400m422M614J1745J1459
2923A1197N779l848j1136j1683p012K987J0311J2648O926j597r464j2275q971
2936a6138O95R336J2533Q186Q81p820j2093r804k042P382J2357J0143K127n967
2950I776j1541j0400m388M981J1571J1857M747m607j0900j1114n914K890J0495
2963b547J1632O944k149j0034j1919p134J112Q566J1921Q768j63q378j1916q802
2977a4099j353P220J1775R883K210o469j1651j0211l101N750J1185J0058M590
2990A5787m477j0818j1347n095L796J0306J1000O272k486r632j1719o908J579
3003a3742R423J1551P435n19q344j1201q370j326P846J1867R330J401p222j1370
$$ plain form
3017 -3241 -12115 -15317 -9643 1452 11901 15430 10465 -532 -10999 -15393 -11317 -1084 9667
3030 9667 15252 12178 2349 -8866 -14907 -13066 -3932 7349 14904 13710 4709 -6593 -13472 -13795
3044 -13795 -6239 4685 13258 14575 7477 -3953 -13263 -14484 -8334 2674 11715 14860 9706 -1174
3058 -1174 -11257 -15307 -10415 -332 10291 14865 11288 1879 -9148 -14511 -12447 -2978 7867 14417
3072 14417 12886 4340 -6612 -13985 -13398 -5623 5337 13423 13855 6384 -4392 -12757 -13837 -7544
3086 -7544 2738 11958 14642 8771 -1811 -11247 -14528 -9458 601 10316 14285 10671 690 -9299
3100 -9299 -14317 -11551 -2153 8209 14481 12317 3108 -6938 -13880 -12432 -4256 5990 13206 13062
3114 13062 6041 -4738 -13087 -13719 -6372 3996 11983 13836 7837 -2007 -11080 -14175 -9231 1343
$$ packed form
3017c241q874l202N674J1095J0449L529m965j0997j0467m394M076J0233J0751
3030I667N585l074r829j1215o041J841R134J1281P555j194r001j1302o879l23
3044a3795P556J0924Q573J317p098j1430r310j221O150J1008R041L145n154j0880
3058a174j0083m050M892J0083J0623M574l577r409j1027n363K064R469J0845O550
3072A4417j531q546j0952p373N87P775J0960Q086M32p471j0776q365j080O293
3086g544J0282R220K684n871j0582r436l281N070J0059R715L969l614r981r989
3100i299n018K766R398J0362O272k164r209j0046o942J448Q176J0246P216j44
3114A3062p021j0779q349o32P347J0368P987J853n999r844r073l095M944J0574
$$ plain form
3128 1343 10649 13743 9566 220 -9732 -14165 -10253 -1336 8560 13713 11088 2435 -7663 -13644 -12280
3143 -12280 -3519 7031 13165 12238 4668 -5151 -12757 -13060 -6084 4579 12278 13312 6910 -3146
3157 -3146 -11642 -13604 -8031 2087 11275 13335 9002 -771 -9985 -13376 -9687 -433 9173 13911 10440
3172 10440 1103 -8118 -12998 -10964 -3339 6869 13292 11753 4145 -5941 -12906 -12574 -5163 4830
3186 4830 12389 12387 6055 -3477 -11528 -13196 -7275 2536 11280 13259 8106 -1498 -10006 -13035 -8975 249
3202 249 9138 13265 9577 1208 -8462 -13321 -10831 -2070 7501 13039 10713 2946 -5958 -12217 -12041
3217 -12041 -4787 5421 12489 12235 4861 -4491 -11334 -12280 -6683 3064 10986 12796 7174 -2268 -10122
3232 -10122 -12475 -8429 746 9138 12933 9076 463 -8526 -12871 -9731 -1594 7582 12573 10656 2275
$$ packed form
3128A343R306L094m177r346r952m433L912Q917R896N153k625q653j0098n981J364
3143a2280Q761J0550O134r27p570r819p606l03O976J0663P699J034o402j0056
3157c146q496j962N573J0118R188K060m333r773r214l391L689R254R606M738l471
3172A0440r337r221m880K034P625J0208O423j539p608j0086o965L32P411R993
3186D830P559ko332r532q051j668N921R811Q744J979n153r604q508l029M060R224
3202B49Q889M127l688q369r670m859K490Q761R571N538k326p767q904o259J76
3217a2041P254J0208P068k54p374r352o843r46N597R747P922J810n622r442p854
3232a0122k353M046R175Q392L795l857q613q989m345L140Q137R176M991j917q381
$$ plain form
3247 2275 -6696 -12346 -11041 -3568 5423 12058 11797 4790 -4601 -11249 -11451 -5652 3510 10815 12332
3262 12332 6797 -2101 -10520 -12338 -7199 1687 9532 12305 8350 -270 -8749 -12153 -9249 -981 8408
3277 8408 12518 9544 1569 -7062 -11486 -9873 -3776 5941 11821 11452 3829 -5704 -11459 -11054 -4843
3292 -4843 3785 10678 11676 6221 -3000 -10170 -12071 -6663 2058 9238 11932 7549 -747 -8873 -11927
3307 -11927 -8062 -308 8001 12351 9305 1530 -7506 -11598 -9284 -2490 6143 10871 10834 3764 -5504
3322 -5504 -11658 -10655 -4298 4486 9945 10610 5368 -3168 -10235 -11782 -6143 2472 9703 11188 6775
3337 6775 -1472 -8548 -11555 -7788 127 8288 11751 8837 768 -7321 -11240 -8569 -1666 6521 11128
3352 11128 9837 3364 -5538 -11181 -9935 -3569 4964 10563 10333 4576 -3627 -10378 -10887 -5349 2977
$$ packed form
3247B275q971n650J305P473Q991O635k61p007r391o648k02N799R162P305J517
3262A2332n535q898q419j818N139Q886P845K773l955q620q479l404K904Q268R389
3277H408M110k974p975q631m424J613O097R717N880l69p623r533n755M05O211
3292d843Q628O893R98n455r221p170j901N408Q721P180K694m383q296q126l054
3307a1927L865P754Q309M350l046p775r036m092K314O794Q633M728l7p070r268
3322e504o154J003O357Q784N459O65n242q536p067j547N639Q615P231J485m413
3337F775q247p076l007L767P915Q161L463k914q069q089l919K671O903Q187M607
3352A1128j291o473q902n643J246O366Q533N599k30n757q203o751n09N538Q326
$$ plain form
3367 2977 9254 10744 6321 -1721 -9048 -11016 -6863 986 8226 11322 7936 256 -7724 -11428 -8327
3382 -8327 -1060 6660 10497 9111 2426 -5732 -10658 -9729 -2919 5399 10329 9791 3964 -3631 -9594
3397 -9594 -10162 -5084 3501 9686 10647 5634 -2225 -8726 -10659 -6715 1118 8172 10463 6942 -370
3412 -370 -7661 -10721 -8149 -345 6930 10539 8263 1558 -6125 -10465 -9277 -2796 5298 10397 9440
3427 9440 3367 -4321 -9531 -9515 -4114 3324 9297 10343 5016 -2548 -8871 -10173 -5786 1826 8135
3442 8135 10183 6802 -326 -7868 -10463 -7318 -88 6964 10241 7732 904 -6425 -10418 -8367 -1694
3457 -1694 5365 9874 8810 2774 -4810 -9518 -9393 -3487 3984 9161 9445 4483 -2949 -8428 -9641
3472 -9641 -5213 1727 8511 9743 5606 -1236 -7505 -9701 -6830 191 7139 9929 7345 701 -6226
$$ packed form
3367B977O277J490m423q042p327j968M153P849P240L096l386p680p980l704L101
3382h327P267P720L837j386o685q158m926R29O810Q318M930n38n827p595n963
3397i594n68N078Q585O185R61n013p859o501j933L944P833P054K291l521p312
3412c70p291l060K572P804P275L609k276o705p683m340J188O481Q094N099r57
3427I440o073p688n210J6N401P438N973J046n327p564o323j302M387P612O309
3442H135K048l381p128p542k595L145P230P052L277k509o828p329l993K051O673
3457a694P059M509j064o036p584m708J25N906P471N177K84m962p432n479j213
3472i641M428O940O784J232m137o842o269k196K871P021O948K790k584o644o927
$$ plain form
3487 -6226 -9894 -7991 -1508 5649 9927 8172 2132 -4992 -9520 -8334 -2943 4158 9169 9081 4005
3502 4005 -3278 -8805 -9385 -4627 2541 8396 9278 5479 -1427 -7635 -9486 -6051 645 7323 9886
3517 9886 6681 254 -6456 -9651 -7148 -565 6041 9167 7703 1802 -5211 -8948 -8489 -2317 4597
3532 4597 9224 8269 3079 -3947 -8051 -8989 -4150 2710 8191 9067 4396 -2320 -7828 -9008 -5611 1147
3548 1147 7395 8904 6099 -754 -6811 -9404 -6552 -297 5982 9183 7422 1381 -5543 -8784 -7393
3563 -7393 -1964 4264 9079 7894 3095 -3928 -8447 -8170 -3682 3283 8107 8327 4273 -2331 -7908
3578 -7908 -9001 -4998 1793 7402 8681 5435 -801 -6576 -8929 -6194 -16 6111 8614 6697 1056
3593 1056 -5547 -8728 -7288 -1413 4936 8701 7160 2275 -4185 -8138 -7905 -3281 3634 8355 8278 3619
$$ packed form
3487f226l668J903O483P157M278j755o040p124m528J186N391P101N011q8n076
3502D005p283n527n80M758P168N855Q82l799o906o208j851L435O696O678K563
3517I886l205o427o710l195K503O583O606L126j464n901p013l737M59O172O914
3532D597M627r55n190p026m104r38M839O860N481Q76m671o716n508j180L397O758
3548A147O248J509k805o853o057k593K852O255O279L201j761o041o924l241J391
3563g393N429O228M815j185m799p023m519K77M488O965M824K20m054o604n577
3578g908j093M003O791N609J279l246o236n775k353K735O178O127K503j917n641
3593A056o603l181J440N875O349L765j541m885o460l953K33M624O915M721p7m659
$$ plain form
3609 3619 -2755 -7419 -8370 -4585 1722 7557 8607 4997 -1734 -6839 -8714 -5641 125 6029 8410
3624 8410 6331 398 -5921 -8770 -6450 -873 4920 8157 7292 2152 -4297 -8440 -7918 -2430 4204
3639 4204 7806 7773 3446 -3035 -7391 -7948 -4015 2218 7444 8434 4375 -1634 -6774 -8266 -5449 512
3655 512 6686 8304 5720 68 -5490 -8422 -6370 -789 5127 8171 6543 1166 -4620 -7943 -7301
3670 -7301 -2406 4032 8004 7418 2732 -3373 -7324 -7514 -3683 2013 7164 8137 3954 -2009 -6912 -7988
3686 -7988 -4554 996 6323 8127 5832 -368 -5878 -8225 -5627 -564 5119 7833 6350 1194 -4964
3701 -4964 -8126 -6719 -1662 4186 7985 7172 2588 -3491 -7591 -7004 -3016 2859 7125 7854 3958 -2404
$$ packed form
3609C619o374m664r51L785O307N835J050l610o731n105j875L073N766N904K381
3624H410k079n933o319k849K320N577N793L237q65n140o449m143N22N488O634
3639D204L602l3m327o481m356n57L933O233N226R90m059o009n140j492K817N961
3655E12O174J618k584n652n558k932K052N581N916L044j628n377n786l323O42
3670g301M895O438L972n86m686o105l951j90L831N696N151R73m183n963m903j076
3686g988L434N550N327J804k295o200n510k347K598N063N683K714j483n156o158
3701d964l162J407N057N848L799q13m584o079m100N87L988N875M266P29l896o362
$$ [...]
8191C04
##END NTUPLES=NMR FID
##END=
