##TITLE=1H_PR175-2
 CDCl3, 8 sc, 
 27.6.2019
##JCAMPDX= 6.0         $$ Bruker NMR JCAMP-DX V2.0
##DATA TYPE= NMR FID
##DATA CLASS= NTUPLES
##ORIGIN= UXNMR, Bruker Analytische Messtechnik GmbH
##OWNER= root
$$ XWIN-NMR		Version 3.5
$$ Thu Jun 27 15:23:42 2019 Russian Standard Time (UT+4h)  she@DPX200
##.OBSERVE FREQUENCY= 200.13155
##.OBSERVE NUCLEUS= ^1H
##.DELAY= (6, 6)
##.ACQUISITION MODE= SIMULTANEOUS
##.ACQUISITION SCHEME= undefined
##.AVERAGES= 8
##.DIGITISER RES= 18
##SPECTROMETER/DATA SYSTEM= spect
##.PULSE SEQUENCE= zg30
##.SOLVENT NAME= CDCl3
##.SHIFT REFERENCE= (INTERNAL, CDCl3, 0, 15.7039)
##AUDIT TRAIL= $$ (NUMBER, WHEN, WHO, WHERE, WHAT)
$$ ##TITLE= Audit trail, XWIN-NMR		Version 3.5
$$ ##JCAMPDX= 5.01
$$ ##ORIGIN= Bruker BioSpin GmbH
$$ ##OWNER= she
$$ F:/spectra/data/she/nmr/H-F/1/audita.txt
$$ ##AUDIT TRAIL=  $$ (NUMBER, WHEN, WHO, WHERE, WHAT)
(   1,<2019-06-27 15:22:31.53 +0400>,<she>,<DPX200>,
      <created by zg, POWCHK disabled, PULCHK disabled
       configuration hash MD5:
       00 E9 B6 7A A2 85 ED C7 34 08 36 98 17 FE 4E 26
       data hash MD5: 16K
       06 6F 87 BF A3 09 51 C4 BB E7 FA AA 96 70 77 0E>)
$$ ##END=
$$ 
$$ hash MD5
$$ ED 95 CC 7D 23 2B BE FE 5C 7F DA 56 A5 E2 E9 D3
##$RELAX= 
##$RELAX= 
##$RELAX= 
##$RELAX= 
##$RELAX= 
##$RELAX= 
$$ Bruker specific parameters
$$ --------------------------
##$DU= <F:/spectra>
##$EXPNO= 1
##$NAME= <H-F>
##$PROCNO= 1
##$TYPE= <nmr>
##$USER= <she>
##$AMP= (0..31)
100 100 100 100 100 100 100 100 100 100 100 100 100 100 100 100 100 100 
100 100 100 100 100 100 100 100 100 100 100 100 100 100 
##$AQSEQ= 0
##$AQ_mod= 1
##$AUNM= <au_zg>
##$AUTOPOS= <>
##$BF1= 200.13
##$BF2= 200.13
##$BF3= 200.13
##$BF4= 200.13
##$BF5= 200.13
##$BF6= 200.13
##$BF7= 200.13
##$BF8= 200.13
##$BYTORDA= 1
##$CFDGTYP= 0
##$CFRGTYP= 5
##$CHEMSTR= <none>
##$CNST= (0..31)
1 1 145 1 1 1 1 1 1 1 1 1 1 1 1 1 1 1 1 1 1 1 1 1 1 1 1 1 1 1 1 1 
##$CPDPRG= <>
##$CPDPRG1= <>
##$CPDPRG2= <>
##$CPDPRG3= <>
##$CPDPRG4= <mlev>
##$CPDPRG5= <mlev>
##$CPDPRG6= <mlev>
##$CPDPRG7= <mlev>
##$CPDPRG8= <mlev>
##$CPDPRGB= <>
##$CPDPRGT= <>
##$D= (0..31)
0 1.2 0 0 0 0 0 0 0 0 0 0.03 0 0 0 0 0 0 0 0 0 0 0 0 0 0 0 0 0 0 0 0 
##$DATE= 1561634550
##$DBL= (0..7)
120 120 120 120 120 120 120 120 
##$DBP= (0..7)
150 150 150 150 150 150 150 150 
##$DBP07= 0
##$DBPNAM0= <>
##$DBPNAM1= <>
##$DBPNAM2= <>
##$DBPNAM3= <>
##$DBPNAM4= <>
##$DBPNAM5= <>
##$DBPNAM6= <>
##$DBPNAM7= <>
##$DBPOAL= (0..7)
0.5 0.5 0.5 0.5 0.5 0.5 0.5 0.5 
##$DBPOFFS= (0..7)
0 0 0 0 0 0 0 0 
##$DE= 6
##$DECBNUC= <off>
##$DECIM= 24
##$DECNUC= <off>
##$DECSTAT= 4
##$DIGMOD= 1
##$DIGTYP= 9
##$DL= (0..7)
0 120 120 120 120 120 120 120 
##$DP= (0..7)
150 150 150 150 150 150 150 150 
##$DP07= 0
##$DPNAME0= <>
##$DPNAME1= <>
##$DPNAME2= <>
##$DPNAME3= <>
##$DPNAME4= <>
##$DPNAME5= <>
##$DPNAME6= <>
##$DPNAME7= <>
##$DPOAL= (0..7)
0.5 0.5 0.5 0.5 0.5 0.5 0.5 0.5 
##$DPOFFS= (0..7)
0 0 0 0 0 0 0 0 
##$DQDMODE= 0
##$DR= 18
##$DS= 0
##$DSLIST= <SSSSSSSSSSSSSSS>
##$DSPFIRM= 0
$$ [...]
##$SUBNAM2= <"">
##$SUBNAM3= <"">
##$SUBNAM4= <"">
##$SUBNAM5= <"">
##$SUBNAM6= <"">
##$SUBNAM7= <"">
##$SUBNAM8= <"">
##$SUBNAM9= <"">
##$SW= 24.9336996594482
##$SWIBOX= (0..15)
0 0 2 0 0 0 0 0 0 0 0 0 0 0 0 0 
##$SW_h= 4990.01996007984
##$TD= 16384
##$TD0= 1
##$TE= 0
##$TE2= 300
##$TE3= 300
##$TEG= 300
##$TL= (0..7)
0 120 120 120 120 120 120 120 
##$TP= (0..7)
150 150 150 150 150 150 150 150 
##$TP07= 0
##$TPNAME0= <>
##$TPNAME1= <>
##$TPNAME2= <>
##$TPNAME3= <>
##$TPNAME4= <>
##$TPNAME5= <>
##$TPNAME6= <>
##$TPNAME7= <>
##$TPOAL= (0..7)
0.5 0.5 0.5 0.5 0.5 0.5 0.5 0.5 
##$TPOFFS= (0..7)
0 0 0 0 0 0 0 0 
##$TUNHIN= 0
##$TUNHOUT= 0
##$TUNXOUT= 0
##$USERA1= <user>
##$USERA2= <user>
##$USERA3= <user>
##$USERA4= <user>
##$USERA5= <user>
##$V9= 5
##$VALIST= <valist>
##$VCLIST= <CCCCCCCCCCCCCCC>
##$VD= 0
##$VDLIST= <DDDDDDDDDDDDDDD>
##$VPLIST= <PPPPPPPPPPPPPPP>
##$VTLIST= <TTTTTTTTTTTTTTT>
##$WBST= 1024
##$WBSW= 4
##$XGAIN= (0..3)
0 0 0 0 
##$XL= 0
##$YL= 0
##$YMAX_a= 675321
##$YMIN_a= -795710
##$ZGOPTNS= <>
##$ZL1= 120
##$ZL2= 120
##$ZL3= 120
##$ZL4= 120
##$ABSF1= 10
##$ABSF2= 0
##$ABSG= 5
##$ABSL= 3
##$ALPHA= 0
##$AQORDER= 0
##$ASSFAC= 0
##$ASSFACI= 0
##$ASSFACX= 0
##$ASSWID= 0
##$AUNMP= <proc_1d>
##$AZFE= 0.1
##$AZFW= 0.1
##$BCFW= 1
##$BC_mod= 2
##$BYTORDP= 1
##$COROFFS= 0
##$CY= 11.3945322036743
##$DATMOD= 1
##$DC= 2
##$DFILT= <>
##$DTYPP= 0
##$F1P= 18.9103706918063
##$F2P= -1.10871071338519
##$FCOR= 0.5
##$FTSIZE= 0
##$FT_mod= 4
##$GAMMA= 1
##$GB= 0.15
##$INTBC= 1
##$INTSCL= 1
##$ISEN= 128
##$LB= 0.24
##$LEV0= 0
##$LPBIN= 0
##$MAXI= 10000
##$MC2= 0
##$MEAN= 0
##$ME_mod= 0
##$MI= 1.114404
##$NCOEF= 0
##$NC_proc= 0
##$NLEV= 6
##$NOISF1= 3.799351
##$NOISF2= 2.8
##$NSP= 1
##$NTH_PI= 0
##$NZP= 0
##$OFFSET= 15.70392
##$PC= 1
##$PHC0= -8501.063
##$PHC1= 16.60098
##$PH_mod= 1
##$PKNL= yes
##$PPARMOD= 0
##$PSCAL= 0
##$PSIGN= 0
##$REVERSE= no
##$SF= 200.130013532006
##$SI= 16384
##$SIGF1= 3
##$SIGF2= 2
##$SINO= 400
##$SIOLD= 16384
##$SREGLST= <1H.CDCl3>
##$SSB= 0
##$STSI= 0
##$STSR= 0
##$SW_p= 3612.71676300578
##$SYMM= 0
##$S_DEV= 0
##$TDeff= 0
##$TDoff= 0
##$TI= <>
##$TILT= no
##$TM1= 0
##$TM2= 0
##$TOPLEV= 0
##$USERP1= <user>
##$USERP2= <user>
##$USERP3= <user>
##$USERP4= <user>
##$USERP5= <user>
##$WDW= 1
##$XDIM= 8192
##$YMAX_p= 0
##$YMIN_p= 0
$$ End of Bruker specific parameters
$$ ---------------------------------
##NTUPLES= NMR FID
##VAR_NAME=  TIME,          FID/REAL,        FID/IMAG
##SYMBOL=    X,             R,               I
##VAR_TYPE=  INDEPENDENT,   DEPENDENT,       DEPENDENT
##VAR_FORM=  AFFN,          ASDF,            ASDF
##VAR_DIM=   8192,          8192,            8192
##UNITS=     SECONDS,       ARBITRARY UNITS, ARBITRARY UNITS
##FACTOR=    0.0002004,     1,               1
##FIRST=     0,             0,               0
##LAST=      1.6414764,     0,               0
##MIN=       0,             -795710,         0
##MAX=       1.6414764,     675321,          0
$$ Real data points
##PAGE= N=1
##DATA TABLE= (X++(R..R)), XYDATA
0@%%%qJ6j6K4l2M0n6P2q8J12j37J62k01K48k96L49m12M80n61O55p57Q70r98J140
27F06j300J477j669J884k123K381k666K979l320L698m112M564n061N607o211O879
43C613p613Q432r351J0381j1548J2884j4426J6232j8382K0993k4245K8426l4025
56a8629M1982n4275P6010j26060M48379K45943m86514R7413R7535J28059K1161
67D71004p161k63285k41938l2777J96542O5968j17718k02295j12679p6210K5004
78b95545J19880O7468j92638k54028n5143J17907Q5305M5688j9074j45577j81158
89g06915J2762J81604J41989j3442j00136r5921k0101Q6878J75191J37607l3908
100b34392j62486o1242J36637J89864J12450L2061o5725j23838K47K06639K29769
$$ y = [0, 0, 0, 0, -8, 8, -8, 16, -16, 24, -32, 40, -48, 64, -73, 89, -112, 136, -160, 189, -223, 257, -304, 351, -406, 464, -534, 606, -694, 783, -886, 998, -1125, 1256, -1410, 1569, -1751, 1947, -2165, 2399, -2662, 2945, -3266, 3613, -4000, 4432, -4919, 5462, -6086, 6798, -7628, 8604, -9778, 11215, -13030, 15396, -18629, 23353, -30922, 45088, -80972, 367407, 613350, 126836, 224249, 321784, 449843, 471004, 463843, 200558, -41380, -74157, 122385, 188353, 70635, -131660, -244339, -320549, -295545, -175665, -108197, -300835, -554863, -610006, -492099, -406794, -361106, -380180, -525757, -706915, -694153, -512549, -370560, -384002, -484138, -580059, -600160, -513282, -338091, -200484, -234392, -396878, -458120, -321483, -131619, -19169, 12892, -52833, -176671, -176424, 30215, 259984]
111B59984N6445j02878j26721k5567J21169J90935J20026k7302j38459j17432
121B10200L2428J60525J38966J8802r8892j57136q7105Q4790J66132O1017r4496
132D35231j63649j28221j918J25676J07750l9871j57835j56682o2794O2785J18479
143A38951L6843j07447j80024j20293K8800J32515Q0447o3786j55332j32187j8631
154c60144J14536J31992n527j37143j29448l1911P5178J36927Q3120o7329j50690
165c40439p5368O7653J48939J12676r111j09825r9170P019J23602J56290O2064
176D4330p6140j15885l6067P7040J47110J22818o002j23883r8908L1994J32864
187I9271J32936L7810q2854j19617l6146Q2984J34725Q1016m4191j33142r5608
$$ y = [259984, 316429, 213551, 86830, 61263, 182432, 373367, 493393, 466091, 327632, 210200, 242628, 403153, 542119, 560921, 462029, 304893, 217788, 302578, 468710, 529727, 435231, 271582, 143361, 141443, 267119, 374869, 334998, 177163, 20481, -42313, 20472, 138951, 175794, 68347, -111677, -231970, -203170, -70655, 9792, -53994, -209326, -341513, -360144, -245608, -113616, -119143, -256286, -385734, -417645, -342467, -205540, -122420, -189749, -340439, -415807, -348154, -199215, -86539, -95650, -205475, -304645, -297626, -174024, -17734, 44330, -31810, -147695, -183762, -106722, 40388, 163206, 157204, 33321, -65587, -33593, 99271, 232207, 270017, 187163, 67546, 31400, 114384, 249109, 330125, 285934, 152792, 57184]
198E7184L0275J20870J06325l090j20266j31803k3284R0244J10129L2058q3556
209A85086j41144p7390M5415J05347O5091l5304j25739j22918j1821J00710J03523
220I0856L255j05772j31313n0430O2893J04822N1091m8787j21652r5733K1259
231b19511J11532Q9625p310r4426j10509l0926Q7198J25718M4130p0297j12230
242a87006n2057N5194J13744Q1015r921q8736r2616J027J11255J19663K3611p4124
254A049r5518l3717O9844J27969P4797m0370j05044o7338L1986J08232R6159Q196
266A76245q0369r9677k8859Q2612J25655M6900p0435j10737n5993L9997J04852
277A30191P9473k3113j06898r5351l253Q5545R5585J7208p8082j08101n3767M4281
$$ y = [57184, 87459, 208329, 314654, 311564, 191298, 59495, 36211, 126455, 236584, 268642, 185086, 43942, -33448, 11967, 117314, 182405, 147101, 21362, -101556, -113377, -12667, 90856, 94111, -11661, -142974, -193404, -130511, -25689, 25402, -23385, -145037, -240770, -219511, -107979, -18354, -25664, -120090, -230599, -261525, -174327, -48609, -4479, -74776, -187006, -239063, -183869, -70125, 10890, 969, -87767, -180383, -179356, -68101, 51562, 75173, 1049, -94469, -128186, -58342, 69627, 144424, 104054, -990, -68328, -36342, 71890, 168049, 176245, 95876, -3801, -32660, 49952, 175607, 222507, 152072, 41335, -14658, 25339, 130191, 209664, 186551, 79653, -15698, -18951, 66594, 162179, 179387, 101305, -6796, -60563, -16282]
289a6282J05100O1544n2330j17209p5780J7201Q2009P6918J209q5283j02251l2834
301a37988O0794R5217L8747n7733j04396o0665L1184R3958P2220k1262r8320q0173
313a68417O871P9846Q4488K0883o5605r6972l5641N9340J03356N8487l6385r6381
325h6130o3834K9799R7449Q3861J872p8263q2750r495P2016R3977M5308l7906
337F5904q9532n6254L5033R7305P6948n888q0423q1512n212P6197Q9660K9969
349A52195n2518q8670m5825L9088Q8922O1826j9188q7893q0832L807Q2981P9991
361A33884M034p4102q9279k7649N6979Q4843L2554n0601r1998n7172K5753Q0809
373B8055N9164j7942q4410q1702q620P4002Q1599Q989o8384q5595l5343M1216
$$ y = [-16282, 88818, 150362, 98032, -19177, -94957, -77756, 4253, 81171, 82380, -2903, -105154, -137988, -77194, 18023, 56770, -963, -105359, -166024, -134840, -40882, 31338, 10076, -88244, -168417, -161546, -81700, 2788, 23671, -41934, -138906, -174547, -115207, -11851, 46636, 10251, -86130, -149964, -120165, -22716, 61145, 63017, -15246, -97996, -107491, -35475, 58502, 103810, 65904, -23628, -79882, -44849, 52456, 129404, 123516, 43093, -38419, -43631, 32566, 122226, 152195, 99677, 11007, -34818, 4270, 93192, 155018, 135830, 47937, -32895, -29088, 53893, 133884, 137918, 63816, -25463, -53112, 3867, 88710, 121264, 70663, -21335, -78507, -52754, 28055, 87219, 69277, -15133, -96835, -105455, -31453, 50146, 59135, -9249, -94844, -130187, -88971]
385h8971Q0734M8794k8461q3210o7633P934P9069P7928P051o8153q3691k7182
397a45791N7861R4440M3659m3180q4206m9521K6312Q3909P4098M94p2235p7089
409i1249q210P1624R0250K9767n1416p9106l4355M2390Q7004N5479k2350p2892
421A6936n2055J2390O4255O6042J3835n2430p2409k4595M9739P7881L3676l9812
433I3453p2282m2654J7742O1831N4545l340o5906p2985j5702N3088P0253K3942
445A01985m8513q2729m9405K6028P6653N3858k4767q4604o8782K381O3236O7106
457C2447J2978n8075q3932l5372M4172Q1350M2071l4100p8823n4802J5963P3328
469d2795O6698n18o5384o4370n043N3260O6148L1945k8250o8181m4413L0244Q0454
$$ y = [-88971, -8237, 40557, 12096, -71114, -138747, -130813, -51744, 26184, 33235, -34918, -118609, -145791, -87930, 6510, 50169, 6989, -77217, -126738, -100426, -16517, 57581, 58075, -14160, -91249, -99459, -27835, 62415, 92182, 40766, -38340, -72695, -30305, 56699, 112178, 89828, 16936, -35119, -22729, 41526, 107568, 121403, 68973, -3436, -28031, 21708, 99589, 133265, 93453, 21171, -21483, -3741, 58090, 112635, 109295, 43389, -29596, -45298, 7790, 78043, 101985, 53472, -29257, -78662, -52634, 24019, 77877, 53110, -31494, -100276, -97895, -34659, 32447, 45425, -12650, -96582, -131954, -87782, -6432, 35639, 1539, -77284, -132086, -116123, -42795, 23903, 23385, -41999, -106369, -111412, -58152, 7996, 39941, 11691, -56490, -100903, -70659, 9795]
482I795N6456j4065o2259m9738N852N7434O7570K2432m6180p0041k3071M5590
494b25P0878L9277k0202o6241n4848J3979P4044O1476p979o5106o2414r330M8659
507B1968O5045K4583m3069p5889l9859L1201O4768L8894j6811o3164o4360q092
519f4785N9091O4511L956n6126o3936k4039K8759N8364L7903k0136o5690n4752
531i6880N655N8928N5472N254m8151o3922k3226M4847P1781K7983l5325n8547
543e6131l3808J5680N9051N5962j22n6347n7502q19N7475O4193J5626m0307n7941
556c4990k5993L3303O8766M1180k4564o0753l9176J1585N3699N4933Q129n0604
568C5515o2242j6471M2851O3532K6954l5232o3583l6716J8154N7182M6692q573
$$ y = [9795, 66251, 52186, -10073, -59811, -53959, 3475, 71045, 93477, 47297, -22744, -45815, -225, 70653, 109930, 89728, 23487, -31361, -17382, 56662, 118138, 110159, 45053, -17361, -26691, 21968, 87013, 111596, 68527, -7362, -47221, -16020, 48748, 87642, 70831, 7667, -56693, -64785, -5694, 58817, 62773, 6647, -57289, -81328, -52569, 5795, 43698, 23562, -42128, -96880, -91225, -32297, 23175, 28429, -19722, -83644, -106870, -62023, 9758, 37741, 2416, -56131, -89939, -74259, -15208, 40754, 40632, -15715, -73217, -74036, -16561, 47632, 63258, 22951, -34990, -60983, -27680, 41086, 82266, 57702, -3051, -42227, -30642, 23057, 77990, 86119, 35515, -26727, -43198, -347, 63185, 90139, 54907, -8676, -45392, -27238, 29944, 76636, 68063]
580F8063n8211n3723n983M2142N5070K0595l8804o7774l3401L1865O3256L6324
592E9419k3019n9718m3127N769M7478N1547J0010m5940o1503j6421M0269N7472
604B2236K8212k4182n7317m0122J7501N8497M6074o936n0156m7040l645M1437
616a5441N3269K2708l1158o0140k9518L0750N8186L3471j4743n0667m5286K828
628d5741N1777N1109L182m2916m9817j5817L0349N1218L0066k0512n9536m2648
640e9286J7388N7553M0724r089m6466m8543r520M1738N4087J3993l5415n0510
652c3346k6869J8688N0912M0372q965n2850m7737L783N0167M8042N569l7143m9411
665c8788k1412L2152N8418K6906k5970m8085l0079R373M5687M7200K461m7562
$$ y = [68063, 9852, -43871, -49854, -7712, 47358, 67953, 29149, -38625, -72026, -40161, 23095, 59419, 36400, -23318, -66445, -60676, -13198, 38349, 48359, 2419, -59084, -75505, -35236, 22236, 50448, 26266, -31051, -71173, -53672, 4825, 50899, 43963, -6193, -53233, -56878, -15441, 37828, 60536, 29378, -30762, -60280, -29530, 28656, 62127, 47384, -3283, -48569, -45741, 6036, 57145, 60327, 17411, -32406, -48223, -17874, 33344, 63410, 42898, -16638, -59286, -41898, 15655, 56379, 47290, 824, -47719, -57239, -15501, 38586, 52579, 17164, -33346, -60215, -41527, 9385, 49757, 40792, -12058, -59795, -56012, -5845, 42197, 47766, 10623, -38788, -60200, -28048, 30370, 57276, 31306, -16779, -46858, -37485, 8202, 55402, 57863, 10301]
677A0301m9944n897M0381M8386J7080k5996m7584l2065J5395N3416L9683j3344
689D9812m8265l9786k917L5978M9788J4622l9729n4818j6698K9840M4879K4594
701D7300j5565m6505l9844K126M6207M6785M36m5931m8090r816L4544N1225K2623
714D5495l2540n6995k3873K6796M7070K9706r324m2581m0508R74M2026M6588J0890
727D3724l4567m7761j7202K8933M9589K9478j8275m8960l0703J4690M2514L6376
739D7836N290l3013m5805j2203L3911M6733K0009k1392m4453l0414J4836M6460
751B7795L5896n787m1849m0000l008L4480M0852J4278k7920n0324k5067K6557
763a4097M7871K2095j7191m1806l5787J605M0945L7635j921l7641l9267j1538
$$ y = [10301, -39643, -45540, -5159, 43227, 60307, 34311, -13273, -45338, -29943, 23473, 63156, 49812, 1547, -38239, -41156, -5178, 44610, 59232, 19503, -35315, -52013, -22173, 22706, 47300, 31735, -14770, -54614, -52488, -6281, 40504, 40940, -4991, -53081, -62897, -28353, 22872, 45495, 12955, -44040, -67913, -41117, 5953, 35659, 26335, -16246, -56754, -55780, -13754, 32834, 43724, 9157, -38604, -55806, -26873, 22716, 52194, 33919, -15041, -45744, -31054, 11460, 47836, 53126, 20113, -25692, -37895, -3984, 42749, 62758, 41366, -3087, -33501, -18665, 27795, 63691, 57904, 16055, -23945, -26953, 7527, 48379, 62657, 34737, -15587, -40654, -14097, 33774, 55869, 38678, -3128, -38915, -37310, 3635, 41270, 39349, 1708, -37559, -49097]
775d9097K3364L9113K1065j8332m8009l4335J5261M7593K9519j1559l7122l5299
787e7838q978L2389M7210J3212l1665m3043j8587J8844M4652L3955r354m5038
799b4241m0321N909M8863M5554O63l5134l6018j1897K5792M9109K7512k2189m4899
812a1297k2705J5773M0381L6380p06l7109l8191k631L5966M2210R597k9362l6436
825A870j4279J3860L4716K9931p642m2061l3446L962L2069L2895N113l1222m2714
838a6948j4556K2368L6959J8650j9089m3220k9051P748L3921L1369j32l9182m3079
851e4242o435L0990L6610J3427k4953m5031k2255K1090L9808K3261p771l4377
863b9878l4649r56L5858L9632Q494k7396l9143j1334K7493L9971K1246j0680l5974
$$ y = [-49097, -25733, 13380, 34445, 16113, -31896, -66231, -50970, -3377, 26142, 14583, -22539, -57838, -66816, -34427, 12783, 25995, -5670, -48713, -67300, -48456, -3804, 30151, 20797, -24241, -64562, -58653, -9790, 35764, 36427, 1293, -34725, -46622, -20830, 28279, 55791, 33602, -11297, -34002, -18229, 22152, 58532, 57826, 20717, -17474, -20105, 15861, 58071, 67668, 38306, 1870, -12409, 1451, 36167, 66098, 58456, 16395, -17051, -13089, 18980, 51875, 56988, 25766, -16948, -31504, -9136, 27823, 46473, 27384, -15836, -44887, -37139, -3218, 28151, 28019, -11163, -54242, -60677, -29687, 6923, 20350, -4603, -49634, -71889, -50799, -10991, 12270, 4499, -29878, -64527, -65483, -29625, 10007, 18501, -8895, -48038, -59372, -31879, 8092, 29338, 18658, -17316]
876a7316k8352J2391M1805L1066P44k3957l2948j3318K8963M6112J8537k2816
888D0911l8605j9602J6780L7821K5840n967l3366l4546k227L5634L6731J196k8901
901C1699l4066j8369J4695M0564K3288k1667m4535k4951J0161L1942K4193l576
913B9378k8849l6002j3931K3379L9312J3277k6965l6859j8620Q299L2382L1338
925A6139m716l8585l1851L093K9255L1055Q664k0968l2880j6020J6894L9659K7795
938B7534j2610l7414k3148R936L2501L3262N800k8879l4841l838K8063L4272J6290
951D6928j5318l3594j9791J2335L4919K9200l987l5635l1613L295K9756K9065
963D5560Q120k0321l5211j8225J5989L3934K0162j1640l4892k8319L922K8331
$$ y = [-17316, -45668, -33277, 8528, 39594, 40338, 16381, -16567, -29885, -922, 45190, 63727, 40911, 2306, -17296, -516, 37305, 63145, 57178, 23812, -10734, -12961, 22673, 59404, 60600, 31699, -2367, -20736, -6041, 34523, 57811, 36144, -8391, -33342, -23181, 8761, 32954, 29378, 529, -35473, -49404, -26025, 13287, 26564, -401, -37260, -55880, -47581, -15199, 16139, 11423, -27162, -59013, -55920, -26665, 4390, 13054, -7914, -40794, -56814, -39920, -261, 27534, 14924, -22490, -45638, -35702, -3201, 30061, 35861, 6982, -27859, -31697, -3634, 30638, 46928, 31610, -1984, -21775, -9440, 25479, 54679, 50692, 15057, -16556, -13261, 16495, 45560, 53680, 33359, -1852, -20077, -4088, 29846, 50008, 38368, 3476, -24843, -20921, 7410]
975G410K7182L301k7852l7200j1871K5297L1187R913j6932l0236k3723N165L1766
988f593K6447l087l1149l0822k925K7670L1093P745k0477l3212j6846J8372L6616
1001B832J9118j1044k7271k3320l07K9448L3790N806k6358l1646p670K3831L4322
1014B1531J4101j5678k9921j9391Q962L3608K8484m343k9530k7079l930K3787
1026F01L2994J1660k1853l3247j4199J5933L2489K0108j1202l1500k3522K102
1038a9636K4940K8824N194k4359l1817j0942J8353L1496J5231j5934l2801j8694
1050c0145R340K6979K2984k036k8124k8527k776K2225K7719J1270j7524l3240
1062b1855j7249J4510L1481J8998j0359l0609k1911M765K4525K3965N350k1138
$$ y = [7410, 34592, 37893, 10041, -27159, -39030, -13733, 17454, 27367, 10435, -19801, -43524, -38359, -6593, 19854, 16767, -14382, -45204, -48129, -20459, 10634, 18379, -2098, -35310, -52156, -33784, 2832, 21950, 10906, -16365, -39685, -39992, -10544, 23246, 29052, 2694, -28952, -36622, -12791, 21531, 35632, 19954, -9967, -29358, -20396, 13212, 41696, 37353, 7823, -19256, -23186, 601, 33595, 45255, 23402, -9845, -24044, -8111, 24378, 44486, 33284, 1784, -21738, -19636, 5304, 34128, 39322, 14963, -16854, -27796, -9443, 22053, 37284, 21350, -11451, -30145, -20805, 6174, 29158, 27122, -1002, -29529, -32305, -10080, 17639, 28909, 11385, -21855, -39104, -24594, 6887, 25885, 15526, -15083, -36994, -32229, -7704, 16261, 21611, 473]
1074D73l0929j0578K0294K9609J4120j1840k8945k1056P202K9345K4673q26k5105
1087c563k6002k693K1339K6435J0757j1812k8389j8667J2329L3078K1934p497
1099B7249k6651k3100J651K5601K7584O117k0777k8340j0166J8988K9892J4167
1111D2215j1901k6664k0426L662K9929K6492m420k8599k4969k310J9683K4941
1123B7633Q933j5965k8565j6553R905K7094J7572r316k6274k2641k034K1094K6575
1136A7458M818k4552k9364p914J5172K4080J3748r047k7192k1443L392K6355K4619
1149A0130r29k5083k3974l103J9723K7234J2087j5738k8174j1782J4148K6755
1161A294J8808k795k2424k0769J597K4438K6995O783j8611k5256o256J8066K5737
$$ y = [473, -30456, -41034, -20740, 8869, 22989, 11149, -17796, -38852, -31650, -2305, 22368, 21542, -3563, -29565, -32258, -10919, 15516, 26273, 14461, -13928, -32595, -20266, 12812, 34746, 27249, 598, -22502, -20851, 4750, 32334, 38451, 17674, -10666, -20832, -1844, 28048, 42215, 30314, 3650, -16776, -13114, 16815, 43307, 38887, 10288, -14681, -16991, 2692, 27633, 36566, 20601, -7964, -24517, -14612, 12482, 30054, 20738, -5536, -28177, -30211, -9117, 17458, 22276, -2276, -31640, -39554, -24382, -302, 13446, 4399, -22793, -44236, -40844, -14489, 10130, 9201, -15882, -39856, -42959, -23236, 3998, 16085, 347, -27827, -39609, -25461, 1294, 20102, 17307, -5117, -25886, -24289, 149, 27144, 33927, 15316, -9940, -16196, 1870, 27607]
1174B7607J4111p527k4123j7660N865K3398K2111J837k0148k5547p485J7614K5803
1187C5856J0188j4569k8167j6913Q939K4715J5923o101k4005k4547m880J8878
1199d683K3659N396j9497k9455j3138J2911K5425J1781j0961k5296j9578K881
1211d0555K3544J9609j767k0325k1218o169J6074K5936J1877j2894k5505j3371
1223d4764J1258K6574J8050m476j9076j7098o65K0624K6970Q631j5905k2061r082
1236b1020J4061K6651J7965o640k3645j7602N507K4621K2316P50j9945k0852m314
1249b147J4572K3164J1767j2609k6426j4984P607K3236J6525n537k3197k1164
1261i193j552J5741J9238M168j6786k4777j1127R742J9627J2356p142k4092k0695
$$ y = [27607, 41718, 34191, 10068, -7592, -1727, 21671, 43782, 45619, 25471, -76, -7561, 10053, 35856, 46044, 31475, 3308, -13605, -4666, 20049, 35972, 29871, 5866, -18681, -23561, -4683, 18976, 24372, 4875, -24580, -37718, -24807, 618, 12399, 1438, -23858, -43436, -40555, -17011, 2598, 831, -19494, -40712, -46881, -30807, -4871, 7006, -5888, -31393, -44764, -33506, -6932, 11118, 6642, -12434, -29532, -30197, -9573, 17397, 26028, 10123, -11938, -21020, -6959, 19692, 37657, 31017, 7372, -10230, -4723, 19898, 42214, 42964, 23019, 2167, -2147, 12425, 35589, 47356, 34747, 8321, -6663, 944, 24180, 40705, 35168, 11971, -9193, -10745, 4996, 24234, 28402, 11616, -13161, -24288, -14546, 5081, 17437, 10295, -13797, -34492]
1274c4492K110K0264J8306l63j9172k2205o167J3777K0575J1182q576k4174j5659
1287d4594Q210K3479J7216j197j9090k0402j459K1037K4774O538j4775k0976o573
1300b7812J3391K2526J4081k920j8498j8537K574K4639K2252N28j6335j8652n788
1313h551J4083K4109J1195j0824k2085j3466P624K0170J5190j851j6815k0599
1325a820n958J6986K3370L827j7703k1127r603O987J9121J4339o670k3257j9081
1338b0589J477J8718J6967m3j6866k1407r685J1851K3094R998j4046k2352j0895
1351c3778N554J6190J5757J187j8507k0837l427J7280K0925O600j2699j9924r424
1364c5103Q869K1907J6047n382k0566j3646N111J6776J7683N836j2532k0481o201
$$ y = [-34492, -32382, -12118, 6188, 5825, -13347, -35552, -41719, -27942, -7367, 3815, -4761, -28935, -44594, -36384, -12905, 4311, 3114, -15976, -36378, -37837, -16800, 7974, 14512, -263, -21239, -27812, -14421, 8105, 22186, 19266, 768, -17769, -15195, 9444, 31696, 32224, 15889, -2763, -8551, 5532, 29641, 40836, 30012, 7927, -5539, 2085, 22255, 37445, 35594, 18779, -1820, -7778, 9208, 32578, 36405, 18702, -2425, -12028, -5041, 14080, 28419, 21749, -1508, -20589, -19112, -394, 16573, 16530, -336, -21743, -31428, -19577, 3517, 13515, -531, -22883, -33778, -28224, -12034, 3723, 4910, -13597, -34434, -37861, -20581, 344, 6944, -5755, -25679, -35103, -26234, -4327, 11720, 6338, -14228, -27874, -22763, -5987, 11696, 17532, 5000, -15481, -21682]
1377b1682J4790K2754J1382q615j9330j2100O808J9636J7342q66j7579j7346n02
1390e308J5253J8332P507r591k1232j2468Q626K0914J3254n879j9828j6858N19
1403f759J6384J6294K174j4762k0274q718R927J8399R137q204k0587j6523L494
1416b0018J8264J5035k890j7495j7965m400J3019J7539O041j0698j9476j2109
1428c5153P133J9729J3602l922j7463j6075N14J6642J8788L561j3081j6757o550
1441b9032J0800K0013J2926n584j7903j3118M153J9868J8586J25j5362j6843k153
1454a3524J4891K0721P471j1129j7405q153O477J7598J4970k139j8237j6950J95
1467e214J6572J7586K224j4107j8068p254Q582J7731R509q787j8423j2698K029
$$ y = [-21682, -6892, 15862, 27244, 18629, -701, -12801, -5993, 13643, 30985, 30119, 12540, -4806, -5308, 9945, 28277, 35784, 26193, 4961, -7507, 1119, 22033, 35287, 29408, 9580, -7278, -6759, 9625, 25919, 28093, 13331, -6943, -15661, -5734, 12665, 21802, 13598, -6989, -23512, -20018, -1754, 13281, 10391, -7104, -25069, -29469, -16450, 1089, 7130, -3568, -23044, -35153, -28020, -8291, 5311, 1389, -16074, -32149, -31635, -14993, 3795, 7356, -5725, -22482, -29032, -18232, 1781, 14707, 9123, -8780, -21898, -17745, 2123, 20709, 20834, 5472, -11371, -13524, 1367, 22088, 29559, 18430, 1025, -7128, -651, 16947, 31917, 29778, 11541, -5409, -5214, 11358, 28944, 31168, 17061, -1007, -8261, 321, 18052, 27561, 18774, 351, -12347, -10318]
1480a0318J3145J3385K040j5481j9449n234J1939J6602N803r977j8258j1329M557
1493b2575J6666J3499k578j7195j5764J50J3676J6472N972j0804j9590p910J1573
1506a8408J9246R638n440j4750j1879J965J6537J6569K853j3559j6515l005J2607
1519d141J7624Q243p049j7159j0939P455J8082J1858k852j3319j4244k415J2421
1532C565J7061N400j1249j8309q653Q374J7212J0540n754j7595j4426J870J5636
1545C672J3941n16j3126j6143o204R787J7818P939r658j8244j0540M792J6365
1558a17J2808l049j5629j4032m32J2815J5037M082r798j5271p631O547J7131J1225
1572A3686m717j5454j1541K032J4286J4524K267j2188j4258m197R768J5207Q960
$$ y = [-10318, 2827, 16212, 18252, 2771, -16678, -21912, -9973, 6629, 12432, 2455, -15803, -27132, -22575, -5909, 7590, 5012, -12183, -27947, -27797, -14121, 2351, 8323, -2481, -22071, -29981, -18408, 838, 10476, 5036, -9714, -21593, -19628, -3091, 13478, 16331, 2772, -13743, -16748, -4141, 13483, 21726, 14677, -2482, -13421, -5966, 12116, 23974, 21122, 7803, -6441, -8856, 3565, 20626, 26026, 14777, -3532, -12185, -3811, 13401, 23941, 18187, 592, -13834, -11964, 3672, 17613, 17097, 3971, -12172, -18376, -8589, 9229, 17168, 7510, -10734, -21274, -16482, -117, 12691, 9642, -5987, -20019, -20451, -7636, 7401, 11483, 1685, -13586, -21217, -14670, 2461, 13686, 8969, -6485, -18026, -15994, -1708, 12816, 15083, 2895, -11363, -15560, -5792, 9415, 18375]
1585A8375o164j5497j1312L988J5347J4512j183j4483j4755j707J2288J4969N782
1598B0160j1146j5709p480O796J4992J0546l472j5947j3285J525J4038J3443J231
1611A5692j2457j5146m739R532J5095P411o859j5759j0423M006J3447J2623O97
1624A3120j3262j5976k616J3026J4851M080q799j3807q403N895J4779J1247k750
1637A1385j4674j2687N73J3627J3817K812j0707j4953n599R561J6083P519p312
1650I445j4091r255L133J3666J2310m60j2125j3179l193J1021J5261N319q977
1663H875j4620p870O178J4885R631l786j3329j0985l13J1116J4134L305j0806
1676F415j4773n984Q068J5398Q212p593j4789r023L127J2012J1564P82j2400j4483
$$ y = [18375, 12211, -3286, -14598, -10610, 4737, 19249, 18066, 3583, -11172, -12879, -591, 14378, 20160, 9014, -6695, -14175, -7379, 7613, 18159, 14687, -1260, -14545, -13020, 1018, 14461, 15692, 3235, -11911, -16650, -7118, 7977, 15388, 8529, -7230, -17653, -13647, -200, 12423, 13120, -142, -16118, -18734, -5708, 9143, 13223, 4424, -9383, -17786, -11891, 2888, 14135, 11385, -3289, -15976, -15403, -1776, 12041, 14853, 4146, -10807, -16406, -6845, 9238, 16757, 9445, -4646, -13901, -10768, 2898, 15208, 14748, 2623, -10556, -13749, -2728, 12533, 17852, 8875, -5745, -13615, -7437, 7448, 17079, 13293, -36, -11021, -11334, -218, 13916, 17221, 6415, -8358, -14342, -6274, 9124, 17336, 9743, -5046, -14069, -10942, 1070, 12634, 13416, 1016, -13467]
1690a3467k868J0663J3659M834q526j4307q085N368J3905J0959l043j5036j1759
1703a7703K036J1394J0862L762q377j3724o805Q329J4618Q274n299j3677r046
1716a5356L417J2399J0940J826j0745j3530j916J0397J2561N532n508j2636r141
1729a1760M254J5041J0486k573j3088j1233L52J1405J1897K714p957j3380o944
1742a0786P001J4308P259n574j2168j0088L29J2004J2173O5j2012j3405k682R803
1756c773J1966M067o691j2496r257K112J4427J1198l566j3325j0401o27R724J2175
1770E533L733q911j3679n186P177J3729O978m979j0812q690k6J1224J3780J875
1784A1746j2245j2159j140Q899J1389O497n012j2432p671M300J2566J0202j824
$$ y = [-13467, -16335, -5672, 7987, 12821, 4295, -10012, -18097, -12729, 1176, 12135, 9092, -5944, -17703, -15667, -4273, 6589, 10351, 1974, -11750, -18555, -10226, 4392, 12666, 7367, -6310, -15356, -11939, 460, 11400, 13226, 2481, -11049, -12965, -2568, 9993, 15525, 10017, -2619, -11760, -7506, 7535, 18021, 15448, 2360, -8873, -8521, 2884, 14781, 17495, 9538, -3842, -10786, -3785, 10523, 17782, 12208, 40, -10048, -9719, 2285, 14458, 14523, 2511, -10894, -13576, -3773, 8193, 12260, 5569, -6927, -16184, -14072, 355, 11553, 7987, -5338, -15739, -16366, -6642, 5533, 9266, 355, -13324, -18510, -11333, 2396, 9374, 4395, -6417, -15107, -15133, -3909, 9871, 11746, -499, -12658, -13798, -4899, 6490, 12987, 7975, -4457, -12128, -7828, 4738, 14940, 13116]
1797A3116j1494r505o05Q039J2619N605q393j4732m712Q617J1026N907l305j0704
1811A479r899K08J1095J1372J641j1561j2713k036Q209J0433N449m146j3737r891
1825a4097M951J2691P443k386q711j0210k873Q327J1853M759p699j4027o297P772
1839h504J2029N720k673r538j1738J46J2138J1903o54r403j0123l877O661J2509
1853D596O549n236j2477r670N012J3512Q412l403q097q707l371P629J3429M155
1867A2333q470j1240m782N465J1299P849k532j0779r292m2J0648J2216K81r464
1881C490q652l049L838J1890Q471m916j3091o780L089J0739R318o38j0455r646
1895f392j846P366J2146M786q459j1964m500L894R345Q722j587j2444j0145J712
$$ y = [13116, 1622, -7883, -8488, -449, 12170, 17775, 9382, -5350, -10062, -1445, 9581, 15488, 12183, 1479, -8420, -8212, 2883, 14255, 15896, 4335, -8378, -10414, -2205, 8228, 13677, 9531, -4206, -14097, -9146, 3545, 10988, 8602, -109, -10319, -13192, -4865, 6988, 11747, 4048, -9979, -16276, -8504, 3525, 9245, 6572, -2966, -14704, -14558, -2420, 9483, 8829, -574, -10697, -14574, -7913, 4596, 11145, 5909, -6568, -16238, -11226, 2286, 10698, 7295, -802, -9509, -12880, -5251, 8178, 12333, 3863, -7377, -12159, -6694, 4605, 12454, 9922, -857, -10149, -10191, 457, 12673, 12954, 3490, -5162, -8211, -4373, 7517, 15988, 11072, -2019, -8799, -5710, 5029, 14347, 13709, 3254, -6392, -8238, -872, 11274, 16060, 7601, -4363, -8863, -4969, 4376, 13098, 11511, -933, -11078, -9366]
1909i366R236R182J847q981j1228k866N672R055O419l676j2126q449L585R507
1923b189P878Q69q980j1275j757Q476R851M173n155j1302o250N290J0107O969
1937F705K75q735j1304l93J0921J1153J876o917j0042m056O461J0808N958l001
1951I709r601q821L541J1748P563o87o655j0011m277Q102J3202L146p096r691
1965A72n499L330R382O758j793q606r698k145R319J0298k68p510q963n726L130
1980g819J1394P372o118j1154o891J321Q374Q124J7p915r513l857O267J2491M603
1995F696p900r981m174K734Q633R624j132r801p673O10P736R481L143n922r191
2010g117k951M250J0409Q361l050j1093o057L380P856Q471K420p365j0067k063
$$ y = [-9366, -130, 9052, 10899, 1918, -9310, -12176, -6504, 2551, 8970, 5294, -6832, -15281, -11696, -2189, 5689, 6558, -2422, -13697, -15454, -6978, 2873, 7046, 1891, -9411, -15661, -10371, -264, 6705, 6980, -1755, -13059, -13452, -2531, 8622, 10498, 3581, -6461, -10517, -4056, 6752, 12710, 9709, 108, -8713, -5172, 6576, 14139, 13452, 6797, -3214, -7491, 611, 13813, 16959, 9863, 172, -5327, -1997, 7385, 14143, 12350, 3744, -5954, -8099, 1220, 11518, 11250, 3740, -5223, -10949, -7819, 3575, 10947, 4829, -6325, -13216, -11895, -3521, 4603, 4620, -3295, -12808, -16665, -10398, 2093, 6696, -1204, -11185, -15359, -12625, -3992, 5632, 4500, -5301, -12974, -12364, -4628, 4853, 7996, 2074, -7117, -10068, -5818, 4591, 12952, 9902, -1191, -7248, -3868, 3988, 12459, 14879, 7514, -2553, -4616]
2024d616O082R882N582m923j1026n258L692P838P585M15j0737j0661Q94Q277P192
2039A0218J708n751j0339n504L588R777O155l000j1471q382K785P982O137P50
2053D653o413j0650m232P858R734K306m077p810o584J468R278P896j0q009r141
2068a3733k85R279Q804J383m527p424n970N149J1436O077l303p277o369L48Q832
2083B420Q923J019o330q277k820N794J0779L731m855p897n667O95R363Q588j457
2098A4009q667q492j420O511R079J964o877q142m234J923Q444O378l285r772o353
2113h934M38N867Q179J481p739r635l059M788R871M417n815q623l856J429O331
2128d860P867Q21q477q678M59O704P378L974m201r161m840M478R220O863k204
$$ y = [-4616, 1466, 11348, 16930, 12007, 981, -4277, -585, 7253, 14838, 15253, 4516, -6145, -5251, 3026, 10218, 11926, 6175, -4164, -9668, -6080, 3697, 9852, 6852, -4619, -13001, -10216, -2234, 3903, 4653, -1760, -12410, -16642, -8784, 950, 3256, -821, -8631, -15215, -13747, -4469, 3427, 3417, -4592, -13733, -14018, -4739, 4065, 5448, 921, -6503, -12473, -7324, 4112, 10189, 6886, -391, -6760, -6412, 2420, 11343, 12362, 6032, -2245, -5065, 729, 11508, 15239, 10384, 2487, -3180, -2485, 6878, 15466, 14009, 5342, -3150, -4570, 1941, 11020, 12984, 6107, -2035, -6269, -4346, 4098, 10476, 7191, -2581, -8934, -8496, -2629, 5550, 7031, -708, -10343, -13402, -8614, 1257, 5674, -141, -8764, -12620, -11191, -4860, 3007, 3828, -4649, -13327, -12868, -6164, 1214, 5188, 987, -8174, -13014, -8536, 684, 7547, 5343]
2143E343q635n670K115O106P248L436n262r892k544P323Q176L835k851p615n872
2158d759K091P909O923N62p490q441p54O345P228L191l761r134o114L984R022
2173F802M791k611p707p199k80O932O563J289n169q973m254M722Q548L011l290
2188C175p621p019R67Q923O505j435p509p393j402O226P262K669l791p648n922
2203a4013K810R849N950l016p212n201j07O463Q309J957n485p578k374M792Q386
2218C530M552k835n652n259Q9P829Q366l95o743o071l31M712P145M456l723q009
2234A661m670L038P442O038j856o936n686j523N331Q239K177p273q365k204L414
2249a173O505M299k792q111o403O18O560O255k87p181p344j799M426O795L045
$$ y = [5343, -3292, -8962, -6847, -741, 6507, 9943, 4681, -5211, -7755, -432, 7744, 11579, 8728, 1113, -4759, -2668, 5241, 12164, 12726, 5236, -3205, -3959, 2386, 9614, 12805, 9044, -90, -6204, -2220, 6802, 11593, 8982, 1275, -5924, -6204, 728, 7291, 8580, 3411, -5562, -9816, -5094, 3454, 6465, 3175, -4446, -11465, -10498, -1575, 4930, 3495, -4014, -11407, -12809, -6583, 679, 3348, -443, -8091, -14013, -11203, -1354, 4596, 1580, -5632, -10833, -10940, -4477, 3832, 5789, 304, -7274, -9648, -4856, 3530, 8082, 5247, -405, -5664, -5575, 2254, 10620, 10225, 3482, -2589, -2920, 1792, 8937, 13393, 9670, 1661, -3009, 29, 7471, 13509, 11653, 4717, -969, -2492, 2839, 11078, 13255, 5982, -2383, -4587, -1173, 5332, 9631, 6839, -1272, -7675, -7057, -497, 5758, 5471, -1710, -9054, -10853, -6427, 368, 3413]
2264C413m076q691l813K621O478M793o74o423o690n37O462P125K727n128p651
2279a0064k658M915P679M181j208o507n150J755P181O870J257m901p327r35N624
2294G12P954L579k979p411m227K979P781N054j229n819o146p39N878O022J751
2309A3160m807p563l772L830O566L284k452p209n939l83O061N522m76n940o402
2324f520k773L618O269L387m114p614n457K543O954M342j222n553n720j282M978
2339h164P595J957m666o430k858L712P272M665j413n712m762O98P659O468K04
2354F225n033m866j279M172P360L959k838o308l977K652O250N275l39n277n604
2369C72j407N008O765J803m655o470k821J811N647M480j063p411n926J48N431
$$ y = [3413, -663, -9354, -13167, -10546, -4068, 725, 51, -6372, -13062, -13599, -7137, -12, 2715, -2413, -10064, -12722, -7807, -128, 4053, 2845, -3662, -8812, -7057, 124, 6994, 8251, 3350, -3977, -4912, 712, 8666, 12245, 9266, 1855, -2372, 607, 8388, 13442, 12213, 6394, 248, -491, 5387, 11409, 13160, 8353, 790, -2982, 848, 7414, 10698, 8246, 1037, -4902, -5285, 776, 6298, 5822, -118, -6520, -9293, -5675, 594, 3981, -133, -7747, -13204, -10661, -3707, 635, -587, -6140, -11860, -13142, -8164, -569, 1388, -3278, -9708, -12566, -8854, -1582, 3083, 1670, -4042, -8804, -8106, -447, 6021, 6225, 1192, -3674, -4953, -781, 6579, 10538, 7700, 1392, -2585, 67, 6317, 11592, 11253, 5976, 372, -1035, 3973, 10738, 12541, 7886, 1416, -1405, 406, 6053, 10533, 9470, 2059, -3867, -3719, 1712]
2384A712N004J68n467o271k477L040N675L073l155p059l998J405N428M591j31
2399A538n935o158n33M705O220K045l997n866k727L064N756M418l07n678n201
2414h656J033N620O147J026l455n965k325M665O604L327k046o281l875K213N607
2429C639M786N36n065n841j032M803O073J591l317o069l464K097N904L783j538
2444F886n532n187l65N242M858P11m331o271k530L566N664K530k509n592m059
2459f919J89N797M723j70n020m897j614L802N828K748l185n654l768K746N775
2474C81M075j000n210m177m81M590N864J565m339n161j829K879O217L009j801
2489D582n405m238J042N593M927n20m323m673j495L517N397K772l137n943k978
$$ y = [1712, 6716, 6884, 1417, -4854, -7331, -4291, 1384, 4457, 1302, -5757, -9755, -8350, -2922, 1669, 1538, -4397, -10555, -11088, -6383, -163, 1882, -2115, -7981, -10708, -7644, -1888, 2530, 2223, -3455, -8656, -7623, -2003, 4144, 5170, 1715, -4250, -6575, -1910, 4694, 8021, 5975, -306, -4181, -1968, 3639, 8425, 8961, 3896, -1945, -2977, 1826, 7899, 9490, 6173, 104, -3360, -1263, 4641, 8424, 6886, 1354, -3833, -4198, 1044, 5902, 6613, 2282, -3989, -6519, -2953, 2711, 5241, 2732, -2860, -6919, -6730, -933, 3790, 3620, -1400, -6297, -7911, -4109, 1719, 4467, 1282, -4372, -8140, -5394, 381, 4456, 3456, -1754, -5931, -6412, -1822, 4042, 5607, 1268, -3893, -5722, -2843, 3374, 6383, 4582, -823, -5061, -4019, 1574, 6501, 5981, 1658, -3015, -4510, -993, 4404, 7176, 4039, -1904, -4882]
2504d882J912N403M070j240n153m643m95M664N481M09l986m929j991K192N189
2519B001L470j826n796m079J173N009M480J84m241m859j436L346N220K519k892
2534B273n128l072J762M826L822j21m481m811j78M005M788J440l415n181j936
2549e407K031N564L404j744n175l999J271M257M460N00m306m754j405L551M919
2564C167J966k236m894l024J751M138L961k3m493n126j91M478M549Q91k573n214
2580b873k722K742M996L185j538m341m256L95M397M272L83k912m933j958L096
2595b067N211K079k405m553l446J478M756L534q28l471m288j166L727M810J362
2610D733k748m517k567J369N399L157j712l766l792nL606M799N73l511m040j997
$$ y = [-4882, -2970, 2433, 6503, 5263, 110, -4533, -5028, -364, 5117, 5526, 1540, -3389, -5380, -3188, 2001, 5471, 3645, -2151, -6230, -5057, -48, 4432, 4616, 375, -4484, -5920, -2574, 2646, 5165, 2273, -2855, -5927, -4165, 661, 4483, 4362, -119, -4930, -5108, -1103, 3685, 5125, 1710, -3471, -5407, -3376, 2188, 5592, 3848, -1327, -5326, -4055, 202, 4662, 5162, 856, -3898, -5303, -1752, 3167, 5133, 2897, -1997, -5021, -3270, 868, 4829, 4806, 313, -4813, -5004, -526, 4023, 4914, 2341, -2873, -5595, -2853, 2143, 5328, 3790, -551, -4807, -4412, -15, 4257, 4640, 1728, -3205, -5163, -2067, 3144, 5223, 2818, -1735, -5181, -3703, 1053, 4587, 3759, 288, -4000, -5166, -1439, 3371, 4733, 1985, -2532, -5099, -3730, 1669, 4826, 3114, -652, -4444, -4449, -843, 3956, 4529, 1018, -3022, -5019]
2626e019K802N107K605k756m189k607O03M177M500k94m663l478p32K698N198J441
2642E393l073m715j931J466M645L253r22n089l625O81L288M020O11l400m013j058
2658d469J920L825L190j971n367k831J617L342L295J186l970m847k46L225L828
2673A727K264k522m665k149K324L519L152M79m614m227R46M259K959R17j903m332
2689a866k060K878M368K237j254m150l450J307M234L234J4k757m749j186M091
2704H91M091J6j919l426k959J275M385K457p24l769l963l08L475L547j57j889
2720A023m093k936K249N202J610k024l624k651k04L672M116o73k928l246j893
2735f400K753N162J230k451l457j530O7M434L884j141l950k218j4K531M474J090
$$ y = [-5019, -2217, 2890, 5495, 2739, -1450, -4057, -3454, 723, 5223, 4929, 266, -3212, -3944, -1246, 3952, 5393, 2320, -2395, -4326, -2860, 1785, 5038, 4116, -973, -4598, -3917, -629, 3391, 4002, 602, -3411, -4469, -2549, 1276, 4466, 2495, -2872, -5703, -4086, -744, 2551, 3737, -233, -5080, -5326, -2101, 1727, 3991, 1469, -3196, -5345, -3021, 498, 3650, 4129, -485, -4712, -3766, 493, 3452, 4369, 2466, -1866, -3926, -1048, 3320, 5557, 4303, 153, -3297, -1990, 2244, 5478, 5492, 2735, -2014, -3200, 891, 4982, 4998, 3079, -347, -3306, -2031, 2354, 4811, 4087, 318, -3645, -3953, -478, 3069, 2912, 1023, -3070, -6006, -3757, 1445, 3055, 1031, -2593, -5244, -5448, -1776, 2340, 1667, -1261, -4507, -6400, -3647, 1515, 2745, 294, -3163, -4693, -4626, -192, 3692, 2551, -1399, -3617, -3631, -1100, 3374, 4464]
2751D464l188l095j285J544M417L173k156l768j384JK092M312J266l509m186m04
2767a706J977L860J843k139m346j723J075K890L326m82m497l382Q76K209K462
2782B243J923k177m966j746K330L130K209j336l692k988J253K695K565J145k873
2797b85m840l28L092K617J546m47l452l211R97M284J828J97k853l570J24L277
2813a024K941Q39q50m014k863K520M538J206o72k442l049l15L551L393N2k209
2829A602l619j037K593L730P44q48k464l751K70M442L548j467k969k293o33J988
2845a64L552J048k253l000k334J423M682J381k059k113j958j046J913N162J68
2860D402m215l023r6J359K899J941j381l169k543K78L172L572j391l376j619n14
$$ y = [4464, 1276, -1819, -3104, -1560, 2857, 6030, 3874, 106, -1278, -1277, 815, 5127, 6393, 2884, -1302, -1706, 271, 4131, 5974, 3835, -511, -2234, -1159, 1731, 5057, 4575, 78, -3304, -2428, -219, 2243, 4166, 1989, -2977, -4723, -2393, 737, 2946, 1610, -2082, -5070, -3817, -1122, 1443, 2588, -285, -5125, -5453, -2361, 256, 1802, 1355, -2097, -5308, -4311, -27, 1801, 1998, -855, -4425, -4301, -1024, 1917, 2756, 1906, -2108, -4971, -2451, 2087, 3293, 2621, 179, -2870, -3185, 366, 3759, 3811, 1602, -2017, -3054, -461, 3269, 4013, 3165, 701, -3050, -2780, 1662, 5210, 3743, 774, -1519, -2152, -164, 3388, 4436, 2183, -817, -3151, -1728, 2954, 4335, 2276, 163, -1795, -2841, -928, 4234, 4402, 187, -2836, -2932, -1573, 1326, 3267, 1886, -1283, -3826, -3548, -376, 3196, 1805, -1571, -3190, -3704]
2876c704R45L181K716k472m278j222K031K780J499K34l203k494K67J866L416J232
2892B794l224l334K01J716J960K749k44m130k778J737L250K226K82j974l289k76
2908b334J986K807K062j448l883j535K187K902J131N81k671l410m49K753L234
2923C913Q73k153l196j214J723K632R70o41k955l213Q06L857J631o08j671l047
2939b293j577K139L029J079j634k872k443J585L091J199n57j859k898j077L200
2954a888L431p3k159k184j362J086L310J884o72k774k231N14K817K907m84k244
2970a22j372j502J238L860J881k066l063q41M91K484K704j65k927k120n64K157
2986G3L424N95k834k350p24Q18K657K351p72l969j744O32K302K024N37k668k524
$$ y = [-3704, -2759, 422, 3138, 666, -3612, -4834, -2803, -23, 1476, 1710, -1493, -3987, -3720, -1854, 1562, 2794, -430, -3764, -3563, -1847, 113, 2862, 2618, -1512, -4290, -2553, 697, 2923, 3205, 1231, -2058, -2334, -348, 2459, 4521, 3073, -810, -2345, -158, 2744, 3875, 4456, 1785, -1625, -2074, 679, 3913, 4786, 2633, -563, -1777, -54, 2578, 3548, 2907, -48, -3261, -2455, 1402, 3033, 2425, 754, -2293, -3870, -1731, 1298, 2377, 743, -2129, -4572, -2987, 104, 1303, 746, -1113, -4011, -5088, -1888, 1543, 1470, -689, -2873, -4235, -3149, 161, 2045, 1373, -1401, -3632, -3118, -301, 2606, 2122, -122, -1494, -2996, -1758, 2102, 3983, 1917, -1146, -1987, -1496, 988, 3692, 3527, 600, -1520, -2084, 73, 3497, 4092, 1258, -1092, -1816, -998, 1659, 4010, 3238, -731, -2475, -1843, 459, 2483, 3020, 352, -2172]
3003b172m66J283K945J746j979l217r42J064J994J906N12k503l281J99K138K650
3019A877O26j059l249j007J397K462J844k31k945k339P02K512K115L09j682l047
3035a715j005J856K576J552j151k880k110J093K775J339j49j750l037q35K419
3050a022K735J48j835j949j731J194K565J876q66k402k535J70K782K001m30j098
3066c97j967j511J288L472J469j591k274r51K08K222K292M30j994k433q00K393
3082a44L088O58j769j709j324Q36L044J742q86k907j587R09J905J738Q06j711
3098B689k708j074J359K672J458j880k684j087J78J315K368J61k619k669j54J644
3114a031J816N94j151k243k232P63K224J890m11k643k112O45J791J335R44j485
$$ y = [-2172, -2638, -1355, 1590, 3336, 1357, -1860, -2802, -1738, 256, 2162, 2674, 171, -3110, -2911, -773, 1877, 2503, 1444, -1805, -2812, -1415, 1047, 2891, 2660, -285, -2624, -1922, 590, 2705, 3014, 1332, -1715, -2720, -864, 1712, 3264, 2113, -767, -2877, -1784, 991, 2330, 2181, 431, -2606, -3441, -1022, 1713, 1861, 26, -1923, -3654, -2460, 105, 1981, 1115, -1287, -3822, -3652, -870, 1131, 701, -397, -2364, -3875, -2587, 885, 2354, 763, -1511, -2462, -2254, -32, 2260, 2690, 696, -1737, -2537, -144, 2944, 3602, 1833, 124, -1200, -364, 2680, 4422, 3536, 629, -958, -49, 1856, 3594, 4400, 2689, -19, -1093, 266, 2938, 4396, 2516, -168, -1255, -1077, 238, 2606, 2767, 148, -2521, -2675, -1031, 785, 1379, 228, -2015, -4247, -3484, -1260, 630, 219, -2424, -4536, -3891, -2100, -765, 179, -1306]
3130a306k572o53J054K668J523j472j418j577P20K124K146J47j626k315l01K332
3146e26K552M68j065j532j050N33K438K299m49k107j765J69J662J882P68r20k458
3163H99j156J574K151P44r31j965j463q2J552K314K61k353k338m94J258K085M71
3180B527j181k166j125j36K028K028q76k762j572L30J146J736M05j029k518j410
3196d575J655K049J197r15k004j546j0J966K072N05j705k301j31J786J564R47
3212E54n34j818j414M68K656J924k47k030j757K61J631K009Q32r15k417q49J463
3229a83K305R81m88j397j820L61K046J952l2j377j867n27J472J531R44m43k298
3246A160j518Q05J902J625q19j662j853k34J313J730R85j674k403r55P68J859
$$ y = [-1306, -3878, -4531, -3477, -809, 714, -758, -2176, -3753, -3033, -909, 1237, 1384, -242, -2557, -2858, -526, 2026, 2494, 1429, -103, -1153, -620, 1818, 4117, 3668, 1561, -204, -35, 1627, 3509, 4277, 3357, 899, -257, 1317, 3468, 4212, 3281, 1316, -147, -229, 1323, 3637, 3898, 1545, -793, -1287, -29, 2056, 2527, 1346, -820, -1945, -2081, -53, 1975, 1099, -1663, -3235, -2905, -1759, -23, 382, -647, -3165, -4575, -2920, -871, 326, -589, -2593, -4139, -4149, -2183, -111, 394, -1311, -3612, -3743, -1957, -393, 554, 20, -1798, -3212, -2744, -88, 1836, 1589, -441, -2198, -1937, -306, 1703, 2535, 1620, -797, -1646, -183, 2122, 3103, 2615, 1218, -602, -241, 1805, 3757, 3725, 2348, 481, -46, 1426, 2957, 3901, 3458, 1160, -358, 447, 2349, 3974, 3155, 1493, -360, -594, 719, 2449, 3434, 1760, -643, -1598, -830, 1029]
3262A029P72q03j811j492n45J829J542K90k245j724m39R24J571J015j005j946
3278c038j226N32J727J430l90j434j411j20R02K147R78j246j790q32J180J847
3294g44J607m8j808j425M21J757K205K00j003j795j80J541J615J209k00j801j428
3311A23J158J501J394L99j252j927k42R83J934J122j506k096j076R31J418R07
3327C771k50j826j957r9J279J508l51j321j999j029J006J673L86r38k052j892
3343d091N85J783N54K34j580j707k91J080J848K85j085j377j027Q10J798J252
3359i29k06j078j579J7J710K242O07j443j444n47J205K075J421o25j050j161M18
3376c67J791K427m61j314r30l21J056J556J055j008j279j322P67J568J169o17
$$ y = [1029, 1801, 998, -813, -2305, -2850, -1021, 521, 811, -1434, -3158, -3597, -2673, -1102, -87, -1092, -3038, -4264, -3732, -2005, -575, -965, -2399, -3810, -3930, -3028, -881, 97, -1149, -2939, -3771, -2591, -744, 863, 815, -993, -2418, -1997, -240, 1965, 2165, 1162, -633, -813, 728, 2343, 3552, 3352, 1551, 123, 1281, 2782, 4176, 4575, 3323, 1396, 1154, 2137, 4071, 5193, 3687, 1591, 515, 1446, 2864, 3771, 3521, 1695, -262, -361, 918, 2426, 2075, 754, -1245, -2274, -1268, 405, 791, -147, -2199, -4091, -3506, -1723, -1169, -935, -2515, -4222, -4513, -3433, -1585, -1300, -2385, -3762, -4789, -3979, -2181, -929, -1135, -2213, -3792, -3775, -2065, 177, 784, -659, -2103, -2650, -1445, 630, 2051, 1426, 376, -785, -367, 1424, 3851, 3390, 2076, 1146, 825, 1881, 3437, 4492, 3484, 2205, 883, 1650, 3218, 4387, 3770]
3392C770j343j394j80Q62J816k2j725j155q11N71J087Q50l06j977j547K85R02
3409c17J496n16j654j470k82P21J108J125j307j861o37N19J342R82k10j370j352
3426c683q6J471J311L54n05k079l96Q50J646J079Kj754j241P74J414J284M40j000
3444a19j344k39J075J786P47l89j511o83L95J712J103P9j133j716N67J462R20
3461B712O77p71j525p11P39J829N75o43j102j114j20J489R89m7n52j925m24O64
3479G40J708N0p89j364j025j66J739R28r08j242j237n65J166J028n2r98j221j198
3497c406L51J850R73j243j130p26m46Q49J559J65j414j058k86P21J539Q65l94
3514a231j603l36J50J032J989k5j095r65L42Q20J755J141r19j449j44N11J789
$$ y = [3770, 2427, 1033, 853, 1715, 3531, 3509, 1784, 629, -182, 389, 1476, 2326, 2020, 43, -1504, -1219, -317, 1179, 663, -991, -2461, -2743, -2022, -914, 211, -1096, -2957, -3594, -3075, -1733, -751, -961, -2331, -3683, -3769, -2298, -987, -633, -1138, -3217, -3613, -2763, -1117, -38, -36, -1790, -3031, -2257, -843, 441, 881, -119, -1463, -1702, -627, 1159, 1906, 1517, 6, -677, -282, 1430, 2533, 2612, 1479, -237, 330, 1792, 2712, 3389, 2618, 1093, 382, 1121, 2950, 3525, 2882, 1780, 666, 546, 2035, 3024, 2977, 2425, 500, 76, 740, 2448, 2498, 1709, 345, -680, -846, 893, 1821, 913, -329, -1566, -2131, -965, 63, 11, -987, -2208, -3406, -3055, -1205, -232, -1475, -2605, -3331, -3777, -2928, -1369, -1204, -2618, -3676, -3962, -3241, -1702, -837, -1231, -2834, -3170, -3020, -1988, 1, -24, -1119, -2084, -1742, -922, 833, 1974, 1055, -394, -538, -27, 1762]
3531A762J341l38j094n82L75Q82J447O86j134j650L74J176O06O75l39j222j439
3548A526K94J266P27J75j686j393j19N44P75L40j139j797j079Q83N34L56k69j527
3566a589j315l80J060J094l15p79j844p47J119J016L17m5j552j122O41J559O10
3583b272l03m70j205M22O98J681P46o22o58l04N29J382J316j61l50r01j14J812
3601A226J417Q6n51m62n27P66J539R82l43j225o27j74J682O20l26o62q57p46P77
3620B595J362O54j561j640k44k1Q16N75m24j413j312m22P79R94J80j512j451j44
3638b189l1N32J144p85j703p93K75R75M11M15j176j160P2N44J259P53p59j386
3656c602j39J179N06J203K02j045j274O40J650O98K83n10o46p5O31J064J103J17
$$ y = [1762, 3103, 2765, 1671, 1089, 1464, 2346, 3793, 4479, 3345, 1695, 2069, 3245, 3851, 4526, 4187, 2965, 1526, 1820, 3086, 3813, 3988, 2302, 909, 790, 1334, 2109, 2449, 1310, -487, -1566, -683, -149, 207, -62, -1589, -2904, -3284, -2224, -1130, -1445, -2224, -4068, -4815, -3696, -2680, -2363, -2408, -3960, -5082, -4441, -2882, -2272, -2575, -3045, -4250, -3828, -3130, -1449, -703, -1325, -1983, -2287, -1758, -376, 940, 779, 429, -472, -586, 1226, 2643, 2729, 2178, 1716, 1189, 1955, 3494, 4476, 4133, 2908, 2281, 2107, 3789, 4409, 4083, 3421, 2564, 1818, 2595, 3957, 4611, 3050, 1410, 1166, 1145, 1961, 2536, 2112, 699, -613, -1035, -256, 738, 918, -594, -2045, -2189, -2220, -1688, -544, -1329, -3032, -3825, -3550, -2575, -2164, -1749, -2925, -4085, -4013, -3469, -2210, -1457, -2216, -3602, -3741, -2562, -2056, -853, -651, -1696, -2970, -2330, -680, 18, 301, -209, -855, -930, -299, 765, 1868, 1985]
3674A985j259r27J058J320M14K75j70j198n02O51J306O60o36q95p42O65P72L95
3692C172J07q71j487n65J802R41p04o37n74j335lJ341P93r43j178p01j5P99L75
3711C17j61n80j273j249J194J397J44j130o60r18n6R82J413J9j708j038m2J164
3729b185Q83j89j95p92l33r3J659J167o76j104l02P93M16R51N27p08o87m10J103
3748a75J473K77n11o00l5j81R55J566P0j308r09O89Q72P2Q29k71r52p65J85J053
3768B334Q33m80j361m79K30N45L37Q87q50k006n10J123J95K75o11p91j345P19
3786i55M50Q19l99j124j287L82M43N46R7j19j106j259O55J440K16l05o29n36j86
3805b857O60J425M1n75r91k33J260J154Q5j98q8p00k85K009P14l39l00p42j03
$$ y = [1985, 726, -201, 857, 2177, 2591, 2866, 2696, 1498, 996, 1647, 2953, 3613, 2977, 2082, 1340, 2005, 2777, 3172, 3279, 2408, 921, 356, 2158, 3099, 2395, 1758, 1184, -151, -154, 1187, 1980, 1037, -141, -842, -857, -58, 317, 156, -424, -1697, -2946, -1752, -355, -211, -1341, -2001, -2919, -2975, -1993, -580, -561, -2269, -3307, -3349, -2185, -1302, -1491, -1686, -2478, -2811, -2904, -1245, -78, -754, -1858, -2160, -1367, -951, 0, 527, -181, -868, -1278, -175, 1298, 1575, 1064, 464, 429, 248, 1203, 2769, 2839, 1531, 622, 1311, 2183, 2255, 3084, 2813, 1861, 1096, 1281, 2334, 3167, 2687, 1326, 847, 1077, 1622, 1959, 2846, 1996, -10, -520, 603, 798, 1073, 462, -329, -1674, -955, -505, 314, -85, -1209, -2496, -2114, -1671, -1125, -1028, -1147, -2253, -3512, -2857, -1417, -1201, -1506, -2135, -2671, -2857, -2197, -772, -731, -1306, -2297, -2530, -1270, -116, -31, -229, -317, -1017, -1302, 707, 1421, 1082, 782, 40, -63]
3824f3R98J053J87l64o47m71J48J273P69p69o81l71o8J67J305L40j277p35j84
3843F10J58P61J78p63o70q85M2M79J117N8j461q30l1L60M75N09m51j249o11P71
3863a433N89M99j91q18p99L84M69Q41M81p81j223K49P95L06J060m57j167j49L80
3882i65N70Q42N26q63r33L46P52L98O30j73q06o95M08R16L08l6m74m33l43Q10
3902G85N54K46n35j073j24M40P60J52m98j21j047m03J043N34J37r60k97o70N88
3921d89O96M04n14q17m43M6J075N73l08q39r0n87O58R49M12p55o40l09K28O08
3941a42O76n48m37j32l93Q42J245j75j206l92P3L68P93N04l70j107n37L92N79
3960C3R40m57p74l02J75L3P04O26p19j017mP56O23N8J01p72q91L55L49J034J54
$$ y = [-63, 935, 1988, 2175, 1811, 1164, 693, 841, 2114, 2883, 2114, 1433, 1062, 994, 1161, 2466, 2806, 1529, 794, 610, 768, 1529, 1707, 944, 274, -611, -569, -90, 1027, 1085, -376, -1206, -1237, -877, -402, 107, -344, -1593, -2204, -1433, -844, -345, -536, -1354, -2153, -1769, -1300, -459, 22, -759, -1982, -1733, -938, -632, 428, -29, -1196, -1345, -965, -395, 447, 973, 110, -823, -477, 275, 673, 1303, 1130, 324, -371, 37, 953, 1261, 1225, 751, 318, -25, 785, 1339, 1585, 1050, -23, -147, 293, 1053, 1205, 707, 586, -461, -864, 179, 713, 850, -110, -407, -1077, -489, 207, 611, 97, -720, -1163, -1117, -42, 531, 223, -616, -706, -1293, -635, 314, 726, -29, -669, -978, -750, -142, 534, -14, -451, -583, -976, -134, 1111, 936, -270, -662, -589, -221, 572, 1076, 706, -401, -938, -546, 33, 973, 516, -258, -560, -385, -352, 352, 978, 259, -758, -762, -6, 617, 675, 776, 4, -887, -532, -183, 851, 1005]
3981A005j075n17K69L92k7P29j2j219o16R05O26N56n38k75p17JJ07Q65N56n55
4001D60r97q07J309M60k14K37m55r18k15R85O44j68n41n22m39N38O39M17o7m79
4021a33j037K55J117N9k56J78o64k77M50J131K11p96n36n1L71L17M40j72k8r84
4041d05k28J147Q99n69n80J51l65j93P96O29n51r91m64N35O09J48k39n06m91k87
4061i55R7J305R6q03r05L58J83k08R47l0o34q79%P59O53K89j042l68K22O0K77
4082e78R00j7j125m22N73Q06K80K22k23r12J79N25Q78J78k91n00j76N01L5N80
4102A413K03p01q60K93J179L38m66j58m26l31J99K41P46l76q03j150L05P94M2
4121D82L37n53j199k49M17P65J97r72j99m59o9N85N23j63p44n97LR92K79nk30
$$ y = [1005, -70, -587, -318, 74, 47, 776, 764, -455, -1071, -166, 460, 1016, 478, 203, -514, -513, -406, 459, 1015, 460, -537, -1344, -35, 425, 211, 448, -7, -925, -1140, -155, 489, 321, -220, -742, -1181, -643, -4, 413, 346, -133, -1170, -915, 202, 261, 5, 183, -481, -758, -308, 823, 1034, 238, -298, -349, 22, 339, 779, 607, 579, -405, -633, 514, 1413, 844, 264, 415, 50, -143, 653, 1282, 731, -260, -724, -189, 420, 568, 329, -177, -668, -955, -858, 447, 543, -260, -1165, -807, -624, -832, 115, 85, -549, -1428, -1428, -669, -16, 273, -769, -1137, -915, -855, -578, 322, 305, -820, -1242, -669, 137, 417, 639, 416, -496, -317, 208, 1086, 1264, 973, 473, 297, 798, 833, 1413, 1616, 915, 55, 348, 1527, 1865, 1399, 1241, 815, 484, 683, 924, 1670, 1294, 491, -659, -354, 440, 482, 819, 266, -933, -1182, -765, 0, 197, -775, -974, -1433, -1502, -917, -394, -557, -1301, -1898, -1895, -903, -624, -629, -859]
4142h59k35m72k92J272O75n79m13j84j41P81N50L90j51n73k52Q47Q80J70m82J5
4162I47m48k63P97R98k10o24m20L65O6N81K16k89n33o36M61P25Q6o81p69L15o93
4183iJ90P00j07k41r32m20N09J12N19o61n57m88L7J83N00M12j091n13l9J35N60
4204a201K76j60m98m22L11O37M17L8p91j43M70J88L39M77j08j080M86P85N26K22
4224G69o8l65l27K09N40Q50J01o95n17M50K85Q6K10L54p26l71K00Q31o7l64l16
4245A069j74n8K54M34j88q5j017l16Q98K31k28Rp84n22K41K90K43k95q93N6J05
4266g30j35K50J45m45l74n0l84R41J08l00l48l63p3M5J008K38p30k24l54O44K45
4287h86N36k94m31k71PR74K66J75p44J3L96m9R19J94j79k46n34O34N47M77j80
$$ y = [-859, -1094, -1566, -1858, -586, 89, -490, -903, -1087, -1228, -447, 103, 493, 342, -231, -483, 364, 1244, 1414, 932, 947, 499, 236, 1033, 2031, 1821, 1197, 777, 1142, 1208, 1789, 2005, 1716, 1183, 547, 1008, 1733, 1819, 1138, 369, 684, -9, 181, 881, 774, 533, -399, -819, -310, -198, 321, -340, -897, -1385, -1348, -1165, -665, -253, -1344, -1857, -1896, -1761, -1201, -925, -1085, -1583, -2005, -1694, -1057, -640, -602, -1393, -1536, -1066, -878, -539, -62, -170, -1250, -764, 21, 547, 769, 701, 336, 9, 218, 758, 1608, 1709, 1014, 497, 947, 1232, 1318, 1528, 1882, 1156, 785, 985, 1816, 1749, 1385, 1069, 895, 837, 1091, 1525, 1337, 1252, 235, -81, 817, 1048, 820, 829, 45, -477, -236, 54, 297, 2, -891, -835, -730, -865, -615, -470, -915, -1289, -1339, -1723, -782, -674, -974, -1322, -1685, -1758, -1713, -705, -467, -1197, -1421, -1775, -1131, -886, -350, -644, -1075, -1346, -1339, -365, -99, 76, -668, -655, -259, -308, 611, 805, 626, 380, -154, 480, 1027, 1504, 1324]
4308A324m9o22M76K10M54L39n08m54j41N97Q1L04j42l51l80j41O14J70O9q10n51
4329D89R7j63K49M62p38n60m21k01N73K09l05n66m13n40M32K61J11n58n21l8k20
4350b361P87l27K61m50l73L57K02L00J55j46m25J67J59Q41O49n13l19J83K77P82
4370B06L21pj88K52m04O52R43N12o48K6k26O32J56P79m57n29k50N37K1M64J73
4391B965p91l17k44K11J20R1n35p38j99L4K71k11j53m72p76p7Q3L11m09m18o96
4412a950k05K12O0K30K27j202l17K29L08N12m04L4r8o97Q16N69L34j61k18l77
4432b098L07R94L96k7J91k98J13Q72J86L56j24J6j47L28J059J99m23k93J87J27
4452A921K87L95K33l56m29q4J51R5Rm33m4o38M1K69k0j24q82j45kl56K50J33m06
$$ y = [1324, 1275, 653, 1129, 1339, 1793, 2132, 1624, 1170, 1029, 1626, 1707, 2011, 1869, 1518, 1138, 997, 1611, 1781, 1850, 1040, 489, 586, 423, 672, 1134, 396, -164, -585, -786, -213, -4, -309, -875, -1288, -1828, -1396, -1135, -1024, -1582, -2103, -2141, -2361, -1574, -1901, -1640, -2090, -2463, -2106, -1904, -1604, -1449, -1595, -2020, -1853, -1694, -853, -204, -717, -1036, -853, -576, 206, 527, 520, 332, 584, 180, 832, 1775, 2287, 1639, 1665, 1439, 2071, 2227, 3006, 2549, 2020, 1770, 2307, 2328, 2792, 2965, 2174, 1857, 1613, 1824, 1944, 2035, 1500, 762, 563, 597, 868, 657, 504, 32, -744, -821, -738, -427, -836, -1254, -1950, -2155, -1943, -1883, -1653, -1426, -2628, -2945, -2716, -2408, -1896, -2300, -2266, -2364, -3061, -2245, -1676, -1342, -1503, -1721, -2098, -1791, -797, -401, -428, -237, -535, -422, 450, 636, 992, 868, 884, 737, 1065, 2124, 2323, 1900, 1607, 1794, 1921, 2208, 2603, 2836, 2480, 2051, 1967, 2118, 2213, 2222, 1789, 1745, 1107, 1148, 1417, 1397, 1273, 391, 246, 244, -112, 138, 271, -135]
4475a35n85l01l97O41n6l42n73j31o50O69N31k85l68k59M9K76R9K35J18m64Q4
4496a844j95O52O57K85q58K44M95k2L68N35K06p87J35L21N50N37k89j66n9Q8K51
4517A104K13M59l52m81J31M45J63j31J91k79o36L32L66O1j38n23n10M7J98P3J71
4538I04M4q87k79J83M44k97k01l8o58R3j44O22q6n04l26m4J02N05k49k23rp10
4560a758n1P07M32j90l92N49p11N0M74M23ro99L24J64M84p1jj11J66k75L56P91
4582F52O9q10J7M88j10J43O24J23p22j68O0L56N72K7o02J1k44L73K71M87n01n63
4604E53J10J97m8L61j66n31r6J25P8P6O9l14n06J8oj34M24J55n88n10L22J11m9
4627c49k36K9o44j0J9M65j39L8n02k22N79j20j43O36j43o97R5P55NK0J5l41M32
$$ y = [-135, -720, -1021, -1418, -777, -833, -1175, -1748, -1879, -2529, -1860, -1329, -1614, -1982, -2241, -2192, -1916, -1817, -1582, -1464, -1928, -1844, -2039, -1387, -730, -445, -1303, -1059, -564, -586, -218, 317, 523, -264, -129, 192, 742, 1279, 990, 824, 765, 853, 1104, 1317, 1776, 1424, 943, 1074, 1519, 1682, 1551, 1742, 1463, 827, 1159, 1525, 1586, 1448, 925, 415, 462, 660, 733, 904, 948, 61, -218, -35, 409, 112, -89, -127, -785, -692, -836, -214, -300, -804, -1130, -1174, -1072, -567, -816, -1039, -1048, -1758, -1809, -1102, -670, -860, -1252, -703, -1414, -1364, -890, -467, -476, -1175, -851, -687, -203, -274, -275, -386, -220, -495, -139, 652, 721, -89, -72, 416, 306, 449, 1073, 1196, 474, 306, 366, 722, 1294, 1321, 719, 730, 486, 859, 1130, 1617, 1116, 553, 663, 860, 812, 1173, 1007, 476, 380, 505, 583, 659, 728, 414, -92, -74, -80, -214, 210, 365, -223, -733, -411, -300, -349, -585, -556, -1200, -1210, -1191, -726, -865, -827, -1329, -1551, -972, -1092, -1235, -599, -742, -1439, -1344, -589, -584, -564, -549, -890, -458]
4650d58J90J4K03M29j53o05K54Q69J21k92L93l79n08O82J36L64l50K63l12j60
4670G01N05J78M5pn73l78M29M67m44j85J92p02l27O61J82n82P7k61j36P5M3j3
4692e3k23l22l14J50L7N23r50k10K55k72o3O31l3n99M27j16q0L74M70n07j67L17
4714g25l27N18N28j38n41L84J82L7L73K68k59l17J17K10L98R3R7n55M5L29J92
4735I09N2O06n98o01M35J16l68N87r6o02K3M00m91J89J26k00q04M31L49l9l97
4756B7L19n97m21N49P1k32M25o50l99L41K44k23m6K38o80r9K58M06j75L19j33
4777d58o95L35M14l2kk8l25j04O83j46J56J30j6m40J66N88M21p79K76ml27K35
4799D8L49r4Q0J03j25j47O80L8m65O0K60n10M43L68l61k34k97L42k96L69L03m88
$$ y = [-458, -268, -254, -51, 378, 225, -380, -126, 743, 864, 572, 965, 586, 78, 760, 896, 1260, 910, 1173, 861, 701, 1206, 1384, 1429, 1422, 849, 471, 900, 1367, 923, 738, 930, 228, -99, 562, 744, 162, 239, -22, -158, -83, -40, -53, -276, -598, -912, -762, -725, -202, -1152, -1362, -1107, -1379, -1442, -811, -844, -1443, -1016, -1132, -1212, -838, -368, -875, -1042, -725, -1052, -534, -6, -144, -685, -301, -119, -82, 291, 559, 300, -17, 100, 310, 708, 801, 898, 343, 388, 717, 909, 961, 1567, 969, 368, 803, 919, 551, 1138, 1042, 440, 463, 863, 372, 561, 687, 487, -317, 114, 463, 424, 27, 346, -251, -672, -123, -52, -284, 141, -509, -908, -567, -323, -546, -592, -354, -1034, -1133, -875, -469, -644, -325, -458, -1153, -818, -404, -436, -438, -466, -791, -895, -212, -358, -202, -72, -88, -528, -362, 226, 647, -132, 144, 140, -187, 48, 397, 303, 383, 486, 361, 214, 894, 932, 467, 527, 787, 277, 720, 1088, 727, 493, 196, 538, 242, 611, 914, 426]
4821D26j94N1OL68rm13n97N75m9j24L83L84p08p30N13J4mJ28q6l96j66k28L6Q36
4845A6l03n98k64N98j5j55K02J12n30J11J48l0L00M4k93j69M46k23P6M31L21q34
4867f09J63P65j83l77O20J3m30O8N20K09j63j12j22K35L16m3Q0M15l77n50L19
4888G57M20n3k20J87J41o82M22j80L81l29n45L4p1K02L2M5m48k73n12N52R3l42
4910c89M2l53l99P8K24n6K9o29K02RJ73K48m56J39J4j52R1O12k50l97J56K51M01
4933d12J29o2L86k25j28m8K54L85N34n51K20%NN21K33q7n00K86L35k12L50j43
4955A270j85P2j63J47J47K44n89p8P7j08j9O0M1o73m11L76K09k52j6l73k79l71
4977h74K25r6o7L71o61j87L39k2l36K98m9n14m8M14J04L46k69j23r2L84J4J70
$$ y = [426, 232, 283, 289, 657, 648, 235, -362, 213, 164, 40, 423, 807, 99, -631, -118, -104, -108, 20, -66, -462, -628, -856, -820, 16, -287, -885, -1149, -551, -566, -721, -519, -407, -937, -826, -678, -708, -408, -364, -657, -826, -380, -603, -527, -96, 225, -609, -446, 319, 136, -241, 379, 392, -38, 30, 550, 759, 596, 484, 362, 597, 913, 870, 950, 1365, 988, 438, 757, 1177, 1124, 904, 1091, 1232, 550, 972, 792, 1173, 844, 299, 333, 262, 464, 496, 541, 93, -180, -692, -140, -47, -389, -347, -700, -1099, -1021, -797, -853, -824, -1453, -1251, -1242, -1069, -821, -1277, -1138, -1124, -1276, -1185, -573, -823, -1220, -1064, -813, -412, -283, -345, 41, -184, -312, -360, -106, 279, 813, 262, 482, 482, 487, 1008, 1241, 1154, 654, 940, 1275, 1063, 1413, 1270, 1085, 1157, 994, 1141, 1288, 1532, 943, 865, 942, 834, 815, 875, 916, 243, -168, 208, 417, 165, 149, -224, -503, -874, -649, -745, -812, -441, -1102, -1289, -950, -972, -1308, -1010, -1059, -1573, -1621, -1207, -1103, -757, -1026, -1149, -1241, -857, -843, -673]
4999f73QJ20k62N38p9K76k74O10k37l5M43L80l0J06m66L81K5K51L04l02J70l71
5021H83K79m1M28j48l98j74l7k27L23l02N22m37k62l79L08n2K74l88k06N1k37
5042b20J70Jn00l84M83l21J31K53k76l32K4j46r2M44M0j95j27N9j7O9M09R6k66
5065f97j96M39k97M17K12k40pJ04n0O03l30K45m47L26K47l46O54l0o9o7r9L31
5087G03j65J21j04k84L94m07O24K11q6l61k58K01N9k79K32k00L4l58K70qj20N5
5109B74l14k2M9N02o83K75l77k9N9k05L33n21K73Om0l94j03N52J41n22j21L3L46
5132d88k50L0M27k30k7J04K63O8j11k25k01J86R4J24L43j6l73LM40r9J97M0J74
5155D73m61K9M25K18j3q8k45J17K45N13n74K31O7n41J23J73M51p42r1L66L5m94
$$ y = [-673, -665, -545, -807, -269, -348, -72, -346, 264, 27, -8, 435, 815, 785, 891, 425, 806, 831, 1082, 1386, 1084, 1254, 883, 1162, 1121, 1549, 1401, 1003, 829, 792, 565, 888, 586, 1108, 671, 409, 30, 338, 286, 560, 172, -34, 17, -220, -50, -49, -549, -933, -450, -771, -640, -387, -663, -995, -971, -1117, -1209, -765, -725, -920, -1047, -988, -1005, -936, -527, -431, -697, -893, -454, -751, -334, -122, -362, -369, -265, -315, 288, -42, 203, -244, 82, 329, -17, 637, 607, 538, 471, 372, 703, 538, 659, 555, 271, 665, 258, 882, 1093, 1007, 646, 388, 589, 648, 369, 601, 401, 435, 77, 347, 339, 219, 274, -40, -62, -13, 489, -194, 81, -296, -325, -266, -471, -138, -659, -386, -380, -420, -814, -917, -365, -224, -746, -867, -834, -488, -738, -708, -281, -511, -538, -434, -171, -103, -214, -439, -640, -454, -360, -236, 107, 91, -282, -279, 161, 62, 259, 299, 473, 12, 41, 466, 684, 671, 583, 338, 455, 700, 1213, 639, 870, 937, 396, 519, 692, 1143, 401, 310, 676, 711, 217]
5177B17K27J26j76j96J51l05K36k38o4j6k50k65J54J68j03p0l51K38j81L87l36
5198f47k63P5l4J62K7J8l0l13J27L22l27L37M69k38l93L92l2R7L14Plj61j34L35
5222A07L44J00K7k94L38K81m1j4J50m29lJ56L69j91q7j33k85N48n0j65l55r4J36
5245D15l58L26q0k86K06l71l89K39j91L31r7l71J67l05K37l24O6O4j59l33M52
5266g61L6J42l16J23j14K01J14L28j51o8p4J6K70J36K9N79l87m37P0P25j63K10
5288E08o7j21K74k45K43J02j45J9J14L82oj69k35k97M8J55Q3J10p59L80n4k27
5310I3J93m60L68j04J35o11j63K44L69k89m5l71QJ73J70l94L1l74L9K86K42J4
5332d46j25qj27K16k6J95J57m00j70M56k83M98j41M49o32J53L09jK42kp2j44L45
$$ y = [217, 444, 570, 394, 198, 349, 44, 280, 42, -22, -38, -288, -553, -399, -231, -334, -404, -755, -517, -698, -311, -647, -910, -835, -869, -707, -680, -662, -692, -1005, -878, -556, -883, -546, -77, -315, -708, -316, -348, -251, 63, 70, 67, -94, -228, 107, 451, 551, 578, 284, 622, 903, 862, 848, 998, 569, 566, 722, 1091, 900, 813, 680, 395, 943, 893, 728, 373, 279, 415, 57, 383, 303, 17, 223, -148, -537, -298, -489, -158, -255, -626, -459, -764, -527, -851, -785, -721, -880, -1213, -761, -725, -583, -899, -776, -890, -689, -575, -247, -398, -466, -540, -524, -254, -118, -89, 490, 103, -334, -264, 461, 298, 508, 441, 320, 594, 349, 592, 694, 549, 568, 682, 1064, 1058, 889, 654, 357, 405, 560, 643, 753, -6, 374, 320, 93, 286, -174, 194, 90, 225, -386, -549, -305, 64, -225, -270, -641, -633, -460, -290, -684, -653, -1027, -988, -702, -460, -446, -571, -579, -706, -490, -516, -321, -164, -564, -734, -278, -561, -63, -204, 245, -387, -234, 75, 74, 316, 314, 242, 98, 443]
5355D43j31K91N2j63m4J2L4L7r1Q0l34N9O8k66L92K02J0n58L73j49j38J13j18
5378A74j38k54K76k46R7K37r0n53k7J35K85J3Q8l11q1M45k83RQ2r5N3j48J9J65
5402a48mnk99K39M7O2K11J48l03k45K28M12l86K68J35l83m0O7L7K02p5k92L60
5425B36l97M86K2J20n16k6J17J7K59K29l37j34Q4j20K79j94j30K38k57J05j21
5446d0K62J65k73j49Pq7N7K97j01k58K10k25Q0K06k1j28M7p3k51K64P2k71k64
5469d74j4O2K16j83R6J48K4j79m67K43M67M4l10K59k73K5J75J86k89M2j9j1M01
5492A69k27K20k33M59k47L0K99Q5p31M21L36l98L23K9j30m0K14j16k4j79L53l09
5514C04O8K85l08K48p0k39j82M32j90j84O2j62j06l7j44L45l18k6m9k95J59L02
$$ y = [443, 312, 603, 655, 492, 448, 460, 494, 531, 440, 520, 186, 245, 313, 47, 439, 641, 651, 93, 466, 317, 179, 292, 174, 36, -218, 58, -188, -91, 146, 56, -497, -524, -389, -104, -91, -3, -314, -395, 50, -233, -224, -142, -237, -184, -332, -313, -148, -152, -157, -456, -217, -170, -108, 103, 251, -52, -297, -69, 343, -43, 225, 360, -23, -63, 4, 41, 243, 168, -124, 236, -161, 325, 347, 467, -49, -75, 42, 59, 318, 547, 210, 76, 160, 40, 319, 125, -5, 233, -24, 81, -40, 222, 387, 114, -35, -28, -115, -58, 239, 138, -120, 90, -135, -55, 151, 130, 2, 49, -24, -275, -11, 61, -210, -474, -488, -426, -210, -393, -297, -149, -125, -304, -771, -528, -61, -17, -327, -68, -341, -316, -141, 45, -244, -202, -221, -232, 169, -58, 162, -71, 388, 141, 171, 470, 555, -176, 245, 581, 183, 506, 535, 405, 365, 579, 463, 439, 260, 613, 304, 372, 657, 349, 597, 527, 288, 106, 538, 348, 164, 226, 64, -42, -79, -223, 122, -196, -222, -271, -566, -407, -105]
5536a05j89k22J16m22j46M63j27J11p8j14L09l38M59o4j42L63l20l24M22M25l40
5557b63J14K1j44M55o1k3N8P3j24J40L58p1o1M28j21j16m8m3J83l68n9M01L1N3
5581H13J17j82l45J93L6m01K59Q1n53o6K18j15j3K01m26l56M14j05l61M76n5o51
5603h21p1N66l27J20m7J75n14L70j14k78N28P6m33K79L1L4o7N1K30j90j06L77
5625a31k27N91k58k52L57J87M5M1J17K24m77J75J12M34k07qj01k93J05L54l73
5646D15J81L9l81k7N21l01j03m9L37m41P0K19l21J21J35n64J61K47j95m45J89
5667a92L45l76J0L1k84M19m9n84J01K52L61k54N5k47k91L64j75L28l47J13j15
5688e35j69L80j41k9j13N88l10K9L0R1P4k21K12k3J68j40J05j27L88p7k8J90k76
$$ y = [-105, -294, -516, -400, -822, -968, -505, -632, -521, -599, -713, -404, -742, -283, -347, -489, -126, -446, -770, -348, 77, -263, -149, -128, -272, 183, 122, 99, 157, 230, 106, 246, 604, 533, 472, 900, 779, 663, 615, 572, 755, 387, 328, 729, 760, 813, 930, 748, 403, 596, 632, 231, 490, 571, 18, -48, 170, 55, 42, 243, -183, -539, -125, -230, -591, -115, -170, -821, -892, -326, -653, -533, -580, -405, -919, -549, -663, -941, -413, -337, -770, -491, -460, -426, -493, -442, -212, -402, -508, -131, -358, 233, -25, -277, 80, 267, 312, 353, 470, 694, 217, 392, 504, 938, 731, 723, 622, 329, 434, 788, 415, 596, 635, 254, 227, 748, 447, 344, 295, 632, 191, 261, 480, 159, 280, 415, -149, 12, 259, 64, -381, -192, 153, -223, -213, -182, -466, -47, -96, -680, -579, -327, 34, -220, -165, -412, -703, -339, -514, -186, -533, -420, -535, -704, -324, -465, -494, -607, -19, -329, -300, -270, -179, -105, -326, -114, -137, 31, -109, -4, -131, 257, 180, 152, 342, 66]
5711F6L5J87j18J5Q0J58k83K20K20J73m23K72j31k47K50Q7k20P0J85l00J35k07
5733B24K12J4k77K34q0o1N3n1j55J93k12k20J89P7j50l00M25m52k74K32j28K46
5755b61r1l32K2J20K80m26Q8K26m07k76M54j23L8R3K6J66J51l37K31j04l5L16
5777a81Nl2K54j96J40L23m03K43M4K48k73K34K86k55m1L80j38j3m6J62J51m4q1
5800G67k4J81l89j41J79J73k57n83N18l01o8K74nok78k16l46M89p4k15Jk2Q3m90
5824g50M19M5k16m66J95MK50q5K02m83J56J16j75L70k51j03j3M66R9l45M26l0
5846a69Q5k34M36j3p6M9M02k59J09J14j13K30k33N7K56J04j81l54M47K40k92j48
5868D57M26j86K67m99j49M7K4j5M7N4l80k66K23J37j18l16QJ62j59J06J18J59
$$ y = [66, 101, 288, 170, 185, 265, 423, 140, 360, 580, 753, 330, 602, 471, 224, 474, 561, 341, 411, 596, 296, 431, 224, 436, 450, 173, 407, 327, 266, 319, 268, 113, 306, 94, -126, 63, 140, -10, -310, 115, -337, -611, -379, -507, -261, -352, -684, -662, -542, -262, -688, -600, -374, -781, -1057, -603, -726, -688, -595, -569, -403, -252, -589, -358, -462, -497, -181, -176, -208, 46, -150, -10, 313, -90, 153, 197, 445, 172, 406, 692, 437, 396, 776, 638, 625, 579, 741, 892, 848, 767, 743, 924, 535, 394, 573, 746, 489, -94, 424, 123, 55, 329, 324, 318, 40, -176, -522, -33, -107, -322, -321, -343, -260, -750, -331, -286, -502, -968, -773, -769, -519, -604, -402, -885, -729, -613, -788, -418, -669, -772, -785, -319, -220, -565, -139, -169, -84, -318, 118, 105, 29, 78, 480, 221, 330, 444, 331, 561, 328, 385, 641, 745, 564, 210, 657, 897, 605, 457, 883, 697, 964, 465, 316, 363, 387, 372, 419, 473, 93, -173, 50, 187, 69, -247, -239, -77, -236, -130, -12, 147]
5890A47m97j60K48P5m4r2P0j1j07J7j47J13j51J16m3j4K3ML93j55j33j31L03J45
5914c1M5k89j42K69r0K77J71p9o1k92K71r1K15j41p1j80L08M0J9j52j49K12K77
5937C36j44o3L66j18J07n63L29L24j81k88n1L08r6M9k4r6r6l2L9olj70J70K37
5961C34K9l36j77L32j12J45j15k7k37N3j14J59k89p4O7j25J38L27l56lo6r2L5
5984e04K01L9l99n3M04rJ49lj13J5k77L02j90J92J39N3m5R4j57L28L5J14m02N10
6008D23j11O7l2j16L7Q0j45M89k16K76O4k79j15K5n9J62j46L99m54q1j13rP2k95
6032g7n6J79L7K8n3l17K7o0K26j83k01J29k7l01R9o0K60j49k27NP3o9L58m4k63
6057f66O7k41J29M08j8j78K10k64M15J08qJ64R5Jl9J57J08j65M70q4k50l36M46
$$ y = [147, -350, -510, -262, -187, -231, -323, -253, -264, -371, -354, -501, -388, -539, -423, -466, -480, -457, -453, -60, -215, -348, -479, -176, -31, 14, -275, -417, -148, -238, 39, 210, 131, 70, -222, 49, -42, 173, 32, -39, -219, 89, 129, 148, -4, -153, 59, 336, 192, 129, 495, 377, 484, -79, 250, 574, 393, 105, 54, 362, 266, 315, 291, 195, 99, 67, 106, 100, 97, -73, 97, 334, 363, 27, -150, 182, 70, 215, 100, 73, -164, -111, -225, -66, -355, -429, -362, -487, -349, -22, -378, -381, -447, -539, -504, -303, -264, -663, -716, -312, -321, -172, -175, -288, -273, -550, -248, -438, -246, -107, -54, -99, -5, -162, 166, 201, 315, -87, 423, 312, 379, 347, 231, 268, 348, 203, 692, 476, 752, 816, 537, 422, 447, 388, 550, 404, 803, 349, 268, 155, 146, 218, -77, -133, 46, 83, 111, 58, -259, -232, -292, -66, -249, -450, -321, -348, -649, -550, -610, -350, -499, -726, -721, -648, -717, -359, -403, -666, -599, -840, -711, -303, -321, -499, -289, -553, -138, -30, -38, 126, 221, 222, 183, 340, 448, 283, 753, 669, 419, 83, 529]
6080E29L0l1K96k49q3K86l21L97k99j57K75j69l96K48m1O4k08j54j86N6J04rk22
6103b40j57R7k36J00m6K15l00r2R4O0o8K4l00M59l80K97J93k05j72oM73m03L92
6126b01j63L0K6q2K33P3K57r9J4J71J23k82M51J06n9j21P9j80J11J47k99K10p6
6149D69k98M21j67J6o1L82o38K53k92L90j84q7K3k20K58j78l8l29R6m00N44j69
6171b09j05r4K5j55L20n13O24n05J5J53k99L13J63J3ol50J3K35q4QL68J4k58K33
6195h1K64Rm79L43j03j1K88K6k46J31k61K05L7K15J62r2L29l60j80J93P1k37r0
6218A33Q7J85M88o73m6M8j3k19J43k4K48j60rJ17k46J24j06j57j51j0k1K13m81
6241e30N45k69J97k74k14M09m46M14k06L4J20J52j65n6M2j42k1j10J4O94n54K24
$$ y = [529, 559, 528, 824, 575, 492, 778, 457, 854, 555, 398, 673, 504, 108, 356, 315, 379, 171, 17, -169, -113, -9, -18, -240, -397, -300, -536, -436, -482, -267, -567, -659, -565, -505, -573, -549, -849, -390, -770, -473, -280, -485, -657, -663, -190, -593, -201, -364, -334, -308, -390, -157, -84, 173, 74, 88, 259, 382, 100, 551, 657, 598, 477, 556, 376, 487, 634, 335, 545, 469, 171, 592, 425, 441, 380, 762, 124, 377, 85, 475, 291, 204, 227, 7, 265, 87, 49, -280, -184, -584, -40, -209, -314, -408, -383, -538, -218, -731, -107, -612, -597, -444, -743, -430, -267, -254, -260, -610, -597, -362, -446, -438, -70, -56, -314, -81, 183, 192, -287, 56, -47, -58, 230, 256, 10, 141, -120, 85, 122, 337, 499, 407, 736, 376, 196, 389, 460, 223, 133, 220, 405, 893, 220, 174, 222, 209, -10, 133, 109, 357, 197, 188, 305, 59, 183, 77, -80, -231, -241, -262, -49, -530, 15, -254, -57, -331, -545, -136, -582, -168, -374, -340, -220, -68, -233, -289, -247, -389, -410, -520, -506, 188, -366, -142]
6263a42j9k04l6M40M6l70m9K48pj44L76J46n38N43r3P3O6r2J77n74L26m1J37K31
6287E00m13M86l36j2j01L50J07l98k3M6m9N2K46k91q8M5j29j5L2j17k88L01l26
6310d21M26j80l4P7j55J64l73K66o8k57R1J06j16j5l0j23J76J46j09J59j45j0
6332d25j81N04k63L34m82P80k05j00L5q6K73K74j16j48J18j3o7k83M36j24N8L00
6354F19j80j36P6J4N3Q3K11m49M6J53j49M3j57O4N3k81j04P7J79n61J32j23M20
6377H3n34M95P5n12k51M54k95M19k68r1M42o01K90j76k5M8j7j04K75j21r6J34
6399c76R7J93l17M14J12m72N3M63rJ79k74l4J45K82O0j12K84j88l89J90J76J0
6421D87J14j33j20J01J60o9m67O08l02j36K7M1k79j67M54k99j79k57M21k13J93
$$ y = [-142, -161, -365, -401, 39, 85, -285, -334, -86, -93, -237, 139, 285, -253, 290, 197, 270, 336, 244, 421, -153, 173, 132, 269, 500, 87, 573, 237, 225, 124, 474, 581, 183, 160, 206, 157, 209, 455, 164, 76, 121, -8, -23, 9, -108, -396, -95, -421, 5, -175, -209, -132, -287, -123, -496, -230, -298, -555, -464, -358, -474, -489, -519, -642, -466, -320, -429, -270, -415, -425, -606, -102, -365, -31, -513, 267, 62, -38, -3, -89, 184, 458, 342, 194, 312, 299, 232, -51, 385, 261, 319, 619, 439, 303, 379, 393, 446, 529, 740, 291, 337, 490, 341, 384, 227, 291, 344, 63, -41, 36, 215, -346, -214, -337, 83, -451, 44, 119, -393, -644, -190, -485, -66, -334, -425, 17, -584, -294, -470, -495, -447, -464, -568, -293, -414, -510, -376, -279, -86, -403, 11, 123, -349, -296, 167, 158, 337, 63, 29, 174, 456, 516, 404, 688, 500, 111, 301, 477, 487, 601, 468, 348, 449, 609, 540, 73, 681, 379, 243, 270, 311, 32, -135, 319, 20, -159, -416, 5, -208, -15]
6442a5k30J50k53m2K18j86J23j26R0o23O95m7r5p2j53KL92j73k78M34k39K62L
6465a63n2J42J1k90N99n61N20K4j00l6J01K0R1L05l67J81j87K47k32L13r5j13
6487C58k58J11m3M1J51l09K62l98N16L6k60j44j80M29j65j03l7Q6j26q2N6P5j23
6510a07k48J38J93J36l39J98m5j09j46K58k62L43m09J90J53km10L98K11m29J70
6531a18p1N4K36l75M9QP2J04q2J91m6m5O0J5k19J29O2P8j52J75k36J81k85L78
6555A63O5p3k47K15m07M62l02L00R7j17j15R7M20m74k3kL68l08J45j10j7k1J73
6578B89j5j65K51J09m92M01r9m12J57m1J90L1l76K09j53l0K40j91r3k59L39j85
6600b95q4J63J45l05K14o4k57K72R1n02J90J78l30K32n6K32j73K59K3k96J76%
$$ y = [-15, -245, -95, -348, -390, -172, -358, -235, -361, -271, -894, -199, -246, -341, -413, -566, -564, -172, -345, -623, -189, -428, -166, -163, -215, -73, -62, -352, 247, -314, 206, 230, 130, 94, 195, 215, 306, 611, 244, 425, 238, 485, 253, 566, 471, 358, 100, 211, 168, 209, 360, 51, 313, -85, 431, 467, 207, 63, -117, 312, 147, 44, 7, 93, -33, -115, -59, 16, -107, -355, -217, -24, 112, -227, -29, -74, -183, -329, -71, -333, 10, -399, -209, -56, -58, -468, -70, 141, -288, -118, -189, -135, 101, -274, -225, -217, -145, -41, -123, 68, 22, -23, 37, 52, -167, -38, 24, 102, -50, 125, -111, 70, -215, 163, 228, 155, -92, 123, -284, 178, -124, 176, 273, 156, 41, 138, 558, 84, 61, 59, 427, 119, 264, 154, 137, 116, 289, 274, 109, 360, 469, -23, 378, 279, -133, 24, -17, 173, 204, -172, 37, -116, -146, 94, -97, -190, -449, -110, -295, -379, -216, -71, -376, -162, -226, -483, -211, -120, -622, -432, -254, -584, -352, -408, -176, -349, -90, -67, -363, -187, -187]
6622a87k7n1K12n1jL53m99L55L41p4l03L26n5KQ1L4J50k46J71l8q7K64j40rl55
6647A66L35m67L40L68k93j45r5J72m05l4J72j22k00q2O2j96J33q5r4q5K64K7Q
6670b56O7j07j94J1J20l24L02P3M12p39K37M7K85j88q3L46j7m23j4M64k2k06K18
6693Ij88L71Q0Rr3K44j42j02J46K62K6k44p1n5N99m98j34L01l37J21p0l9k9q5
6717H1J79n2j10O1J06l19j89K13j68N20o63J07J34J96n86J36j11K44l81L26p6
6738c52l42N51k2k5l19K66k63K22J56k38N6R6o8pL22P9k77L25j19k98L23r5J14
6761H5j3J0r3l5J09J80r9K21o0j59n6K59O4j26q4k01K39M4o0m12J27K39j89r9
6785a09L20P5m85M37j65k06L01k54j27r2L67m72J80L81j64j72j23L95N3j57j41
$$ y = [-187, -214, -265, -53, -104, -105, 248, -251, 104, 445, 371, 68, 394, 339, 341, 422, 456, 606, 360, 531, 493, 406, 670, 530, 521, 166, 501, 34, 374, 742, 449, 304, 209, 381, -24, -58, 114, -8, -208, -290, -228, -424, -291, -376, -470, -555, -291, -264, -256, -189, -296, -490, -479, -359, -683, -381, -308, 104, -635, -398, -351, -66, -254, -337, 9, -8, -431, -445, 19, -3, -209, 9, -179, 192, 272, 281, 188, 432, 290, 188, 334, 596, 622, 378, 307, 252, 851, 353, 219, 520, 183, 304, 234, 195, 166, 81, 260, 208, 98, 159, 265, -54, -243, -30, -198, 322, -341, -234, -100, 96, -490, -354, -465, -221, -602, -276, -352, -694, -143, -165, -190, -509, -243, -506, -284, -128, -366, -310, -214, -282, -289, 33, 112, -165, 160, 41, -257, 66, -29, 85, 72, 82, -11, -46, 63, 243, 144, 365, 305, 146, 90, 349, 413, 287, 203, 2, 241, 285, 225, -187, -60, 179, -10, -109, 211, 286, -199, 238, 73, -133, 168, -86, -213, -305, 62, -410, -230, 151, -13, -185, -308, 87, 140, -17, -158]
6806a58l4J23Oj13j55J61O1JJ16j00J69j88j07M0l2j18J53j17L09J24r6Q0K2P7
6830B24k92m3J96j58L14J36l73K55j46J6n6lJ88j05o4mJ17j23M24k57j89k4K48
6853B81j41l19N15k59J11K4Rj00J54j57q0J57J0q6K00j14j99J87k79J45l6O2k36
6876a51K47k87J47m8k03J53j87J24M3J92l81M18m21R4m2N8k0N9l5l2J36m1N9k93
6900d11L33j97L80k00L3N4k9J14K08k94k9O0N8J90j6J15j52rR8k89K92K86k93
6923C02o5m4n7J79o0J0q1J30L0k34K64j20r4L6j21K69l23M02k66k43J49j05J16
6946G4J40k40j27j20l1QP9K16Q3m47n0L21p8q0O2j71R6K6k2j00PL58rO3J95l52
6972i9J70j27L6k38J12K57q8J47j99O3K39L4l43P8L12m87K60k2k07K76L3J3p2
$$ y = [-158, -192, -69, -63, -176, -331, -170, -109, -108, 8, -92, 77, -111, -218, -178, -210, -328, -175, -292, 17, 141, 45, 125, 147, 224, -68, -111, 85, -73, 241, 377, 4, 259, 113, 129, 73, 70, 258, 153, 89, 85, 202, 79, 503, 246, 57, 33, 281, 140, -179, 336, 77, 188, 212, 221, 121, 275, 118, 38, 195, 205, 119, 319, 205, 6, 193, -86, 59, 23, 85, -151, 96, -191, -44, -92, -295, -142, -329, -205, -162, 30, -351, 67, -354, -260, -302, -244, -264, -205, -240, -272, -136, -177, -118, -411, -78, -275, 105, -95, -62, -8, -37, 77, 285, -9, -38, 22, 80, 270, 254, 369, 217, 208, 306, 17, 309, 595, 302, 237, 193, 136, 315, 255, 265, 184, 314, 344, 110, 374, 254, 160, 196, 75, 344, 21, 423, 157, -86, 63, -42, 74, 214, -26, -153, -273, -304, -296, -217, -1, 82, -365, -415, -94, -172, -252, -190, -361, -265, -239, -261, -361, -354, 4, -5, 58, 253, -99, 71, -56, -20, -258, -146, 111, 23, 170, -29, 34, 273, 307, -36, 42, 354, -133, 127, 105, -102, 174, 207, 220, 148]
6995A48n4J64K2k22L06q5l69J72k4j55J30j51o0K47M5qk53O1l34J45K23O9J15
7018A32j46o6k02L96o6l4p2K4L0j5j6J55k8p6N0n9j86J15k18J29L43j31l1M9J06
7043A83L1n6l30J14j39J87L3j6j8J2j52L7JO2j42m9K8m4O7j1K75k54L61k55J03
7068B8k08N9J89j22L83m70J16J78o5J49j82n0n5J14K12J46l23mr3MM10j07j79
7091A30J30k29J64j62n5M7J65l20L45l00N1K2j87K31m56L02J74q9j26m09K22L24
7113b6k12k55L04K3q7oJ21p1j4k00RK70J60k61k1Qk2J17oK01l57L35j57J82l81
7138c46L71j06K45K5j29p3R2K7R9J96j31j03J51R6L0j21p9k46O50n13j49L32j13
7161B05k55M42n63L33l1Oj59J07K35n90J62k37K99j35O7L07k38m01K09j73L14
$$ y = [148, 94, 258, 280, 58, 364, 279, -90, 82, 58, -97, 33, -118, -178, 69, 114, 106, -147, -86, -420, -275, -52, 17, 132, -14, -80, -282, 114, 48, 14, -58, -34, -4, -19, -35, 120, 92, 16, 66, 7, -179, -64, -282, -153, 190, 59, 28, 77, 183, 214, 158, -172, -58, -197, -10, 23, 7, -11, 1, -151, -114, -113, -51, -193, -242, -214, -258, -191, -202, 73, -181, 180, -75, 28, -180, -121, 68, -54, 329, -141, -25, 153, 88, 237, 55, 5, -50, 64, 276, 422, 99, 95, 2, 6, 416, 309, 130, 260, 31, 195, 33, -22, 25, 190, -130, 215, -85, -34, -12, -199, 32, -424, -122, 52, -37, -163, -572, -350, -26, -238, -493, -189, -166, -253, -259, -138, -209, -223, -423, -414, -144, 16, -245, -266, -258, -280, -163, -169, 32, -325, 10, -147, 35, -346, 25, -81, 164, 189, 60, -13, 79, 106, 205, 401, 270, 167, 318, 414, 444, 323, 244, -2, 648, 135, -14, 318, 205, -50, 392, -171, 162, 131, 137, -22, 85, 320, -270, -108, -345, -46, -181, -114, 193, -45, -446, -237, -410, -96]
7182i6j74J74j11M4k95J68K46n09M00l1n8k66M61j42Q6K81k26j16L72Qk57n0R9
7205HJ22k31M04j08j98L19j62j01L4K68j97K6L6j88L45k49Q3j50K76k26L1P9j74
7228D7N1J35j11Q4l42K04q9j52P8j37N42m08J48J40o32K17j8R0k39L47j59MK41
7251D1k61J68Q1nJ4k20k31K37K95n7K34k6J1j76Q2m3k96J45r7L43k99QK18rL3
7276A90l55J00kJ81j47m6M87k84j08J17J29j34j33j65J04J14k58M74j68l37q8
7297c29J47L95j05j48n9L0P8RJ8mN0J86l90J83L25k69j14q4K56j38J73j28j99
7320a17K87k47J09l22K45m6J44J27j97j42O1O5L15mj74k51J19k64L74MP5n5l21
7343b15K25j5k91K88r7J23j52K21r5j5Oj73L06l7kk51p7K28J74l12j18N95l17
$$ y = [-96, -270, -96, -207, -163, -458, -290, -44, -553, -153, -184, -242, -508, -47, -189, -103, 178, -48, -164, 208, 216, -41, -91, 8, 130, -101, 303, 195, -3, 316, 154, 53, 87, 355, 158, 184, 220, 32, 377, 128, 211, 61, 337, 111, 142, 221, 47, 98, 233, 122, 206, -136, 68, -21, -173, -95, -232, 310, -98, 50, 190, -442, -225, -243, -153, -392, -45, -204, -200, 41, -220, -52, 29, 24, 38, -182, -413, -176, 119, 62, 296, 270, 281, 105, 187, 144, -152, -7, -104, 239, -60, -52, 166, 157, 190, -165, -65, -67, 114, -33, -79, 408, 124, 16, 133, 262, 128, -5, -170, -66, 48, -210, 264, 96, -241, -329, -182, 213, 108, -40, -99, -69, 9, 18, 36, 32, 82, 268, -122, 61, 386, 117, 3, -81, 175, 37, 210, 82, -117, 170, -77, 32, -290, -45, -91, 53, 180, -17, -159, -98, -33, 282, 278, 104, -147, -28, -292, 82, 86, 161, 106, -215, 10, -5, -296, -8, -105, 18, -134, 87, -8, -23, -17, -190, 116, 79, 77, -174, -251, -23, 151, -161, -279, 316, -1]
7366aj64K64j11Q3l6O3J37j64R8k3j98l1J15q0P3k25N64j51j90m0K18k71k90K40
7390a20J13l40K55J50P4j38j14j02M08j26k06N12l84p7j82M31o9k55J43K54k65
7411c8j06K78K6P4q6j24l1J82nJ6n7J36j69k44L84j17L1r3J1R8l03L75q5p4j24
7436d5j77K47kj55R4j19k1N11p58J99K79j58m3k4k59K82J55r0n8o8L14k70J97
7459C1p3L1j45j22J96n6J07j75J6K57J6m23L73P9n9r1L45J5l36K08K4j4l44M96
7483C56o4M9M5k72R4R5k75j40L21J04j87k9K09l49K55K8l94j1K0r4K87p3L03o73
7507c95m2O9L23k91J79R6l46M70l13j68L58j34k1r0J82K98n70M34m7P1l11J98
7529e0O3p1K24l06Q9o5L29K46k46K87k17j23K38m4p7J09j14k75L52l23K19j28
$$ y = [-1, -165, 99, -12, 71, 35, 98, 235, 71, 169, 146, -52, -83, 32, -48, 25, -200, 364, 213, 23, -17, 201, -70, -360, -120, -7, -347, -92, 58, 132, -6, -120, -222, 186, 60, -146, 366, -18, -95, -277, 154, 85, -170, -27, 227, -38, -144, 134, 160, 234, 148, 24, -7, 175, 170, 186, 129, 265, 96, -148, 236, 119, 150, 57, 68, 166, -137, 238, 153, 79, -45, -222, 25, 23, -132, -38, -157, -178, 333, -425, -226, 53, -105, -148, -172, -431, -149, 6, -84, -142, -210, 104, -166, 31, -42, -11, -156, -278, -82, -138, -31, -206, -190, 67, 83, -340, 33, 112, 53, -38, 307, 322, -14, 194, 218, 204, -140, 356, 292, 341, 386, 114, 208, 303, 28, -112, 209, 313, 126, 97, 306, -43, 212, 240, -154, -165, -145, -239, 48, -25, 278, -395, -437, -368, -45, -336, -157, -61, -407, 63, -250, -418, -60, -194, -215, -305, -123, 175, -395, 39, -8, 63, -248, -50, 13, -58, 166, -140, -51, -116, 213, 459, 213, 500, 283, 160, 398, 354, 277, 386, 272, -3, 349, 26, 245, 117]
7551A17K75j32p4J29j80j06o6R1J80K68l45k51J32J09j25l39K12K22n21M39j66
7572a31J61l82J04o4K99j62K0r6L56m42pj83P72l12j22L21m9p6J48j76j19P0k0
7595i0J43J43J3j4PNJ07k76j25K13J10k88M15j78q3M1J20J10l34n8J02K05j7l42
7619g1jJ26o1k48jL22q3k34K51j46j34j44N5L42r5l8J41j9K99n80P7P3j42J65
7643a46M5P2j46J01nQ6K59k49o4o5m3L99l1j58Nk21L02J40l79M34L1k24J36l35
7667e6L74l72l7K62p3M8k56J83j28K95q8m86L82m0j42q3J49J29l71K92P4J14l8
7690A32J9n10K45J37j39K22l8j08J61j34n0K96j59M1n8j73M00j02m01J77k4j9
7712h5K52l5J78k26o5j5j51o7K48p8M9K23j90p9L5P9m1R6k95K02K72l93j03j49
$$ y = [117, 392, 260, 186, 315, 135, 29, -37, 54, 234, 502, 157, -94, 38, 147, 22, -317, -105, 117, -404, 35, -131, 30, -352, -248, -312, -13, -175, -155, -251, 105, -337, -344, -527, 245, -67, -189, 132, 83, 7, 155, -21, -140, -70, -90, 53, 196, 209, 195, 202, 207, 314, 38, -87, 126, 236, -52, 363, 185, 102, 143, 263, 373, 39, -19, 83, 288, 271, -71, -72, 54, -7, -255, -256, 66, -17, -251, 0, -146, -280, -424, -369, -27, -122, -160, -19, -38, 261, -319, -242, -169, -311, -146, -101, -29, -175, -74, -79, 7, 266, 17, -47, -112, -155, 244, 213, 55, 60, -161, 141, 281, -98, 336, 367, 143, 279, -56, 318, -54, -91, 171, 98, 146, -110, 73, -55, 240, 152, -334, 48, 8, -134, -217, -68, 61, -310, -18, 56, 170, 132, 151, -359, -114, 23, -116, 106, 68, -40, 121, -13, -63, 233, 74, 115, 57, -116, 284, 182, -219, -42, -66, -85, 167, 132, 310, 84, 19, 4, -147, -214, 34, -44, 5, 228, 38, -41, -6, 73, 32, 128, -167, 35, 307, -86, -189, -338]
7736c38K23k24J79K72k91L55l05r7J83R6m6j11J57j6k29K63R9k04K27k47J44k28
7758a38K7L64l57K88j45K54m36N18m29M6J85l25O0K16J89k55J40j15n8m1K47R0
7780C25o05L06J56k34K52K2j29j43k2J01L5k15J51k1m4J52j13M5J26k72r9m4J90
7803h0Q6p5J60l78K10q2J45Q6l13N28l74L57j31m35K35n6k9J80J90r7N5Mk42R6
7827D0j12K09n00M45j76J89j53J50j94J2J92L6k60N0J77k6j2J47m25J89k09j19
7849c50K49K05k85Q6j67M11o0k27L85l19q7k1N19n02K63j14K56k08J90k26J6Q3
7871I7m6q7J47k49M50l59r2N5j3N13k93j81J27OL4k4k00J51k01J61j54J21J1o2
7895h8RM7p0K4k43Q2J15Q1J72j91j68L91k65J17j83R3L1j42R3l08L64k42L6K53
$$ y = [-338, -115, -339, -160, 112, -179, 176, -129, -226, -43, 53, 7, -104, 53, 37, -192, 71, 170, -34, 193, -54, 90, -138, -111, 253, -104, 184, 39, 293, -143, 375, -54, -8, 177, -148, -88, 128, 317, 62, 202, 87, 29, -12, 235, 325, -280, 26, 182, -52, 200, 222, 93, -50, -72, 29, 64, -151, 0, -21, -65, 87, -26, 19, 145, -127, -226, -270, -80, 6, -69, 91, -287, -77, -159, -14, 72, -241, 287, -87, 270, 139, -296, -61, -117, -146, 34, 224, 127, 182, 186, -56, 40, -72, 137, -363, 82, -94, 95, -58, 92, -102, -90, 102, 138, -122, -72, 105, 79, 67, 214, -211, -22, -231, -350, -101, 104, -181, -95, -262, 149, 89, -138, 247, -72, -159, -180, 339, -163, 100, -14, 242, 34, 224, -2, 14, 97, 51, -36, 111, -138, 312, -47, -139, -84, -97, 416, 123, -58, 69, 75, 109, 85, -115, 36, -165, -4, -158, -37, -26, -88, -79, -32, -102, -78, -321, -239, -124, -43, 129, -62, -230, 161, -104, 13, -170, -77, -46, -188, -95, -403, -39, -281, -245, 8]
7919Hj31j98M20j56J55J6j55o3L21k88j52K96k31K64J44o3j62L6K26k48Q5j20
7941DN8K97j42j95j59K02j51O1R4J70l87M5n9o6l0M40m07O1L16n50J08J95Q1k90
7965c04K20J83m60J33J77j69K38Ml47L12j61L48l88K83K00m0m26M2N54j15q6k48
7987e0K68l70K66j3K2k7K09m51J94p6J75j54J08m9O6J12j35k84K63n2K05K4q9
8010A62k45j58M03j04q4j79K98k79J93O7nj90J21k76L67j36lj19K58o6j21j51
8032b47J47m03O95n34J45K69L1J35l77m4q4K19k31J40K22l02K61J06n8J88Jk99
8054b0k3n5J15j04O0lJ20o7L3K27k24K24k15j10J73Q8j95k77Q7J40K97j44k75
8077a48k03K69o5J7L15k84P6o5J08N1k04q0J05l01N94l12j81N97o7k0M8l13j43
$$ y = [8, -123, -321, 99, -57, 98, 114, -41, -104, 217, -71, -223, 73, -158, 106, 250, 187, 25, 61, 287, 39, 124, 4, 62, 359, 217, 22, -137, 65, -86, -25, 69, 239, -148, -103, -162, -228, -258, 182, -225, -164, 152, -398, -290, -95, -14, -304, -84, 99, -361, -228, -51, -220, 18, 22, -325, -13, -174, 174, -214, 69, 269, 229, -197, -155, 399, 284, 198, -50, 218, -152, 114, 101, 123, 96, 305, -146, 48, -28, 147, -7, 101, 52, 118, 230, 95, -189, 74, 22, 227, 251, 162, -83, -241, 162, 58, -26, -205, 93, -186, 7, 74, 69, -121, 0, -276, 91, -45, -48, -167, 91, 25, -96, -247, -100, -503, 192, -342, -197, 72, 103, 238, -139, -183, -267, -48, -279, -139, 83, -219, 42, 148, 90, 278, 279, -20, -43, -98, 17, -87, -27, -30, 90, 23, 56, 283, 59, 283, 68, -42, 131, 219, 24, -253, -166, -26, 271, 127, -148, -351, -82, -147, -130, 185, -99, -23, -88, 20, 71, -133, -213, -108, -409, 185, -127, -308, 289, 222, 202, 250, -63, -206]
8100b06j61K87j6J08K06j40r3K21k91j3K39j76K27J02n2j99J87j74J75k10o0Q3
8122D4J3j06K13l02m8k89L94K39k62J57K89k77q8M2j89J4L73j90q8M68l83n2l8
8145f6qK15k73J62j20L39j28j88L02j46J36l11j22K23J13L4J06j71J1L2OP9j16
8168A09k80PL37j5O3l67R9j47J26O0k4p5J18q8j23J94j53J39m2J23o7K84k04
$$ y = [-206, -367, -80, -96, 12, 218, 78, -15, 206, -85, -98, 141, -35, 192, 294, 242, 43, 230, 56, 231, 21, -39, 44, 57, -49, 164, -138, -186, -475, -81, 158, -104, 53, 342, 65, -23, 19, -170, -156, 217, 27, -61, 407, 24, -28, -66, -74, 141, -132, 30, -90, 249, 121, -67, 235, 89, 225, -86, -208, 15, 128, 162, 268, 97, 108, 140, 146, 225, 109, -171, -164, 173, 158, 221, -146, -47, -194, -68, -8, -32, -107, 11, -77, -200, -6, -159, -20, -62, 61, -6, 278, 74]
8191G4
$$ Imaginary data points
##PAGE= N=2
##DATA TABLE= (X++(I..I)), XYDATA
0@%%%Qj6QqJ6k4L2m0M8o4Q0r5J19j41J65j97K32k71L15l64M23m87N56o34P23q18
29d34R25j045J173j317J476j644J833k041K268k518K791l090L424l792M196m648
45b443N156n726O378p122P983r000J0215j1700J3566j5985J9270k4025L1548m5335
59b7220P8896l08134n39252K52727K28044P2326r2006r6838k21308j30891J06549
70f77107K49709M7386j60947j63998M825Q1084J15889J25342L9382j60626j47475
81f46536J03655K51304J27884N760l6675p9894m9046J41727K49817J20752o7354
92A21394j03086j8351Q6675J53380J52428N3574r5214j45973R569J92067J68946
103E75409Q040q5617j06636q3675M9996J92467J25337r5333k07478j27799K5836
$$ y = [0, 0, 0, 0, 8, -8, 0, -8, 8, -16, 16, -24, 24, -40, 40, -55, 64, -77, 88, -109, 123, -148, 167, -197, 226, -261, 295, -339, 384, -434, 491, -554, 619, -698, 778, -866, 967, -1074, 1194, -1324, 1467, -1623, 1801, -1991, 2205, -2443, 2713, -3013, 3365, -3757, 4226, -4774, 5441, -6259, 7307, -8678, 10592, -13433, 18115, -27220, 51676, -256458, -795710, -542983, -314939, -242613, -334619, -431457, -652765, -783656, -677107, -427398, -380012, -540959, -704957, -700132, -619048, -503159, -377817, -338435, -499061, -646536, -542881, -291577, -163693, -157933, -194608, -274502, -323548, -181821, 67996, 188748, 121394, 18308, -43, 86632, 240012, 392440, 446014, 350800, 204827, 214396, 406463, 575409, 583449, 497832, 391196, 307521, 357517, 549984, 675321, 579988, 372510, 244711, 270547]
114B70547J31535J11274k4383j59516j85355q3842P1975J35463L4910j16594j80366
125E648j39830k1757J13636J18562m2109j82242j63387m6702P6972J32534M7257
136a01418j14168j73660q3855M7012J27380J05440j8837j35143j26818j674J32613
147c43128J59567M3002j02729j27152k6254R9458J66245J07002m9734j36683n5074
158b65480Q2942J47675J25304K3560j01702j16894J5687J48488J53606M6807p7611
169A82382j19380m0885Q4293J46725R9131k8732j32137j02240K6283J19634J13710
180C48784K5447r6641j51152o0467Q4559J31403N4051o6387j41386j07189J5594
191C6616J08894Q8688j6296j22850j43554m5190Q2536J15284L2167q8790j49580
$$ y = [270547, 402082, 513356, 488973, 329457, 144102, 60260, 132235, 267698, 302608, 186014, 5648, -134182, -155939, -42303, 76259, 34150, -148092, -311479, -358181, -281209, -148675, -101418, -215586, -389246, -473101, -426089, -298709, -193269, -212106, -347249, -474067, -475741, -343128, -183561, -140559, -243288, -370440, -396694, -297236, -130991, -23989, -73723, -210406, -265480, -182538, -34863, 90441, 114001, 12299, -104595, -88908, 59580, 213186, 259993, 182382, 63002, 22117, 106410, 253135, 352266, 323534, 191397, 89157, 115440, 235074, 348784, 374231, 277590, 126438, 65971, 150530, 281933, 335984, 269597, 128211, 21022, 36616, 145510, 234198, 217902, 95052, -48502, -93692, -11156, 104128, 136295, 47505, -102075]
202a02075r0314M4234J19855O9245m5102j26823j13851m569J04459J04485P605
213c2851q9583j18860n3400O7982J33109P0184n5736j22464p7985L7173J22510
224a19921J01170J100q5320r6266j8039R5075J32960N1888o0192j01459n2050
235a51054M9776J29166J02403j5078j06244q5204J8192J08865J09458K3940o8982
246A15238r7619m2702N9607J24887P3933m8283j13437p1006K4911J01156R6282
257B22967P68j03005j10674k0582P7999J02470L5033o5714j12551p0226K6280
268a7235J02770Q4134k8571j22467j02748m18Q4112R0476J6036q4097j18860m9831
280a46699N5374J03127N4686m6286j10123q0739J0951Q8722R1277O455r5945j08028
$$ y = [-102075, -192389, -148155, -28300, 40945, -4157, -130980, -244831, -249400, -144941, -40456, -32851, -122434, -241294, -294694, -226712, -93603, -23419, -79155, -201619, -279604, -242431, -119921, -18751, -17651, -102971, -199237, -217276, -122201, 10759, 62647, 2455, -99004, -151054, -101278, 27888, 130291, 115213, 8969, -76235, -58043, 50822, 160280, 184220, 115238, 17619, -25083, 34524, 159411, 233344, 185061, 71624, 618, 25529, 126685, 222967, 223735, 120730, 10056, -10526, 67473, 169943, 204976, 139262, 26711, -43515, -17235, 85535, 169669, 141098, 18631, -84117, -84535, -423, 90053, 106089, 21992, -96868, -146699, -91325, 11802, 66488, 20202, -89921, -170660, -159709, -70987, 20290, 26745, -69200, -177228]
292a77228j6817P8886R6111L7633m7920r7475o0811L3976J00786P9185r744q7440
304g0858q1825K998Q6003R7973K9380o2955r5937l0356O7440J01782N3159l0347
316F6457q5320o4682K3892R8663Q8567L540p9750q8513j3200P8349J00294L5138
328A63435n5036r6046n0277M2080R4406O3694j5949q1288q2615j2145P3791R0494
340A34544K3004o4972r8040m8895M1420R1002N4076l0983q9836p5830j076P3173
352G587P6669Q755p0100r4132m0484N0980R3205M1936m9714r5612n9453K4573
364a05790Q4603O4889j7041q3515p6350n343O9496Q2789J9802o0025q5906l7632
376a50023M6613R4131N4597l5954q7611n5816K2025P9179P4057P477o2893p6087
$$ y = [-177228, -194045, -115159, -19048, 18585, -29335, -126810, -187621, -153645, -52859, 26326, 16582, -70858, -152683, -149685, -63682, 34291, 63671, 716, -95221, -125577, -58137, 43645, 96804, 66457, -18863, -83545, -59653, 39010, 127577, 131117, 51367, -37146, -50346, 28003, 128297, 163435, 108399, 12353, -37924, 4156, 98562, 162256, 146307, 65019, -17596, -29741, 44050, 134544, 157548, 92576, -5464, -54359, -12939, 78063, 132139, 101156, 11320, -64510, -65586, 7587, 84256, 93011, 22911, -71221, -111705, -60725, 32480, 74416, 24702, -70910, -130363, -105790, -21187, 43702, 26661, -56854, -133204, -138547, -69051, 13738, 33540, -26485, -112391, -150023, -103410, -9279, 45318, 9364, -78247, -134063, -112038, -32859, 41198, 48675, -14218, -90305]
388i0305j9345N9592R2248M5735l9097q4112n0776K9022Q9545P6410m620p8204
400B6093p3805j386P0335Q4347L1269m9092q6419m5185L9260Q9949N9739k4313
412A20792q4425o5792Q213P2078P0933O830o7103p9660k1569M6746O7870K9884
424A04797l4131p5192n4854J3329O8745N6619j2735p3894o8429o607N0827O0119
436B8594J8537m3367p5967m4183K8328P2657M9834j9858p3078o5180j033O5595
448e9121P4894J5892o0724q1800k5665N3103Q1691M2049k7831p3923n5241J7164
460i9512Q0225P2684K749o5138o9618q629O1273Q1472L4435l9669p4903l5921
472f0552L8548P4593M7446r334n5528n7666n897O1226P5214J6936n4622p0807
$$ y = [-90305, -109650, -50058, 42190, 87925, 48828, -35284, -86060, -57038, 32507, 108917, 104297, 26093, -47712, -49098, 21237, 105584, 136853, 87761, 1342, -43843, -4583, 85366, 145105, 120792, 36367, -29425, -21212, 50866, 121799, 128629, 61526, -18134, -39703, 7043, 74913, 104797, 70666, -4526, -59380, -46051, 22694, 79313, 66578, -7316, -75745, -82352, -31525, 28594, 47131, 3764, -72203, -116386, -88058, -15401, 34433, 14575, -58503, -123683, -124716, -59121, 15773, 31665, -29059, -110859, -136524, -83421, -1730, 40319, 12488, -61435, -116676, -99512, -19287, 53397, 56146, -8992, -78610, -87239, -25966, 55506, 89941, 50272, -24631, -60552, -22004, 52589, 100035, 90701, 35173, -22493, -28390, 32836, 108050, 124986, 70364, -443]
484d43k2688L9801O5133L6861k3661p0075n6626J1399O6328N4185o285n8338o7349
497c1758k2873M5072P2493K3991n2001p9049l7204K8963O4379M1975j8016o8045
509c2073o2643q0O1100O1277L131n0704o3827k9309L3568P4147M2804l1927p0424
522f4960m1486J8741N8064N3112O759m6577o0179j8021M6080P1088L2738k9118
534B6241o0127l8635J8560O8025N8651o919o0244n0644J896M7342N8978K4732
546H7856l4619o5696l2192L4013O8202L9469k3952o2746m5607Q797N4233N6013
558H3771L072n6587o1838j1016M1662N5409K4671l0169o6222m3580J8395O1165
570A8733M6182j1866n9980n6320l424M7791N5783J5669m1055o4151k8675L0356
$$ y = [-443, -23131, 16670, 81803, 118664, 95003, 24928, -31698, -20299, 46029, 100214, 93929, 35591, -31758, -54631, -9559, 62934, 86925, 34924, -44125, -81329, -52366, 12013, 53988, 35972, -32073, -94716, -94796, -33696, 27581, 30712, -19992, -83819, -113128, -79560, -5413, 37391, 5464, -64960, -106446, -87705, -29641, 23471, 30230, -16347, -76526, -94547, -48467, 22621, 55359, 26241, -33886, -72521, -53961, 14064, 72715, 65796, 5552, -45092, -43196, 4146, 63124, 87856, 53237, -12459, -44651, -10638, 57564, 97033, 73081, 10335, -35272, -26475, 27758, 83771, 86843, 30256, -31582, -42598, -936, 54473, 79144, 48975, -17247, -60827, -42432, 18733, 64915, 53049, -6931, -63251, -66675, -18884, 36899, 52568, 11513, -52638, -81313, -50957]
582e0957N7720L6900j3782n7349n2724M410N9486N7654M140n0388n7540j2240
594g4670M0290N7126K8732k2168n7413m1167J8952O2162M6163n585m8488m9993
606d6059q445M5513O0001J7718l8242n6957k4544K8159N4439L4694j2131n1063
618C083m9518Q10N3403N1670K263m4975n1701j8942L1796N7427K7682k9139n6725
631b2866l4189J5398M7950M0200p99m4691n3513j2573M5553N9267J4603l8935
643A5405n2643k4386K2787N4452L8086j5578n2928l9205N351M3233M7611J3010
655E5195l5772n4713k2313L3924N8899K7523k6243n1394l3086J0584M9446M7077
667E9127k642m9508m5609l490L5040M6043K1671k7258n6356l2076K4015N3258
$$ y = [-50957, 6763, 43663, 29881, -27468, -80192, -75782, -16296, 41358, 45498, -4890, -62430, -74670, -34380, 22746, 51478, 29310, -28103, -69270, -50318, 11844, 58007, 52422, 3934, -46059, -54504, -8991, 51010, 68728, 30486, -26471, -51015, -22856, 31583, 66277, 54146, 3083, -46435, -45625, 7778, 59448, 61711, 16736, -34965, -53907, -22111, 35316, 62998, 33859, -22866, -57055, -41657, 6293, 46493, 45694, 1003, -52510, -65083, -19530, 39737, 54340, 15405, -37238, -61624, -38837, 15615, 53701, 38123, -14805, -54010, -48659, -5426, 42185, 55195, 19423, -35290, -57603, -23679, 35220, 62743, 36500, -14894, -47980, -37396, 12050, 59127, 56485, 6977, -38632, -42122, -7082, 38961, 60632, 33374, -22982, -55058, -31043, 22215]
679B2215L3224j4025m6346l9914l987L7525M9910J3545m0523n3667j7338K7009
691c2372M6173L0714j4340n3460m0901J2648M9558L7909k268l7141m3530j3737
703f0747L0283N1782K6189k6888n4417k8208K2269N0509L6818o386m9026m6055
715e3877N450N0152M4257L854l3140m2973j7916K8172N0394K8351j8108m8198
727c582l4665J0720M6755M0508J158m0675m6219q278L7561M4840J3787k3607m3301
740d998l1305J2644M6753L4654r178m2167l9913o558L4656M4199J1922l2764m8561
753c0616k1793K1883M3453K5532j4011m3193l9501J979M3957M2283k582l9277
765a1886l9949j2037K6150M5711K1246k5296m5284k2630J5435L8895L1709j386
$$ y = [22215, 55439, 41414, -4932, -44846, -48833, -11308, 38602, 52147, 11624, -42043, -59381, -32372, 13801, 44515, 30175, -23285, -64186, -51538, -1980, 35929, 33661, -3480, -47010, -60747, -30464, 21318, 47507, 20619, -33798, -62006, -39737, 10772, 47590, 41204, -7822, -53877, -48427, 1725, 45982, 49836, 16696, -26277, -44193, -16021, 34373, 62724, 44616, -3582, -38247, -27527, 19228, 59736, 60894, 20219, -26000, -34278, 3283, 48123, 61910, 38303, -4998, -36303, -23659, 23094, 57748, 48570, 6403, -33510, -40068, -5412, 38787, 50709, 17945, -30616, -52409, -30526, 12927, 38459, 24448, -18745, -58246, -56267, -12310, 29973, 27391, -11886, -51835, -63872, -37722, 7989, 29235, 3939, -41345, -63975, -48540, -9645, 22064, 20678]
777B0678l4403m0251p768L8791M9360J0170l3824l9004j3517J9456M3414L4295
789D7397j0442m5009l2490Q662L9515M0623R349l1665m5924j6230L2086N3701
801D9573K4690k6455m7588k3189J4158L8982L6971L45m2518m3122j321L5022L7828
814E3376J1380k5937m5149k3710J9331M2095K5019j6763m4708l0803O212K8996
826f61K8544O901k8458m4282j7280K5366L6967J5702j7352m0427l0132R365L8069
839a7678L0526k759l4057l8012o120L1285L8577J4345k0664m1102k3807K0654
851d8812M5933K7772q745l5610l3013L666M1864L9314M126k6390l3401j3535K2733
864a4098M4030K6009j3895l8231k6866J1007M1173L2257k352k9968l4242r349
$$ y = [20678, -13725, -53976, -61744, -22953, 26407, 36577, 2753, -36251, -49768, -30312, 13102, 47397, 36955, -8054, -40544, -31882, 7633, 48256, 57605, 25940, -19984, -36214, -4128, 49573, 74263, 47808, 220, -22969, -8811, 30171, 67142, 67487, 24969, -18153, -19474, 15548, 53376, 64756, 38819, -6330, -30040, -10709, 31386, 56405, 39642, -5066, -35869, -29657, -661, 27883, 34784, 6326, -37956, -55236, -29870, 7097, 22799, 5447, -34980, -65112, -55747, -17678, 12848, 10089, -23968, -61980, -68100, -36815, 1762, 16107, -4557, -45659, -69466, -48812, -2879, 24893, 16148, -19462, -52475, -48809, -6945, 32369, 36495, 10105, -23296, -36831, -14098, 29932, 55941, 42046, 3815, -23051, -12044, 29129, 61386, 59034, 29066, -5176, -14525]
876a4525K8651M1978J1954k4276l4933k1412P085L5982L3075p853m1705l5858
888b1837q70L0801L3405L669k9120l8073j8101J6850L9762K0932k2296m1064k4039
901d9981M241K9039L3931K903l7787m0734l553L1239L3933R220k1093l3576j9109
914f1327J1326L5619L2616n068l8174k9185N836K9327L2867J4979k0803l9155
926c1142j4101K5780L8678J9393j0394l0640k3281O107L1973L4701P310l0003
938B4381l7779n553K8786L4267J4600j5978l7194k3933J4260L6783K3479p328
950D8791l1796l1060m025K6796L1428Q016k4967l9891j8375K1035L5501J4306
962C5759j4909l1965k7446j61K9672K9971J177k8565l4030j1001K2470L3515J3871
$$ y = [-14525, 14126, 56104, 68058, 43782, 8849, -12563, -5478, 30504, 63579, 55726, 14021, -21837, -22707, 8094, 41499, 45168, 16048, -22025, -40126, -23276, 16486, 37418, 15122, -25942, -49981, -45740, -16701, 17230, 20133, -17654, -58388, -61941, -30702, 3231, 12451, -8642, -42218, -61327, -50001, -14382, 18234, 13166, -25008, -54193, -48357, -19030, 13837, 28816, 8013, -31142, -45243, -19463, 19215, 38608, 28214, -2426, -25707, -19600, 12373, 47074, 54384, 24381, -13398, -18951, 9835, 44102, 58702, 42724, 5530, -18403, -4143, 32640, 56119, 48791, 16995, -14065, -18090, 8706, 40134, 48150, 23183, -16708, -35083, -14048, 21453, 35759, 20850, -11115, -38561, -38722, -9050, 20921, 22098, -6467, -40497, -51498, -29028, 4487, 18358]
975A8358j5647l3106k3982J0052L6870K5861p721k8518k4037l568K2683L4489
987A1734J3795k0390l3298j4749J7666L6152K1297j0302l0186k3716M017L1809
999C829L2985J951k6949k7707p169J7437L2785K0184j3783l5274k1815J0979L3250
1012B0703K5620n921l0340k7074k405K3793L1463J0583k3012l5249j5342J4837
1024a2344L0130K1396q003l3899k7312L532K9148K6794J735k6634l1921q508J9791
1037a6095K9142J5118j2581l1772k3026P672K9372K4748j669k8556k9115j602
1049c8364K4514K7795Q577j7547l0956j5463J5331L0643J9355p194k7132k5485
1061c5926L48K8470K9159L424k3949k9308o539K0887K9052J2540j1788k6734k0960
$$ y = [18358, 2711, -30395, -54377, -44325, -7455, 18406, 10685, -17833, -41870, -45438, -22755, 11734, 25529, 5139, -28159, -42908, -25242, 10910, 32207, 21905, -8281, -31997, -27980, 3829, 36814, 38765, 11816, -15891, -23060, -5623, 27162, 47346, 33563, -1711, -23526, -12547, 20703, 46323, 40402, 10062, -17012, -19417, 4376, 35839, 46422, 23410, -11839, -27181, -12344, 17786, 39182, 31179, -2720, -30032, -26500, 2648, 29442, 31177, 4543, -27378, -35886, -16095, 13047, 28165, 15584, -16188, -39214, -31542, -2170, 22578, 20909, -7647, -36762, -38364, -13850, 13945, 22522, 4975, -25981, -41444, -26113, 4530, 23885, 16691, -10441, -35926, -35578, -7108, 22051, 25475, 1526, -27782, -34321, -13434, 15618, 28158, 16370, -10364, -31324]
1074c1324P095L1248K4711l001k4692k5543m943K2480L0628J1536j7470k9704
1086h979j4646J3383K8369J8196n444k3654k3200k946K4250L0853N798k4238k9764
1099a2022r324J6577K8684J5540j2114k9475k1093N697K7549K3082l402k6138
1111C561k5500o349J7752K9515J1626k0832l3519j3999J3842K6617J6025p014
1123A1725k5656k3955q24K2308K5805M444k1907k6889q497J5233K6411J7444r940
1136E702k9820j9109J0021K7176K1015M67j9649k3506n934J9915L0129J4210j4922
1149A5695k8002j2808J4396K7973J9649l923k4690k2531L029K6098K4669L606
1161D3161j7382k4373j0606J4563K7313J4595j0673k7948j9037O543K4461J8656
$$ y = [-31324, -24229, 7019, 31730, 28729, 4037, -21506, -26449, -3969, 26659, 38195, 20725, -8979, -23625, -10242, 18127, 36323, 30879, 7225, -15975, -18921, 5329, 36182, 41980, 17742, -12022, -21346, -4769, 23915, 39455, 27341, -2134, -23227, -17530, 10019, 33101, 29699, 3561, -21939, -28288, -10536, 18979, 30605, 9773, -23746, -37745, -23903, 2714, 18739, 11725, -13931, -37886, -38710, -16402, 9403, 13847, -8060, -34949, -43446, -28213, -1802, 15642, 5702, -24118, -43227, -33206, -6030, 14985, 15452, -4197, -27703, -33637, -13722, 16407, 30617, 15695, -12307, -25115, -10719, 17254, 36903, 32980, 8290, -14241, -11212, 14886, 39555, 43161, 25779, 1406, -9200, 5363, 32676, 47271, 36598, 8650, -10387, -3844, 20617, 39273]
1173C9273k541k1972k4033p318J5966K3628Q426j4531k7219j8303N981K4448J7852
1186A9657o126k5265k4337k743K0631K3905L258j9384k5300j1828J1335K5943
1198a0254J6947q104k6089j9904L983K5976K4004k43k0273k1042m178J8299K7473
1211F595J1856j3536k2540r867J0313K4558K0755j025k1543k0489J088K3493K5101
1224C4759N870j7148k1477o938J2096K3833J6424p221k5190j8630M159K1614K0812
$$ y = [39273, 36732, 14760, -9273, -16591, -625, 23003, 31429, 16898, -10321, -28624, -22643, 1805, 19657, 13531, -11734, -36071, -38814, -18183, 5722, 8980, -10404, -35704, -47532, -36197, -10254, 6693, -1411, -27500, -47404, -43421, -17445, 6559, 6316, -13957, -34999, -39177, -20878, 6595, 18451, 4915, -17625, -27492, -17179, 7379, 28134, 27109, 5566, -14923, -13835, 9658, 34759, 40629, 23481, 2004, -4934, 7162, 30995, 47419, 40198, 15008, -3622, 537, 22151, 42963]
$$ [...]
8191a03
##END NTUPLES=NMR FID
##END=
