##TITLE=1H_PR173_K2
 D2O, 8 sc, 
 28.6.2019
##JCAMPDX= 6.0         $$ Bruker NMR JCAMP-DX V2.0
##DATA TYPE= NMR FID
##DATA CLASS= NTUPLES
##ORIGIN= UXNMR, Bruker Analytische Messtechnik GmbH
##OWNER= root
$$ XWIN-NMR		Version 3.5
$$ Fri Jun 28 14:30:50 2019 Russian Standard Time (UT+4h)  she@DPX200
##.OBSERVE FREQUENCY= 200.13155
##.OBSERVE NUCLEUS= ^1H
##.DELAY= (6, 6)
##.ACQUISITION MODE= SIMULTANEOUS
##.ACQUISITION SCHEME= undefined
##.AVERAGES= 8
##.DIGITISER RES= 18
##SPECTROMETER/DATA SYSTEM= spect
##.PULSE SEQUENCE= zg30
##.SOLVENT NAME= D2O
##.SHIFT REFERENCE= (INTERNAL, D2O, 0, 15.7039)
##AUDIT TRAIL= $$ (NUMBER, WHEN, WHO, WHERE, WHAT)
$$ ##TITLE= Audit trail, XWIN-NMR		Version 3.5
$$ ##JCAMPDX= 5.01
$$ ##ORIGIN= Bruker BioSpin GmbH
$$ ##OWNER= she
$$ F:/spectra/data/she/nmr/H-F/1/audita.txt
$$ ##AUDIT TRAIL=  $$ (NUMBER, WHEN, WHO, WHERE, WHAT)
(   1,<2019-06-28 14:29:53.54 +0400>,<she>,<DPX200>,
      <created by zg, POWCHK disabled, PULCHK disabled
       configuration hash MD5:
       00 E9 B6 7A A2 85 ED C7 34 08 36 98 17 FE 4E 26
       data hash MD5: 16K
       1E 96 89 0E 07 7A 35 05 74 DA 43 C5 C3 6C FA 94>)
$$ ##END=
$$ 
$$ hash MD5
$$ 46 ED A4 0B 94 E8 B5 5C A3 61 60 05 D8 13 F9 4C
##$RELAX= 
##$RELAX= 
##$RELAX= 
##$RELAX= 
##$RELAX= 
##$RELAX= 
$$ Bruker specific parameters
$$ --------------------------
##$DU= <F:/spectra>
##$EXPNO= 1
##$NAME= <H-F>
##$PROCNO= 1
##$TYPE= <nmr>
##$USER= <she>
##$AMP= (0..31)
100 100 100 100 100 100 100 100 100 100 100 100 100 100 100 100 100 100 
100 100 100 100 100 100 100 100 100 100 100 100 100 100 
##$AQSEQ= 0
##$AQ_mod= 1
##$AUNM= <au_zg>
##$AUTOPOS= <>
##$BF1= 200.13
##$BF2= 200.13
##$BF3= 200.13
##$BF4= 200.13
##$BF5= 200.13
##$BF6= 200.13
##$BF7= 200.13
##$BF8= 200.13
##$BYTORDA= 1
##$CFDGTYP= 0
##$CFRGTYP= 5
##$CHEMSTR= <none>
##$CNST= (0..31)
1 1 145 1 1 1 1 1 1 1 1 1 1 1 1 1 1 1 1 1 1 1 1 1 1 1 1 1 1 1 1 1 
##$CPDPRG= <>
##$CPDPRG1= <>
##$CPDPRG2= <>
##$CPDPRG3= <>
##$CPDPRG4= <mlev>
##$CPDPRG5= <mlev>
##$CPDPRG6= <mlev>
##$CPDPRG7= <mlev>
##$CPDPRG8= <mlev>
##$CPDPRGB= <>
##$CPDPRGT= <>
##$D= (0..31)
0 1.2 0 0 0 0 0 0 0 0 0 0.03 0 0 0 0 0 0 0 0 0 0 0 0 0 0 0 0 0 0 0 0 
##$DATE= 1561717792
##$DBL= (0..7)
120 120 120 120 120 120 120 120 
##$DBP= (0..7)
150 150 150 150 150 150 150 150 
##$DBP07= 0
##$DBPNAM0= <>
##$DBPNAM1= <>
##$DBPNAM2= <>
##$DBPNAM3= <>
##$DBPNAM4= <>
##$DBPNAM5= <>
##$DBPNAM6= <>
##$DBPNAM7= <>
##$DBPOAL= (0..7)
0.5 0.5 0.5 0.5 0.5 0.5 0.5 0.5 
##$DBPOFFS= (0..7)
0 0 0 0 0 0 0 0 
##$DE= 6
##$DECBNUC= <off>
##$DECIM= 24
##$DECNUC= <off>
##$DECSTAT= 4
##$DIGMOD= 1
##$DIGTYP= 9
##$DL= (0..7)
0 120 120 120 120 120 120 120 
##$DP= (0..7)
150 150 150 150 150 150 150 150 
##$DP07= 0
##$DPNAME0= <>
##$DPNAME1= <>
##$DPNAME2= <>
##$DPNAME3= <>
##$DPNAME4= <>
##$DPNAME5= <>
##$DPNAME6= <>
##$DPNAME7= <>
##$DPOAL= (0..7)
0.5 0.5 0.5 0.5 0.5 0.5 0.5 0.5 
##$DPOFFS= (0..7)
0 0 0 0 0 0 0 0 
##$DQDMODE= 0
##$DR= 18
##$DS= 0
##$DSLIST= <SSSSSSSSSSSSSSS>
##$DSPFIRM= 0
$$ [...]
##$SUBNAM2= <"">
##$SUBNAM3= <"">
##$SUBNAM4= <"">
##$SUBNAM5= <"">
##$SUBNAM6= <"">
##$SUBNAM7= <"">
##$SUBNAM8= <"">
##$SUBNAM9= <"">
##$SW= 24.9336996594482
##$SWIBOX= (0..15)
0 0 2 0 0 0 0 0 0 0 0 0 0 0 0 0 
##$SW_h= 4990.01996007984
##$TD= 16384
##$TD0= 1
##$TE= 0
##$TE2= 300
##$TE3= 300
##$TEG= 300
##$TL= (0..7)
0 120 120 120 120 120 120 120 
##$TP= (0..7)
150 150 150 150 150 150 150 150 
##$TP07= 0
##$TPNAME0= <>
##$TPNAME1= <>
##$TPNAME2= <>
##$TPNAME3= <>
##$TPNAME4= <>
##$TPNAME5= <>
##$TPNAME6= <>
##$TPNAME7= <>
##$TPOAL= (0..7)
0.5 0.5 0.5 0.5 0.5 0.5 0.5 0.5 
##$TPOFFS= (0..7)
0 0 0 0 0 0 0 0 
##$TUNHIN= 0
##$TUNHOUT= 0
##$TUNXOUT= 0
##$USERA1= <user>
##$USERA2= <user>
##$USERA3= <user>
##$USERA4= <user>
##$USERA5= <user>
##$V9= 5
##$VALIST= <valist>
##$VCLIST= <CCCCCCCCCCCCCCC>
##$VD= 0
##$VDLIST= <DDDDDDDDDDDDDDD>
##$VPLIST= <PPPPPPPPPPPPPPP>
##$VTLIST= <TTTTTTTTTTTTTTT>
##$WBST= 1024
##$WBSW= 4
##$XGAIN= (0..3)
0 0 0 0 
##$XL= 0
##$YL= 0
##$YMAX_a= 245638
##$YMIN_a= -349551
##$ZGOPTNS= <>
##$ZL1= 120
##$ZL2= 120
##$ZL3= 120
##$ZL4= 120
##$ABSF1= 10
##$ABSF2= 0
##$ABSG= 5
##$ABSL= 3
##$ALPHA= 0
##$AQORDER= 0
##$ASSFAC= 0
##$ASSFACI= 0
##$ASSFACX= 0
##$ASSWID= 0
##$AUNMP= <proc_1d>
##$AZFE= 0.1
##$AZFW= 0.1
##$BCFW= 1
##$BC_mod= 2
##$BYTORDP= 1
##$COROFFS= 0
##$CY= 11.3945322036743
##$DATMOD= 1
##$DC= 2
##$DFILT= <>
##$DTYPP= 0
##$F1P= 18.9103706918063
##$F2P= -1.10871071338519
##$FCOR= 0.5
##$FTSIZE= 0
##$FT_mod= 4
##$GAMMA= 1
##$GB= 0.15
##$INTBC= 1
##$INTSCL= 1
##$ISEN= 128
##$LB= 0.24
##$LEV0= 0
##$LPBIN= 0
##$MAXI= 10000
##$MC2= 0
##$MEAN= 0
##$ME_mod= 0
##$MI= 1.114404
##$NCOEF= 0
##$NC_proc= 0
##$NLEV= 6
##$NOISF1= 3.799351
##$NOISF2= 2.8
##$NSP= 1
##$NTH_PI= 0
##$NZP= 0
##$OFFSET= 15.70392
##$PC= 1
##$PHC0= -8503.96
##$PHC1= 13.00098
##$PH_mod= 1
##$PKNL= yes
##$PPARMOD= 0
##$PSCAL= 0
##$PSIGN= 0
##$REVERSE= no
##$SF= 200.130013532006
##$SI= 16384
##$SIGF1= 3
##$SIGF2= 2
##$SINO= 400
##$SIOLD= 16384
##$SREGLST= <1H.CDCl3>
##$SSB= 0
##$STSI= 0
##$STSR= 0
##$SW_p= 3612.71676300578
##$SYMM= 0
##$S_DEV= 0
##$TDeff= 0
##$TDoff= 0
##$TI= <>
##$TILT= no
##$TM1= 0
##$TM2= 0
##$TOPLEV= 0
##$USERP1= <user>
##$USERP2= <user>
##$USERP3= <user>
##$USERP4= <user>
##$USERP5= <user>
##$WDW= 1
##$XDIM= 8192
##$YMAX_p= 0
##$YMIN_p= 0
$$ End of Bruker specific parameters
$$ ---------------------------------
##NTUPLES= NMR FID
##VAR_NAME=  TIME,          FID/REAL,        FID/IMAG
##SYMBOL=    X,             R,               I
##VAR_TYPE=  INDEPENDENT,   DEPENDENT,       DEPENDENT
##VAR_FORM=  AFFN,          ASDF,            ASDF
##VAR_DIM=   8192,          8192,            8192
##UNITS=     SECONDS,       ARBITRARY UNITS, ARBITRARY UNITS
##FACTOR=    0.0002004,     1,               1
##FIRST=     0,             0,               0
##LAST=      1.6414764,     0,               0
##MIN=       0,             -349551,         0
##MAX=       1.6414764,     245638,          0
$$ Real data points
##PAGE= N=1
##DATA TABLE= (X++(R..R)), XYDATA
$$ [...]
82 -38782 -13737 22875 140444 193935 31694 -177962 -183796 -28611 38630 -4065 33718 167881
94 167881 159381 -64568 -241409 -156372 41825 103445 47721 52230 107155 51720 -115943 -198401
106 -198401 -94914 66978 134601 110742 61921 -520 -79657 -124686 -93286 -12205 66897
117 66897 123732 129389 45406 -92281 -163915 -104312 7916 68043 78287 89469 76679 -12903
129 -12903 -130435 -155680 -58687 63738 118919 103150 50693 -22118 -90927 -114162 -75386 -1372
141 -1372 77057 130785 114016 5803 -118409 -142688 -58840 25914 49374 65872 105389 85936
153 85936 -44810 -168122 -137717 7110 98287 82957 54856 56204 11653 -97280 -153028
164 -153028 -69838 62683 115005 86442 47637 2067 -77213 -133757 -86968 27879 95752
175 95752 86609 61679 33378 -44259 -137417 -128858 -106 111602 102719 40649 18309 -1248
187 -1248 -79398 -142296 -75068 76131 145147 82129 -747 -27649 -48816 -97251 -94695 8547
199 8547 119736 124032 41500 -29988 -62951 -88001 -87577 -16184 86293 121398 65940 -7840
211 -7840 -49700 -79831 -95272 -46194 60226 127091 88120 -23 -52143 -66242 -77927 -62837
223 -62837 15992 108130 117287 35032 -50172 -80022 -75070 -56387 -2930 77045 113895 66171
235 66171 -20315 -75576 -85281 -66567 -16706 60046 109293 80210 -391 -62936 -79647 -69701
247 -69701 -35047 34722 101831 99754 22755 -56717 -82731 -68075 -39173 12651 80197 107161
259 107161 53950 -35380 -85217 -78824 -45668 244 60643 101096 73790 -8996 -76066 -84655
271 -84655 -54992 -12600 41312 90600 86585 15620 -64370 -88927 -61616 -19026 26320 74583
283 74583 91584 42566 -43233 -91855 -74804 -27019 19408 61318 87106 61916 -14659 -82279
295 -82279 -86554 -41411 10430 51788 80128 70983 9951 -64730 -91172 -56162 -723 43227
307 43227 71847 74002 29098 -45799 -90717 -71787 -14528 35093 65172 74056 43823 -24431
319 -24431 -83820 -84857 -32667 24268 59215 71685 54002 -2057 -68064 -89950 -49822 12133
331 12133 53571 68968 59220 15833 -48830 -87548 -64687 -2275 48512 67756 61745 29339
343 29339 -29193 -80329 -78035 -21598 39334 67093 63505 37730 -11328 -66437 -84451 -42777
355 -42777 23206 63430 64660 41901 1220 -51054 -81980 -58932 4738 57245 68768 46901
367 46901 9768 -37572 -74848 -68996 -14536 47338 72409 56068 19190 -24582 -64286 -73279
379 -73279 -33361 30796 71290 65264 29516 -13817 -53557 -71300 -46890 11898 62900 71136
391 71136 40200 -4286 -44970 -68879 -55755 -5398 50748 72390 50696 6938 -36586 -65213
403 -65213 -63237 -22151 36015 70295 59341 19050 -25449 -57889 -65664 -36678 19587 64348
415 64348 66419 30488 -15081 -50336 -64007 -45310 4007 55014 70365 42403 -4338 -43189
427 -43189 -61824 -51801 -10456 42668 70752 53216 8073 -34883 -58300 -56078 -24179 27493
439 27493 66350 62335 20780 -26073 -54187 -57318 -34497 11773 57255 67735 34240 -16431
451 -16431 -50857 -57836 -40231 -1558 44965 68237 48103 -1960 -45578 -59932 -46126 -11750
463 -11750 32191 63551 57156 14434 -34355 -59363 -51822 -21408 20858 56629 61348 27485 -22402
476 -22402 -54690 -55420 -29972 9358 47764 63284 39811 -9640 -50225 -58745 -37042 -438 37662
489 37662 60151 49415 6210 -40359 -60612 -45818 -9469 29762 55938 53477 18870 -28581
501 -28581 -56679 -52106 -20653 19265 51141 57739 29847 -17921 -53553 -55179 -28269 8800 42208
514 42208 57002 41255 -2492 -47199 -60624 -37321 1594 35629 52999 46433 12300 -33591
526 -33591 -59858 -48537 -10143 29067 51543 49448 21520 -21421 -54048 -53493 -21392 18861 47045
539 47045 51821 31095 -9616 -47859 -57787 -31875 9982 41666 51253 36981 2589 -36645 -58246
552 -58246 -43509 -2614 36335 52458 40615 10574 -26736 -52387 -49059 -15703 26133 50933
564 50933 47014 19381 -18161 -47890 -51315 -25213 15914 46526 50857 29059 -7753 -41171 -52992
577 -52992 -34597 4395 40430 53066 36927 1977 -33950 -51787 -41126 -6873 30452 50755
589 50755 43325 12749 -25422 -50727 -47290 -16414 22427 46625 45062 20885 -14692 -44476 -51401
602 -51401 -28417 11906 44340 49652 28645 -6433 -37514 -49939 -35213 -8 35666 50657
614 50657 37620 5441 -30262 -50015 -41027 -7852 28769 47515 40315 14035 -19042 -44329
626 -44329 -47054 -21198 19849 48376 45961 18639 -14604 -38452 -45192 -29830 4050 39638 51749
639 51749 31671 -6293 -38575 -47183 -32030 -1354 29911 45459 37680 8427 -26912 -49061
651 -49061 -42599 -10445 27286 47681 39106 12020 -18102 -39206 -43149 -23731 12597 45444 50354
664 50354 22841 -14711 -39638 -42176 -25557 3155 32935 46904 34512 677 -33665 -48403
676 -48403 -35309 -2077 30872 44756 33664 6122 -22175 -40467 -41205 -18361 19860 48773
688 48773 44857 12045 -23205 -39107 -35216 -20257 4596 34496 49750 31519 -10560 -42673
700 -42673 -44429 -21858 6015 28203 40494 33870 5508 -29540 -46516 -35235 -4343 27238
712 27238 44213 37160 8669 -24554 -42086 -35247 -12944 13715 36607 44293 24520 -15547 -46347
725 -46347 -43994 -14474 14255 29630 34566 29126 3932 -32685 -51708 -33120 7803 36357 38815
738 38815 23772 3926 -19520 -39833 -39482 -11091 26536 45598 35804 8407 -19935 -38296 -37327
751 -37327 -15629 15480 37758 37950 19287 -8779 -34351 -43965 -26251 9979 38953 40301 19036
764 19036 -5413 -24032 -35724 -33584 -8455 29485 49369 33147 -2880 -29346 -34601 -26706 -11362
777 -11362 13254 38558 43071 16439 -22223 -42775 -35083 -11538 13436 31562 36956 22655 -7245
790 -7245 -34332 -40916 -23756 5950 31340 40431 26594 -2830 -30253 -38555 -25852 -2601 20910
803 20910 36816 35540 11276 -24187 -44297 -33969 -4150 20691 31674 30404 17977 -7725
815 -7725 -35623 -43439 -19891 16454 37771 34181 15369 -5682 -25519 -36566 -28437 475 31391
828 31391 41499 25768 -2925 -26639 -35842 -28454 -5686 21761 37679 31808 8220 -18879 -36035
841 -36035 -34453 -13006 16881 37427 34614 12053 -13900 -30212 -32559 -20817 4655 32061 41599
854 41599 23171 -9609 -32095 -33563 -19443 101 21434 36335 32124 4758 -27584 -40322
866 -40322 -27326 -1966 20012 31955 30500 12957 -15474 -37113 -34865 -11778 15466 32070
878 32070 32525 16706 -9356 -32289 -36172 -18307 8502 27823 33620 23015 -987 -26860 -38848
891 -38848 -25403 3113 26421 32752 24328 5986 -17763 -35711 -32896 -7944 22594 35803 27853
904 27853 8240 -13014 -29617 -33231 -16691 12326 33643 33942 14568 -9977 -28122 -32906 -21015
917 -21015 4361 27988 35263 22153 -2786 -24659 -33957 -25703 -2565 23139 35226 26552 3912
930 3912 -19368 -32300 -28797 -9711 16397 33887 31624 11141 -14174 -30857 -30659 -14687 9616
943 9616 29511 33430 17862 -7061 -27958 -33082 -20466 3668 25681 33157 22183 -352 -22633
956 -22633 -33221 -26102 -3953 21181 33399 26311 5262 -17533 -30656 -28804 -10555 14436 32033
969 32033 30430 11257 -12745 -28515 -30069 -16096 7865 28420 33540 17603 -6652 -25842 -30744
982 -30744 -20803 965 23391 33835 23577 -333 -22139 -30715 -24080 -5295 17248 32627 28335
995 28335 7057 -17900 -30458 -26782 -10332 11122 28549 31369 14107 -11619 -28969 -29062 -15133
1008 -15133 5894 24632 31680 20400 -4123 -25573 -30963 -19349 882 20330 31031 24592
1020 24592 3317 -20556 -31367 -23713 -4307 16082 28975 27336 9551 -14571 -30266 -27774
1032 -27774 -10076 11243 26670 28666 14994 -8768 -27587 -29724 -15435 5776 23373 29300
1044 29300 19889 -1890 -23467 -30610 -20139 501 19466 28773 24063 4791 -18736 -30936 -24316
1057 -24316 -4515 15389 27498 26133 11095 -12337 -29237 -28139 -10890 11089 25614 27162
1069 27162 15692 -5439 -25699 -30626 -16527 5615 22486 27381 19274 675 -20864 -31103
1081 -31103 -22195 -45 19423 27156 21919 6437 -14685 -29568 -26752 -6579 15706 26755 23770
1094 23770 10361 -8538 -25682 -29129 -13494 10566 26105 25977 13802 -4171 -21386 -29191 -19600
1107 -19600 3328 23442 27816 17207 38 -17656 -27466 -23162 -3563 18941 28928 21698 4460
1120 4460 -13568 -25865 -25416 -9640 13007 27442 24744 9608 -8927 -23167 -26580 -15569 7011
1133 7011 25471 27601 13739 -4843 -19811 -26170 -18915 -201 20966 29026 19004 -36 -17364
1146 -17364 -25818 -21515 -5193 15394 27336 22663 5728 -12981 -24840 -24625 -10688 10938 26392
1159 26392 25236 9566 -8811 -21644 -24526 -15682 4034 23820 28349 14807 -5264 -20034 -23837
1172 -23837 -17386 -1706 17719 28239 20473 842 -17268 -25081 -20131 -5432 13761 26563 23205
1185 23205 5761 -12943 -23078 -22421 -11237 8007 25143 27075 10771 -10150 -22324 -21831 -13441
1198 -13441 1201 19149 27998 18530 -4531 -22453 -24586 -14972 -1002 14448 25139 22294 3875
1211 3875 -17211 -26029 -19451 -4646 11301 23702 24220 8771 -12525 -24448 -21558 -8501 5983
1224 5983 19978 26045 15465 -7120 -24768 -24121 -10643 4633 16116 22648 19070 1727 -19991
1237 -19991 -28034 -16969 1705 15617 22124 19126 5842 -13282 -25824 -21482 -4796 12350 22282
1250 22282 21553 9849 -9047 -24094 -23563 -8491 8602 19394 21649 14510 -2267 -21061 -26832
1263 -26832 -14611 5814 19197 21436 15012 1902 -14611 -25563 -20290 -1950 16623 24082 18240
1276 18240 4720 -11602 -22943 -21478 -7058 10777 21991 21303 9759 -7493 -22255 -23905 -10428
1289 -10428 7992 19940 20987 12877 -1914 -17424 -24833 -16474 2754 19127 23053 14813 1004
1302 1004 -14078 -22660 -19158 -3249 14431 22968 18811 5283 -11156 -22435 -21579 -7217 11018
1315 11018 21169 19667 9076 -5394 -19358 -24159 -13242 6685 21354 21472 11156 -2175 -15200
1328 -15200 -22698 -17607 -122 17960 23505 15113 592 -12782 -21164 -19689 -5489 13602 23374
1341 23374 18322 4149 -9923 -18908 -20830 -10344 8228 22562 21306 7762 -7213 -16805 -20025
1354 -20025 -14196 2463 19112 23683 12540 -3771 -15570 -19757 -15825 -2434 14818 23945 17108
1367 17108 85 -13963 -19178 -16778 -6837 9484 23065 21209 5586 -11675 -19503 -17413 -8853
1380 -8853 4751 18750 22750 11732 -7458 -19274 -19559 -11310 1796 15529 22097 15221 -2109
1393 -2109 -16674 -20649 -14376 -2187 12324 22076 18760 2538 -14240 -20871 -15420 -4581 7786
1406 7786 18800 21005 9142 -9927 -21648 -18748 -6766 5868 16290 19615 13118 -3011 -17959
1419 -17959 -21762 -11866 2916 15669 20542 14420 -227 -14640 -20493 -14262 -2392 11040 19821
1432 19821 18342 5198 -12530 -21145 -16632 -3594 8446 16377 17870 10082 -5888 -19922 -21082
1445 -21082 -8604 7431 16793 17777 10537 -2252 -14945 -20451 -13470 1383 15046 20217 14795
1458 14795 402 -13894 -20339 -14252 -1561 10557 18110 16892 6860 -9602 -21188 -18549 -4499
1471 -4499 9836 16870 15837 8215 -3639 -16385 -20598 -11592 5368 17920 18445 10254 -2536 -14039
1485 -14039 -19026 -12929 685 13269 19014 14668 2543 -12368 -20172 -15535 -1555 11798 17091
1498 17091 14731 6448 -6319 -17957 -19567 -7796 9290 18642 16455 6745 -4977 -14612 -18167
1511 -18167 -12134 2732 16338 19231 11186 -2255 -13788 -18107 -13130 -93 12528 18203 13800
1524 13800 2741 -10186 -18814 -17085 -4199 11157 18617 14684 4459 -6759 -14965 -17649 -9527
1537 -9527 6080 18419 18338 7737 -5392 -14102 -16369 -11004 1398 14167 18982 11995 -1277 -13166
1551 -13166 -17616 -13169 -1140 11729 18503 13801 1856 -9976 -16528 -15589 -5659 8063 18234
1564 18234 16703 5099 -7977 -15256 -15231 -8211 3996 15627 18474 9758 -5098 -15029 -16097 -9745
1578 -9745 1131 12615 17982 12741 -94 -12654 -17229 -12658 -1925 10204 17453 14613 3056
1591 3056 -10215 -16534 -14576 -4984 6873 16043 16601 7223 -6683 -16214 -15409 -7332 4253 13568
1605 13568 16790 10400 -2931 -14384 -17142 -10347 1516 12053 16578 12294 1033 -11309 -17085
1618 -17085 -12891 -1987 9501 16470 14418 4259 -8705 -16326 -14907 -5191 6500 14988 15690 7535
1632 7535 -5440 -15240 -16268 -7936 3771 13251 16232 10131 -1847 -13041 -16655 -10612 833 10905
1646 10905 15953 12239 1735 -10461 -16764 -12784 -2207 8975 15685 13940 4550 -7487 -15814
1659 -15814 -14888 -5035 6155 14320 15128 7962 -4211 -14579 -16490 -8638 3402 12735 15035 10028
1673 10028 -864 -12105 -16408 -11111 460 10876 15358 11968 2354 -8773 -15828 -13317 -3267
1686 -3267 8805 15411 13124 4960 -6402 -14624 -14989 -6547 5739 14240 14293 7079 -3204 -12724 -15726
1701 -15726 -9477 2335 12639 15356 9572 -574 -10715 -15308 -11433 -1178 10563 15473 11994
1714 11994 2030 -8915 -14933 -13215 -4129 7377 14919 13589 4997 -5881 -13703 -14401 -6917 4427
1728 4427 13451 15003 7811 -3165 -12378 -14863 -9361 1569 11526 15092 10317 -45 -10132 -15020
1742 -15020 -11510 -1311 9383 14768 12038 3083 -7811 -14419 -13137 -4219 6416 14075 13601 5486
1756 5486 -4969 -13266 -14323 -7439 3729 12924 14313 8013 -2797 -11498 -14191 -9755 368 10843
1770 10843 15085 10446 592 -9507 -14161 -11472 -2510 8222 14989 12770 3093 -7376 -13778 -12957
1784 -12957 -4881 5571 13287 13706 5763 -4930 -12520 -14132 -7414 2564 11969 14461 8777 -1758
1798 -1758 -11257 -14028 -9882 16 9573 14495 11086 1216 -9231 -14216 -11420 -2526 7782 13567
1812 13567 12402 4552 -6105 -13738 -13176 -5255 5357 12799 13254 6660 -3306 -11593 -13798 -7847 2308
1827 2308 11606 14008 8766 -1092 -10565 -13647 -9460 -456 9207 13809 11030 1787 -8152 -13655 -11738
1842 -11738 -3092 7060 13284 12056 4397 -5538 -12406 -12704 -5892 4354 12425 13576 6983 -3532
1856 -3532 -11650 -12714 -7871 1726 10343 13834 9598 -457 -10197 -13890 -9606 -560 9162 13242 10925
1871 10925 2797 -7240 -13236 -11971 -4138 6588 13127 12049 4450 -5122 -12136 -12512 -6540 3353
1885 3353 11591 13118 7439 -2708 -11125 -13307 -8098 1562 9804 12822 9069 713 -8518 -13338 -10860
1900 -10860 -1708 8533 13522 10501 2225 -6629 -11946 -11430 -5047 5043 12668 13030 5388 -4874
1914 -4874 -11873 -11890 -5858 2570 10283 13100 8254 -1576 -10665 -13544 -8424 825 8967 12732 9448
1929 9448 1208 -8369 -12643 -10451 -2790 6906 12751 11438 3452 -6434 -12229 -10855 -4038 4287 10681
1944 10681 12274 6713 -3534 -11790 -13190 -6146 3456 9845 11355 7894 -181 -9158 -13397 -9313
1958 -9313 255 9158 12488 8797 1022 -6991 -12056 -10464 -3144 6131 11952 11085 3826 -5599 -11699
1973 -11699 -11401 -4511 4700 11003 11335 6110 -2760 -10188 -12478 -7302 2082 10155 12454 7556 -721
1988 -721 -8643 -12177 -9072 -1057 7617 12667 9853 1646 -7105 -11979 -9810 -2811 5591 11405 11007
2003 11007 4576 -4684 -11909 -11607 -4742 4316 10369 11178 6633 -2099 -9969 -12413 -7445 1741 9307
2018 9307 11798 8088 442 -8192 -12373 -9048 -1209 7348 11762 9611 2603 -5950 -11310 -10737 -3816
2033 -3816 5475 11301 10538 4432 -3878 -10507 -11707 -6117 3281 10625 11268 6254 -2043 -8858 -11707
2048 -11707 -8029 801 9190 12158 7882 306 -7054 -11097 -9462 -2567 6990 12421 9771 2015 -5920
2063 -5920 -10542 -9753 -4438 3965 10815 11419 5000 -4541 -10044 -10697 -5818 2199 9270 11471 7300 -1374
2079 -1374 -8826 -11082 -8149 7 8097 12066 8470 525 -7307 -10619 -8416 -2481 5296 10903 10399
2094 10399 3227 -5941 -11009 -9536 -3981 3794 9741 10826 5619 -2849 -10184 -10786 -6121 1917 8873
2109 8873 10654 7028 -711 -8124 -10734 -7378 -362 7257 11429 9010 1552 -7235 -11093 -8911 -2223
2124 -2223 4865 9918 10114 4330 -4917 -10738 -10533 -4109 4008 9559 10493 5884 -1947 -8930 -11288 -6721
2140 -6721 1331 8524 10943 7453 -626 -7744 -10823 -7984 -509 6610 10229 8872 2475 -6285 -10947
2155 -10947 -9509 -2423 5133 9645 9420 4302 -3536 -10125 -10359 -5099 3216 9328 9963 5536 -1601
2170 -1601 -8234 -10318 -6641 1004 7929 10576 7488 138 -7505 -10758 -7717 -796 6314 10096 8496
2185 8496 2762 -5283 -10733 -9553 -3085 5080 9565 9350 4224 -3232 -9194 -10314 -5192 2531 8733
2200 8733 10217 5903 -1508 -8102 -10525 -6735 1106 7173 10243 7204 1046 -6501 -10533 -8575 -1209
2215 -1209 6358 9989 8289 2580 -4334 -9465 -10055 -3941 4431 9508 9212 3897 -2814 -8222 -9658
2230 -9658 -5709 2055 8368 9988 5472 -1201 -7569 -9721 -7179 21 7394 10348 7156 454 -6109
2245 -6109 -9710 -8382 -2591 5628 10508 9028 2332 -4678 -8972 -8670 -3980 3208 9425 9631 4489
2260 4489 -3071 -8413 -9378 -5692 1507 7910 10239 6108 -967 -7453 -9679 -7243 -466 6638 10045
2275 10045 7801 1191 -5735 -9332 -7846 -2398 4592 9524 8774 2930 -4310 -8850 -8819 -4039 3132
2290 3132 8539 9804 4872 -2599 -8312 -9180 -5823 1201 7415 9761 6727 -583 -6837 -9165 -7199
2305 -7199 -1108 5642 9662 7900 1116 -5934 -9480 -7641 -2531 3944 9155 8841 3232 -4061 -8938
2320 -8938 -8368 -3865 2572 7958 9285 5457 -2047 -7990 -9162 -5195 775 6855 9286 6928 403
2335 403 -6669 -9515 -6825 -435 5097 8752 7978 2186 -5101 -9315 -8034 -2770 3833 8002 8423 3808
2351 3808 -3145 -8991 -9070 -3991 2293 7475 8757 5146 -1289 -7588 -9497 -5682 912 6600 9010
2366 9010 6737 737 -6117 -9652 -7188 -1092 5544 8721 7788 2270 -4065 -8996 -8294 -3040 4085
2381 4085 8206 8124 3654 -2731 -8039 -8807 -4484 2166 7568 8654 5512 -680 -7002 -9627 -6344 525
2397 525 6307 8622 6419 696 -5361 -9331 -7557 -1552 5217 8715 7203 2455 -3636 -8493 -8444 -3576
2413 -3576 3629 8333 8003 4130 -1963 -7402 -8917 -5382 1496 7545 8495 5208 -646 -6190 -8612
2428 -8612 -6642 -320 6293 8688 6362 694 -5190 -8285 -7723 -2157 4666 8684 7251 2024 -3881
2443 -3881 -7668 -7999 -3999 2729 8163 8341 3822 -2115 -7055 -7861 -5163 998 7118 8870 5550 -554
2459 -554 -6181 -8415 -6171 -816 5520 8430 6891 1352 -4860 -7950 -7436 -2521 4091 8432 7486 2854
2475 2854 -3153 -7219 -7881 -4121 2003 7415 8390 4034 -1914 -6849 -8023 -5242 489 6305 8615
2490 8615 5525 -446 -5808 -7698 -6106 -1134 4909 8398 6856 1101 -4600 -8053 -6949 -2893 3553
2505 3553 7440 8002 2915 -3433 -7288 -7200 -3866 1485 6836 8330 5093 -1719 -6951 -7608 -4589 206
2521 206 5723 7904 6340 577 -5762 -8148 -5766 -629 4393 7454 7043 2380 -4363 -8006 -7297 -2523
2537 -2523 3125 6968 7513 3706 -2488 -7358 -7567 -3858 1847 6169 7602 5023 -879 -6707 -8345
2552 -8345 -5354 840 5499 7216 5807 961 -4623 -8100 -6594 -882 4439 7621 6563 1983 -3405
2567 -3405 -7078 -6954 -3015 2954 6841 7309 3759 -2188 -6791 -7627 -3843 1588 6016 7202 4568 -470
2583 -470 -5911 -8429 -5579 252 5507 7696 5541 1162 -4473 -7567 -6690 -1793 4024 7255 6597 2587
2599 2587 -3509 -7107 -7023 -2952 2803 6581 6876 3926 -1514 -6646 -7982 -4460 1814 6211 7297 4621
2615 4621 207 -5099 -7751 -6241 -635 5109 7814 5689 810 -3917 -7132 -6382 -2166 3539 7030
2630 7030 6427 2615 -2564 -6685 -7007 -3178 2395 6653 6868 3589 -1165 -5988 -7436 -4676 747 6042
2646 6042 7649 4678 -318 -4921 -6755 -5512 -1073 4338 7488 5964 1358 -4082 -6996 -6473 -1971
2661 -1971 3235 6548 6565 2761 -2782 -6671 -7286 -3368 1793 6620 7465 3773 -1439 -5589 -6932 -4891
2677 -4891 11 5374 7759 5090 -78 -4872 -7054 -5307 -982 4091 7098 6198 1558 -3741 -6594
2692 -6594 -6122 -2200 2589 6823 6711 2739 -2439 -5962 -6346 -3551 1231 5772 7437 4464 -1444 -5593
2708 -5593 -6584 -4194 173 4477 6912 5485 642 -5066 -6889 -4911 -1076 3491 6515 6104 1962
2723 1962 -3310 -6924 -6192 -2322 2444 6179 6558 3465 -2275 -6123 -6537 -3370 1258 5177 6798 4695
2739 4695 -135 -5194 -7147 -4366 518 4243 6240 5097 1286 -3977 -7130 -5984 -1002 3666 6571
2754 6571 5740 2253 -2875 -6121 -6195 -2857 2342 6043 6422 3308 -1416 -5933 -6641 -3759 1326 5398
2770 5398 6410 4219 -384 -4794 -6994 -4945 -189 4358 6638 5161 693 -3841 -6680 -5899 -1657
2785 -1657 3162 6334 6086 2537 -2739 -6290 -6309 -2699 2054 5605 6129 3571 -1106 -5285 -6558 -3816
2801 -3816 834 5069 6364 4344 287 -4216 -6718 -4773 -395 3965 6411 5262 1396 -3318 -6531
2816 -6531 -5974 -1927 3078 5844 5489 2084 -2120 -5485 -6369 -3067 1708 5620 6354 3227 -1054 -4911
2832 -4911 -6382 -4305 267 4813 6285 4376 260 -3953 -6455 -4901 -757 3685 6337 5433 1356
2847 1356 -3364 -5900 -5534 -2258 2531 6256 5848 2386 -2113 -5308 -5921 -3272 1387 5122 5867 3764
2863 3764 -882 -4978 -5988 -4316 83 4068 6099 4579 633 -4081 -6331 -5095 -1290 3327 6009
2878 6009 5605 1531 -2747 -5847 -5556 -2135 2116 5664 5699 2751 -1718 -5334 -5676 -3238 1220 5106
2894 5106 6027 3692 -583 -4552 -5864 -4341 -160 4116 6409 4683 487 -3588 -5699 -4898 -1426
2909 -1426 3036 5599 5171 1630 -2659 -5269 -5453 -2237 1814 5072 5670 2914 -1604 -5015 -5767 -3138
2925 -3138 1070 4829 6051 3993 -191 -4659 -5907 -4141 -361 3786 5823 4964 755 -3182 -5563
2940 -5563 -4917 -1453 2884 5554 5358 2247 -2728 -5258 -5286 -2314 1811 5018 5547 3022 -1228 -4655
2956 -4655 -5871 -3669 955 4491 5635 3992 94 -3875 -5757 -4512 -263 3628 5469 4873 1260
2971 1260 -3172 -5495 -4803 -1708 2666 5468 5184 2321 -2154 -4998 -5520 -2516 1498 4948 5418 3285
2987 3285 -887 -4497 -5772 -3765 528 4250 5226 4001 307 -3836 -5733 -4390 -740 3226 5688
3002 5688 4508 1275 -2778 -5303 -5201 -1766 2479 5236 5159 2408 -2029 -5120 -5653 -3103 1308 4659
3018 4659 5540 3208 -502 -4117 -5451 -3809 178 4074 5375 4326 235 -3536 -5534 -4255 -868
3033 -868 2888 5497 4849 1244 -2951 -4950 -4855 -1731 2158 4872 5096 2242 -1464 -4707 -5024 -2787
3049 -2787 1027 4324 5394 3422 -463 -4098 -5319 -3566 143 3853 5723 4079 638 -3272 -5291
3064 -5291 -4600 -1318 2764 5108 4506 1765 -2217 -5204 -4706 -2231 1686 4773 5214 2881 -779 -4387
3080 -4387 -5536 -3275 922 4308 5231 3624 -550 -3609 -5479 -4276 -460 3476 5038 3968 471
3095 471 -3099 -5137 -4541 -1364 2519 4972 4758 1587 -2116 -4693 -4966 -2584 1488 4406 5240 2590
3111 2590 -1183 -4262 -5091 -3288 473 3725 5356 3578 96 -3370 -5274 -3654 -285 3504 4995
3126 4995 4347 1322 -2998 -5166 -4417 -1575 2340 4789 4820 2493 -1714 -4880 -5129 -2453 995 4208
3142 4208 4832 3007 -627 -4101 -5185 -3564 108 3392 5065 3929 167 -3253 -4878 -3987 -1078
3157 -1078 2872 5113 4109 1187 -2215 -4718 -4556 -2080 2068 4628 5023 2248 -1313 -4347 -4872 -2792
3173 -2792 955 4279 5003 3099 -460 -4071 -5087 -3508 -115 3615 4797 3669 243 -3262 -4935
3188 -4935 -3846 -979 2632 4682 4087 1458 -2106 -4492 -4402 -1897 1825 4670 4579 2266 -1108 -4152
3204 -4152 -4972 -2583 715 3735 4888 3111 -70 -3744 -5081 -3565 -81 3001 5302 3742 492
3219 492 -2823 -4401 -3967 -1359 1904 4540 4251 1494 -1872 -4433 -4389 -2193 1237 3879 4730 2105
3235 2105 -1265 -4104 -4763 -2607 839 3290 4632 3502 -84 -3314 -4703 -3488 -563 3030 4849
3250 4849 3864 854 -3044 -4402 -3922 -1428 2228 4053 4454 2204 -1653 -4696 -4508 -2008 1520 3913
3266 3913 4502 2746 -613 -4113 -5240 -2880 383 3542 4457 3125 351 -2943 -4791 -3560 -355
3281 -355 2855 4270 3684 1105 -2323 -4535 -4129 -1641 1950 4364 4062 2037 -1245 -3943 -4679 -2547
3297 -2547 1183 4010 4583 2406 -424 -3391 -4319 -3220 162 3365 4680 3364 363 -3236 -4507
3312 -4507 -3324 -875 2577 4237 3636 1361 -2387 -4466 -4072 -1572 1785 4123 4088 2001 -1084 -3861
3328 -3861 -4471 -2695 874 3891 4255 2460 -417 -3199 -4337 -3267 125 3010 3990 3254 581 -2620
3344 -2620 -4515 -3722 -1192 2498 4106 3799 1075 -1949 -3895 -4375 -2027 1670 4160 3968 2030 -1351
3360 -1351 -3679 -3995 -2575 626 3515 4424 2876 -531 -3006 -4006 -3076 -470 2733 4233 3652 799
3376 799 -2520 -4138 -3751 -1050 2147 4348 3663 1253 -1360 -3831 -3785 -2182 1299 3748 4132 2105
3392 2105 -1316 -3630 -4200 -2503 174 2952 4264 3135 -17 -3134 -4437 -2866 -85 2412 4349
3407 4349 3059 854 -2321 -3899 -3602 -1352 1886 4203 3711 1555 -1178 -3793 -3599 -2287 813 3604
3423 3604 3919 2500 -931 -3338 -4179 -2739 80 2725 3963 3215 370 -2884 -3850 -3091 -302 2214
3439 2214 3886 3595 683 -2268 -3766 -3423 -1171 1602 3606 4160 1998 -1387 -3864 -3918 -1720 979
3455 979 3140 3905 2428 -73 -3359 -4222 -2275 192 2762 3709 3013 581 -2852 -3774 -3035 -410 2102
3472 2102 3738 3476 1179 -1664 -3913 -3568 -1247 1591 3569 3642 1826 -1076 -3547 -3685 -2060 696
3488 696 3249 3890 2310 -338 -2883 -3742 -2756 9 2584 3505 2834 267 -2397 -3984 -3199 -895 2352
3505 2352 3586 3494 1413 -1465 -3503 -3506 -1587 1395 3501 3547 1839 -1018 -3271 -3908 -2166 638 3226
3522 3226 3990 2516 -136 -2727 -3827 -2927 -35 2404 3511 2880 576 -2087 -3665 -3440 -1023 2218
3538 2218 3892 3278 1389 -1615 -3312 -3601 -1731 1257 3382 3535 1732 -1035 -3245 -3555 -2433 335
3554 335 2973 3895 2384 -160 -2460 -3756 -2439 -285 2542 3707 2943 613 -2112 -3613 -3387 -1294
3570 -1294 1550 3389 3294 1214 -1394 -3216 -3593 -1688 1067 3528 3395 1902 -662 -2978 -3397 -2409
3586 -2409 153 2642 3560 2637 188 -2657 -3622 -2809 -453 2124 3819 3379 746 -1781 -3568 -3203
3602 -3203 -987 1562 3102 3228 1420 -1049 -3284 -3431 -1485 845 3193 3916 2115 -865 -2790 -3096
3618 -3096 -2185 113 2460 3754 2525 131 -2612 -3749 -2729 -277 1863 3621 3041 498 -1861
3633 -1861 -3382 -3023 -1009 1253 3202 3114 1734 -1217 -3282 -3126 -1923 423 2753 3334 2114 -427
3649 -427 -2670 -3855 -2460 281 2469 3565 2686 204 -2210 -3645 -2930 -615 1690 3551 2688 1232
3665 1232 -1532 -3388 -3452 -1410 1259 2902 3219 1680 -872 -3031 -3399 -1797 396 2719 3474 2113
3681 2113 -113 -2444 -3501 -2652 -116 2151 3421 2694 596 -1742 -3206 -2786 -879 1913 3362 3083
3697 3083 1011 -1467 -3185 -3300 -1182 1161 3217 3124 1607 -776 -2774 -3609 -2216 538 2605 3615
3713 3615 2441 19 -2333 -3284 -2334 -195 2000 2770 2732 931 -2049 -3076 -2771 -999 1717 2879
3729 2879 2871 1199 -1242 -2848 -3219 -1668 987 2935 3022 1749 -437 -2810 -3415 -2050 293 2453 3198
3746 3198 2212 -111 -2448 -3453 -2777 -327 1951 3133 2795 722 -1652 -2923 -3239 -1140 1325 3121
3762 3121 2813 727 -1254 -2778 -3113 -1509 746 2613 2988 1563 -577 -2373 -3164 -2290 -21 2472
3778 2472 3357 2161 -148 -1997 -3096 -2646 -374 1471 3151 2950 768 -1862 -2767 -3133 -1094 1155
3794 1155 3118 2910 1557 -834 -2754 -2630 -1640 487 2549 3358 1549 -323 -2072 -3235 -2073 75
3810 75 2033 2873 2465 318 -1934 -3106 -2604 -551 1440 3040 2876 965 -1463 -2812 -2804 -1139 1347
3827 1347 2635 2950 1530 -637 -2635 -2921 -1825 590 2618 3045 1872 -32 -2173 -2924 -2073 -195
3843 -195 1968 2792 2353 577 -1677 -2894 -2343 -441 1294 3073 2638 896 -1223 -2712 -2664 -1519 976
3860 976 2644 2613 1555 -695 -2301 -2940 -1577 134 1924 2697 2016 108 -1852 -2885 -2348 -467 1816
3877 1816 2638 2212 626 -1280 -2910 -2515 -813 1333 2606 2656 1158 -1159 -2396 -2875 -1451 802
3893 802 2547 2649 1637 -490 -2577 -3039 -1583 303 2247 2790 2263 177 -1957 -2906 -2379 -283 1823
3910 1823 2662 2175 422 -1398 -2652 -2326 -690 1446 2665 2387 1294 -957 -2684 -2961 -1279 805
3926 805 2438 2724 1804 -8 -2096 -2913 -2165 216 2001 2806 1818 295 -1793 -2680 -2327 -326 1702
3943 1702 2610 2632 672 -1375 -2314 -2696 -1050 858 2324 2682 1441 -655 -2343 -2852 -1515 716 2207
3960 2207 2735 1791 -172 -1920 -2632 -2003 -265 1869 2695 1929 242 -1849 -2385 -2029 -517 1369 2821
3977 2821 2652 729 -1158 -2557 -2491 -1069 786 2341 2703 1187 -761 -2250 -2505 -1302 484 2294
3993 2294 2458 1805 45 -1722 -2771 -1948 -136 1696 2798 2084 452 -1411 -2573 -2469 -617 1368
4009 1368 2580 2539 678 -953 -2278 -2530 -1097 930 2145 2492 1199 -727 -1887 -2352 -1747 -288
4025 -288 1692 2550 2003 -49 -1692 -2505 -1662 -371 1299 2420 2335 586 -1545 -2464 -2086 -619 890
4042 890 2202 2432 705 -814 -2506 -2263 -1314 711 2046 2179 1415 -636 -1835 -2600 -1633 123 1862
4059 1862 2519 1891 28 -1768 -2401 -2134 -161 1437 2113 2165 645 -1089 -2523 -2241 -1043 1219 2595
4076 2595 2062 1225 -701 -2061 -2441 -1445 676 2419 2540 1526 -115 -1862 -2377 -1715 359 1688 2392
4093 2392 1374 294 -1523 -2310 -2035 -453 1438 2384 2052 781 -888 -2054 -2303 -1066 388 2045
4109 2045 2746 829 -773 -2032 -2360 -1140 433 1847 2435 1612 -427 -1936 -2018 -2056 71 1772 2536
4126 2536 1920 294 -1359 -2375 -2169 -282 1124 1974 2351 848 -759 -1907 -2271 -1035 676 2452
4142 2452 2320 1194 -355 -2017 -2235 -1426 385 1884 2363 1300 163 -1748 -2424 -1530 -405 1327
4158 1327 2582 1673 202 -1378 -2373 -1938 -606 1209 2162 2257 751 -798 -2024 -2180 -1117 369 2140
4175 2140 2308 1464 -611 -1718 -2435 -1425 17 1724 2109 1473 45 -1642 -2236 -1561 -354 1231 2187
4192 2187 1829 270 -1264 -1870 -2228 -707 797 2100 2452 1192 -746 -1838 -2175 -1186 680 1923
4208 1923 2131 1491 -379 -1754 -2362 -1374 -4 1653 2230 1465 58 -1447 -2187 -1685 -212 1205 2306
4225 2306 2140 669 -1131 -1941 -1716 -552 772 2036 2097 949 -354 -1959 -2319 -1201 266 1688
4241 1688 2236 1180 -434 -1967 -2151 -1613 239 1433 2118 1535 304 -1186 -2134 -2059 -338 1194 2026
4258 2026 1940 411 -1077 -1837 -2124 -840 1038 1990 1969 840 -562 -1791 -2258 -1168 279 1838 2024
4275 2024 1313 -175 -1561 -2145 -1642 -47 1524 1917 1432 471 -1137 -2091 -1935 -209 1089 2098 1840
4292 1840 270 -1345 -1901 -1710 -740 564 2002 2026 995 -454 -2006 -1696 -1191 160 1749 1946 1196
4309 1196 -175 -1639 -1994 -1223 -248 1360 1805 1843 318 -930 -2247 -1701 -700 816 2066 1702 654
4326 654 -468 -2014 -2076 -619 478 1845 1853 856 -347 -1503 -1951 -1235 483 1613 1934 1277 199 -1234
4344 -1234 -1718 -1422 -39 1128 1927 1377 227 -1223 -1926 -2004 -796 838 1790 2035 770 -630 -1692
4361 -1692 -1945 -1227 437 1342 1667 935 -287 -1078 -1788 -1071 348 1560 1934 1496 71 -1384 -2148 -1209
4379 -1209 -289 970 1757 1460 54 -944 -2095 -1840 -609 690 2021 1675 966 -365 -1647 -1867 -678
4396 -678 374 1625 1807 737 -121 -1710 -2180 -1466 382 1349 1957 1273 7 -1139 -1807 -1656 -389
4413 -389 1093 1740 1516 528 -1029 -1916 -1778 -896 528 1720 1334 947 -570 -1838 -1874 -1434 388 1374
4431 1374 1960 1177 -72 -1273 -1999 -995 -102 1477 2418 1453 341 -1166 -1676 -1649 -297 1174 1709
4448 1709 1917 610 -715 -1646 -1614 -756 596 2050 1577 861 -336 -1459 -2083 -1191 488 1500 1643
4465 1643 1040 -11 -1418 -1748 -1036 -58 1209 1551 1647 87 -1437 -1837 -1407 -423 615 1823 2162 964
4483 964 -665 -1845 -1883 -1025 505 1763 1773 1133 -429 -1272 -1656 -1166 282 1115 1564 1343 -43 -1133
4501 -1133 -1856 -1394 -163 877 1740 1445 288 -965 -2059 -1170 -560 675 1648 1409 765 -765 -1651
4518 -1651 -1605 -576 462 1581 1606 823 -514 -1327 -1575 -1218 127 1416 1361 1472 76 -1365 -1541 -1407
4536 -1407 -126 1035 1626 1351 367 -705 -1412 -1744 -745 639 1681 1601 733 -661 -1623 -1724 -857 112
4554 112 1403 1789 1025 -78 -1527 -1730 -1282 324 693 1805 1378 129 -1101 -1773 -1439 -294 867
4571 867 1554 1386 919 -992 -1650 -1295 -599 843 1589 1644 589 -525 -1468 -1989 -772 266 1263 1828
4589 1828 1101 54 -1319 -1724 -1084 252 1082 1485 1052 240 -731 -1847 -1736 -182 727 1636 1453 247
4607 247 -607 -1453 -1602 -609 540 1632 1191 733 -358 -1188 -1523 -1072 25 1199 1421 1314 138 -860
4625 -860 -1497 -1146 -35 1310 1860 1368 304 -823 -1187 -1287 -605 693 1721 1831 627 -514 -1267
4642 -1267 -1313 -450 400 1653 1364 944 -423 -1360 -1410 -1088 -161 1282 1531 991 -346 -948 -1763 -1278 -113
4661 -113 929 1721 1043 293 -977 -1479 -1448 -656 706 1330 1446 746 -880 -1306 -1490 -431 356 1152 1519
4680 1519 633 -104 -1327 -1667 -1075 -119 1108 1617 918 -197 -844 -1724 -1291 -300 786 1465 1233 275
4698 275 -768 -1321 -1381 -418 750 1414 1421 662 -457 -1229 -1381 -648 479 1287 1515 1125 -62 -1377 -1538
4717 -1538 -1065 109 986 1393 1219 166 -959 -1779 -1174 79 807 1401 1249 405 -844 -1563 -1568 -658 464
4736 464 1367 1459 774 -698 -1642 -1478 -572 236 1247 1408 744 -64 -1257 -1279 -1127 55 962 1756 1219
4755 1219 227 -998 -1609 -1057 -213 693 1431 1600 531 -557 -1246 -1270 -578 707 1350 1187 754 -406
4773 -406 -1518 -1410 -760 268 1053 1514 1081 -12 -1371 -1418 -927 276 1048 1239 1270 77 -821 -1560 -1226
4792 -1226 -96 706 1405 1524 246 -777 -1365 -1175 -539 471 1148 1455 550 -314 -1056 -1210 -520 273
4810 273 1268 1528 751 -64 -742 -1561 -1052 75 966 1524 1141 53 -471 -1265 -1328 -264 1033 1431 1281
4829 1281 613 -628 -1512 -1449 -723 708 1340 1515 968 -250 -1413 -1321 -639 319 926 1312 835 -68 -1056
4848 -1056 -1500 -1138 -203 907 1377 1085 572 -818 -1330 -1134 -458 666 1650 1424 571 -361 -1213 -1321 -606
4867 -606 390 870 1125 1082 -458 -1466 -1121 -694 78 941 1173 814 11 -1008 -1378 -1133 -232 622 1480
4886 1480 1239 410 -685 -1307 -1039 -702 412 1461 1429 285 -597 -1126 -898 -627 289 864 1201 922 -239
4905 -239 -751 -1270 -969 40 628 1220 751 71 -1021 -1221 -862 -442 700 1149 1302 498 -377 -1185 -1102
4924 -1102 -481 626 1244 1560 327 -374 -928 -1452 -457 -45 1221 1337 484 13 -1071 -1625 -792 -5
4942 -5 881 1052 966 70 -1054 -1265 -1069 -142 786 1484 908 288 -333 -1432 -1374 -495 482 1162 1285 619 -290
4963 -290 -1405 -1357 -564 -143 885 1180 958 -143 -849 -1437 -724 83 835 1292 1171 94 -560 -1301 -1013
4982 -1013 -137 606 1196 1490 578 -669 -1375 -931 -578 580 1313 1221 960 -264 -886 -1305 -578 132 775
5001 775 1201 836 156 -935 -1446 -1134 -258 881 1410 1336 108 -592 -1190 -802 -491 582 1434 955 356
5020 356 -383 -993 -1064 -699 179 1316 1183 1077 -38 -995 -1485 -598 409 1022 1238 710 155 -737 -834 -1210
5040 -1210 -158 348 1128 1139 -76 -854 -924 -1127 -381 677 1181 1126 400 -525 -1094 -1366 -487 134 1111 1243
5060 1243 779 -379 -906 -1111 -808 203 835 1332 722 203 -663 -1231 -967 -501 617 1340 1144 10
5078 10 -656 -1201 -1033 -373 539 1363 1074 607 -529 -1062 -1105 -948 448 1019 1167 529 -84 -624 -1195 -289
5098 -289 -143 516 1049 1132 6 -817 -1056 -836 -432 759 1250 1242 370 -199 -1370 -1214 -490 511 1124 1194
5118 1194 739 53 -854 -1000 -682 178 1201 1187 642 157 -809 -1244 -750 -87 592 1308 838 71 -446 -1251
5138 -1251 -1074 -230 369 1232 986 407 -559 -961 -1319 -559 296 837 1079 607 -241 -919 -1013 -397 210 629
5158 629 1487 992 195 -867 -1105 -1073 -47 674 1104 921 193 -478 -1013 -667 -200 487 1225 1079 398 -265
5178 -265 -1035 -1286 -712 255 915 954 544 -288 -944 -1303 -439 322 1134 1089 960 263 -746 -996 -910 -142 446
5199 446 1406 976 -145 -464 -680 -1045 -597 601 1149 1159 613 -132 -1125 -1526 -488 39 1113 1260 558
5218 558 -452 -701 -1025 -863 104 657 1108 897 -23 -601 -936 -748 46 553 1073 826 390 -438 -1054 -924
5238 -924 -448 425 1267 1007 725 -672 -1129 -819 -630 250 1007 992 1053 -213 -1124 -1214 -808 136 700 1181
5258 1181 588 142 -593 -1168 -660 -97 528 1179 629 300 -536 -1014 -1033 -481 315 1142 1140 570 -372 -970 -1082
5279 -1082 -441 22 815 1040 699 -213 -673 -971 -777 -145 679 947 853 -28 -920 -1015 -870 -223 551 967
5299 967 940 594 -209 -1047 -1243 -349 136 968 1071 833 -327 -1076 -933 -473 122 793 848 489 -104 -917
5319 -917 -1130 -791 28 692 1177 871 147 -724 -803 -1178 -252 393 1102 866 462 -375 -975 -1187 -142 226
5339 226 1071 1032 508 -43 -1042 -1102 -826 -97 632 1141 982 59 -864 -1197 -719 -46 693 1139 843 615 -589
5360 -589 -1058 -959 -553 633 1209 548 415 -127 -1080 -1009 -352 -1 844 1138 388 -413 -1141 -1007 -474 169
5380 169 868 1091 895 163 -604 -912 -759 158 654 1057 932 406 -174 -818 -1035 -461 333 769 1142 614
5400 614 -361 -1199 -1220 -654 318 831 1045 458 -39 -797 -1224 -662 -83 564 1048 627 370 -475 -978 -665
5420 -665 -371 292 779 1121 393 -613 -979 -1157 -394 331 1181 829 622 -324 -817 -1053 -411 192 949 902
5440 902 354 -99 -704 -878 -696 251 611 973 437 349 -609 -1099 -882 -211 607 1049 829 629 -321 -976
5460 -976 -1139 -368 555 931 1135 458 -183 -1069 -960 -469 32 648 1276 629 -167 -837 -998 -688 -69 786
5480 786 654 748 159 -538 -1109 -1008 48 212 1097 955 324 -278 -1064 -574 -571 369 627 945 730 -148 -699
5501 -699 -950 -640 461 816 863 550 69 -452 -1272 -664 18 409 860 663 566 -464 -930 -971 -230 661
5521 661 878 1046 169 -771 -951 -1078 -661 144 867 1083 499 -146 -709 -787 -594 180 404 827 604 -125
5541 -125 -401 -854 -812 -133 1041 1109 832 354 -639 -891 -978 -300 340 960 586 287 -435 -796 -1036 -350 306
5562 306 1012 1099 612 101 -611 -810 -664 -328 494 949 668 -296 -613 -1192 -541 -248 652 886 709 135
5582 135 -735 -782 -604 -509 454 516 1040 700 -343 -937 -860 -328 -86 833 942 670 186 -388 -1189 -714 -250
5603 -250 514 963 1081 -70 -538 -894 -830 -387 601 911 961 370 -599 -999 -856 -234 264 715 1020 336
5623 336 -127 -776 -977 -600 250 666 1062 633 -129 -746 -937 -727 53 439 815 662 16 -511 -826 -988
5643 -988 -185 327 652 890 257 -141 -1057 -724 -411 338 816 1115 423 15 -673 -1134 -608 -12 489 927
5663 927 654 308 -563 -1040 -524 -226 769 1009 727 231 -318 -1077 -752 -233 128 842 580 504 -175 -855
5683 -855 -920 -440 349 618 766 644 -24 -877 -736 -843 29 648 678 837 -63 -519 -845 -395 -303 388 861
5704 861 1086 250 -191 -814 -910 -413 555 514 916 247 -173 -553 -948 -433 476 886 881 641 -144 -793 -729 -776
5726 -776 -237 504 1163 634 301 -558 -696 -825 -218 566 549 666 157 -204 -994 -761 -386 621 758 832
5746 832 490 -267 -520 -954 -284 178 774 677 510 -239 -441 -861 -574 199 748 695 709 205 -751 -930 -706
5767 -706 -113 378 895 870 526 -283 -959 -1014 -264 227 984 874 306 -278 -453 -856 -437 148 523 779 456
5788 456 117 -494 -460 -573 -231 656 356 638 -127 -544 -1062 -519 -79 339 928 808 459 -681 -1119 -663
5808 -663 -327 613 827 969 262 -127 -617 -1027 -733 221 544 989 522 62 -503 -666 -769 35 290 993
5828 993 421 -76 -439 -683 -941 -428 125 762 824 343 -73 -805 -706 -587 132 368 934 506 -194 -587 -718
5849 -718 -534 -164 604 1027 697 -17 -849 -467 -667 -347 509 706 940 319 -128 -710 -852 -353 498 492 948
5870 948 376 -371 -651 -927 -231 133 688 456 287 -134 -634 -896 -125 145 376 594 729 232 -722 -963
5890 -963 -521 -76 463 666 882 77 -486 -793 -824 -233 108 694 536 322 -71 -791 -1067 -705 -42 256
5910 256 408 767 116 -491 -654 -471 -312 501 640 744 201 -712 -751 -731 -72 709 572 561 204 -365 -499
5931 -499 -900 -281 205 827 548 282 -11 -326 -889 -485 157 465 553 688 -409 -769 -912 -488 -253 545
5951 545 699 630 105 -503 -673 -609 -192 294 474 857 366 152 -465 -1071 -524 134 584 353 308 -139 -845
5972 -845 -611 -278 86 596 846 499 33 -435 -658 -369 -9 546 973 516 79 -525 -935 -540 -269 526
5992 526 1021 633 208 -331 -660 -713 -493 175 690 488 436 -37 -609 -847 -651 49 616 553 512 -335 -542
6013 -542 -679 -566 27 414 643 431 202 -511 -487 -727 -200 419 819 763 341 -449 -885 -901 -482 128 451
6034 451 601 320 -142 -459 -813 -488 232 508 655 627 7 -463 -775 -712 -58 126 612 537 290 -521 -845
6055 -845 -707 -84 401 924 762 154 -384 -587 -601 -232 189 323 932 467 -69 -661 -596 -747 -47 342 473
6076 473 428 -69 -207 -746 -596 55 263 640 438 104 -431 -700 -827 -405 334 664 530 208 -534 -575 -641
6097 -641 -386 160 503 760 384 31 -362 -590 -630 -353 369 706 695 -45 -326 -993 -444 -171 411 675 516
6118 516 199 -353 -841 -780 -346 182 698 414 418 233 -755 -949 -458 -226 396 532 587 -74 -277 -344 -583 99
6140 99 708 614 546 -14 -486 -393 -517 -540 182 857 575 583 -453 -940 -500 -407 446 472 825 94 -90 -546 -842
6163 -842 -484 71 659 689 481 156 -313 -658 -212 -182 539 577 385 141 -658 -714 -737 -103 314 708 442 269
6185 269 -178 -857 -733 -139 199 810 533 310 20 -834 -698 -634 -222 387 637 333 -292 -373 -730 -485 -105
6206 -105 89 1130 397 43 -237 -888 -586 -316 343 492 447 454 -111 -615 -661 -506 210 810 525 350 265
6227 265 -379 -750 -477 -279 461 700 573 297 -361 -571 -446 24 517 671 671 150 -488 -754 -515 -297 463
6248 463 621 463 436 -233 -536 -658 -453 212 653 678 593 24 -620 -606 -114 103 434 561 617 -149 -504 -758
6270 -758 -431 -71 323 472 300 201 -146 -587 -431 -457 209 443 540 45 -65 -665 -686 -124 -38 467 453 271
6292 271 -63 -389 -611 -345 17 293 710 540 167 -302 -428 -710 -19 378 620 528 9 -64 -679 -473 -106
6313 -106 0 652 697 354 -169 -643 -437 -285 -128 430 764 452 221 -479 -634 -505 -78 417 610 416
6333 416 2 -442 -571 -759 -367 218 570 529 116 -393 -442 -333 -106 231 198 583 268 -173 -676 -790 -459
6354 -459 -189 349 545 566 -100 -405 -797 -601 -171 155 457 615 84 -298 -882 -658 -148 53 539 368
6374 368 40 -247 -257 -755 -373 -185 662 541 177 -109 -510 -574 -372 -60 114 568 551 114 -175 -248 -513
6395 -513 -203 411 570 559 211 -362 -518 -496 -501 -76 544 540 386 62 -514 -585 -379 105 471 598 463 -94
6417 -94 -474 -703 -273 -116 188 510 709 214 -353 -481 -499 60 373 519 547 223 -157 -400 -525 -483 124
6438 124 558 374 125 1 -586 -530 -545 241 624 304 226 100 -265 -826 -514 63 319 705 709 205 -508 -509
6460 -509 -192 -95 -13 392 456 -97 -196 -251 -245 -399 167 262 492 292 -235 -501 -629 -115 -136 425 658 651 462 -272
6484 -272 -381 -428 -244 169 568 323 159 -139 -634 -524 -95 235 768 611 9 66 -507 -486 -374 50 383
6505 383 520 573 -119 -669 -326 -356 -82 305 652 546 167 -399 -549 -417 -356 319 598 622 -9 -346 -425 -605
6527 -605 -58 285 649 922 202 -33 -96 -381 -350 121 276 975 171 54 -273 -611 -405 -192 113 174 400
6548 400 46 -58 -417 -524 -88 200 535 451 242 -137 -820 -614 -227 183 484 561 262 -426 -211 -772 -484
6569 -484 257 259 364 506 -234 -366 -325 -487 -60 253 658 737 -25 -225 -459 -601 -184 91 681 311 199
6590 199 -139 -560 -351 -399 123 355 265 276 -162 -232 -472 -383 -148 257 486 562 228 -418 -345 -367 224 443 502
6613 502 657 231 -9 -494 -653 -59 184 351 672 206 -385 -601 -401 -17 16 441 76 66 -45 -500 -619
6634 -619 -451 180 653 767 191 -113 -467 -632 -390 -42 327 196 250 128 -117 -611 -626 -34 290 388 228
6655 228 491 84 -390 -432 -268 329 138 432 409 -130 -431 -660 -350 -144 520 494 20 32 -484 -793 -399
6676 -399 -145 120 649 379 132 -518 -592 -483 -351 362 611 436 72 -187 -378 -663 -292 -19 375 298 88
6697 88 -191 -480 -506 -476 9 365 268 351 -155 -405 -418 -651 -145 466 276 449 16 -250 -566 -557 -101 338 495
6720 495 284 -94 -238 -184 -521 -348 280 57 478 454 218 -92 -670 -341 26 565 565 482 -20 -272 -528 -561
6742 -561 -60 449 738 631 117 -152 -530 -217 -372 7 469 404 392 -105 -656 -692 -363 51 502 366 241
6763 241 -238 -464 -677 -239 209 319 623 284 129 -475 -284 -246 -251 170 529 440 211 -404 -520 -580 -264 -156
6785 -156 210 411 616 76 -458 -448 -98 -42 357 334 677 322 -380 -541 -536 -136 -4 599 273 50 -84 -272
6807 -272 -253 -152 62 653 488 124 -223 -337 -716 -156 187 174 473 471 -56 -692 -444 -426 64 265 677 377
6829 377 382 -256 -421 -275 -148 436 353 491 287 -637 -526 -410 -211 217 593 449 6 -394 -374 -387 -190 -29
6851 -29 94 724 42 -49 -599 -640 -245 186 122 441 482 -15 -202 -535 -561 -220 415 565 508 234 -96 -318
6873 -318 -37 -144 312 253 504 519 98 -290 -450 91 195 474 779 412 -159 -335 -475 -467 38 238 510
6894 510 280 77 -313 -537 -291 -190 262 335 278 47 -118 -370 -623 -164 238 451 617 123 -46 -430 -473
6915 -473 -396 -22 492 301 229 13 -547 -488 -525 114 336 519 386 -18 111 -787 -237 -225 24 447 476 325
6937 325 -9 -431 -457 -245 -1 43 299 168 45 -278 -416 -178 -241 199 370 423 -325 -348 -310 -586 11 152
6959 152 673 582 135 56 -413 -511 -106 104 195 385 204 138 -260 -115 -376 -101 468 530 228 -6 -380 -498
6981 -498 -230 104 138 531 123 58 -88 -439 -414 -243 303 518 663 58 -103 -513 -469 -534 272 197 450 194
7003 194 -50 -179 -420 -255 113 57 281 35 50 -369 -227 -192 -12 48 604 340 120 -240 -151 -324 -131 76
7025 76 517 417 262 -171 -613 -74 63 -6 413 448 196 -357 -296 -551 -127 2 179 231 159 -366 -460 -102
7047 -102 -274 148 586 559 646 208 -346 -307 -222 15 219 650 378 423 91 -92 -496 -408 52 301 255 85
7069 85 -422 77 -367 -298 25 117 350 -29 -161 -544 -594 -409 -140 152 471 168 -85 -295 -222 -206 -13 113
7091 113 434 323 186 -126 -308 -504 -144 130 550 464 158 0 -484 -325 -299 98 406 144 155 120 -202
7112 -202 -635 -191 -197 75 364 9 609 40 -171 -435 -206 206 243 520 82 -329 -184 -88 -464 -91 431
7133 431 559 412 192 -309 -284 -153 -203 401 603 46 -30 -162 -265 -482 84 370 399 22 -160 52 -318
7154 -318 -424 -201 -55 661 429 12 221 -181 -295 -78 -110 519 380 89 334 -475 -262 -171 -256 82 318
7175 318 366 -167 -408 -260 -468 -206 334 37 186 348 47 -59 -210 -274 133 269 246 190 -385 -460 -363 -422
7197 -422 -105 319 485 72 -68 -161 -152 -229 -90 342 331 204 72 -288 -274 -250 -189 324 472 125 228 -285 -324
7220 -324 -438 -203 148 228 79 533 156 -513 -199 -338 238 355 68 148 85 -571 -504 -488 -70 371 295 481
7242 481 100 -181 -368 -119 -19 421 781 591 -226 -287 -315 -256 -152 23 304 376 448 23 -283 -516 -6 90
7264 90 351 321 86 260 -508 -304 -412 -202 132 341 347 98 -230 -177 -285 -86 0 527 304 395 -73 -368
7286 -368 -503 -307 -32 63 479 256 -56 -409 -215 -478 32 56 269 205 84 -567 -482 -365 -103 -4 342 251
7308 251 365 -479 -493 -74 -97 278 634 314 67 29 -487 -500 -204 173 401 250 398 29 -364 -231 -362
7329 -362 -133 476 403 439 -180 -148 -277 -310 -345 243 318 389 363 19 -411 -500 -9 93 278 614 251 20 -253
7352 -253 -484 -37 -169 152 225 96 -16 23 -482 -227 24 349 245 325 -268 -301 -492 -322 288 38 565
7373 565 345 325 -125 -125 -280 -113 -162 172 270 137 23 -415 -235 -99 -67 531 343 249 -106 -223 -326 -324 83
7396 83 111 253 366 311 -27 -104 -178 -285 176 391 70 235 8 -499 -368 140 -191 407 316 55 -99 -31
7418 -31 -507 -52 174 244 363 344 -19 -334 -477 -475 159 181 300 181 414 -363 -451 -111 -431 74 395 221
7440 221 120 -43 -249 -60 -231 31 317 428 433 -220 -219 -530 -204 -290 133 626 185 -92 -173 -360 -548 -151
7462 -151 402 326 396 -102 -590 -346 -272 -217 31 275 320 255 -152 -450 -604 -355 -94 257 616 418 -150 -433
7484 -433 -466 -188 -381 237 384 381 -139 -128 -184 -393 -81 238 770 161 24 -202 -372 -669 -344 119 357 628
7506 628 320 79 -353 -566 -424 3 285 574 245 101 -152 -65 -227 -139 348 703 219 -51 110 -340 -289
7527 -289 -130 183 217 142 152 -34 -205 -91 -316 154 292 543 264 -187 -379 -353 47 -109 383 326 394 -131
7549 -131 -553 -509 -91 99 117 517 290 31 -170 -277 -456 -55 162 537 471 51 -50 -386 -59 -163 -10
7570 -10 499 87 43 -55 -242 -546 -246 85 301 264 171 -105 -312 -149 -64 181 373 428 -3 -170 -19 -378
7592 -378 -496 -61 70 10 342 233 -20 -814 -566 -163 175 379 245 444 -10 -290 -432 -177 62 421
7612 421 518 365 -13 -451 -212 -278 -279 286 591 365 -63 -5 -298 -314 -42 340 142 431 262 -180 -265 -613
7634 -613 -84 -14 130 264 342 190 -259 -686 -223 -10 59 320 422 -46 -153 -394 -170 -110 160 460 462 79
7656 79 18 -248 -456 -124 160 240 272 -68 -132 -334 -460 -417 155 268 484 25 -50 -115 -283 -3 -57 99 231
7679 231 283 331 -59 -303 -354 176 190 370 257 119 44 -394 -564 -472 212 265 260 305 -76 -550 -485 -85 124 561
7703 561 349 312 -13 -150 -416 -59 25 357 484 175 59 57 -139 -424 -305 247 454 691 227 -236 -278 -168
7725 -168 -117 98 620 413 347 -455 -332 -195 -220 7 286 233 431 -143 -85 -163 -237 -147 509 538 309 286 -289
7748 -289 -468 -354 -248 228 806 475 296 143 -379 -291 -272 -11 294 235 289 17 -239 -156 -158 114 105 364 123
7771 123 -22 -259 -264 -171 90 99 332 297 195 -112 -348 -348 -180 -33 -9 309 248 -173 -368 -243 72 -128 46
7794 46 311 -3 126 -304 -179 -168 73 155 198 20 309 -358 -280 55 -8 322 390 594 -82 -110 -480 -116 -260
7817 -260 179 310 298 23 256 -379 -96 6 136 186 244 339 229 -205 -490 -352 -47 163 508 -12 -185
7838 -185 196 -108 -211 -50 -239 571 557 -38 64 -253 -370 -219 343 249 432 180 -81 -194 -397 -48 63
7859 63 273 396 562 -30 -177 -561 -152 240 434 359 203 184 -251 -319 113 -29 -69 455 501 -100 77 -132
7881 -132 -511 -59 -65 380 151 285 342 -417 -305 -359 89 111 338 416 235 -478 -44 -448 116 254 390 -18
7903 -18 211 -91 -42 -32 -287 441 358 -166 222 -62 -262 -402 -254 -23 523 486 -73 -6 -310 -290 -113 -117 327
7926 327 548 9 13 -238 -411 -390 -27 244 384 349 223 -275 -497 -199 -49 -17 75 408 208 -108 -89 -187 -381
7949 -381 244 214 314 189 116 -86 -349 -282 413 -123 443 342 148 -411 -571 42 -174 239 249 288 299 -258
7971 -258 -396 -380 47 104 383 242 270 47 -585 -484 -80 239 201 275 277 -21 -566 -100 -240 144 141 300 40
7994 40 145 12 -376 -158 -36 -35 303 100 160 -232 -455 -171 -60 29 424 195 -130 146 -370 -286 -347 -38
8016 -38 147 31 -30 49 19 -249 -264 170 -21 495 409 439 91 -41 -293 -161 191 393 76 254 -291 14
8038 14 -201 -514 -226 400 240 -2 1 -462 -283 76 -262 -196 400 151 -84 -242 -187 -361 -51 297 235 113
8060 113 323 -89 -198 -244 -165 136 282 331 61 -62 -325 -199 162 -170 141 189 349 -98 -157 -447 -391 111
8082 111 156 279 416 -18 -286 -291 -401 122 193 518 153 -113 -203 -420 -451 61 328 158 402 29 21 -255 -312
8105 -312 -233 -104 259 357 -127 120 -201 -284 -148 -66 466 283 218 -113 31 -10 -380 39 285 7 203 -178
8127 -178 68 13 -197 -195 188 349 238 395 -130 -65 -123 -252 -253 9 528 71 268 -131 -620 58 -115 101
8149 101 396 359 216 -282 -411 -467 -346 23 200 -185 194 -312 -117 -203 -34 99 27 433 21 46 -252 -404
8171 -404 -239 270 353 123 398 172 96 33 -367 127 65 150 300 263 98 -308 -268 395 9 103
8191A03
$$ Imaginary data points
##PAGE= N=2
##DATA TABLE= (X++(I..I)), XYDATA
0 0 0 0 0 0 0 0 -3 8 -8 8 -8 16 -16 16 -24 25 -32 40 -48 56 -64 73 -85 98 -114 129 -146 166 -186 212
30 212 -238 267 -299 334 -374 415 -462 514 -569 629 -698 772 -854 946 -1049 1165 -1294 1441
48 1441 -1618 1816 -2056 2345 -2701 3158 -3764 4607 -5870 7967 -12083 23233 -116934 -349551
62 -349551 -91345 134997 93722 -34016 66916 190378 57692 -218012 -246566 -24670
72 -24670 137026 98348 57685 92682 55572 -113758 -201226 -88299 66383 93324 77378
83 77378 111668 90101 -83965 -230282 -143396 67846 133718 52061 33218 98804 43117 -158872
95 -158872 -243679 -64528 156764 167661 39889 -8876 17707 -34798 -152406 -150019 16185
106 16185 166749 157203 47663 -41086 -86866 -110430 -88713 -6231 84099 121729 102218 38778
118 38778 -61903 -150657 -138076 -13288 108208 125399 70953 24437 -15397 -85990 -140185
129 -140185 -89066 47806 144608 126095 37792 -44990 -96111 -108797 -69051 11417 84144 113053
141 113053 91053 16451 -91927 -156140 -102961 27633 108054 89940 49061 35078 -9417
152 -9417 -111048 -159577 -56777 105933 153748 70876 -8511 -26110 -52542 -109456 -98075 24468
164 24468 139629 128200 31680 -40801 -71092 -97164 -89022 -819 107579 126137 53744 -16500
176 -16500 -50770 -88481 -113361 -46589 90121 154221 79273 -29160 -60594 -53453 -79026 -82088
188 -82088 16125 140817 141601 15694 -85556 -85538 -55466 -50794 -14900 80308 139809 77472 -44121
201 -44121 -103887 -85137 -50587 -10505 60051 119869 92893 -7760 -84907 -89549 -61837 -27921
213 -27921 34986 109426 114110 22011 -78948 -99812 -60893 -23051 14466 75934 114783 64595
225 64595 -45990 -111021 -87686 -28294 18523 61636 96558 77029 -8436 -90763 -101870 -53556
237 -53556 4255 55170 93207 84858 11867 -74271 -101613 -64203 -9384 37340 80353 93745
249 93745 40762 -53387 -106217 -79437 -16478 32520 67054 87700 60912 -20119 -95976 -98027
261 -98027 -37328 25337 63102 82287 69609 5677 -75023 -102730 -57794 10137 54756 76160
273 76160 73888 26741 -53706 -102738 -75488 -5348 48586 69750 70677 41281 -27593 -93569 -93401
286 -93401 -27973 40776 70475 69574 47014 -6261 -74084 -99489 -52665 23069 68721 72838 52360
299 52360 9212 -53252 -93612 -69791 2572 62020 75946 57633 20225 -35183 -84460 -81117
311 -81117 -18449 51075 78496 63815 29183 -20096 -72071 -88117 -41564 32692 76363 70691
323 70691 37366 -7250 -57592 -86851 -60469 10501 68527 76075 45053 2488 -43541 -78978
335 -78978 -71674 -11273 56556 80405 54649 11499 -31989 -68885 -76277 -31700 39973 81442
347 81442 66943 22193 -21734 -57946 -74470 -48224 18079 74272 77156 34954 -13312 -49508
359 -49508 -68534 -56668 -2929 59866 81461 48385 -3779 -44328 -65228 -60884 -19632 42548
371 42548 80027 62362 9462 -38368 -63040 -62640 -33015 23784 72651 73286 26792 -27522 -58919
384 -58919 -63221 -41017 7611 60055 77237 43385 -13035 -53505 -64420 -46998 -4661 47312
396 47312 76013 55784 2502 -45543 -64828 -53477 -17484 33424 70993 65449 18276 -35148
408 -35148 -62897 -58327 -28957 17752 61196 70318 33423 -22462 -59033 -61398 -36435 4989 49558
421 49558 70368 46182 -7810 -52660 -63387 -43778 -5672 38603 67878 57286 8477 -42966
433 -42966 -64271 -50225 -15447 27486 61637 64022 24773 -30511 -62341 -55821 -24333 15980
445 15980 52340 65170 38626 -15372 -58414 -62005 -32589 6992 43310 62350 48350 1048
457 1048 -49352 -66803 -43915 -2090 35876 58239 53516 16182 -34830 -64986 -54106 -14713
469 -14713 26981 54746 56698 27729 -21365 -58982 -59229 -25485 17327 48447 57717 37986 -7004
482 -7004 -51220 -63556 -36435 7913 42897 56282 43926 6718 -39194 -63797 -48168 -5046
494 -5046 35964 55857 48477 16814 -27534 -58143 -54239 -17991 25474 52170 53156 27199 -15962
507 -15962 -53536 -58841 -27594 16341 47230 52927 34903 -2442 -43756 -62622 -41610 4786
519 4786 43703 54082 39054 7108 -31884 -57836 -50594 -10684 34009 55780 45850 14883 -22676
532 -22676 -51706 -53849 -22454 22548 51909 50775 24774 -12382 -45200 -56088 -33605 11400
544 11400 47969 54336 31669 -3277 -36388 -53701 -42674 -3885 39317 57249 40917 4532
556 4532 -30422 -50239 -45599 -15710 26376 53208 47837 15916 -22377 -48529 -49270 -23947 16236
569 16236 48069 51444 25644 -12722 -43487 -51472 -32742 5445 41384 53763 35588 -2140
581 -2140 -37059 -51403 -38827 -4505 32638 52090 42588 10020 -27259 -49666 -45506 -15189 24712
594 24712 50014 46357 17453 -18786 -44026 -48223 -26159 12090 44987 51935 27508 -10514 -41206
607 -41206 -48832 -32492 1688 35959 50529 36156 1588 -33050 -49753 -39915 -7812 29784
619 29784 49936 40532 9394 -24395 -44155 -42675 -19046 18050 48447 49524 19593 -19454 -43091
632 -43091 -43141 -22589 7815 37488 49978 33133 -5360 -40661 -50340 -30540 3512 33678 45536
645 45536 34133 4739 -27886 -47264 -41115 -11239 26820 49286 41376 9444 -24942 -43025
657 -43025 -39094 -18319 12514 41340 49022 25515 -15177 -44979 -45670 -21502 9841 34425 43584
670 43584 31281 89 -33265 -48138 -34651 -945 33013 47620 34713 2969 -27242 -41272
682 -41272 -35010 -12921 18036 44312 46181 16883 -24318 -47595 -38789 -12115 13523 31753 40644
695 40644 29568 -4479 -41998 -51142 -25515 12310 35723 38547 26287 2440 -26823 -45236
707 -45236 -36113 -3832 29698 44650 35220 7348 -24906 -44325 -36839 -8898 20800 37623 37322
720 37322 20695 -10630 -42520 -48279 -20133 20007 41035 34830 17565 -2697 -25622 -44013
732 -44013 -37188 678 39402 48325 24553 -6346 -26145 -34778 -32264 -11806 21995 45927 39551
745 39551 7663 -25171 -40389 -35071 -13080 16751 38292 38872 16407 -12988 -34519 -39238 -24507
758 -24507 6858 37843 45257 22805 -11317 -32533 -33801 -23824 -4615 22555 44360 38414 2365
771 2365 -34379 -44342 -26137 -845 18396 32118 35991 18253 -16881 -44675 -41196 -11180 20455
784 20455 35887 33342 17297 -7595 -32433 -40723 -23952 7439 33471 39868 25183 -3277 -31174
797 -31174 -41215 -26625 1793 26468 35647 29138 8887 -20248 -42243 -38202 -7729 26130 39273
810 39273 28740 8764 -11956 -30192 -38136 -23133 11910 40463 40538 14883 -14119 -29760 -32244
823 -32244 -22081 -158 28065 41985 28953 -3140 -30572 -38109 -25241 -1702 22576 36508
835 36508 31016 6756 -21338 -36860 -32341 -10993 16746 36621 35854 12847 -17696 -34980 -32033
848 -32033 -14591 7878 28559 37361 24577 -6931 -35335 -39374 -18768 7470 25020 31710 26493
861 26493 5918 -23775 -41460 -31376 -896 26627 35005 26200 7863 -14994 -34031 -34585 -13135
874 -13135 17298 36011 32742 13213 -11696 -30933 -35062 -19301 9341 31757 33838 18995 -4234
887 -4234 -26037 -36458 -26454 908 28778 36707 22555 -248 -20535 -31733 -29474 -9136 20325
900 20325 38512 31269 5515 -18999 -30547 -28510 -13475 10770 33038 35893 15819 -12713 -31194
913 -31194 -31828 -17194 5842 27392 35299 22095 -4219 -27256 -33967 -23185 -842 22797 35026
926 35026 27232 2826 -22431 -34097 -27004 -6870 16668 32758 31018 10696 -15958 -32769 -30490
939 -30490 -12305 11580 29546 32275 16792 -8250 -29263 -33144 -18874 5410 27019 33373 21648
952 21648 -2224 -23965 -32632 -23811 -2229 21372 33674 26527 4054 -19908 -31829 -26649 -8003
965 -8003 15114 31368 30450 11332 -14479 -31185 -29372 -12939 9259 27907 31869 17685 -7600
978 -7600 -28349 -31482 -18266 3426 23361 32328 23821 -265 -24118 -33213 -22430 -1635 18780
991 18780 30434 27161 7765 -18084 -32688 -27100 -7299 14725 28278 28663 13805 -10717 -30316
1004 -30316 -31233 -13606 9410 26278 29121 18300 -3705 -25670 -32883 -19974 3328 23191 29547
1017 29547 21915 2624 -19981 -32328 -24559 -2397 19267 29310 24836 8283 -14165 -29986
1029 -29986 -28382 -9232 14047 28327 27068 12917 -8563 -27041 -30483 -15800 8139 25899
1041 25899 28774 17186 -3023 -22973 -31118 -20910 1923 22503 29161 21016 2585 -17976 -30623
1054 -30623 -25680 -4718 18449 29077 23921 7787 -12538 -27640 -28679 -11559 12701 27881
1066 27881 26926 12499 -7259 -24259 -29619 -17490 6176 25545 28536 16482 -2408 -20000 -29115
1079 -29115 -22403 -847 21612 29776 20207 2305 -16057 -26986 -25492 -7888 15882 29901 24518
1092 24518 6665 -12319 -24579 -26129 -13786 9317 27599 28558 11935 -8347 -22297 -25798 -17154
1105 -17154 1932 23311 30189 18186 -3329 -20473 -25998 -20001 -3330 17665 29651 23038 2996
1118 2996 -17169 -25997 -22763 -8218 12477 27752 26382 8592 -12470 -24878 -24442 -12548 6406
1131 6406 24293 28837 14913 -7405 -23559 -25647 -15844 1118 19354 28446 20222 -763 -20121
1144 -20121 -26681 -19279 -2850 15556 27156 23264 5562 -15221 -25732 -22727 -8114 10952 25331
1157 25331 25897 10539 -10991 -24249 -23437 -11795 5180 21469 27771 16425 -5757 -23801 -25652
1170 -25652 -14602 2164 17004 26221 20326 1296 -19058 -27245 -19133 -2492 14611 24891 23102
1183 23102 6574 -14338 -25675 -21802 -7036 9404 22689 25944 12850 -9658 -26010 -24372
1195 -24372 -9818 6370 18368 23826 18070 -1004 -22586 -28584 -15577 3985 17283 22230 18841
1208 18841 4379 -15591 -27591 -21486 -2659 14950 23362 21158 8498 -11072 -25948 -23679 -7009
1221 -7009 10964 20933 21470 13532 -4276 -23272 -27639 -12697 8448 20553 21002 13607 1212 -16104
1235 -16104 -27192 -20177 1395 20161 24587 15924 2456 -12541 -23759 -22270 -6207 14325 24232
1248 24232 20114 7066 -9513 -22602 -24357 -10376 10400 23107 21412 10284 -4380 -18601
1260 -18601 -24991 -16349 4499 22136 24451 12782 -2153 -14642 -22284 -19411 -3555 16480 25909
1273 25909 18655 1775 -13862 -22271 -19865 -6456 11532 23128 21239 7872 -9062 -21208 -23030
1286 -23030 -11876 8130 22292 22132 10060 -5131 -17292 -22430 -15873 1124 19353 25143 15105
1299 15105 -2152 -15985 -21677 -17253 -3030 14211 24049 19152 3472 -12340 -21467 -20268 -7549
1312 -7549 11202 23015 20867 6877 -9003 -19259 -20980 -12642 5192 21760 24176 10915 -6263
1325 -6263 -17646 -20264 -14776 -737 16558 24682 16860 -1626 -16301 -20895 -16189 -4550 11837
1338 11837 23417 20720 4145 -13185 -20502 -17623 -7599 7326 21258 23049 9403 -9660 -20604
1351 -20604 -18765 -9754 3155 17079 23233 14929 -4218 -19499 -21149 -12103 94 13179 22111
1364 22111 18296 1528 -16384 -22344 -15415 -2598 9988 19560 20626 7405 -12192 -23116 -18246
1377 -18246 -5112 8043 17313 20015 11993 -5681 -20798 -21696 -9605 5400 16139 19851 14047
1390 14047 -917 -16865 -22407 -13732 1173 13791 20154 17035 3706 -13595 -22995 -16976 -2107
1403 -2107 11547 17969 17540 8511 -7675 -21274 -21568 -7109 9531 18145 17401 9849 -3105 -16844
1417 -16844 -21553 -12998 4028 17117 20164 12839 -569 -14770 -20839 -14476 -2 13249 19380
1430 19380 16226 4854 -10660 -21761 -18879 -3523 11939 18753 15491 6810 -5663 -17618 -21037
1443 -21037 -10220 7660 19459 18618 8218 -4396 -15149 -19209 -13103 1435 15377 20373 13470
1456 13470 -73 -14229 -20751 -15182 -701 13146 18249 14431 4489 -8715 -19250 -19534 -6239
1469 -6239 11299 20390 16398 5068 -6367 -15009 -18368 -11505 4025 18267 20533 9965 -4901
1482 -4901 -15554 -18254 -12121 977 13954 19149 13680 1147 -12413 -19790 -15872 -2483 12583
1495 12583 19267 14341 2880 -8320 -16331 -17378 -8170 7632 20257 18843 6155 -8017 -15609
1508 -15609 -15970 -9937 2515 15402 19771 11799 -3404 -15152 -18085 -11929 697 13097 18465
1521 18465 13311 840 -11462 -17722 -15412 -4381 10471 19778 16475 3341 -10252 -16720 -14793
1534 -14793 -7161 4943 16905 19477 9122 -7009 -16928 -16284 -8537 2746 13699 18296 12641
1547 12641 -1490 -14253 -18108 -12070 -255 11770 17945 14067 1616 -11500 -17062 -13917 -3715
1560 -3715 7894 17171 16833 5759 -9016 -17615 -15238 -5614 5378 14328 17020 9949 -4142 -16262
1574 -16262 -17722 -8872 3407 13244 16710 11810 -102 -13125 -18068 -12350 4 11425 16723
1587 16723 13803 3025 -9987 -17776 -14504 -3578 8295 15525 15378 6606 -6715 -16840 -16715 -6698
1601 -6698 6225 14379 15752 9430 -2758 -14099 -17637 -10222 2472 13378 16322 11116 57
1614 57 -11404 -17065 -12697 -1187 10684 16681 13331 3343 -8814 -16557 -14492 -4355 7793 15708
1628 15708 14682 6247 -5504 -15052 -15971 -7872 4980 14516 15281 8930 -2411 -13044 -16607 -10844
1642 -10844 1771 12193 16075 11222 738 -10956 -16641 -13051 -2000 10329 15992 13244 3646
1655 3646 -7895 -15396 -14859 -4853 7441 15375 14261 6369 -4871 -13863 -15781 -8605 4208 14275
1669 14275 15703 8841 -2205 -11788 -16071 -11166 43 11870 16299 10969 653 -9787 -15354
1682 -15354 -13108 -3220 8970 15759 13146 3783 -7341 -14525 -14639 -5925 5750 14784 14919 6463
1696 6463 -4725 -13079 -14582 -8366 2638 12879 15608 9510 -2010 -11627 -14790 -10710 -321 10497
1710 10497 15724 12271 1327 -9502 -14979 -12448 -3374 7742 14922 13701 4472 -7159 -14391 -14018
1724 -14018 -6170 5271 13183 14621 7539 -3907 -13024 -14982 -8754 2297 11825 15170 10000 -663
1738 -663 -10877 -15089 -10688 -645 9887 15220 12113 2032 -8571 -14423 -12465 -3724 7416 14251
1752 14251 13680 4980 -6237 -13765 -13820 -6605 3985 12880 14440 7794 -3546 -12216 -14242 -8729 1514
1767 1514 10841 14618 9972 -411 -10663 -14595 -10497 -1330 8770 14301 12451 2639 -8014 -14410
1781 -14410 -12413 -3510 6331 13674 13501 5625 -5166 -13210 -13789 -6640 3825 12089 13877 8130 -2100
1796 -2100 -11656 -14697 -9131 1273 10473 14242 10204 484 -9323 -14802 -11449 -1775 8591 13666
1810 13666 11388 3492 -6837 -13579 -13217 -5269 5643 13453 13152 5730 -4334 -11936 -13246 -7454
1824 -7454 2719 11994 13742 8483 -1837 -10635 -14037 -9084 386 9674 14259 10371 1049 -8470
1838 -8470 -13866 -11308 -2779 7679 13644 12105 3568 -6925 -12933 -12293 -5181 4588 12197 13347 6581
1853 6581 -4243 -12435 -13390 -7000 2789 10453 13458 8789 -826 -10240 -14088 -9860 71 9547 13400
1868 13400 10145 1688 -7715 -13449 -11647 -3253 6577 13468 12190 4351 -6129 -12433 -12135 -5724 3855
1883 3855 11637 12724 7105 -2831 -11225 -13508 -7855 1797 10550 13339 8422 -551 -9024 -13175 -10145
1898 -10145 -1227 8799 13707 10714 1646 -7673 -12468 -10571 -3660 5123 12078 12512 5723 -5134
1912 -5134 -12688 -12174 -5166 4073 10300 11934 7457 -1491 -10343 -13453 -8346 1394 10413 12925 8733
1927 8733 318 -8658 -12516 -10091 -1554 7340 12707 10902 3067 -6530 -12972 -11387 -3348 5948 11565
1942 11565 11285 5872 -3349 -11191 -13116 -6602 3662 11325 11847 6252 -1330 -8993 -11976 -9160 -208
1957 -208 9340 13434 8918 16 -8160 -11950 -9662 -2330 6458 12163 11069 3261 -5863 -11991 -11134
1972 -11134 -4425 5032 11573 11512 5431 -3710 -10509 -12058 -7192 2186 10389 12501 7472 -1791 -9426
1987 -9426 -11827 -8035 -295 7862 12233 9499 1698 -7959 -12760 -9958 -2104 6322 10921 10385 3872
2002 3872 -5153 -11534 -11501 -4939 4819 11416 11298 5439 -2750 -9839 -11830 -7430 1723 10056 12129 7547
2018 7547 -665 -8445 -11605 -8985 -1107 8213 12191 9190 1361 -6414 -11346 -9927 -3519 5624 11809
2033 11809 10733 3558 -5078 -10140 -10911 -5649 3029 10380 12087 6038 -3243 -9749 -11123 -7351 1046
2048 1046 8509 12195 8183 -502 -8514 -11228 -8023 -1313 6574 11481 10008 2116 -6918 -11322 -9373
2063 -9373 -2846 4503 10124 10956 4856 -4204 -10911 -11176 -5091 3263 9277 11064 6596 -1823 -9285
2078 -9285 -11786 -7193 583 7944 11411 8696 543 -8036 -11791 -8312 -1233 6182 10595 10090 3056
2093 3056 -5662 -11502 -10380 -3170 4749 9878 9930 4988 -3084 -9619 -11128 -5668 2804 9713 10951
2108 10951 6962 -1395 -8405 -11013 -7221 199 7594 10768 8391 1307 -6960 -11476 -9146 -1409 6451
2123 6451 10018 8981 3579 -4795 -10833 -10841 -4135 4456 10197 10164 4791 -2917 -9178 -11043 -5863 1542
2139 1542 8821 10953 6723 -643 -8308 -10949 -7647 220 7575 10620 8154 1703 -5860 -11036 -9613
2154 -9613 -2161 6451 10425 9001 2994 -3962 -9647 -9923 -4941 3530 9803 10140 5102 -2750 -8689
2169 -8689 -10081 -5921 1618 8455 10331 6724 -227 -7686 -10870 -8025 -495 7350 10223 8128 1648
2184 1648 -5588 -10094 -9567 -3040 5664 10584 9756 3451 -4015 -8974 -9672 -4733 2704 9268 10247 5300
2200 5300 -2058 -8431 -10283 -6559 1424 8307 10556 6833 -64 -6752 -10336 -8232 -1416 6513 10627
2215 10627 8537 1499 -5313 -9206 -8448 -3426 4048 9992 9849 3862 -3905 -9000 -9367 -4861 2148
2230 2148 8696 10203 5684 -2111 -8297 -9767 -6293 189 7223 10165 7412 361 -7025 -9912 -7692
2245 -7692 -1679 5346 10168 9059 2546 -5671 -9589 -8161 -2867 3596 8922 9732 4632 -3291 -8975
2260 -8975 -9179 -4880 2087 8042 9714 6040 -1208 -7761 -9665 -6584 145 6915 9858 7771 788
2275 788 -6477 -9971 -7839 -1830 4730 9250 8523 3080 -4637 -9700 -8419 -3610 3258 8550 9434 4826
2291 4826 -2672 -8599 -9449 -5260 1811 7853 9745 6240 -663 -7361 -9947 -6464 103 6119 9258
2306 9258 7659 1038 -6180 -10094 -7501 -1535 4719 8642 8374 3241 -4124 -9345 -8721 -3401 3499
2321 3499 8154 8527 4813 -2102 -8227 -9714 -5211 1851 7190 9041 6252 239 -6731 -9570 -7045
2336 -7045 -241 6560 9408 7017 1806 -5090 -9183 -7897 -2288 5129 8859 8083 2947 -3439 -8537
2351 -8537 -9183 -4327 3088 8061 8807 4724 -1788 -7519 -9429 -6154 1062 7336 8856 5916 -261
2366 -261 -6109 -8837 -7356 -805 5842 8629 7169 1895 -4840 -8397 -8069 -2397 4486 8674 8178 3151
2382 3151 -3026 -7926 -8600 -4430 2981 8052 8891 4787 -1228 -6876 -8947 -6084 645 7195 8906
2397 8906 6159 65 -5667 -8523 -7195 -1387 5568 9015 7067 1323 -4773 -8131 -7994 -3501 3534
2412 3534 8547 8465 3237 -3253 -7213 -8525 -4758 1537 7802 9211 5245 -1530 -6652 -8100 -6193
2427 -6193 -221 6316 9290 6759 270 -6117 -8290 -6718 -1763 4485 8712 8168 2118 -4469 -8108
2442 -8108 -7376 -3434 2877 7506 8508 4373 -2706 -7921 -8335 -4376 1456 6646 8785 5594 -712
2457 -712 -6870 -8284 -5606 -342 5859 8761 6702 905 -5521 -8289 -6793 -1685 4329 8276 7607
2472 7607 2791 -4163 -8237 -7700 -3349 3057 7459 8235 4284 -2149 -7253 -7993 -4434 1126 6315 8287
2488 8287 5769 -761 -6325 -8615 -5894 -382 5133 7848 6685 1696 -4987 -8206 -6706 -1790 3851
2503 3851 7597 7354 3043 -3556 -7911 -7483 -2906 2296 6864 7747 4705 -1851 -6956 -8426 -4245 1535
2519 1535 5991 7470 5377 358 -5633 -8739 -5878 -362 5410 7718 6339 2089 -4133 -8136 -7267
2534 -7267 -2226 3761 7521 7067 2936 -2687 -7367 -7917 -3441 2275 6705 7234 4532 -746 -6125 -8371
2550 -8371 -5437 976 6413 7477 4933 117 -4886 -7931 -6456 -1515 4653 8063 6349 1593 -3930
2565 -3930 -7596 -6814 -2468 3301 7112 7179 3284 -2643 -7130 -7752 -3770 2330 6608 7361 4366 -874
2581 -874 -5618 -7866 -5787 196 6147 7903 5325 -279 -4586 -7271 -6328 -1843 4361 7722 6194
2596 6194 1731 -3401 -7030 -6644 -2745 3050 7231 6818 2982 -1982 -6265 -7640 -3939 1618 7083
2611 7083 7794 4365 -1237 -5274 -7175 -5228 -592 5316 7700 5888 407 -4887 -7200 -5998 -1614
2626 -1614 4043 6934 6528 2449 -3304 -6830 -6924 -3144 2348 6842 7190 3196 -2303 -5918 -6928 -4463
2642 -4463 598 5626 7642 4891 -1039 -5821 -7032 -5090 -594 4243 7014 6245 1477 -4592 -7556
2657 -7556 -6145 -1211 3834 7024 6500 2204 -3168 -6378 -6698 -3137 1815 6582 7302 3853 -1999 -6243
2673 -6243 -6722 -4285 615 5025 7213 5296 -265 -5712 -7227 -5072 -593 4320 6673 5733 1263
2688 1263 -3881 -7129 -5949 -2039 3061 6826 6785 3069 -3053 -6844 -6546 -3018 1488 5521 7199 4654
2704 4654 -1271 -6101 -7086 -3783 984 4815 6414 5096 470 -4693 -7144 -5719 -208 4207 6629
2719 6629 5642 1638 -3186 -6904 -6368 -2153 3035 6365 6406 3155 -2147 -6335 -7249 -3188 1893 5812
2735 5812 6347 3915 -362 -5060 -7188 -4964 437 5252 6788 4662 464 -3906 -6810 -5886 -1192
2750 -1192 4171 6700 5495 1614 -3055 -6341 -5814 -2624 2873 6523 6335 2887 -1953 -5760 -6678 -3501
2766 -3501 1424 5575 6423 3995 -503 -4775 -6362 -4635 -169 4693 7040 4801 520 -4197 -6137
2781 -6137 -5212 -1299 3568 6375 5686 2272 -2540 -6118 -6019 -2485 2458 5747 6140 3082 -1345 -5586
2797 -5586 -6523 -4016 795 5295 6463 3821 -695 -4392 -6290 -4780 -267 4333 6897 5060 800
2812 800 -3925 -6150 -5362 -1758 3163 6513 5978 1908 -2761 -5753 -5954 -2799 1954 5530 6082 2844
2828 2844 -1577 -5223 -6048 -3642 384 4568 6497 4358 -37 -4886 -5986 -4640 -656 3714 6470
2843 6470 5367 899 -3715 -5870 -5265 -1645 2763 5943 5752 2418 -2369 -5497 -5558 -2502 1736 5491
2859 5491 6186 3708 -824 -5366 -6090 -3840 441 4484 6167 4023 -102 -4416 -6176 -4820 -772
2874 -772 3405 6249 4975 1068 -3270 -5830 -5373 -2045 2204 5594 5813 2750 -2033 -5449 -5542 -3034
2890 -3034 1886 4869 5932 3803 -910 -4961 -6075 -4037 552 4578 6115 4132 571 -4010 -5910
2905 -5910 -4806 -843 3025 5883 5043 1341 -2887 -6086 -5117 -2350 2597 5169 5398 2665 -1680 -5272
2921 -5272 -5857 -3056 1364 4709 5641 3530 -636 -4415 -5914 -4153 302 4263 5704 4280 717
2936 717 -3536 -5912 -4942 -970 3327 5528 5280 1602 -2865 -5198 -5518 -2409 2124 5139 5446 2634
2952 2634 -1510 -5127 -5640 -3163 1032 4512 5484 3736 -521 -4189 -5565 -4260 -103 3823 5619
2967 5619 4333 812 -3667 -5585 -4770 -1675 2802 5510 5092 1960 -2255 -4957 -5118 -2343 1949 4887
2983 4887 5346 2991 -1056 -4784 -5697 -3386 863 4564 5690 3712 -318 -3865 -5851 -4386 -216
2998 -216 3793 5413 4625 1177 -3038 -5486 -4840 -1526 2423 5670 5054 1880 -2107 -5219 -5251 -2691
3014 -2691 1602 4923 5597 3048 -894 -4135 -5551 -3640 59 4239 5401 4163 176 -3678 -5164
3029 -5164 -4099 -679 3127 5359 4470 1004 -2804 -5374 -4584 -1578 2245 4872 5056 2643 -1965 -4825
3045 -4825 -5096 -2901 1554 4535 5170 3326 -471 -4208 -5584 -3347 175 3710 5428 3809 422
3060 422 -3200 -5395 -4223 -1169 2994 5344 4597 1492 -2504 -5045 -4770 -1714 2373 4857 5084 2631
3076 2631 -1580 -4478 -5460 -3202 1037 4345 5052 3528 -546 -4047 -5405 -3700 -231 3703 5334
3091 5334 4189 845 -3250 -5086 -4098 -1014 2831 4977 4646 1491 -2212 -5133 -4946 -2095 1871 4682
3107 4682 5079 2463 -1226 -4640 -5370 -3220 627 4060 5172 3557 -118 -3508 -5472 -3615 -226
3122 -226 3588 5168 4139 831 -3053 -5312 -4368 -1195 2615 5080 4784 1805 -2260 -4695 -4946 -2185
3138 -2185 1577 4488 5053 2590 -970 -4386 -5266 -3522 563 3810 5221 3439 128 -3540 -4990
3153 -4990 -3813 -700 3026 5083 4290 927 -2730 -5019 -4443 -1307 2175 4703 4647 2267 -1903 -4562
3169 -4562 -4821 -2184 1264 4317 4922 3059 -620 -3892 -5106 -3358 217 3566 4809 3632 658
3184 658 -3124 -5130 -4095 -743 2922 4770 4231 1291 -2178 -4482 -4382 -1869 1919 4678 4794 2211
3200 2211 -1523 -4119 -4523 -2689 1169 3832 4703 2948 -1026 -4074 -4886 -3407 90 3698 4919 3820
3216 3820 533 -3216 -4754 -3782 -915 2622 4610 4302 1337 -2138 -4639 -4269 -1496 1412 4147 4434
3232 4434 2324 -1365 -4238 -4860 -2691 1037 3716 4718 3147 -406 -3497 -4911 -3397 -176 3470
3247 3470 4621 3770 650 -2953 -4795 -4188 -838 2510 4296 4065 1520 -1446 -4302 -4612 -1792 1737
3263 1737 4363 4209 2323 -846 -3745 -4619 -3066 788 4059 4796 2840 -253 -3613 -4671 -3476 -699
3279 -699 3016 4767 3790 802 -2640 -4664 -4230 -1540 2098 4631 4059 1633 -1698 -4095 -4327 -2079
3295 -2079 1458 4127 4272 2165 -721 -3806 -4326 -2677 -86 3454 4527 3253 203 -2980 -4813
3310 -4813 -3519 -371 2475 4263 3542 1277 -2420 -4208 -4212 -1585 1993 4173 4001 1865 -1356 -4114
3326 -4114 -4350 -2366 1019 3996 4494 2596 -393 -3241 -4427 -2827 197 3246 4262 3271 425 -2773
3342 -2773 -4518 -3926 -602 2452 4369 3626 1056 -2172 -4280 -4162 -1475 1699 4367 4442 1717 -1513
3358 -1513 -3977 -4018 -2078 799 3562 4642 2766 -415 -3406 -4045 -3025 -108 2903 4294 3444 613
3374 613 -2667 -4368 -3495 -992 2165 4155 3874 1106 -1950 -4158 -3955 -1456 1212 3775 4068 1887
3390 1887 -1018 -3787 -4124 -2334 671 3401 4240 2680 -236 -3214 -4197 -3224 -319 2883 4096 3135
3406 3135 416 -2457 -4085 -3410 -708 1754 3830 4070 1355 -1454 -3763 -3830 -1425 1219 3174 4099
3422 4099 2283 -642 -3844 -3982 -2157 477 2852 3951 2572 -109 -2653 -3935 -3155 97 2382
3437 2382 3842 3004 441 -2330 -3935 -3608 -1052 1941 3396 3586 1486 -1385 -4027 -3856 -1759 1777
3453 1777 3360 3535 2112 -460 -3510 -3900 -2445 580 3251 3783 2717 325 -2707 -3885 -3110 -542
3469 -542 2450 3841 3061 872 -2115 -3901 -3513 -1030 1946 3712 3696 1889 -1322 -3601 -3764 -2051
3485 -2051 821 3422 3857 2201 -763 -2903 -3619 -2631 363 2503 3902 2868 287 -2799 -3959 -3146
3501 -3146 -667 2220 3729 3014 959 -1786 -3623 -3572 -1537 1383 3722 3642 1254 -1358 -2981 -3782
3517 -3782 -1727 535 2967 3825 2370 -519 -2764 -3802 -2775 421 2750 3885 2920 84 -2439
3532 -2439 -3547 -2883 -670 2241 3669 3102 1011 -1881 -3559 -3309 -1361 1204 3419 3997 1740 -1429
3548 -1429 -3276 -3627 -1893 623 3220 3774 2508 -548 -2642 -3578 -2313 -358 2239 3895 2953 597
3564 597 -2451 -3596 -3211 -769 1621 3615 3488 1358 -1781 -3520 -3432 -1475 1388 2965 3647 1985
3580 1985 -1014 -3416 -3815 -1991 599 2741 3787 2653 -14 -2570 -3825 -2429 93 2193 3508
3595 3508 3139 667 -1841 -3211 -3087 -968 1695 3289 3320 1430 -1320 -3201 -3462 -1247 1220 2782
3611 2782 3586 1775 -820 -2992 -3493 -2107 458 2860 3408 2689 -74 -2745 -3609 -2495 -87 1725
3627 1725 3361 3242 895 -1921 -3455 -3031 -1000 1609 3229 3274 1589 -1287 -3073 -3296 -1575 1120
3643 1120 3166 3387 2315 -318 -2821 -3644 -2418 367 2431 3415 2375 392 -2451 -3679 -2658 -425
3659 -425 2284 3376 2878 674 -1633 -3300 -3331 -1184 1636 3280 3453 1369 -868 -2893 -3616 -1786
3675 -1786 904 2976 3317 1953 -598 -2345 -3403 -2197 424 2354 3472 2573 193 -1942 -3234
3690 -3234 -2936 -797 1802 3121 2890 580 -1640 -3107 -3291 -1057 1350 3031 3160 1441 -1202 -2759
3706 -2759 -3458 -1990 379 2770 3220 1975 -335 -2591 -3362 -2291 -143 2352 3479 2455 227 -1683
3722 -1683 -3222 -2814 -465 1847 3260 3035 934 -1558 -3209 -2985 -1476 974 2786 3391 1719 -743
3738 -743 -2656 -2868 -2227 255 2526 3566 2468 -212 -2250 -3436 -2345 -309 2065 3232 2567 582
3754 582 -1678 -3005 -2943 -830 1348 3342 2967 945 -1244 -3087 -2998 -1182 952 2787 2838 1690 -704
3771 -704 -2952 -2990 -1956 272 2353 3460 2073 -204 -2528 -3085 -2224 -290 1750 2940 2633 690
3787 690 -1551 -2856 -2995 -844 1516 3162 2841 935 -1059 -2934 -2925 -1473 561 2668 3312 1677 -398
3804 -398 -2513 -3046 -2125 553 2371 2919 2546 107 -1832 -3232 -2388 -429 1808 2907 2667 743 -1627
3821 -1627 -3197 -2537 -1064 1055 2769 2894 1225 -1303 -2720 -2922 -1301 745 2577 3001 2341 -211
3837 -211 -2342 -3343 -2201 171 2109 2985 2190 279 -1919 -3186 -2458 -656 1624 2735 2289 891
3853 891 -1309 -2997 -2581 -1160 1121 3007 2975 1676 -771 -2680 -2877 -1750 687 2496 2742 1653
3869 1653 -271 -2260 -2818 -2216 -370 2208 2899 2387 211 -1717 -3027 -2180 -954 1475 2786 2640
3885 2640 950 -1316 -2444 -2577 -1220 1183 2835 2910 1386 -658 -2416 -2770 -1688 217 2251 2746
3901 2746 1955 -154 -1863 -2899 -2269 -343 1994 3049 2261 551 -1414 -2596 -2702 -607 1439 2624
3917 2624 2641 1165 -880 -2241 -2732 -1423 616 2271 2628 1292 -324 -2108 -2932 -1519 226 2128
3933 2128 2943 2091 -88 -1797 -2969 -2190 -578 1689 2831 2422 557 -1668 -2730 -2102 -1137 1363
3949 1363 2665 2452 1096 -948 -2493 -2682 -1178 431 2596 2710 1608 -484 -1966 -2513 -2136 50
3965 50 2126 2797 2044 -111 -1788 -2880 -2250 -417 1665 2477 2281 618 -1256 -2440 -2506 -860 1185
3982 1185 2551 2554 1115 -733 -2160 -2568 -1391 585 2290 2716 1587 -366 -1908 -2706 -1938 196 2105
3999 2105 2729 2219 130 -1529 -2537 -1875 -547 1212 2353 2330 750 -939 -1998 -2493 -1255 1172
4015 1172 2313 2286 1319 -510 -2135 -2559 -1739 255 1703 2714 1860 -115 -2002 -2547 -1809 52 1519
4032 1519 2704 2262 790 -1454 -2666 -2158 -492 1147 2299 2040 868 -1035 -2497 -2464 -914 1012
4048 1012 2514 2452 1497 -440 -2121 -2709 -1558 209 2031 2334 1825 -72 -1661 -2426 -2046 82 1431
4065 1431 2733 1942 675 -1341 -2370 -2330 -1021 1263 2760 2345 636 -789 -2227 -2529 -1249 610
4081 610 2244 2376 1232 -547 -2147 -2511 -1562 187 1525 2676 2074 185 -1661 -2421 -1906 -480 1750
4098 1750 2219 1842 697 -1268 -2654 -2180 -829 1453 2440 2359 1049 -804 -2014 -2434 -1164 593 2226
4115 2226 2322 1530 -146 -1795 -2731 -1850 47 1732 2346 1939 379 -1510 -2515 -1911 -666 1407 2580
4132 2580 1677 606 -1315 -2105 -2201 -790 698 2034 2132 1062 -656 -2076 -2302 -1319 -12 1777 2515
4149 2515 1354 -207 -1553 -2300 -1710 -13 1381 2434 1953 640 -1381 -2578 -1971 -493 912 2007
4165 2007 2136 761 -883 -1860 -2247 -465 656 1939 1864 1203 -765 -2179 -2253 -1101 137 1616 2277
4182 2277 1550 -207 -1716 -2469 -1777 -94 1813 2165 1683 800 -1219 -2069 -1940 -917 1094 2055 1846
4199 1846 932 -936 -1945 -1938 -1027 644 1849 2384 1065 -483 -2074 -2195 -1264 414 1754 2338 1680
4216 1680 -181 -1863 -2217 -1683 -190 1277 2098 1736 528 -1148 -2021 -1680 -631 776 2046 1866 778
4233 778 -774 -2156 -1851 -704 750 1715 2037 1429 -148 -1619 -2139 -1162 42 1197 2110 1392 -112
4250 -112 -1485 -2010 -1661 -402 1514 2243 1845 807 -1290 -2185 -2082 -735 1003 2163 1973 1031 -587
4267 -587 -2114 -2315 -937 716 1623 2178 966 -453 -1721 -2158 -1514 -64 1510 2032 1458 324 -1301
4284 -1301 -2041 -1801 -507 1482 2129 1713 531 -948 -2129 -1861 -718 572 1846 2037 964 -696
4300 -696 -1464 -1838 -1145 382 1770 2136 1055 -40 -1515 -1938 -1138 -38 1265 1743 1565 456 -1233
4317 -1233 -2191 -1696 -71 851 2267 1820 487 -1091 -2222 -1622 -962 614 1912 2097 969 -741 -1640
4334 -1640 -2021 -1245 44 1532 2178 1209 -86 -1782 -2000 -1399 73 1391 2303 1597 308 -1250 -1853
4351 -1853 -1496 -223 1068 1842 2047 639 -909 -1823 -1920 -815 421 1742 1696 1257 -401 -1677 -2202
4368 -2202 -1241 425 1637 2154 1366 -138 -1155 -1792 -1292 142 1387 1788 1632 328 -1087 -1796 -1699
4385 -1699 -305 1413 1899 1775 793 -872 -1795 -1658 -1007 544 1981 2056 991 -411 -1591 -2023 -1179
4402 -1179 146 1460 1728 1264 -26 -1251 -1939 -1335 -201 1046 1787 1593 348 -848 -2029 -1488 -485
4419 -485 658 1598 1741 665 -1048 -1662 -1542 -1316 454 1445 2039 1256 -367 -1512 -1756 -1550 141 1438
4437 1438 1734 1488 209 -1517 -1891 -1490 -342 1199 1618 1450 150 -743 -1748 -1368 -886 811 1917
4454 1917 1629 948 -494 -1522 -2069 -1049 453 1517 1629 1026 -92 -1185 -1382 -1227 -211 1365 1956
4471 1956 1557 305 -990 -1984 -1460 -374 745 1830 1651 542 -856 -1762 -1832 -569 658 1773 1824
4488 1824 946 -536 -1655 -1800 -1030 111 1397 1778 1072 -281 -1301 -2025 -1400 -207 1182 1672 1422
4505 1422 415 -1093 -1698 -1443 -245 864 1727 1632 556 -519 -1745 -1664 -871 680 1519 1553 969 -414
4523 -414 -1346 -1861 -1207 170 1377 1814 983 49 -1084 -1500 -1465 26 1216 1918 1456 189 -905 -1811
4541 -1811 -1757 -533 1059 1529 1441 722 -328 -1848 -1564 -847 650 1632 1838 1024 -279 -1229 -1774 -1040
4559 -1040 -6 1146 1377 978 24 -1305 -1913 -1323 -380 1241 1671 1466 610 -856 -1433 -1557 -475 826
4577 826 1644 1512 735 -482 -1791 -1749 -936 766 1508 1933 929 -192 -1404 -1846 -1118 13 1352 1580
4595 1580 1251 216 -977 -1412 -1447 -629 968 1715 1379 258 -851 -1364 -1443 -382 846 1310 1329 655
4613 655 -202 -1635 -1655 -1040 168 1306 1591 881 118 -1449 -1636 -1062 -39 818 1722 1539 229 -759
4631 -759 -1760 -1483 -175 856 1545 1781 204 -957 -1701 -1541 -543 457 1455 1594 759 -567 -1232 -1434
4649 -1434 -990 315 1298 1711 826 -197 -1272 -1419 -1135 -129 758 1553 1220 -259 -807 -1621 -1004 -271
4667 -271 705 1701 1274 627 -795 -1381 -1543 -956 286 1113 1661 899 -387 -1546 -1903 -968 141 1278
4685 1278 1610 1026 -2 -1273 -1664 -933 -177 751 1529 1269 259 -794 -1660 -1213 -258 918 1499 1351
4703 1351 577 -526 -1648 -1304 -528 439 1133 1409 973 -149 -1187 -1518 -1091 -230 1213 1491 893 -28
4721 -28 -955 -1562 -1041 -344 663 1669 1295 102 -1064 -1535 -1240 -421 462 1413 1424 851 -227 -1372 -1286
4740 -1286 -860 379 1145 1633 892 -477 -1431 -1630 -881 -236 1153 1737 1294 326 -947 -1495 -967 -134
4758 -134 1102 1288 1284 336 -833 -1694 -1252 -437 391 1637 1206 775 -551 -1543 -1277 -708 103 1195 1111
4777 1111 967 -249 -1004 -1397 -1142 87 1417 1293 1196 -151 -1048 -1202 -1228 -220 1078 1072 974 522 -621
4796 -621 -1286 -1436 -415 709 1341 1304 533 -215 -1159 -1496 -707 166 1269 1440 738 -80 -999 -1130 -1177 -148
4816 -148 1004 1452 1391 61 -879 -1506 -1145 -387 766 1303 1384 487 -590 -1660 -1254 -528 481 1242 1479
4835 1479 679 -317 -1043 -1085 -705 -31 1014 1715 922 -248 -1098 -1618 -957 35 1318 1436 1039 -58 -873
4854 -873 -1284 -924 -246 686 1426 1532 346 -751 -1166 -1237 -509 355 1300 1178 1134 -14 -1074 -1391 -960
4873 -960 329 1188 1459 1045 -105 -917 -1323 -878 -136 884 1317 891 550 -975 -1362 -785 -242 391 1133
4892 1133 946 555 -712 -1168 -1187 -682 293 1108 1341 638 -287 -926 -1298 -759 482 1146 1045 841 50
4911 50 -1060 -1123 -773 -219 896 1362 884 393 -526 -1150 -1258 -594 482 1466 1457 431 -730 -1037 -1283 -1022
4931 -1022 254 1199 1287 789 -119 -924 -1404 -600 363 913 1476 935 91 -808 -1356 -1322 -472 915 1384 786
4951 786 485 -666 -1199 -1001 -529 657 1121 1188 720 -278 -1155 -1300 -779 357 1115 1265 962 35 -1069
4970 -1069 -1403 -809 51 1167 1451 1043 468 -527 -1347 -1070 -291 731 1162 879 305 -552 -1414 -1363 -535
4989 -535 227 1252 1030 960 -286 -1334 -1228 -930 345 1146 1386 917 -114 -742 -1359 -980 20 814
5007 814 1218 1236 206 -861 -1138 -1123 -189 601 1286 1094 372 -886 -1062 -1240 -564 347 1120 1115 503 -398
5027 -398 -1085 -1086 -580 250 1014 1332 793 176 -679 -1333 -867 90 832 1129 1298 377 -781 -1129 -1230 -125
5047 -125 628 1060 1242 833 -650 -891 -1393 -471 184 1082 917 879 -370 -1178 -1025 -722 210 953 1148 968
5067 968 154 -685 -1089 -1073 -435 679 1223 1123 162 -1007 -1010 -907 -510 845 1275 1000 837 -348 -1074 -1164
5087 -1164 -579 137 799 1278 690 -127 -1034 -1375 -466 -36 871 1396 1098 89 -1190 -872 -937 -15 550
5106 550 912 1007 351 -345 -1182 -1039 -276 473 1117 815 410 -368 -1056 -1098 -218 220 800 819 780 -97 -727
5127 -727 -1039 -1009 3 741 1195 964 31 -884 -878 -936 -228 726 1442 986 391 -437 -974 -1152 -434 872 1215
5148 1215 834 472 -103 -752 -1081 -673 249 968 1072 661 -63 -856 -1559 -948 -123 469 924 948 -161 -807
5168 -807 -1114 -897 -432 822 1017 1003 469 -493 -915 -785 -571 424 947 1051 567 -473 -911 -1299 -750 193
5188 193 896 1125 947 15 -905 -925 -926 -203 905 1174 911 421 -444 -1043 -560 -657 463 987 971 504 -276
5209 -276 -922 -1347 -744 299 1137 904 590 -247 -1095 -1184 -831 -17 940 1498 661 18 -745 -882 -1023 -301
5229 -301 548 704 727 236 -697 -945 -585 -129 461 1196 1184 536 -744 -932 -1226 -530 76 1017 981 518 -293
5250 -293 -1165 -1363 -725 328 1061 1169 1067 -49 -548 -929 -724 102 599 1331 807 138 -448 -1195 -918
5269 -918 -389 564 805 1197 325 -181 -1316 -954 -349 152 1006 1082 674 108 -845 -1100 -583 114 831 1286
5289 1286 689 284 -846 -1120 -866 -309 696 1180 1021 360 -261 -1339 -902 -645 379 861 1200 331
5307 331 -478 -809 -1233 -866 589 825 819 668 84 -459 -1035 -618 -180 464 884 959 -20 -621 -994 -671 -256
5328 -256 643 895 1251 555 -387 -939 -967 -526 225 824 1081 634 -254 -986 -1016 -529 202 582 976 813 255
5349 255 -915 -1174 -896 -217 568 894 812 116 -469 -1058 -788 -369 287 1047 916 254 -463 -1108 -1355 -517
5369 -517 413 718 831 443 -290 -656 -918 -576 157 830 1029 451 75 -1046 -1169 -900 -200 894 1117
5388 1117 944 143 -395 -1048 -999 -119 328 1182 915 493 -264 -735 -899 -629 28 1043 1240 645 -169 -947
5408 -947 -1203 -625 -148 893 1178 747 -164 -854 -866 -961 -184 484 1102 725 -5 -199 -1205 -438 -400 320
5428 320 795 633 520 -303 -1097 -1034 -390 516 995 1287 337 -285 -764 -893 -540 89 680 1007 639 119
5448 119 -839 -1315 -752 -373 311 1039 598 149 -377 -997 -1005 -413 471 895 887 323 -331 -838 -777 -605 133 744
5470 744 928 582 -12 -809 -899 -785 193 1063 752 657 53 -507 -873 -643 -436 434 1043 903 303 -652 -1051
5491 -1051 -487 -364 286 1158 754 387 -240 -763 -1078 -328 383 840 982 395 -158 -988 -886 -926 -262 816
5511 816 983 721 200 -315 -474 -772 -169 768 1178 816 465 -305 -954 -812 -377 177 919 944 266 -171
5531 -171 -680 -892 -464 298 711 1165 696 -58 -466 -1193 -874 -209 551 835 1150 321 -422 -1116 -716 -222
5551 -222 585 1093 1139 140 -251 -870 -1057 -730 298 951 786 138 -200 -919 -895 -688 76 956 1166 641
5571 641 288 -694 -812 -872 22 931 978 789 103 -306 -924 -943 -589 132 921 814 330 -472 -731 -629 -608
5592 -608 481 1131 1080 740 -251 -786 -823 -494 -94 628 1019 560 99 -904 -1024 -947 53 762 762 822 25
5613 25 -222 -791 -967 -111 73 961 788 665 -304 -747 -901 -478 335 805 802 632 114 -496 -1114 -793 187
5634 187 506 1021 609 334 -678 -931 -541 162 531 821 893 337 -214 -809 -902 -472 184 899 1121 317
5654 317 -363 -521 -911 -437 175 1101 979 510 274 -610 -1151 -521 -227 735 1069 731 191 -772 -824 -852 -295
5675 -295 44 866 828 166 -238 -872 -683 -312 301 886 964 584 -173 -456 -818 -310 266 494 1064 832 -17
5696 -17 -370 -729 -433 -194 459 782 716 237 -451 -1026 -919 -99 206 725 782 175 -252 -876 -962 -383 236
5717 236 873 708 521 -24 -477 -764 -425 -111 700 879 475 105 -354 -1273 -817 -162 417 1046 826 137
5737 137 -336 -756 -678 -377 482 873 730 300 -298 -629 -757 -607 73 466 999 491 -316 -458 -694 -597 -39
5758 -39 605 863 601 242 -416 -1066 -610 -145 135 592 853 219 -356 -850 -819 23 309 366 933 363 -186
5779 -186 -704 -911 -591 162 754 681 343 -177 -789 -1008 -777 84 553 893 700 117 -236 -774 -679 -141 376
5800 376 668 616 533 -316 -812 -825 -118 189 685 682 315 -73 -698 -673 -449 116 637 681 514 95 -245 -778
5822 -778 -1100 112 595 852 757 347 -497 -730 -939 -80 393 727 822 228 -53 -877 -558 -370 400 752
5842 752 828 352 -126 -586 -853 -761 28 768 955 502 16 -590 -866 -556 -44 332 858 582 308 -310 -835
5863 -835 -694 -30 407 798 554 402 -24 -648 -703 -253 373 526 1001 391 -206 -652 -809 -266 159 754
5883 754 942 362 158 -305 -804 -641 -444 558 858 596 92 -434 -729 -746 -238 193 925 315 427 -304
5903 -304 -603 -643 -300 413 785 763 375 -52 -759 -654 -611 74 360 733 700 -75 -489 -862 -485 -21 268
5924 268 608 596 20 -678 -955 -767 -257 354 699 799 504 -48 -628 -427 -448 -254 475 573 349 -557 -887
5945 -887 -703 -169 34 500 862 757 200 -280 -656 -371 -438 355 787 733 281 -720 -641 -882 -195 347 477
5966 477 610 288 -282 -549 -761 -594 141 826 785 514 -123 -482 -786 -560 -77 530 860 683 -46 -455
5986 -455 -645 -691 -241 317 521 410 282 -436 -843 -791 37 339 622 412 146 -376 -830 -499 -136 -42 333
6007 333 946 500 -193 -559 -570 -573 -300 575 534 714 -140 -415 -765 -736 -194 126 616 785 568 -316 -709 -584
6029 -584 -46 194 398 404 682 -467 -575 -843 -429 -1 410 549 467 266 -459 -576 -663 -110 339 568 781
6050 781 200 -332 -443 -607 -215 285 619 740 579 -448 -483 -677 -225 69 831 449 446 -148 -625 -800 -544
6071 -544 197 573 713 430 -52 -506 -555 -528 -254 2 598 846 205 -42 -506 -723 -367 352 520 846 370
6092 370 80 -347 -618 -252 254 733 1069 444 312 -620 -748 -653 -324 149 935 602 -76 -335 -777 -395
6112 -395 -54 431 763 797 215 -182 -538 -465 -282 140 522 702 311 -118 -789 -607 -146 33 500 528 633
6133 633 168 -494 -629 -643 238 211 768 486 -109 -314 -703 -583 -33 450 493 597 483 -204 -585 -484 -221
6154 -221 316 690 402 106 68 -467 -720 -669 -136 151 638 394 -99 -456 -546 -419 244 394 683 580 -152
6175 -152 -408 -523 -609 -305 211 785 527 199 -134 -607 -670 -635 99 888 780 456 -266 -467 -638 -309 -42
6196 -42 398 647 556 -42 -476 -591 -721 51 661 563 522 -8 -675 -477 -553 -200 326 460 694 271 -512 -653
6218 -653 -746 -171 424 643 584 147 -86 -763 -656 -550 52 314 427 624 -342 -374 -1044 -478 -128 177 717
6239 717 411 493 -387 -744 -405 -274 -56 337 452 83 198 -365 -911 -452 100 679 794 456 122 -291
6259 -291 -523 -531 84 292 576 614 79 -257 -720 -535 -162 321 615 511 308 -481 -691 -438 -81 440 381
6280 381 514 370 -90 -343 -493 -199 76 607 539 707 -74 -528 -824 -579 56 161 791 412 277 -292
6300 -292 -619 -414 -146 211 533 584 285 -404 -913 -560 -88 74 363 727 65 -117 -446 -630 -471 -56
6320 -56 399 443 251 -25 -494 -432 -300 -41 392 664 480 -134 -237 -481 -441 -266 534 561 686 375 -190 -482
6342 -482 -658 -248 331 492 486 189 -20 -279 -447 -491 -85 774 648 405 -69 -186 -262 -314 93 333 668 752
6364 752 270 -598 -596 -482 -108 292 642 409 37 -162 -317 -452 -525 89 383 779 270 34 -722 -662 -229
6385 -229 100 422 714 312 163 -400 -744 -530 -328 327 701 569 -83 -169 -529 -772 -273 49 510 475 328
6406 328 112 -923 -487 -254 -95 712 523 389 197 -366 -610 -281 235 466 734 334 227 -168 -323 -625
6426 -625 -328 347 718 590 270 -166 -1010 -279 -688 6 377 561 225 -355 -759 -456 -314 -114 339 334 442
6447 442 -25 -573 -401 -834 26 350 825 393 74 -503 -506 -635 -105 349 389 473 -147 92 -352 -502 -368
6468 -368 -101 326 624 473 -288 -269 -425 -653 181 336 579 385 200 -481 -780 -416 -41 496 726 115
6488 115 90 -371 -385 -447 -296 -6 671 649 347 -77 -653 -736 -155 54 276 681 180 37 -395 -521 -491 -185
6510 -185 461 479 646 -6 -286 -779 -739 -227 418 400 769 -20 -351 -633 -302 -375 237 548 730 225 -208
6531 -208 -563 -480 -79 139 386 422 388 -259 -536 -612 -190 297 318 440 591 52 -559 -329 -116 -271 257 187
6553 187 618 91 -316 -720 -625 -25 -2 406 450 418 74 -483 -626 -345 237 559 542 86 -34 -592 -669 -461
6575 -461 -224 315 328 208 -5 1 -636 -440 -277 -77 487 521 209 -417 -500 -546 -250 546 543 306 102 46 -594
6598 -594 -547 -276 -224 396 781 208 -32 -208 -719 -434 -106 555 455 314 347 -381 -830 -593 -64 94 575
6619 575 432 41 -332 -582 -619 -217 133 471 533 150 78 -511 -670 -597 -128 84 660 319 141 -385 -871
6640 -871 -194 -82 419 607 221 57 -227 -649 -418 -156 393 824 557 106 -150 -579 -374 -20 -45 732
6660 732 450 96 -132 -459 -401 -197 108 585 408 564 210 -314 -550 -502 236 291 679 443 172 -432 -192
6681 -192 -377 -498 135 508 338 66 -101 -357 -588 -100 284 301 777 190 -64 -110 -318 -339 -185 328 629
6702 629 138 48 -571 -632 -594 222 219 582 231 127 -340 -661 -226 -421 349 410 544 29 -53 -622 -504 -360
6724 -360 -99 442 352 255 261 -246 -493 -284 138 203 530 451 -159 -232 -639 -342 -69 354 430 167 -42 -99 -412
6747 -412 -522 12 267 354 904 176 119 -517 -397 -81 -87 484 434 -145 -314 -278 -504 -418 221 262 661 375 87
6770 87 -440 -428 -437 -118 278 399 463 157 -383 -132 -544 -67 232 250 602 327 -122 -605 -739 -228 -78 330
6792 330 364 300 -32 -785 -863 87 106 520 271 457 128 -156 -451 -420 -13 159 468 556 342 -226 -353 -379
6814 -379 -262 92 348 311 419 75 -322 -531 -172 54 458 443 238 -86 -289 -507 -106 -76 50 271 537
6835 537 34 116 -803 -193 53 47 599 437 55 -212 -706 -379 -395 344 474 354 492 37 -133 -78 -474 118
6857 118 481 416 448 100 -258 -485 -228 105 -21 644 224 -44 41 -155 -530 -457 71 76 522 259 -282 -463
6879 -463 -303 -373 116 404 516 436 -141 -238 -593 -527 31 583 441 519 0 -103 -473 -250 148 58 578 353
6901 353 -17 -374 -554 -455 -153 158 170 422 184 -263 -498 -533 -73 53 498 255 403 115 -423 -482 -429 -138
6923 -138 371 260 134 59 -209 -449 -242 8 307 180 336 45 -174 -116 -222 -226 -1 165 570 141 -42
6944 -42 -391 -568 -247 -157 527 457 404 39 -372 -550 -241 30 291 531 307 -193 -164 -250 -640 179 218 613
6966 613 560 380 140 -440 -745 -256 175 299 337 381 -234 -335 -552 -440 -78 396 411 52 342 -308 -561
6987 -561 -469 15 287 392 253 301 -23 -599 -269 36 63 484 453 246 -199 -733 -648 -169 61 244 679 145
7009 145 -167 -466 -536 -343 13 248 590 46 -329 -230 -245 -479 17 193 316 154 -9 -334 -405 -472 -233 -27
7031 -27 645 297 161 -275 -376 -302 -259 198 519 746 57 -212 27 -359 -302 37 236 321 327 234 -461 -430 -314
7054 -314 335 181 512 433 290 -174 -341 -375 46 126 506 320 250 -33 -146 -869 -228 213 466 553 598 2
7076 2 -231 -346 -229 -6 317 383 60 -73 -327 -111 -214 93 419 356 400 158 -258 -607 -32 -59 366 543
7098 543 279 138 -166 -496 -565 -484 12 187 516 206 -164 -479 -474 -237 -20 222 442 396 269 -99 -114 -602
7120 -602 -377 399 224 457 -86 -142 -380 -707 -79 84 425 583 572 -30 -201 -472 -269 54 653 388 41
7141 41 62 -293 -441 -327 123 -59 254 228 1 -698 -208 -456 15 267 528 85 125 -500 -220 -356 -145
7162 -145 -112 200 238 144 -291 -420 -440 -596 -3 209 176 270 -229 -437 -514 -261 -142 371 415 750 185 -201 -366
7185 -366 -322 14 118 413 267 307 34 -496 -372 -24 -54 208 680 160 -4 -336 28 -480 -2 402 278
7206 278 287 -177 -363 -111 -422 14 36 318 181 38 24 -648 -292 -598 400 339 308 169 164 -521 -231 -37 148
7229 148 250 -41 292 232 -233 -532 -380 -117 168 519 89 261 -188 -297 -163 -232 346 277 299 126 -200
7250 -200 -310 -142 -240 -36 423 551 148 61 -305 -377 -31 299 514 387 162 9 -372 -533 -144 0 160
7271 160 191 459 1 -26 -237 -271 -36 173 622 157 -22 -313 -151 -200 -6 13 307 369 109 1 98 -352
7293 -352 -100 100 3 507 249 -25 -331 -218 40 -372 438 372 22 50 42 -616 -470 -276 120 383 274 183
7315 183 -139 -323 -184 50 90 74 327 139 -127 -149 -242 -264 15 316 375 520 5 -283 -92 -237 -95 198
7337 198 457 263 126 -353 -375 -180 -127 520 377 127 258 -168 -514 -257 92 218 329 278 387 -186 -121
7358 -121 -223 -455 -47 396 302 579 15 -220 -323 -298 -99 234 403 -80 354 -115 -413 -104 -146 324 393
7379 393 584 -103 -35 -468 -704 -189 -148 84 377 106 44 -352 -267 -167 -117 435 102 340 9 -19 -528 -164
7401 -164 -249 140 386 348 350 -368 -494 -318 -111 89 69 314 326 -226 -143 -357 -402 240 607 112 60 189 -263
7424 -263 -282 -81 -83 263 371 263 9 -18 -506 -398 -61 38 549 171 61 -390 -426 -421 -193 -43 501 423 261
7447 261 90 -471 -458 -126 -166 354 598 349 33 -50 -611 -166 -135 249 420 41 -56 -111 -211 -414 -88 226
7469 226 266 635 192 -291 -354 -300 -146 -31 113 458 209 -491 -625 -428 -50 319 352 470 349 140 -376
7490 -376 -673 -160 -94 194 551 567 51 -172 -482 -372 -230 270 209 352 -10 132 138 -391 -206 43 101 368
7512 368 347 119 -43 -342 63 92 -21 492 186 113 -395 -320 -131 -298 280 187 353 195 -109 -303 -423 -104
7534 -104 171 101 328 229 -273 57 -215 -291 -199 426 64 78 39 -217 -339 -473 -58 232 394 381 110 -197
7556 -197 -189 -203 -246 293 183 409 63 -176 -364 -433 -382 89 256 577 256 -107 -539 -444 -71 231 500 258
7578 258 348 -60 -361 -339 -360 37 80 201 168 228 -391 -490 -405 1 170 166 465 -26 102 -533 -372 -163 89
7601 89 162 216 218 -36 -176 -541 -146 -164 336 114 260 -4 -162 -208 -461 -89 628 311 243 -44 -120 -519 -442
7624 -442 -283 356 416 89 304 -93 -495 -644 -187 172 483 297 49 -82 -137 -261 -200 247 49 323 71
7645 71 -125 -152 -685 -424 69 112 381 233 160 -145 -210 -194 103 31 416 353 239 -129 -323 -593 -293 34 -38
7668 -38 238 -19 106 -223 -270 -215 -118 172 346 190 15 -247 -279 -513 -86 197 119 9 -59 98 -88 -368
7690 -368 -261 67 186 173 54 -65 -124 -456 -136 70 301 226 -15 -260 -494 -97 -368 -156 66 122 413
7711 413 7 -26 -13 -121 137 91 457 175 -9 -31 -617 -415 -117 41 52 461 107 -202 -313 -553 -244 34
7733 34 505 438 110 35 -132 -293 -12 74 273 79 651 30 126 -177 -184 -104 147 664 323 -62 -144 -530 -398
7756 -398 -141 80 539 344 263 -115 -313 -482 -432 115 313 356 453 228 -136 -307 -543 28 467 158 645
7777 645 -111 -212 -317 -435 -213 339 150 276 28 -314 -364 -470 -385 129 391 -7 237 -159 -309 -332 -229
7798 -229 -132 555 267 42 -73 -212 -395 -539 -347 223 253 173 -35 -96 -447 -458 -105 80 425 213 209 -270
7820 -270 -238 -245 -166 -75 297 352 28 293 -114 -522 -472 -190 122 73 332 296 -223 -267 -47 -208 397 486 -32 -84
7844 -84 -368 -515 -395 30 17 218 410 113 -1 -163 -354 -418 286 480 124 244 151 -299 -392 -327 64 135
7866 135 316 281 -459 -25 -62 51 -59 -89 564 12 -58 248 -203 -267 -87 134 446 365 222 -173 -572 -339
7888 -339 -103 275 327 381 326 142 -170 -254 -248 -33 390 -52 356 226 -13 -405 -599 -13 -83 242 347 -131
7910 -131 -171 124 -250 -3 210 201 304 38 -101 -32 -145 -166 200 362 167 351 -259 -399 -389 -310 -260 371 225
7933 225 57 69 -81 -419 -270 -76 214 215 9 121 -213 -246 -508 -165 -21 272 161 57 -119 -117 -452 -371
7955 -371 -107 75 130 -1 377 12 -511 -167 -14 114 321 609 -299 -349 -226 -369 127 71 259 271 163
7976 163 -81 -304 -180 -236 -50 133 397 61 -171 -323 -444 75 -31 -56 167 78 386 -272 175 -393 89
7997 89 -102 404 98 -6 45 -376 -435 -124 239 148 532 379 37 37 -514 -190 -283 352 171 129 197 -123 -139
8020 -139 -181 7 148 217 280 -33 -225 -187 -219 -13 289 137 484 -20 -126 -42 -535 -224 -64 223 487 94
8042 94 -56 -242 -151 -284 -58 438 564 298 -206 -287 -353 -437 253 -20 98 228 32 -58 -527 -275 -69 -15
8064 -15 231 498 230 -150 -160 -52 -214 160 -1 171 484 -125 -343 -375 -257 92 -147 364 -191 200 -341
8085 -341 -593 274 -406 121 466 218 47 -85 -198 -194 -156 279 117 174 75 -119 -13 -391 -295 -191 255 361
8107 361 186 -365 -261 -403 -184 -63 144 386 429 -87 -239 -465 -158 -97 95 180 176 189 -100 -139 -355 -86
8129 -86 73 279 144 20 149 -60 -30 46 143 -89 152 -96 -172 -126 -235 -394 49 270 326 249 71 -391 -390
8152 -390 -179 216 82 -81 429 289 113 -310 -19 -42 286 283 380 252 -389 -182 -234 -38 249 378 364 114
8174 114 -92 -404 -208 -193 354 175 233 317 215 -129 -327 -292 -213 80 46 263 365
8191C65
##END NTUPLES=NMR FID
##END=
