##TITLE=1H_PR173_BOC3
 CDCl3, 8 sc, 
 28.5.2019
##JCAMPDX= 6.0         $$ Bruker NMR JCAMP-DX V2.0
##DATA TYPE= NMR FID
##DATA CLASS= NTUPLES
##ORIGIN= UXNMR, Bruker Analytische Messtechnik GmbH
##OWNER= root
$$ XWIN-NMR		Version 3.5
$$ Wed May 29 13:35:36 2019 Russian Standard Time (UT+4h)  she@DPX200
##.OBSERVE FREQUENCY= 200.13155
##.OBSERVE NUCLEUS= ^1H
##.DELAY= (6, 6)
##.ACQUISITION MODE= SIMULTANEOUS
##.ACQUISITION SCHEME= undefined
##.AVERAGES= 8
##.DIGITISER RES= 18
##SPECTROMETER/DATA SYSTEM= spect
##.PULSE SEQUENCE= zg30
##.SOLVENT NAME= CDCl3
##.SHIFT REFERENCE= (INTERNAL, CDCl3, 0, 15.7039)
##AUDIT TRAIL= $$ (NUMBER, WHEN, WHO, WHERE, WHAT)
$$ ##TITLE= Audit trail, XWIN-NMR		Version 3.5
$$ ##JCAMPDX= 5.01
$$ ##ORIGIN= Bruker BioSpin GmbH
$$ ##OWNER= she
$$ F:/spectra/data/she/nmr/H-F/1/audita.txt
$$ ##AUDIT TRAIL=  $$ (NUMBER, WHEN, WHO, WHERE, WHAT)
(   1,<2019-05-29 13:34:12.39 +0400>,<she>,<DPX200>,
      <created by zg, POWCHK disabled, PULCHK disabled
       configuration hash MD5:
       00 E9 B6 7A A2 85 ED C7 34 08 36 98 17 FE 4E 26
       data hash MD5: 16K
       08 83 12 B6 C9 77 5E 00 78 4C 36 5C 6F CC 0A 98>)
$$ ##END=
$$ 
$$ hash MD5
$$ 5C C6 F2 CC 82 F9 5C EB 30 1D 16 58 F5 7D CA ED
##$RELAX= 
##$RELAX= 
##$RELAX= 
##$RELAX= 
##$RELAX= 
##$RELAX= 
$$ Bruker specific parameters
$$ --------------------------
##$DU= <F:/spectra>
##$EXPNO= 1
##$NAME= <H-F>
##$PROCNO= 1
##$TYPE= <nmr>
##$USER= <she>
##$AMP= (0..31)
100 100 100 100 100 100 100 100 100 100 100 100 100 100 100 100 100 100 
100 100 100 100 100 100 100 100 100 100 100 100 100 100 
##$AQSEQ= 0
##$AQ_mod= 1
##$AUNM= <au_zg>
##$AUTOPOS= <>
##$BF1= 200.13
##$BF2= 200.13
##$BF3= 200.13
##$BF4= 200.13
##$BF5= 200.13
##$BF6= 200.13
##$BF7= 200.13
##$BF8= 200.13
##$BYTORDA= 1
##$CFDGTYP= 0
##$CFRGTYP= 5
##$CHEMSTR= <none>
##$CNST= (0..31)
1 1 145 1 1 1 1 1 1 1 1 1 1 1 1 1 1 1 1 1 1 1 1 1 1 1 1 1 1 1 1 1 
##$CPDPRG= <>
##$CPDPRG1= <>
##$CPDPRG2= <>
##$CPDPRG3= <>
##$CPDPRG4= <mlev>
##$CPDPRG5= <mlev>
##$CPDPRG6= <mlev>
##$CPDPRG7= <mlev>
##$CPDPRG8= <mlev>
##$CPDPRGB= <>
##$CPDPRGT= <>
##$D= (0..31)
0 1.2 0 0 0 0 0 0 0 0 0 0.03 0 0 0 0 0 0 0 0 0 0 0 0 0 0 0 0 0 0 0 0 
##$DATE= 1559122451
##$DBL= (0..7)
120 120 120 120 120 120 120 120 
##$DBP= (0..7)
150 150 150 150 150 150 150 150 
##$DBP07= 0
##$DBPNAM0= <>
##$DBPNAM1= <>
##$DBPNAM2= <>
##$DBPNAM3= <>
##$DBPNAM4= <>
##$DBPNAM5= <>
##$DBPNAM6= <>
##$DBPNAM7= <>
##$DBPOAL= (0..7)
0.5 0.5 0.5 0.5 0.5 0.5 0.5 0.5 
##$DBPOFFS= (0..7)
0 0 0 0 0 0 0 0 
##$DE= 6
##$DECBNUC= <off>
##$DECIM= 24
##$DECNUC= <off>
##$DECSTAT= 4
##$DIGMOD= 1
##$DIGTYP= 9
##$DL= (0..7)
0 120 120 120 120 120 120 120 
##$DP= (0..7)
150 150 150 150 150 150 150 150 
##$DP07= 0
##$DPNAME0= <>
##$DPNAME1= <>
##$DPNAME2= <>
##$DPNAME3= <>
##$DPNAME4= <>
##$DPNAME5= <>
##$DPNAME6= <>
##$DPNAME7= <>
##$DPOAL= (0..7)
0.5 0.5 0.5 0.5 0.5 0.5 0.5 0.5 
##$DPOFFS= (0..7)
0 0 0 0 0 0 0 0 
##$DQDMODE= 0
##$DR= 18
##$DS= 0
##$DSLIST= <SSSSSSSSSSSSSSS>
##$DSPFIRM= 0
$$ [...]
##$SUBNAM2= <"">
##$SUBNAM3= <"">
##$SUBNAM4= <"">
##$SUBNAM5= <"">
##$SUBNAM6= <"">
##$SUBNAM7= <"">
##$SUBNAM8= <"">
##$SUBNAM9= <"">
##$SW= 24.9336996594482
##$SWIBOX= (0..15)
0 0 2 0 0 0 0 0 0 0 0 0 0 0 0 0 
##$SW_h= 4990.01996007984
##$TD= 16384
##$TD0= 1
##$TE= 0
##$TE2= 300
##$TE3= 300
##$TEG= 300
##$TL= (0..7)
0 120 120 120 120 120 120 120 
##$TP= (0..7)
150 150 150 150 150 150 150 150 
##$TP07= 0
##$TPNAME0= <>
##$TPNAME1= <>
##$TPNAME2= <>
##$TPNAME3= <>
##$TPNAME4= <>
##$TPNAME5= <>
##$TPNAME6= <>
##$TPNAME7= <>
##$TPOAL= (0..7)
0.5 0.5 0.5 0.5 0.5 0.5 0.5 0.5 
##$TPOFFS= (0..7)
0 0 0 0 0 0 0 0 
##$TUNHIN= 0
##$TUNHOUT= 0
##$TUNXOUT= 0
##$USERA1= <user>
##$USERA2= <user>
##$USERA3= <user>
##$USERA4= <user>
##$USERA5= <user>
##$V9= 5
##$VALIST= <valist>
##$VCLIST= <CCCCCCCCCCCCCCC>
##$VD= 0
##$VDLIST= <DDDDDDDDDDDDDDD>
##$VPLIST= <PPPPPPPPPPPPPPP>
##$VTLIST= <TTTTTTTTTTTTTTT>
##$WBST= 1024
##$WBSW= 4
##$XGAIN= (0..3)
0 0 0 0 
##$XL= 0
##$YL= 0
##$YMAX_a= 139676
##$YMIN_a= -185713
##$ZGOPTNS= <>
##$ZL1= 120
##$ZL2= 120
##$ZL3= 120
##$ZL4= 120
##$ABSF1= 10
##$ABSF2= 0
##$ABSG= 5
##$ABSL= 3
##$ALPHA= 0
##$AQORDER= 0
##$ASSFAC= 0
##$ASSFACI= 0
##$ASSFACX= 0
##$ASSWID= 0
##$AUNMP= <proc_1d>
##$AZFE= 0.1
##$AZFW= 0.1
##$BCFW= 1
##$BC_mod= 2
##$BYTORDP= 1
##$COROFFS= 0
##$CY= 11.3945322036743
##$DATMOD= 1
##$DC= 2
##$DFILT= <>
##$DTYPP= 0
##$F1P= 18.9103706918063
##$F2P= -1.10871071338519
##$FCOR= 0.5
##$FTSIZE= 0
##$FT_mod= 4
##$GAMMA= 1
##$GB= 0.15
##$INTBC= 1
##$INTSCL= 1
##$ISEN= 128
##$LB= 0.24
##$LEV0= 0
##$LPBIN= 0
##$MAXI= 10000
##$MC2= 0
##$MEAN= 0
##$ME_mod= 0
##$MI= 1.114404
##$NCOEF= 0
##$NC_proc= 0
##$NLEV= 6
##$NOISF1= 3.799351
##$NOISF2= 2.8
##$NSP= 1
##$NTH_PI= 0
##$NZP= 0
##$OFFSET= 15.70392
##$PC= 1
##$PHC0= -8502.723
##$PHC1= 23.60025
##$PH_mod= 1
##$PKNL= yes
##$PPARMOD= 0
##$PSCAL= 0
##$PSIGN= 0
##$REVERSE= no
##$SF= 200.130013532006
##$SI= 16384
##$SIGF1= 3
##$SIGF2= 2
##$SINO= 400
##$SIOLD= 16384
##$SREGLST= <1H.CDCl3>
##$SSB= 0
##$STSI= 0
##$STSR= 0
##$SW_p= 3612.71676300578
##$SYMM= 0
##$S_DEV= 0
##$TDeff= 0
##$TDoff= 0
##$TI= <>
##$TILT= no
##$TM1= 0
##$TM2= 0
##$TOPLEV= 0
##$USERP1= <user>
##$USERP2= <user>
##$USERP3= <user>
##$USERP4= <user>
##$USERP5= <user>
##$WDW= 1
##$XDIM= 8192
##$YMAX_p= 0
##$YMIN_p= 0
$$ End of Bruker specific parameters
$$ ---------------------------------
##NTUPLES= NMR FID
##VAR_NAME=  TIME,          FID/REAL,        FID/IMAG
##SYMBOL=    X,             R,               I
##VAR_TYPE=  INDEPENDENT,   DEPENDENT,       DEPENDENT
##VAR_FORM=  AFFN,          ASDF,            ASDF
##VAR_DIM=   8192,          8192,            8192
##UNITS=     SECONDS,       ARBITRARY UNITS, ARBITRARY UNITS
##FACTOR=    0.0002004,     1,               1
##FIRST=     0,             0,               0
##LAST=      1.6414764,     0,               0
##MIN=       0,             -185713,         0
##MAX=       1.6414764,     139676,          0
$$ Real data points
##PAGE= N=1
##DATA TABLE= (X++(R..R)), XYDATA
0@%%%%%%%qJ6j6J6j6K4l2M0m8N6p2Q7j02J19j36J56j80K08k40K75l14L56m02M54
31B41n11N76o46P19q02Q94r95J105j225J358j504J665j842K040k262K510k792
48a471L113l484L917m431N055n828O816q130R977j2784J7609k8155R1849q4623
62a0570j64050J77269J11397r7839q6763J06349J9749j28934j4161J81222K8325
73A21994j90786p2242J76165Q2971j38956p3281J24208M1841j29180k9797J50276
84F3213L3822j58300n2244J51817N8572j32328n1260J23908L2457j27462j9420
95g7225J43454K0868j55271l2252J57210M5869j45679n0256J30478M4328j16718
106c5194k8032J13257R975j20095K176J37310j425j52169j3212J55429L3151j42470
$$ y = [0, 0, 0, 0, 0, 0, 0, 0, -8, 8, -8, 8, -8, 16, -16, 24, -24, 32, -40, 47, -55, 64, -72, 84, -96, 112, -128, 147, -167, 189, -213, 241, -270, 306, -340, 379, -423, 471, -524, 581, -644, 714, -790, 875, -967, 1073, -1189, 1321, -1471, 1642, -1842, 2075, -2356, 2699, -3129, 3687, -4443, 5534, -7250, 10359, -17796, 74053, -10570, -174620, 2649, 114046, 16207, -70556, 35793, 55542, -73392, -87553, 93669, 121994, -68792, -141034, 35131, 118102, -20854, -94135, 30073, 71914, -57266, -87063, 63213, 97035, -61265, -113509, 38308, 96880, -35448, -86708, 37200, 69657, -57805, -77225, 66229, 87097, -68174, -100426, 56784, 102653, -43026, -93282, 37196, 81524, -35194, -63226, 50031, 60006, -60089, -57913, 79397, 77972, -74197, -87409, 68020, 101171, -41299]
118d1299m3447J17005L4698r8372j2191R8213j0504j17268J4969J38050j225j45840
130f7211j9378J33248K7226j15258j9179J05678K404j12289O097J24067j096j29055
142f4746q634J20737J0953j08473P75J05285j5576j14479K1195J28889j1589j32466
154f8129k784J22520J0016j04183k124R3767j3910r3786K6534J05114k8045j14539
166f9549K1589J16915j3644j12579J0061J06265j0424j01712J1801R8222j5049
177D1896r4825J9887R1971k7687r4820L3724J01093l4817j08997K8504J09456
188F5385k1673j02554J7651R1554k3700q4892L3561Q5290m0760r0252M1135R4226
200F4971l8129r2462L6528Q8199l7882q5925M1954Q7044m0924q8151L7944Q5448
$$ y = [-41299, -84746, 32259, 66957, -31415, -43606, 54607, 44103, -73165, -58196, 79854, 78629, -67211, -86589, 46659, 73885, -41373, -60552, 45126, 47530, -64759, -58662, 65405, 64309, -64746, -73380, 47357, 58310, -50163, -49388, 55897, 40321, -74158, -52963, 75926, 64337, -68129, -70913, 51607, 61623, -42560, -44684, 49083, 35173, -58613, -32079, 73035, 44990, -69549, -47960, 68955, 55311, -57268, -47207, 59058, 48634, -53078, -41277, 56945, 41896, -52929, -33042, 58929, 31242, -63578, -29854, 71239, 36422, -72575, -44071, 65385, 43712, -58842, -41191, 50363, 26663, -58229, -24668, 60622, 19862, -70390, -29255, 64971, 26842, -65620, -29092, 59107, 21225, -64700, -22746, 64298, 23374, -64777, -26833, 58615]
212E8615l3500p8077L6173P1870m2953o9979N0875P5146n2854q2283M9765Q4819
224F7617m1932q1431L7283P4261l8477o7422M2373O4381m7983o3890N0120O5103
236F0003n2672o6749N2823O7315n2106o9497M8428O7825m4271o4079M1835N6439
248D5294m3454n1530M8612N0788n4311n4410N5691N8695n1819o0600M7398N7850
260D8204m4748n2928M6795N0649m8651n0674N0290N2039m8896m9971M7825M7899
272D7833m9332m5440N4166M6656n6361n0097N5312N2625n0571n1011M6241M5655
284D5676m6386l9471N0068L6879n5819l8428N8376M1366n7927m4220N3963M3845
296D7922n2085m1510N0148L8245n0739l6285N1181L4033n2990l2823N4436L2496
$$ y = [58615, 25115, -52962, -16789, 55081, 12128, -57851, -6976, 68170, 15316, -66967, -17202, 67617, 25685, -55746, -18463, 55798, 17321, -50101, -7728, 56653, 8670, -55220, -5100, 60003, 7331, -59418, -6595, 60720, 8614, -60883, -12455, 55370, 11099, -52980, -11145, 45294, 1840, -49690, -1078, 49710, -4601, -59011, -3320, 55375, 3556, -57044, -9646, 48204, 3456, -49472, -2677, 47972, -679, -51353, -1063, 50976, 2080, -47891, -66, 47833, -1499, -46939, 7227, 53883, -2478, -52575, 2737, 55362, 4791, -46220, 21, 45676, -710, -40181, 9887, 46766, -9053, -47481, 10895, 52261, -5666, -49886, 4077, 47922, -4163, -45673, 4475, 42720, -8019, -44304, 6877, 40910, -12080, -44903, 9533, 42029]
308D2029n6187l3304N6488L4532n5446l4813N3218L4080n1558k9836N1225K7650
320C8078n2649k5259N4384K5776n4668k5173N4213K5126n3241k3331N3242K2874
332C9372n3326k2581N3581K2468n1169k1628M9087J9335m8625j6083M9867J3862
344C4160n2640j4723N3769J6322n3323j8600N0130J7741m7595j5784M6632J1813
356B7902m7261j0762M8496R985m9630j1023M9367J1322m9035j1101M7941J0514
368B6715m7010r701M6556Q995m5408p840M5400O924m4699n548M5141N572m5400
381b0303m765M5101O017m4351n093M3403N127m1842m447M1713L501m1150k650
394a9739M0903J998m0742j437M0586Q73m0923j189M0569J189m0241j556L8667
$$ y = [42029, -14158, -47462, 9026, 43558, -11888, -46701, 6517, 40597, -10961, -40797, 10428, 38078, -14571, -39830, 14554, 40330, -14338, -39511, 14702, 39828, -13413, -36744, 16498, 39372, -13954, -36535, 17046, 39514, -11655, -33283, 15804, 35139, -13486, -29569, 20298, 34160, -18480, -33203, 20566, 36888, -16435, -35035, 15095, 32836, -14759, -30543, 16089, 27902, -19359, -30121, 18375, 28360, -21270, -32293, 17074, 28396, -20639, -31740, 16201, 26715, -20295, -29996, 16560, 25555, -19853, -27693, 17707, 24631, -20068, -25616, 19525, 25097, -20303, -25068, 20033, 26050, -18301, -23394, 20009, 25136, -16706, -21153, 20560, 24061, -17089, -19739, 21164, 23162, -17580, -19017, 21569, 22442, -18481, -19670, 20899, 22088, -18153, -19709, 18958]
407A8958P48l7898n07L7052j217l7841K115L7656k604l8505K380L7682j855l7331
421b1167K014L6530l254l5280L955L4845m011l4899N054L4910n237l4584O240
434a4884L4183n997l3240O328L3905o636l2755P197L2501p256l1762Q401L1903
447B1888q792l1839R701L1345r648l0845R326L0022r628k9738J0113K9174j1418
460I661k8465J0844K8126j1470k8143J1332K7302j2097k6742J2181K5474j2761
472E242k5213J2557K4884j3358k4091J2717K3813j2971k3056J3264K2725j3704
484B809k2058J3814K1773j3431k1422J4235K0916j3217k0056J3493J9852j3737
496B971j8830J4702J8940j5048j8022J4528J8596j4156j8307J3903J8115j4300
$$ y = [18958, 19706, -18192, -18699, 18353, 17136, -20705, -18590, 19066, 16462, -22043, -19663, 18019, 16164, -21167, -19153, 17377, 14123, -21157, -17202, 17643, 13632, -21267, -16213, 18697, 13460, -21124, -14884, 19299, 13302, -19938, -13610, 20295, 13659, -19096, -11899, 20602, 13346, -18416, -10015, 21888, 13096, -18743, -9042, 22303, 12655, -18190, -8864, 21158, 11530, -18208, -8095, 21079, 9661, -18804, -7960, 20166, 8696, -19447, -8115, 19187, 7090, -19652, -7471, 18003, 5242, -19971, -7414, 17470, 4112, -19979, -7262, 16551, 3580, -19476, -6212, 16513, 2809, -19249, -5435, 16338, 2907, -18515, -4280, 16636, 3419, -16637, -3144, 16708, 2971, -15859, -1157, 17783, 2735, -15287, -759, 17837, 3681, -14626, -723, 17392, 3092]
508C092j6646J4131J5879j4658j5669J5235J5169j5253j6150J5162J5545j5170
520F67j5125J4132J4125j4014j4384J4248J3351j5172j2568J4322J2869j5157
532b706j2568J4908J2570j4984j2113J4799J1893j4871j1520J5114J1108j4430
544b800j0434J4951J0010j4747r394J5547R171j5257q701J5167R806j5393q474
557a0548J4475Q757j4605p604J4090P235j3889o851J4155O377j4488o422J4822
570E504N931j4971o138J4562N820j4393n563J3324M857j3588m427J3586L408j4097
584f185l485J4086L187j4558l268J3916L316j3817k591J3175K606j3026j857J3209
598D708J241j2744o48J3200J80j2699m77J3347N67j2522o6J2308L17j1597K51
$$ y = [3092, -13554, 577, 16456, 1798, -13871, 1364, 16533, 1280, -14870, 292, 15837, 667, -14458, -326, 13799, -215, -14599, -351, 13000, -2172, -14740, -418, 12451, -2706, -15274, -366, 12204, -2780, -14893, -94, 11799, -3072, -14592, 522, 11630, -2800, -13234, 1717, 11727, -3020, -12414, 3133, 12304, -2953, -11654, 3513, 13319, -2074, -10548, 3927, 12684, -1921, -9525, 4565, 11800, -2089, -8940, 5215, 11592, -2896, -9318, 5504, 11435, -3536, -9674, 4888, 10708, -3685, -9248, 4076, 8933, -4655, -9082, 4504, 7912, -6185, -9670, 4416, 7603, -6955, -10223, 3693, 7009, -6808, -9399, 3776, 6382, -6644, -8501, 4708, 5949, -6795, -7443, 5757, 5937, -6762, -7239, 6108, 6675, -5847, -5913, 6395, 6712, -4885, -4634]
613d634J1511o20j1113J105J1345j560j0879J317J1501k130j0964J836J1138k610
627E243j0968J892J0496j868j0380K529Q948k955r663M230Q687m657r522M402
641c586R547m464r409L836Q565l491p462L578P219m697o779N340O829n147p022
656g143N201P220m789p060N753O466m999o274N610O076n200n488N344N808n580
671I45n125N959N179o263n441P123M904o658m716O051M501o387m090O189L697
686E868o996l560P205K392p457k771P324K600p385l086P143K825p528k373O875
701A076J616o832j190P321Q54p769j126Q406J295q051j403P985J394p287m10P495
717C374L64p731M69Q316l62q015O40Q242r13q005J429Q230j161q744K130Q348
$$ y = [-4634, 6877, 6257, -4856, -3751, 7594, 6034, -4845, -3528, 7973, 5843, -5121, -3285, 7853, 5243, -5725, -3833, 6663, 4795, -5585, -3056, 5892, 2937, -6726, -2496, 6191, 1534, -7988, -3586, 5961, 1497, -7912, -4076, 4489, 998, -6464, -2886, 4333, -364, -7143, -1803, 5026, -121, -7143, -1942, 5278, 489, -6571, -818, 5648, 649, -5625, -15, 6061, 861, -4627, 717, 6525, 945, -4180, 1779, 6958, 695, -4746, 2377, 7281, 623, -4093, 1958, 6459, 72, -4018, 2171, 5868, -1128, -4688, 2517, 4909, -2548, -5319, 2005, 4605, -2780, -5866, 1277, 4102, -3426, -5799, 1076, 2692, -4140, -5330, 1991, 2845, -4924, -6050, 2356, 3651, -4400, -5803, 2182, 3576, -3711, -4121, 3374, 3738, -3993, -3524, 4792, 4430, -3585, -2945, 5297, 4384, -3621, -2192, 6038, 4877, -3867, -1737, 6611]
733F611k322p904J999P643k068p673K613P294l324q103L377Q079l595p782K841
748b314P375l320p952L657P441l871p651L620P823m642p565M556P451m623p458
763g473M954P999n388p817N590P953n512p834O776P046o281o737O670P179o603
778E22p117P401P023o952o316O898O229p164n984P584O288p951o206P941N699
793G895p865n860Q141N837q721o070Q282O262q623o383Q590N384q726n587Q877
808A433N271r750n638J0250M904r870n192R859M771j0212m372J0695M195j1099
822d755l935J1122L887j0542l579J0551L502j0477k674J1117L253j1120l083J1112
836D379L361j0669l137J1206K579j1373j949J1673K355j2183k659J2529K318j1951
$$ y = [6611, 4289, -3615, -1616, 6027, 3959, -3714, -1101, 6193, 2869, -5234, -1857, 6222, 2627, -5155, -2314, 5061, 1741, -6211, -2554, 4887, 1016, -6635, -3015, 4808, 166, -7399, -2843, 4608, -15, -7473, -2519, 5480, 92, -7725, -2135, 5818, 306, -7528, -752, 6294, 13, -6724, -54, 7125, 522, -6595, 806, 7829, 877, -5439, 1459, 7688, 524, -5460, 2124, 8412, 461, -5745, 2196, 7895, 30, -5830, 2311, 8148, -573, -6643, 1639, 7901, -722, -7105, 1485, 6869, -1857, -7444, 1433, 6704, -3046, -8684, 1566, 6470, -3400, -8592, 1267, 6038, -4174, -8546, 2149, 6344, -4755, -8690, 2432, 6319, -4223, -7802, 2749, 6251, -4226, -6900, 4217, 7470, -3650, -6733, 4379, 7740, -2929, -6066, 5140, 7719, -3654, -5603, 6070, 8425, -3758, -6417, 6112, 8430, -3521]
850c521k376J1726K079j2779j192J2148J187j3041j157J2832J168j2699j351J2709
864E733K76j3206j23J2748k40j2279k55J2424k49j2319rJ3190q10j2796O83J3427
880F195j010j2805Q48J2881q75j2281O10J3486j101j3286J640J3672j622j3174
894f822J704J3702j598j3822K452J3778k664j4019K946J3837k770j3863K815J3694
908I370l808j3521M031J3620m535j4040M346J3591m416j4145M456J3513m640j3314
922i492M546J3096n071j3666N263J3876n552j3515N915J3267o132j3383N887J4219
936I258o122j4363O862J3890o475j3267O824J3359p435j3178Q609J3051q170j3070
950a0227Q231J3623q287j3070Q162J3068q443j2589Q894J2337q679j2303Q662
$$ y = [-3521, -5897, 5829, 7908, -4871, -6063, 6085, 7272, -5769, -6926, 5906, 7074, -5625, -6976, 5733, 6009, -7197, -7320, 5428, 5188, -7091, -7346, 5078, 4829, -7490, -7499, 5691, 4881, -7915, -7232, 6195, 5185, -7620, -6772, 6109, 5234, -7047, -6437, 7049, 5948, -7338, -5698, 7974, 6352, -6822, -5118, 8584, 6986, -6836, -4384, 9394, 6730, -7289, -4343, 9494, 6724, -7139, -4324, 9370, 5562, -7959, -3928, 9692, 5157, -8883, -4537, 9054, 4638, -9507, -5051, 8462, 3822, -9492, -4946, 8150, 3079, -10587, -5324, 8552, 3000, -10515, -4600, 8667, 2535, -10848, -4961, 9258, 3136, -11227, -4365, 9525, 3050, -10217, -3393, 9966, 2531, -10647, -2038, 11013, 2843, -10227, -1996, 11627, 3340, -9730, -1568, 11500, 3057, -9532, -638, 11699, 3020, -9283, -621]
963f21J2056r504j1775R228J2087r694j2560R936J2173j0089j2231R701J1454
976A0161j0106j1240R888J1389j0643j1360J0867J1617j1321j1717J1521J1322
988A0378j0939j1834J1464J1229j1307j1141J1992J0958j1708j0586J2401J0293
1000A1200j2184j0194J2429J0651j2479j0393J2882J0102j2532r813J2172J0095
1012A1936j2389r401J2488R547j3107r364J3119R665j3751r688J3829R113j4048
1025b051r244J3668R215j3772r278J3662Q653j3964q250J4014P930j4794q244
1038a2455J5404P677j5006q057J4800P868j4656p731J5010O911j4405o776J5235
1051C819O527j5568n927J5180O783j5520o233J6016O243j5570o364J6149O199
$$ y = [-621, 11435, 1931, -9844, -616, 11471, 1777, -10783, -847, 11326, 1237, -10994, -1293, 10161, 55, -11185, -1297, 10092, -551, -11911, -1044, 10573, -748, -12465, -944, 10378, -561, -12395, -931, 10298, -1009, -12150, -158, 10800, -908, -11494, 907, 11200, -984, -11178, 1251, 11902, -577, -10970, 1912, 12014, -518, -10331, 1841, 11936, -453, -9854, 2634, 12181, -926, -10290, 2829, 12494, -1257, -10945, 2884, 11997, -2051, -11295, 2373, 11588, -2184, -11462, 2200, 10853, -3111, -11361, 2653, 10583, -4211, -12455, 2949, 10626, -4380, -12437, 2363, 10231, -4425, -12156, 2854, 9765, -4640, -11416, 3819, 10346, -5222, -11149, 4031, 10814, -4706, -10939, 5077, 11320, -4250, -10614, 5535, 11734]
1064A1734j5794n747J5761N776j6361n039J6352N067j6885m646J6860M568j7361
1077e715m243J7123L995j7257m092J6750L724j6691l442J6094L212j6993k600
1090a0135J6607K605j7228k590J6949K749j7199k476J6824K776j7315j884J7223
1103F906J121j6704j056J7287Q55j6662j168J7229J346j6843j154J7844J04j7000
1117g895j24J6842L25j6719J55J6647k5j6861L33J6946p53j7153J276J6843r38
1132H899j6886P38J6856j482j6511J506J6300j840j6674J851J6416k402j6656
1145i885K516J6575k769j6627K383J6521k376j6951K652J6583l041j6311L528
1158g202J6023l626j5901L714J6725m318j6400M567J6760m457j6217M355J6426
$$ y = [11734, -4060, -9807, 5954, 11730, -4631, -9670, 6682, 11749, -5136, -9782, 7078, 11646, -5715, -9958, 7165, 11160, -6097, -10189, 6561, 10285, -6406, -9848, 6246, 9458, -7535, -10135, 6472, 9077, -8151, -10741, 6208, 8957, -8242, -10718, 6106, 8882, -8433, -10317, 6906, 8027, -8677, -9733, 7554, 8409, -8253, -9421, 7808, 9154, -7689, -8843, 9001, 9105, -7895, -8019, 8823, 9148, -7571, -7416, 9231, 9206, -7655, -7322, 9624, 8871, -8282, -7006, 9837, 8899, -7987, -7249, 9607, 8125, -8386, -6880, 9420, 7580, -9094, -7243, 9173, 6771, -9885, -7369, 9206, 6437, -10190, -7807, 8714, 6338, -10613, -7961, 8622, 5581, -10730, -7202, 8821, 5195, -10706, -6992, 9733, 5415, -10985, -6418, 10342, 5885, -10332, -5977, 10449]
1171A0449m463j5874M875J6134m954j6103N771J5749n730j5681N785J5931o425
1184E464j5192N969J5548o147j5572O275J5260o577j5277O297J5121o807j5186
1197a0824O859J5079p527j4919O854J4731p030j5349P707J4603p682j4546Q255
1210c789J3924q138j3899Q453J3876q696j3773Q864J3756q565j4012R283J3922
1223A1206r432j3334R430J3491r476j2963R846J3005j0122j2673J0385J2803j0156
1236B010j2588R835J2893j0189j2096J0019J2077j0343j1934R990J1704j0416
1248I62j1870J1100J1201j0976j1346J0912J1083j1227j1213J1164J0886j1183
1260e07j0842J1161J0314j1041j0667J1170J0556j1607r930J1769R598j1550r978
$$ y = [10449, 5986, -9888, -5013, 11121, 6167, -9936, -4165, 11584, 5854, -9827, -4042, 11889, 5464, -9728, -3759, 11789, 5642, -9930, -3655, 11605, 5028, -10249, -3952, 11169, 4362, -10824, -3965, 11114, 3587, -11332, -4478, 10253, 3223, -12126, -4419, 10184, 2502, -12044, -3789, 10135, 1997, -11902, -3449, 10427, 1731, -12042, -3178, 10578, 2013, -11999, -2716, 11206, 1774, -11560, -2130, 11361, 1885, -11078, -1232, 11773, 1651, -11022, -637, 12166, 2010, -10578, -743, 12150, 1961, -10135, -116, 11961, 1618, -10316, -326, 11378, 962, -10908, 192, 11393, 417, -10929, -17, 11066, -161, -11374, -210, 10676, -507, -11349, -188, 10126, -915, -11582, -412, 10144, -1463, -11393, 376, 9974, -1576, -11554]
1273a1554J1859R602j1634r539J2165R508j1799r532J2272R035j1840q470J1968
1286B041R003j2392q516J2388Q311j2336p882J2216Q364j2326q196J2548P822
1299A1045j2389p875J2267P627j2668p569J3089O797j2855p074J2958O989j3620
1312c278o771J3291O293j3472o523J3321O170j3303o061J3164N979j3539n610
1325a0339J3055N821j3180n712J3852N285j3534n068J3867M890j3444m954J4368
1338D907M376j3958l914J3705M178j3796l649J3401L891j3381l630J3636L346
1351I112j3695k870J3387L371j3806k909J3299K905j3792k473J3516K256j3406
1364e105k506J3599J863j3628j855J2913J521j3216j686J3468J508j3516j124
$$ y = [-11554, 305, 9907, -1727, -11266, 899, 10407, -1392, -10924, 1348, 10383, -1457, -9927, 2041, 11044, -1348, -9864, 2524, 10835, -1501, -9383, 2833, 11197, -1129, -9325, 3223, 11045, -1344, -9219, 3048, 10675, -1993, -9562, 3527, 10324, -2531, -9605, 3353, 10342, -3278, -10049, 3242, 9535, -3937, -10460, 2861, 9031, -4272, -10333, 2831, 8810, -4729, -10339, 2716, 8537, -4643, -10355, 3497, 8782, -4752, -9820, 4047, 8937, -4507, -9461, 4907, 9283, -4675, -8589, 5116, 9294, -4502, -8151, 5250, 9141, -4240, -7870, 5766, 9112, -4583, -7453, 5934, 9305, -4501, -7410, 5889, 8794, -4998, -7471, 6045, 8301, -5105, -7611, 5988, 7851, -5777, -7632, 5281, 6802, -6414, -8100, 5368, 6876, -6640, -7764]
1377g764J2957J496j3479j215J3587J135j3568n43J3492L71j3542J3J2999M07
1391F346j2874j02J3292k14j2549K4J3054p62j2410O99J2534n05j2577P65J2726
1406G447r69j2299P64J2773j335j2182J245J1693j226j2093J150J2101j566j2175
1420f672J648J1958k029j2043J941J2003j967j2430K297J1794k423j1943K572
1433e294J1504k438j1312K765J0954k783j1236L157J1166k994j1033L230J1377
1446G063l356j1194L638J1132l767j0734L886J0746l741j0476L897J0798l928
1459C964j0672M002J0865m545j0312M338J0436m662r972M403J0265m746j0179
1472f815M613R950n140r563M745J0031n447r807N305R342n584r420N478Q998n342
$$ y = [-7764, 5193, 6689, -6790, -8005, 5582, 6717, -6851, -7394, 6098, 6469, -7073, -7060, 5939, 6346, -6528, -6630, 6662, 6448, -6101, -6077, 6977, 6215, -6195, -5496, 7038, 6533, -6044, -5279, 7447, 6478, -5821, -5057, 7716, 6381, -5801, -4556, 7137, 5911, -6182, -5032, 7069, 5503, -6672, -5024, 6934, 4905, -7138, -5197, 6806, 4839, -7591, -5294, 6500, 4077, -7866, -5294, 6210, 3772, -7540, -4775, 6179, 3396, -7840, -4683, 6483, 3489, -7544, -4314, 7063, 3707, -7487, -3849, 7283, 3516, -7218, -3332, 7414, 3673, -6803, -2906, 7892, 3964, -6708, -2706, 8159, 3614, -6698, -2360, 8076, 3414, -6558, -2155, 8110, 3364, -6815, -2202, 7748, 2608, -6955, -2210, 7821, 2374, -7433, -2128, 7214, 1630, -7790, -2312, 6686, 1344]
1487A344q998N269Q889n639q714N773Q593n626q606N710Q603o007q240N945Q176
1502F472n577q276N527Q812o025q051O432P842o041p797O253Q000o366p880O599
1517g6P729o641p067O224P328o525p059O366P144o799o942O762O179o380o473
1532f230O538O175o604o782O895O109o540o258O737O083p207n942O911O158p469
1547a426n327O855N517p407n187O999N437o852n335P538M634o638m783O682N158
1562E865p368m398P401M591p312m287P366M493p491l553O699M191p208l935P535
1577B589L511p156m010P619L221p088l557P346L274p486l171O884L403o916l706
1592e243O910L366p168l386P257K797p371k930P232K756p283k445P123K637p364
$$ y = [1344, -7654, -2385, 6504, 865, -7849, -2076, 6517, 891, -7715, -2005, 6598, 591, -7649, -1704, 6472, 895, -7381, -1854, 6958, 933, -7118, -686, 7156, 1115, -6682, -429, 7571, 1205, -6675, -76, 7653, 1012, -6055, 169, 7497, 972, -6087, 279, 7423, 624, -6318, 444, 6623, 243, -6230, 308, 6483, -121, -6903, -8, 6101, -439, -6697, 40, 6123, -1084, -7026, -115, 6043, -1426, -6753, 102, 5619, -1788, -6975, 24, 5461, -1391, -6726, 812, 5446, -1192, -5975, 707, 5865, -1503, -5901, 1500, 6091, -1221, -5508, 1858, 6351, -1140, -4693, 2006, 6197, -1011, -4946, 2589, 6100, -1056, -5066, 2553, 5774, -1314, -4871, 2475, 5749, -1737, -4908, 1976, 5379, -1537, -5243, 1667, 5033, -2135, -5521, 1736, 4533, -2838, -5768, 1464, 4220, -3063, -5508, 1615, 4252, -3112]
1607c112k226P010K384p176j739O980J719o766j698P001J867o981j748P362J592
1622D469o837j672O986J384o783j540P202J518o654j156O983J130p218j093O950
1637C669Q10o776j075O806P34o815r18O786N26o563n07O175L79o323m27O189L58
1654C028o736L1O228k36n929m3O279n8o242o6O444k52o018L42N737j66n931O97
1672b891N832m47n912N85O375j006n550R01N521n90n752J097N611r08n719J378
1688a475N222q54n660J336N571j266n439J132N054j164n418J420N179j539n292
1703c193J188N117j900m508J660M712j850n327K143M717j905m642J440M984j821
1718H15m494J860M190j961m044J894M567k230m403K584M056j999m112K333M270
$$ y = [-3112, -5338, 1672, 4056, -3120, -4859, 2121, 3840, -2926, -4624, 2377, 4244, -2737, -4485, 2877, 4469, -2368, -4040, 2946, 4330, -2453, -3993, 3209, 4727, -1927, -3083, 3900, 5030, -2188, -3281, 3669, 4479, -2297, -3372, 3434, 4168, -2647, -3565, 3221, 3747, -2816, -3323, 2852, 3231, -3092, -3519, 2670, 3028, -3708, -3677, 2551, 2315, -3614, -3657, 2622, 2564, -3678, -3744, 2700, 2448, -3570, -3228, 2509, 2343, -3588, -2891, 2941, 2494, -3418, -2833, 3542, 2536, -3014, -2113, 3408, 2818, -2934, -1837, 3774, 2866, -2853, -1475, 3747, 2893, -2767, -1431, 4140, 2874, -2565, -1433, 3621, 2457, -2961, -1541, 3638, 2099, -3193, -2005, 3112, 1212, -3296, -1636, 3076, 1226, -4101, -1958, 2759, 854, -3788, -2348, 2636, 815, -3679, -1819, 2371, 410, -3634, -1740, 2827, 597, -3806, -1222, 2834, 835, -3277, -944, 3326]
1733C326k365m180K299M326k192m183K991L549k504m049K988L824k968l394K510
1748b2L578k484l434K092L866k956l197K511L200k699l420K744K985k417l282
1763b935K499L126k876l087K774K803k656l005K884K791k937k750K871K939l160
1778g19k451K997K430k920k409L205K341l335j598K981K056k992j992L161J943
1793B698k965j720L024J780k929j917L322J903l401j540L123J256k666j796K906
1808A078J650k964j368K940J056l344j006L131R47l026q81K702Q63l042q55K736
1824F17O66k772q13K897M31k745p74K891O78k726p23L302J62k427o47K996J25
1841A138k357k17K237N23k330m92K718M85l054J38K735L47k928L02K422j96k454
$$ y = [3326, 961, -3219, -920, 3406, 1214, -2969, 22, 3571, 1067, -2982, 6, 3830, 862, -2532, -22, 3556, 1072, -2362, -270, 3596, 640, -2557, -46, 3154, 455, -2965, -221, 2764, 347, -2935, -436, 2690, -186, -3273, -499, 2304, -352, -3357, -473, 2318, -619, -3369, -498, 2441, -719, -3170, -173, 2257, -663, -3072, 133, 2474, -861, -2459, 522, 2578, -414, -2406, 755, 2698, -267, -1987, 1037, 2817, -112, -2029, 1293, 3196, -205, -1745, 1378, 2634, -32, -1828, 1078, 2728, -236, -1604, 1336, 2392, -952, -1958, 1173, 2120, -906, -1787, 915, 1778, -1264, -2119, 617, 1283, -1489, -2302, 595, 1026, -1719, -2493, 398, 1076, -1650, -2373, 929, 1091, -1336, -1983, 1013, 1138, -1219, -1436, 801, 1324, -1006, -1498, 1220, 1705, -1349, -1211, 1524, 1871, -1057, -755, 1667, 1471, -983]
1858i83L21K604l7k941K61K815r41k081M62K425m92k599K48K571q68j838N0K098
1876A075l56k454O50K109n55k682J161K229r32k113R21K041j193j672P89K031
1892A049j185j655J148J873j138j604P04K123r31j716J180J799j055k199J731
1907A24J754j266j581J268J394j079j586J274J605j225j604J575J364j548j571
1922a102J775R99j382j523J607J084j846j016J438J166j866j094J549J222j942
1937i31n50J428J170j809j076J745P27j668p69J901P94j918n17J556Q16j909n15
1954a525K153P95k346k90J933Q46k472J86J690O10k282M7J821K72j891o3J854
1971A338M3j812j99K194r8k068P4J969l01j698l91K219m48j828L04J638m41j649
$$ y = [-983, -662, 1942, 1905, -1036, -775, 2040, 1099, -982, -520, 1905, 1413, -1186, -938, 1633, 765, -1073, -1023, 1075, 719, -1735, -1085, 1024, 469, -2213, -1052, 1177, 245, -1868, -947, 1094, -99, -1771, -982, 1049, -136, -1791, -643, 1230, 92, -1512, -808, 1315, 384, -1332, -152, 1647, 592, -1607, 124, 1878, 612, -969, 299, 1693, 614, -972, 302, 1907, 682, -922, 653, 2017, 469, -1102, 673, 1672, 290, -1233, 374, 1458, -388, -1404, 34, 1200, -666, -1760, -211, 1011, -931, -1481, -53, 1117, -692, -1768, -23, 704, -964, -1733, 168, 962, -956, -1473, 83, 899, -1010, -1525, 628, 1423, -923, -1213, 720, 1566, -906, -720, 970, 1580, -702, -655, 1166, 1438, -453, -516, 1338, 1381, -431, -630, 1564, 1466, -602, -528, 1441, 1140, -558, -949, 1270, 822, -1006, -702, 936, 495, -1154]
1989a154L16J713p25j800N70J841o70j668M57J575l56j875N93K092q83j671P12
2006i33J904q50j942J044K029j096j472Q64J527o84j433Q14J780p44j880Q80J968
2023A776r82j557Q25J904j280j619J245J670j185j505J001J642j293k010J553
2038A85J606j449k098J662J486j414j647J277J818j504j887J495J642j681j685
2053b194J914J369j689j446K039J062j587j463J805J671j749j414J456J772j954
2068d08j298K192R71j717j321K300J145k063j175K200J078k100j124K542J045
2083B267k159j361K298J443k405j185K029J098k247j120K241J172k731q10K200
2098G30J145k807p97K890L56k964l96K448Q86k956p32K823N42k924l58K658P42
$$ y = [-1154, -838, 875, 150, -1650, -1080, 761, 91, -1577, -1120, 455, 99, -1776, -1183, 909, 26, -1645, -933, 971, 121, -1821, -777, 1252, 156, -1316, -452, 1075, 391, -1042, -228, 1552, 808, -1072, -192, 1776, 794, -763, 62, 1966, 686, -933, 312, 1982, 797, -708, 293, 1935, 642, -1368, 185, 1791, 342, -1756, -94, 1392, -22, -1669, -392, 1426, -78, -1965, -470, 1172, -509, -2194, -280, 1089, -600, -2046, -7, 1055, -532, -1995, -190, 1481, -268, -1682, -226, 1546, -408, -1706, 486, 1457, -260, -1581, 719, 1864, -199, -1374, 826, 1904, -196, -1320, 1222, 2267, 108, -1253, 1045, 2488, 83, -1102, 927, 2025, -222, -1342, 899, 2071, -660, -1470, 730, 1875, -932, -1729, 1161, 1517, -1447, -1843, 605, 1491, -1465, -2197, 626, 1168, -1756, -2114, 544, 1286]
2115A286k930o64L026M95k553n71K834M51k708m82L125M32l015J52K702L19l092
2132a193j50L402l31k697p0L029k79k652O1K740m3l213N22K842m11k663R3K992
2150A979m66k923N02K446j94l381P70K925r79k911P85K752m80k942M79L032o22
2167G72k875L32L216o29l111P98L112o19l133Q82L040q75k930J132K842o31l342
2184b019Q33L119q28k793Q52K759o63k904R68L360j299l058J359K797j652k499
2200a668J009L139j279k635J004K803j329k939J216K717j285k656R50K887j354
2215E80l019J674K751j705k948J564K757j481k937J818K840j972k759J835K694
2230A692j343l010K207K612k140k846K591K529j880k954K170K960k048k725K052
$$ y = [1286, -1644, -2308, 718, 1213, -1340, -1911, 923, 1374, -1334, -1816, 1309, 1741, -1274, -1122, 1580, 1899, -1193, -1343, 2059, 1728, -969, -1039, 1990, 1711, -941, -880, 1860, 1817, -1396, -874, 1968, 1557, -1106, -1013, 1979, 1513, -1410, -908, 1538, 1344, -2037, -1267, 1658, 679, -2232, -1447, 1305, 825, -2117, -1638, 1394, 772, -2103, -1771, 1445, 816, -2295, -1497, 1615, 996, -2137, -1255, 1785, 910, -2020, -888, 1954, 1323, -2019, -1186, 1933, 1105, -1688, -836, 1923, 1260, -1644, -676, 2684, 1385, -1673, -314, 2483, 831, -1668, -659, 2480, 1201, -1434, -430, 2373, 1044, -1895, -679, 2038, 753, -1903, -953, 1934, 580, -2439, -765, 1986, 281, -2667, -1103, 1654, 173, -2764, -946, 1894, -78, -2837, -1002, 1692, 349, -2661, -454, 2158, 18, -2828, -237, 2292, 412, -2542, -372, 2588, 540, -2185, -133]
2245a33K871k304k544K541K559k629k516K415K994k982k546K453K557k625k360
2260b249K868K331k886k638L073J951k786j936K572K082k958k296K936K222k529
2275b43k375K382K362l089j813L170J276k494j725K489J874k879j371K500J835
2290A899k735j618K865J564k288k346L377J808k753k080L161K008l369j623L123
2305I93J492k601j859L153J644l345j489L240J810l718j302L452J174l354j533
2320b243L411J384l668j078L166J152l327j373L409J090l457j174L388J094l213
2335a439j149L244J112l167j235L529R45l589j009L581J129l504q03L366R14l231
2351a306q88L727N34l471n13L615O91m119l1L627M20l357m52L454L95l602m65
$$ y = [-133, 2738, 434, -2110, 431, 2990, 361, -2155, 260, 3254, 272, -2274, 179, 2736, 111, -2249, 619, 2950, 64, -2574, 499, 2450, -336, -2272, 300, 2382, -576, -2872, 64, 2286, -243, -2618, -236, 2126, -963, -2776, 394, 1670, -824, -2549, -60, 1814, -1065, -2436, 64, 1899, -836, -2454, 411, 1975, -313, -2659, 718, 2526, -227, -2307, 854, 2862, -507, -2130, 993, 2485, -116, -1975, 1178, 2822, -523, -2012, 1228, 3038, -680, -1982, 1470, 2644, -710, -2243, 1168, 2552, -1116, -2194, 972, 2124, -1203, -2576, 833, 1923, -1534, -2708, 680, 1774, -1439, -2588, 656, 1768, -1399, -2634, 895, 1840, -1749, -2758, 823, 1952, -1552, -2355, 1011, 1925, -1306, -2194, 1533, 2067, -1404, -1917, 1698, 2389, -1730, -1761, 1866, 2286, -1071, -1523, 1931, 2326, -1276, -1741]
2368a741L667M13l998O2L625k6l525j78L582K38l945K7L517k29l468N0L558m5
2386A584l763ML389K69l666n5L942n80l528M68L440k74l675K94L809m58l304L19
2404a785L641m94l350L74L364n91l262R36L551m50l784O66L836q86l746J051L339
2421B410q56l243R59L265r63l553J185L305j194l080Q63L328r89l734J323L133
2437B159j099l199J027L086j124l223J155L294j501l022R02L331r58l244J089
2452a327L402j489l283J325L283j264l122J138L327j311l090J789K849j384k961
2467b118J491L056j428l088J753K919j468l134J632L112j670l055J580L102j930
2482G54k895J726L161j942l331K124K701j879k691K202K216k031k664J852K828
$$ y = [-1741, 1926, 2339, -1659, -1597, 2028, 2002, -1523, -1701, 1881, 2119, -1826, -1799, 1718, 1489, -1979, -1929, 1629, 1584, -2179, -2175, 1214, 1483, -2183, -2238, 1704, 1124, -2404, -1936, 1504, 1230, -2445, -2151, 1658, 1200, -2104, -1785, 1856, 1362, -1988, -1614, 1750, 1159, -2103, -1167, 2384, 1934, -1850, -1184, 2652, 1766, -1980, -929, 2410, 1554, -1689, -730, 2535, 1572, -1981, -796, 2509, 1315, -1765, -902, 2426, 1437, -2297, -974, 2159, 1060, -2139, -1112, 1974, 850, -2373, -1218, 2076, 575, -2447, -1545, 1786, 828, -2416, -1327, 2075, 586, -2697, -1372, 1911, 647, -2475, -1337, 1990, 679, -2411, -622, 2227, 843, -2118, -627, 2429, 1001, -2087, -334, 2585, 1117, -2017, -385, 2727, 1057, -1998, -418, 2684, 754, -2141, -415, 2746, 804, -2527, -403, 2298, 419, -2272, -70, 2146, 115, -2549, -697, 2131]
2497B131k126k646K459K171j840k854K125K474k071k877K593K372k223k255K265
2512c02K310j973k534K228K450j807k888K664K268k632k062K377K429k585k373
2527b430K938K034k504k051K475K385k761k041K851J883k756j841K512K038k977
2542b45j832K434K085k505j781K178K002k864j641K496J732k960j403K629J617
2557A942k810j432K505J744l144j249K894J548k683j840K719J613k866j272K804
2572D73J646k788j371L083J026k827j339K931R70k619r82K764J126k551r42K732
2588A332J028k753j319L060J128l248p09K904O84k748q05K691Q99l053o40K520
2604I71P62k812r72K870R66l048p36K840P00k804o13K427J176l463k81K779P77
$$ y = [2131, 5, -2641, -182, 1989, 149, -2705, -580, 1894, -177, -3054, -461, 1911, -312, -2567, -302, 2008, 35, -2499, -271, 2179, 372, -2516, 148, 2416, -216, -2278, 99, 2528, -57, -2430, 508, 2542, 38, -2013, 462, 2847, 86, -1955, 896, 2779, 23, -1818, 694, 2732, -245, -2077, 357, 2442, -63, -1844, 334, 2336, -528, -2169, 327, 2059, -901, -2304, 325, 1942, -868, -2300, 205, 1949, -1195, -2444, 450, 1998, -685, -2525, 194, 1807, -1059, -2331, 473, 2119, -669, -2040, 1043, 2069, -758, -2097, 834, 1804, -815, -1797, 967, 2093, -458, -1400, 1332, 2360, -393, -1712, 1348, 2476, -772, -1481, 1423, 2107, -641, -1446, 1245, 2144, -909, -1549, 971, 1733, -1079, -2051, 819, 1785, -1263, -1999, 841, 1541, -1263, -1876, 551, 1727, -1736, -2017, 762, 1539]
2621A539l304k4K742N69k765p41L064K34k590m14L186j12k755K7K527O35l063
2638a245k0K690L73k548l99K834Q8k790P4K639K86l014j82L047j42k982J76K754
2656A639l23k516J46K533l09k566J33K598j59k771M5K560o4k596K43K697o59k492
2674a861N13K556n82k401N21K511m26k721Q26K462n19k258K2K870n51k684R11
2691h11K370o87k174O94K568o86k654P99K357n58k557O20K569o17k710J078K304
2708A905q05k085P33J984p76k423P24K462r28k259Q49K390j152k508J009J842
2724I62r77j860J157K132j089k165J045K166p87k601J005K393j311j873Q46K101
2740A144j066j921J530J948j333k193J754J874j395j949J199K268j555j938J630
$$ y = [1539, -1765, -1789, 953, 1522, -1243, -1984, 1080, 1314, -1276, -1690, 1496, 1384, -1371, -1344, 1183, 1818, -1245, -1265, 1425, 1798, -750, -1149, 1685, 1773, -1017, -943, 1696, 1982, -1032, -1214, 1833, 1691, -1291, -1115, 1639, 1316, -1200, -1054, 1479, 1170, -1396, -1263, 1335, 1176, -1595, -1550, 1010, 946, -1650, -1407, 1290, 631, -1861, -1348, 1208, 626, -1775, -1254, 1257, 831, -1890, -1064, 1398, 879, -1379, -1357, 1513, 962, -1722, -811, 1559, 872, -1302, -608, 1960, 1274, -1380, -581, 1776, 1218, -1339, -719, 1850, 1233, -1477, -399, 1905, 1100, -985, -252, 1732, 956, -1467, -743, 1719, 791, -1468, -619, 1771, 619, -1889, -880, 962, -15, -1875, -718, 1414, 325, -1840, -795, 1371, 584, -2017, -1012, 1381, 70, -1803, -957, 1144, 78, -1843, -313, 1635, 302, -1891, -137, 1737, 342, -1607, -408, 1860, 305, -1633, -3]
2755cJ793j202j987J486J922j207k114J343J912j361k010J302K059j498j850J268
2771a47J685j268j755J265J630j496j495J479J605j732j587J713J489j531j727
2786a872J596J656j912j119J598J115j438j345J495J566j646j204J684J163j434
2801i7j356J404J265j244j256K020R61j514j499J966P08j183j532J717J490j875
2817b5j034J697P76j518r81J623R57j443j160J752Q30j602j185J684P38j593r13
2834a397J709Q30j647q38J627L72j478q16K059N05j979m65J648J080k077n87J848
2851C94L49j517n01J566R34j925k39J426N48j638m68J619N51j491l36J482P06
2868A460j772j98J688L67j687n57J932Jj858k08J833J56j500k68J584R9j734k31
$$ y = [-3, 1790, 588, -1399, 87, 2009, 802, -1312, 31, 1943, 582, -1428, -126, 1933, 435, -1415, -147, 1538, 270, -1485, -220, 1410, -86, -1581, -102, 1503, -229, -1816, -103, 1386, -145, -1872, -276, 1380, -532, -1651, -53, 1062, -376, -1721, -226, 1340, -306, -1510, 174, 1337, -97, -1453, -49, 1216, -28, -1284, 736, 1697, 183, -1316, 650, 1358, 175, -1357, 360, 1850, -25, -1059, 638, 1414, -104, -1085, 538, 1495, 52, -1108, 644, 1474, -128, -1313, 371, 1109, -484, -1397, 312, 1142, -505, -1343, 284, 656, -822, -1638, 421, 926, -1053, -1518, 130, 1210, -867, -1454, 394, 743, -774, -1275, 291, 1225, -700, -939, 487, 1035, -603, -1071, 548, 1099, -392, -728, 754, 1460, -312, -510, 1178, 1545, -142, -699, 1233, 1234, -624, -832, 1001, 1157, -343, -611, 973, 1072, -662, -893]
2886h93J213L13j449k92J798N5j437n35J887k24j419N2J527l75j052k3J413K43
2904H02j858J62J491j23j245j33J871k31j440r1J833j11j778J43J540O6j399K
2922d99J515k39j201J88J103r1j301L31J304n51j295L56J480m93j143K04J108
2939G76k47j455L94J357l29j572P97P56j94j482O26J508q07j127L82J311l47j569
2957a222N77J508r48j354R64J199m89j268P82Q45n00r65M73J200o55p90Q18N50
2975G25n75o87N43Q77n39q44Q18R21p78j310J053O31k59r25L86Q80n53r30O95
2994A29R22r21o60M48Q85p83p83N28J023n40j285P67Q21r60o12P37Q42q49n15
3013h06P20O43o73j097J057O87n83n98M13P17p38m29J028L44q36p40Q53N33m24
$$ y = [-893, 320, 633, -816, -1108, 690, 745, -692, -1227, 660, 436, -983, -931, 596, 221, -831, -854, 559, 802, -1056, -894, 597, 474, -771, -904, 967, 736, -704, -795, 1038, 927, -851, -708, 832, 898, -501, -499, 1016, 777, -424, -236, 867, 776, -525, -194, 1110, 559, -736, -380, 1100, 607, -536, -332, 776, 529, -926, -532, 825, 496, -1076, -279, 477, 283, -1199, -573, 935, 128, -999, -617, 694, 347, -1222, -645, 863, -85, -1439, -475, 724, 235, -1033, -251, 594, 94, -871, -398, 802, 147, -643, 175, 725, 150, -537, 6, 883, 344, -500, 318, 1239, 461, -849, 204, 835, 576, -349, 37, 917, 364, -566, 129, 1051, 130, -530, -82, 803, 20, -763, -235, 788, 248, -1037, -270, 551, -409, -1021, -284, 558, -291, -806, -86, 557, -116, -1213, -156, 531, -52, -650, -237, 480, -258, -687, 341, 685, -151, -891, -38, 495, 71]
3032G1p79P68R97j113j83P86N49r72n62P26N21p95q6N08K46p18n6J94P46p49j054
3053i55J419J22p41n81P43N97p36m05P95J73q89o10R70L51o46k56Q27m8o07k04
3073f81P38L63q85r3Q45J68q91l05P30M62p78k13R00L39q29m04R06M44j068j2
3093b64R35K9j120M86L60j10l59O2M95n2p15r2J276n59p55Q8N83n7n17O9Q76m60
3115A99j054M11O50J82o46k37P18l68o06K90R66o45o64M22L98J22p47J74N61N7
3135A83j006N88P54l44k43k73J005k87r84O71M78o34j91L28P85n00k00M8O7N5
3155C00n68K46P36n09n60L76N15m56m56L42M80m11n05Q35l7l80k88J9P02n94l09
3176e22N46K59o29n37P64N81p23k83M52K77l88k63K59M24m34j77M32L05l62l83
$$ y = [71, -708, 60, 1057, -56, -239, 547, 1096, 124, -438, 288, 809, 14, -72, 436, 682, -36, -92, 102, 848, 99, -955, 464, 586, -155, -736, 7, 604, -132, -537, 258, 431, -458, -1068, -98, 253, -393, -649, 178, 130, -477, -681, 57, 420, -465, -558, 287, 455, -436, -741, -11, 451, -327, -540, 360, 699, -130, -534, 372, 816, -252, -264, 671, 700, -420, 66, 426, 316, -43, 19, 514, 462, -253, -345, 931, 372, -383, -295, 288, 231, -286, -217, 659, 199, -855, -444, 206, 388, -258, -495, 223, -145, -751, -461, 505, -140, -804, -382, 16, 138, -609, -435, 126, 183, -823, -235, 519, 175, -68, -341, 664, 377, -607, 64, 542, -92, -283, 45, 830, 330, 130, 178, 245, 300, -268, -22, 714, 205, -355, 21, 536, 80, -376, -34, 446, 35, -470, 365, 328, -52, -340, -321, 381, -213, -522, 24, 283, -346, -883, -119, 462, -261, -544, -92, 185, -203, -466, -207, 217, -217, -394, 38, 343, -19, -402]
3196d02M19L76n25j06N01L83m18m32M70K56k49k30L48J99k16l14J89L93p58j64
3216b80N23J34n09J50M72R0o14l20L88J42o53n4R88j20m16n47Q00m4n90k51J133
3237D22l39q52K46O42J4n68j99N51K08o80K66P52k01o21L86K29J00n95J03M54
3257C18P6n26K64K72o7m37L11M55m60k48L77M02k32n66K86L31r3p85J73Q58n81
3278A28n37O36M04n55o06L39M96l66l71P1L90k33k79M94J85n84k86N88M64m44
3298f6p66N03P12p97m21N32O87n07l99K39O98k90n21L65L80j75o38O12Q27q27
3318A48k32L85K54l46n88O63M42m11n30M64K17o18q1L52M66m06o59O27L11o54
3338a96k01O15P1m51m39N90M70q37k0L27L11k03p10K15P51q96j39O52M39p71k24
$$ y = [-402, 17, 393, -132, -238, 263, 646, 228, -204, 266, 522, 273, 43, 391, 590, 374, 60, 249, 642, -116, -280, 243, 377, -132, 18, 490, 580, -34, -354, 34, 176, -477, -531, 457, 337, -79, -626, 174, 130, -460, -711, 422, 83, -769, -523, 119, 133, -435, -634, -83, 125, -555, -289, 463, 262, -359, 27, 256, 356, -239, -136, 318, 394, -132, 132, 404, 337, -100, 211, 666, 206, -42, 335, 737, 505, -61, 225, 556, 463, -322, -149, 709, 128, -409, 227, 631, 76, -530, -191, 305, -61, -432, -361, 29, -204, -483, 11, 196, -388, -674, -86, 378, -66, -832, -329, 383, -414, -835, -303, 384, -123, -522, -283, 415, 125, -396, -31, 349, 174, -464, 148, 975, 148, -84, 301, 555, 209, -379, 284, 726, 315, -215, 249, 466, -152, -233, 119, 585, 179, -480, 147, 458, -196, -397, 218, 289, -162, -601, -11, 459, -378, -398, -71, 240, 37, -673, -458, 293, -603, -742, -90, 349, -422, -646]
3359f46N97N66q31k71R15L77j127J56P08l31j59m17J006k10m08L9P38K01q67n33
3379d97R57J57q77N5Q19m3r37N1O29N09j029k16J154M6j248J21O78r2n81j30O36
3400A62qn97j61R16k94q41J13R07J31p95j76O16L16n63j53Q35j43q99M10O04r3
3421B87o81L09Q67o93k72K4P61j41m30k79P37K02r65J48P16K06j053L30N12L6
3441F21q84L81N19m03q01L99Q23m05p71K66O08k84q74L45O42j13q78P47N16n45
3461i1n89K98O58k26r40K51Q53l97p20N87N74k05p70M56O79m92k47J35Q75n15
3481A74n72M11M85l08p73O13O04m12o23O35L26K8j010K13P46j02q22M48P73m95
3501C39j253P28Q67p64n02M20Q78n80r78R42L22n63p60N29P40l76q31O02O08m62
$$ y = [-646, -49, 517, -314, -585, 330, 707, -420, -264, 444, 113, -46, -463, 543, 333, -75, -36, 702, 903, 36, -497, 460, 617, -260, -205, 614, 571, -366, -315, 314, 823, -206, -422, 732, 778, -470, -349, 329, 237, -344, -474, 162, 154, -443, -604, 312, 18, -823, -710, 197, 328, -467, -643, -27, 289, -274, -427, 408, 265, -634, -224, 380, 287, -394, -85, 782, 89, -183, -159, 602, 461, 31, -248, 489, 691, -274, -126, 590, 796, -257, 73, 585, 621, -263, 118, 637, 234, -567, -168, 655, 250, -521, -255, 353, 69, -805, -460, 182, 69, -809, -62, 454, -91, -680, -382, 276, 50, -890, -639, 214, -183, -903, -316, 258, 53, -717, -261, 418, -74, -321, -186, 689, 174, -398, 13, 498, 190, -583, 30, 634, 222, -401, 234, 560, 588, -422, -209, 537, 435, -387, 61, 834, 339, -914, -186, 681, -83, -585, -165, 713, 133, -845, 97, 419, -144, -904, -375, 365, -11, -842, -240, 368, -94]
3521i4r99J155O35p86q96R50N61p43m76L85J241j022p10P49N64l89o61N10R12
3540H86p78p55O12P32m23m82K96R38j095m02Q67M60r01k52M19N37o11o13J345
3559G80l24q49m42R99L26p86m17J167j91p00m03R84K95j065J08Q5N83l97l32O24
3579D5K03o72j90N85N48j070j38N54M56n91n4N21J72o62k81Q66N50j108k88P51
3599A97N89j033j5P94K05p02l16Q02M8p41k71J055J68j210j81J098J94j063m2
3618d24R83Q9r41k48R88l8p61k14O72K48j036J21O74K5q51j84J142m11l87L43
3638b10L72J06q80L0R33m4o87r2J097q0j246L10J166l19q37j6O51L58j080N12
3658D4M75r7o34k9J160m83p45r4J230m24r44K70Q50K83j278j65J146n04m42L6
$$ y = [-94, -1093, 62, 697, -89, -985, -35, 526, -217, -693, -308, 933, -89, -799, -50, 514, 125, -536, -26, 886, 108, -647, -35, 697, 274, -208, 88, 1026, -69, -471, 396, 856, -45, -297, 122, 659, 48, -565, 780, 456, -393, -835, 164, 490, -296, -713, 454, 263, -437, -840, 144, 439, -626, -518, -433, 150, -247, -579, 45, 248, -424, -614, -29, 519, -551, -689, -135, 321, -270, -324, 197, 369, -293, -574, 292, 842, -266, -554, 197, 786, -247, -262, 532, 737, 35, -281, 521, 569, -172, -443, 612, 780, -430, -611, 487, 681, -382, -424, 559, 648, -293, -541, 447, 409, -352, -566, 106, 354, -682, -561, 113, 138, -713, -897, 245, -166, -553, -210, 162, 268, -612, -582, 351, 307, -380, -472, 625, 545, -701, -391, 775, 456, -381, -397, 254, 612, -468, 44, 519, 422, -212, -241, 919, 436, -309, -403, 827, 403, -541, -271, 579, 862, -416, -581, 565, 61, -381, -345]
3678c45R45m03p00J46N50K23j276N23Q39k95r71L10P47O5r26J68R01l03q12N67
3698d7O49l15j264O81O12o8p00J96R11n38p10N31P09j78q96K30R68l17j017N68
3718ER07p62o11L11R46p72n17M80N30L9j056M64Q12m87p67L84O57n51r12O96N09
3739C05l59q22N79N90k23r22O44N26l15p44O24O16m76r80Q36N59k70r44N91Q58
3759F73o46j009J152M80p61m84N52J025j030p75P01J008p90j15Q1P47p12n64N26
3778E9Q87q38o16O28P14p36o41N24N66n21n63O95N02n94r97P68N90m21r84Q98
3798h0R73r79r23P73N74q36n28Q87O66p14o03O24N17n33m37Q89O40j148m48Q72
3818A86L42p62j95M90N41p53k84O66O08o51o14P99M44p24l59O76L93p97k12O34
$$ y = [-345, 600, 197, -503, -357, 193, 416, -860, -337, 502, 207, -764, -454, 293, 358, -568, -400, 501, 198, -614, -47, 602, 287, -977, -296, 316, 248, -452, -256, 655, 117, -593, -62, 647, 469, -427, -197, 771, 454, -563, 5, 912, 150, -461, -150, 796, 24, -493, -13, 517, 556, -500, -36, 776, 289, -478, -94, 563, 12, -900, -204, 305, -54, -876, -297, 293, 70, -852, -208, 318, 3, -741, -117, 499, 23, -957, -121, 438, 168, -776, -185, 673, 27, -982, 170, 650, -111, -595, -43, 982, -48, -823, -122, 886, 96, -19, 62, 809, 97, -467, 59, 946, 108, -508, 120, 834, 98, -543, -19, 547, 26, -537, 158, 660, 66, -931, -163, 427, 6, -978, -80, 893, -86, -1009, -236, 338, -498, -1026, -139, 527, -187, -790, -166, 351, -182, -619, 270, 910, -238, -686, 186, 528, -234, -429, 61, 602, -151, -435, 231, 839, 188, -426, 373, 817, 93, -266, 410, 803, 6, -206, 428]
3838D28J48r16k88Q31K25q83j32O93L00n70O2J81O87j228l47R16L68q46j75N78
3858C2L47p64n7O50J9o22K79K85L08q46k43P43L30p95j73Q75P6q23o2Q33L34o85
3880D1m5L70O4q39L90K30M09n11k70N53J39n84k93Q45K01j062j47Q27J13r54J73
3901c50P85j6p83j65Q11j15o95N8O88j24m40k17R60j61j066K55P75j15n90O3R51
3922E09k28n15j36M21K38r93K55Q10L29q94j16P97o0p67l3R47j89m91P3N68k4
3943E01p95Q1Q49j96p27R8R05l88o98j46O64K87p69J57J000n61o76K6R63l76p08
3964e09L10M94o8q25J5Q70j42o62M23K49j66o51N38K05l75j67K92M56k34l59L58
3985E2PL9m20m6P92o5p64M37M91J02q68K92P86o10n01K85Q56n21q10Q35L02n13
$$ y = [428, 576, -340, -628, 203, 428, -455, -587, 106, 406, -164, -102, 79, 766, -462, -809, 107, 475, -371, -546, 32, 379, -385, -442, 208, 227, -395, -116, 169, 477, -369, -612, 131, 461, -334, -507, 368, 444, -379, -441, 392, 726, 41, -4, 366, 430, -409, -19, 211, 620, 109, -161, 392, 531, -53, -346, 499, 700, -362, -509, 318, 431, -523, -350, 435, 419, -364, -529, 282, 167, -528, -470, 218, 94, -346, -563, 397, 236, -830, -575, 200, 85, -505, -442, 509, 281, -234, -370, 51, 289, -704, -449, 361, 690, -204, -320, 477, 417, -350, -383, 564, 375, -116, -43, 525, 501, -294, -213, 636, 440, -287, -189, 716, 328, -370, -516, 148, 435, -334, -177, 823, 262, -414, -388, 575, 199, -509, -199, 295, 227, -598, -583, 287, 145, -517, -94, 155, -11, -662, -124, 81, -294, -461, -169, 287, 53, -306, 52, 59, 98, -322, -368, 424, 359, -405, 32, 523, 625, -243, 49, 835, 225, -276, 9, 865, 344, -466, 369, 671, 158]
4007A58o09K33O65l00p83M86N64n93k07K86K81No75J04N12l98l02K80N23m32j27
4028c29L45K74k99l90K73J81Q6p45L74Q55l82o26J63N95k45n57M47M40k26l62
4048a28J1M21k00l64L93K10m93j53L96O10m61m07K0P30n98m59O97M25o79l23O65
4069C13n9n05k5J74Q22r23m87N56L21k28n23N23K17m54l99M23N50k32p08R39j94
4090A01n55QL65N96p03k4K08M33o36j39P16k3p21L73m5N00k43k81N25j62J2n90
4112b85L44K87m69k06M24L17m79j4K20K56o86K52J34r1m39J26M25J96l75k51M77
4133A63k14k83k38N55K53o61R5M26nl85l84O47l8j20J71Q8L1l23j73P03n7n23
4155b72Q0O42K0j136P77P2P3k36k50O39p0k05n9K19r1k44N8K14k17j61R0M30n6
$$ y = [158, -451, -218, 447, 147, -636, -150, 414, -179, -386, -100, 181, 186, -489, -385, 127, -271, -573, -293, 230, -202, -329, 16, 290, -9, -399, -126, 55, 141, -604, -230, 625, 243, -383, -220, 375, 130, -427, 20, 460, 234, -128, -117, 304, 104, -260, 133, 343, -150, -303, 93, 703, 242, -165, -145, 585, -13, -472, 225, 650, -29, -352, 313, 254, -251, -276, -102, 720, -203, -690, -134, 187, -41, -564, -41, 176, -278, -677, -254, 296, 64, -644, 295, 101, -454, -446, -81, 515, -188, -212, -4, 429, -207, -346, 370, 347, -374, -1, -46, 454, 211, -70, 455, 293, 305, -285, 59, 346, -123, -329, 95, 412, -67, -81, 139, 395, -291, -39, 95, 4, -435, -309, 116, 312, -63, -314, 163, -51, -334, -572, -17, 236, -425, -330, 96, 91, -294, -678, -31, -69, -189, -18, 70, 101, -222, -395, 308, 251, -272, -192, 450, 470, -666, 111, 183, 256, 20, -230, 409, 339, 134, 75, 294, 203, -41, 17, 231, 14, -147, -57, 373, 317]
4178C17m17n7K70j77m95M63L74k91j38k69O57%n43l5K48J75m37l11N95J83q03
4199f91M98R3K09k50m44O88k7m49K95M02l38o3o8N23L2o34L26L33k08k35k54O80
4221D18k50p5j1N41l53n11J54L49J44n83J64K26K80o73%K15N9m27M53J08k60j26
4243a58j07O30p99K03J95P4j07j92J44K87j59l89J85K60m07l13N27K78j4l17J85
4264FK44k35k68p6M56j75j58L26K87k85m44L31L13k77j24K80J0k17o4M13J03m11
4286C5j65M89j66m76L27k63N12k46l82L86k05K30m10N59l40k85J96k3J58j23K12
4307B0k49L24l10p0J90R4m95J62M58k20j21m5J75K18l95Q7j4M80p39O52p7j4l97
4330b86J06N81l74n5j76M66p1j83J07K68n2l12k35N93l48p5J2j20L84l0l73K12
$$ y = [317, -100, -157, 113, -64, -559, -96, 278, -13, -151, -420, 237, 237, -306, -341, -93, 82, -355, -666, -71, 112, -691, -193, -100, 109, -141, -585, 103, 76, -373, -78, 324, -14, -77, -145, 378, 410, -224, 102, 435, 227, -8, -262, 418, 168, 93, 82, 623, 270, -241, -87, 262, 406, -177, -13, 213, 493, -180, -180, 35, 94, -333, 120, 228, -32, -158, -265, 365, -434, -231, -36, 38, -69, -261, -117, 170, 11, -378, -193, 67, -340, -653, -126, 152, 138, -179, 6, 250, 15, -253, -329, 127, -48, -206, 120, 407, 122, -322, 9, 322, 45, -79, 201, 211, -6, -70, 343, 446, 35, -130, 359, 193, -283, 44, -219, 293, 47, -335, 51, -154, 76, -334, 225, -115, -400, -204, -227, -69, -192, 20, -229, 95, -215, -285, -95, -1, -496, -334, 124, -96, -217, -262, -87, 131, -264, -177, -191, 289, -450, 202, 125, 111, -286, -180, 401, 27, -28, -204, 262, 191, 8, 115, 383, 331, 19, -216, 377, 29, -46, -34, -154, 230, 200, -173, 39]
4352C9M6J25j20N8o0k32k3K27J22n44L36m9P2l03M88J34k61m71K71J53K4k29n6
4375b53N39M2l58j41N37l46m5J44j40J90N7l33L36Q7k89r7J95L5j30k80O26j24
4397B52k20rN30o25k64M51K4K21l75J75J11j31k74j96M89j62l71L08j39k79M18
4418f6K8K80o14J19P3J14n1p8j47R3M8j79N42K15l29k86L88k2j4j65J15M69l04
4441B29l37L31q1m1j48q6N00l45O1J70Q4o8l97L20j14l7l27K45J10J98m34L12
4463A45k15P3o9J35r7k66M40k00j71Q6L4J18M9k72R5N4K17k70J4J94m2L7j42L34
4487B81j60k60K4L17r4j73q0M56n19K30j9R6l8N0o2Q9j09M4Q8M74p08r6M1L47
4511B19j45j8l3RLj74J56J96k09n3O8j3j41p3k4J33rk12M56p9l35OJ48l6J27k58
$$ y = [39, 85, 210, 90, 148, 88, -144, -167, 60, 182, -362, -26, -75, -3, -306, 182, 316, 55, -416, -145, 8, 32, -197, -253, 286, 328, -30, -171, 366, 20, -25, 119, -21, 169, 226, -107, 229, 316, 27, -70, 125, 160, 30, -250, 376, 252, 32, 23, 553, -72, -336, 115, 139, 360, -15, 160, 271, 140, -134, -330, 159, -3, -374, -66, -205, -484, -66, -38, 242, -372, -253, -180, -66, -117, -195, -342, -249, -201, -380, 162, 377, 48, -238, 150, 128, 114, -51, 64, 533, 229, -108, 223, 142, 101, -47, -133, 367, 22, 83, 253, 337, 269, -128, 192, 78, 41, -286, -41, 69, 267, -167, 145, -70, 3, -66, 69, -28, -294, 146, -54, -225, -139, -105, 13, 62, -210, -115, -61, 156, -114, -100, 94, 52, 89, -53, 281, 121, -139, -115, 202, 108, -65, -145, 311, -208, 22, 3, 99, 61, 111, 49, 138, 29, 73, 161, 635, -73, -169, -128, 219, 74, 56, 23, 32, 35, -139, 17, 213, 4, -49, 19, 6, -135, -208, -232, -99, -108, -320, 136, 57, -278, -272, -124, -160, -33, -291]
4537b91J91K09k62k02J90J64k14q6L38L24k62j50L96J23l73R2k87M14k2l80k8
4558a16L33j60j42J46L36m66N6R4K04k35j34K06Q1j94k27M92k64J21r3J09j60
4579a3J26j67k96M25k08k75N42J26l77m22L70L47n74K71M2K20l26q8K12l7n8j88
4601c48K22L69l62o1M78k17j26O8J18j06m2j55O48k11p4l17L11j12k78K04L36
4622C45m90L45l72J37M00k90j29M01l62m3J62j7K51l53l37Q1O5j11O1M02Q3k82
4644e3k92K48Q1l15M6K06k80L50j28R3J88l44R4J4M91o16K20J75j9n64R0M37K18
4667C40n06M1O39l27j96p4J71j41J39q6M48m47K15j62J00J76o11M45Rj91q0O8
4689c0L35j91n11M21l2j1o8j26L41j59j18k3N05m96j36k5M67k72j23L21n0J46
$$ y = [-291, -100, 109, -153, -355, -165, -1, -215, -301, 37, 361, 99, -51, 345, 468, 95, 187, -100, 314, 292, -88, -116, 217, 57, -85, 61, 397, -69, -13, 81, 285, 50, -84, 122, 203, 9, -218, 274, 10, 131, 38, 147, -13, 113, -54, -350, 75, -133, -408, 134, 260, -117, -539, -169, 178, -396, -125, -83, 137, -189, -277, -65, -102, -160, -348, -126, 243, -119, -180, 298, 81, -45, 23, 141, 35, -7, -162, 486, 275, 201, -116, 195, 83, -195, 9, 345, -145, 200, -172, -35, 365, 75, -54, 347, -15, -58, 104, 87, 338, -15, -352, -271, -206, -317, -256, 146, 229, -53, -345, -97, -16, -331, -285, -79, -359, -9, -137, -44, 144, -200, -106, -92, 399, -217, 3, 178, 159, -405, -315, 122, 340, -166, -125, 514, 187, -9, -83, 88, -53, 86, 0, 448, 1, 216, 54, 154, 330, -281, 164, 173, -18, -98, -30, 305, 114, -397, 24, -8, -19, -87, -213, 128, -31, -149, -172, 333, -163, -299, -324, 143, -129, -252, 69, 19, 165]
4711A65j95J12q6K15n8m29L25rl04L38K61j31o4o4L27k32o3O6K65k19m38K90K98
4734C70j34l50J67K73k52l72M17J35l43r6K09j6j25J19j22Q0J15k33j00K02m15
4755d71L35J45M89q48L77J00o9j46k74M19r2l7j98K03o0M7M2J52O8l98k3M42J43
4778C46j95k31K28K85o80K29K17l4k02J87M6J37m46K66q0K55k54j58L41l9k7o18
4800d27N44K7k83l33N61L24n44q0L42l3j87j51O9L66o25L78N3J15l77J9J69K72
4822A99l91j51J18K11m3j81L20N9l11O0J23K86l04r3L20j38j86q3M94k06j71k4
4844i2L03Q9m81L18m4L14m48J53J27R1m95J74P2M5l43L62J12o8k03j63m6M30l92
4867a85M6K75j57k68k52P00k66j94Q2L53Qj49k85J99l9k4Q7J33L1l22J22M65m35
$$ y = [165, -30, 82, -4, 211, 153, -276, 49, 40, -264, 74, 335, 204, 140, 76, 403, 171, 108, 174, 439, 220, -218, 72, 370, 236, -114, 53, 326, 74, -298, 119, 254, -89, -185, 24, 8, -117, 2, -120, -40, 75, -158, -258, -56, -471, -136, 9, 498, -350, 27, 127, 58, -88, -362, 57, -35, -72, -270, -67, -127, -80, -38, 114, 182, -216, -239, 203, 346, 151, -80, 148, 433, -247, -18, 199, 165, -37, 150, 196, 333, -113, 153, 73, 328, 74, -84, 257, 218, 191, -427, 117, 144, -139, -472, 89, 413, -131, -211, 131, 98, -89, -240, -171, 195, -430, -52, 1, 116, -261, -242, -73, 199, -192, -343, -225, -14, -57, -238, 82, 141, -170, -110, 13, 299, -5, -98, 222, 84, -102, -185, 309, 103, -68, -92, 211, 300, -181, 137, 93, 407, -41, 112, 239, 330, -165, 9, 81, 126, -217, 145, 257, 189, -14, -177, -223, 207, -185, -139, 136, -21, -289, -541, 159, -107, -301, -219, 134, 142, -7, -292, -93, -132, -156, -69, 64, 95, -227, -105, 360, -75]
4890g5J12R9Q0k30j20R1L62J24o50M97l42P8j66J06K58k71K15r1M16l86l10K93
4912I0J14k81l39K87M23k13m05K81N0n5k29J09M69p7n32q2N67l38j82J87L31j84
4934ij36J16J51j8j66o0M27l35k19J31K81J0m80J03N22j53j34J23N0J04m39J54
4956B3J90j06Lj20L21l0o15J81O24l68l76J98l3K29k39Q5L98k67j58K56j56j45
4978a05k93K9J46P1k24L20J06j78k5J55J83m14Q6j4K38m14M6K68J76k04q4L53
5000B22k89J51m58M80M14l67n6m8J39l49L8K80K02j43m29J32N38m72j32K15O9
5021A37j26j54K74j58J38n0j46L42n85J50K15l13L62n36M22r6J06j09J24J61n43
5042c85R2M67J20m20jL53l87K20l36J32K8l02N96l30Q7k25L65O7L67o81j5K15
$$ y = [-75, 37, 136, 216, -14, -134, -43, 319, 443, -207, 290, -52, 26, -140, -34, 224, -47, 168, 77, 493, 107, -203, 90, 204, -77, -416, -129, 294, 81, -324, -43, 7, -48, -277, -168, 301, 224, -308, -390, 177, -161, -343, -156, 175, -9, -145, -29, 122, 104, -62, -122, 305, -30, -249, -118, 163, 173, -307, -204, 318, 165, 31, 154, 204, 308, -131, 23, 213, 107, 110, -10, 311, 281, -334, -153, 471, 103, -273, -75, -108, 121, -118, -33, 365, 98, -60, 196, 40, -105, -398, -369, -223, -152, -376, -56, 50, -128, -153, 2, 185, -229, -143, -157, 81, -333, -287, -19, 157, -47, -131, 222, -67, 84, -374, 106, 520, 153, 97, 49, 188, -161, -123, 157, 359, 216, -213, -81, 457, -15, -147, 68, 137, 11, -143, 131, -27, 111, 61, -85, 257, -328, -178, 37, -276, 86, -450, -28, -124, -18, -127, -3, 158, -385, -293, 174, 294, -126, -127, 226, -161, 59, -277, -145, -117, -419, 177, -153, -66, -291, 74, 141, 508, -173, -188, 27]
5064B7O52l15n47N93M4l44n38J94L99l14l4K88j8j24o7k3L03j52j15NK31l47r7
5087b99L09J68k24k16M42l11l37J41K57K59l70J6l35P96n84N7J57K47l60k40N27
5108A00ol23k5L96o8k01j36K68J90k50k04K74L59m33O5K21M5j67l14K71L59m16
5130EJ17Pj27j20j64K61Mk40J49K73m7o70J53L45N2k86K89K63m80J7J33K27n99
5153d38J37K59J24j75j65P0K11L01q41K12L66n6J50j30j93k1o8K36L25k2m10P2
5175e6J3L57k25p0K29j58J7k03L83l72M4oK07r2l89J59M28l35j90K7M73j88n3
5198@k61J20K07m06J91K72j06l60L08j31K80j3k87R0l6O1j23M64j6j87rJ22j59
5221B1j39Q4j13K30L1q5qn7j43J34L93j24k94J78K15j05j82n6M85p41K4M75R5
$$ y = [27, 679, 364, -183, 410, 454, 110, -428, -234, 165, -149, -183, 105, 87, -37, -104, -127, 176, 24, -91, -86, 145, -202, -299, 10, 178, -46, -262, 180, -131, -468, -327, -70, 189, -181, -165, -500, 296, -288, -231, -74, 173, -187, -427, 100, 94, -229, -254, 142, 74, -127, -263, 5, 195, -55, -259, 15, 374, -59, 6, 227, 272, 105, -209, 62, 421, 5, 122, 129, 2, -118, -282, -21, -17, -257, -108, 165, 118, -552, -399, -54, -2, -288, 1, 264, -216, -199, -66, 161, -438, -301, -42, 82, -93, -258, -188, 23, 324, -517, -305, 61, 5, 155, 25, -168, -189, -257, -21, 304, 282, -128, -56, -43, 314, 89, 19, 248, 90, 107, -96, 287, -85, -41, -47, 160, 68, -321, -162, 266, -69, -259, -232, 241, 53, 0, -261, -141, 66, -340, -149, 123, 17, -343, -35, -166, 114, 101, -186, -96, -132, -71, -194, 270, 254, 67, 58, 180, 21, -118, -34, -147, 83, 114, 29, 21, -36, -179, -45, 348, 224, -70, 108, 323, 218, 36, -20, 465, -276, -252, 223, 318]
5244C18o6m93J33M71k70m36L35K13l48k47K15K91j04k44J7J63K29l84m8J05L42
5265A92m12J74J78k85j5L97j07k69j45J40L12j90k45J57M62n52l1M67n8K59l05
5286A24N7j1N1n23J05M34k84j74L05J39m0R5k89K27l69M12j17L14n77Q9J7K29
5308B14l05J16r6K81k18j53N11m43p7J79j03K02k13O3J93q4q3k17L66q5j51l2
5330a35q1L23j54j38J53K87k45j08J64K01m66J52L79p4n2p9l0M2k47k71P36j25
5352B32L09n58J27L82k57l86J44J78k73l3K44j66k42J94K12j69j36rJ58K40l33
5373a42J99j31M20l16k47j59J72k38K40K04Jk63K2K37k28l2K4J05L50j46K37j20
5395A89m4j43R9j45L11k89j8l1L47j24j3k21J39k46L77K0l06J2K73r6j85j6M45
$$ y = [318, 252, -241, -108, 363, 93, -343, -8, 205, -143, -390, -175, 116, 12, -232, -215, -52, 177, -207, -255, -150, 192, -220, -46, 132, -153, -168, 229, 122, -147, -292, -152, 160, -30, -275, -118, 344, -208, -239, 228, 170, 429, 124, 181, 170, 221, -302, -197, 237, -47, -221, 84, 223, 183, 278, -11, 216, -153, 259, 142, 456, -121, -32, -15, 214, -91, 25, -71, 210, -8, -161, 350, -93, -170, 9, -94, 108, -105, -42, 151, 67, -16, -233, 133, 48, -103, -135, -216, 107, -47, -185, -32, 255, 10, -98, 66, 267, -199, -47, 332, 258, 206, 127, 97, 139, -108, -379, 357, 232, 541, -17, 110, 492, 235, -151, -7, 171, -102, -135, 109, -57, -299, -105, 107, -62, -198, -207, -49, 191, -142, 57, -74, 346, 30, -217, -376, -204, -442, -202, 2, 3, -260, -238, -1, -229, -261, -237, -132, 218, 72, 309, 189, 145, 2, 101, -44, 267, -22, -40, -71, 276, 152, 139, -82, 57, -189, 188, 208, -98, -86, 187, 91, -94, -110, 335]
5418C35l57j1L6K27j07j52K3k05K41j21q3K29l27O5m9K66l25M39j22r5K2J59q3
5441Ej80L37j34RJ65J2j54o1n1N1L3k65J99J76k92O13l66L2J05j33j56J86q1J32
5465A82j63J04q3r5J12K29k97N2r7L84k89k59L31k48K30j66k13N60j33k92l2K26
5487D3kl20M51j69k02L2K3J2K39n56L47P3q5J49ml7K18k84K1J24K6r6L9n8R5j06
5513b7P1O3j16J19j7K65j89M0q9K36n7k89K91Nm29j44J09K33l29J70KL03l84j75
5537c38M04k18k96N09J94m38O8L08k03J51m17N9j17L56r7J62k66O6K24k19J16
5558HK07j65J7p1Q7j15J8J72k35o9M03j90j06j0K10J53l61oJ31J72k49P2Ln4J67
5583A89J28l29J62J08l90K3K07r0m38L76N72n34L9l10M79l46k73K85J04j8j62
$$ y = [335, -22, -33, 3, 230, 123, -29, -6, -211, 30, -91, -174, 55, -272, -207, -256, 10, -315, 124, 2, -93, -71, 88, 5, -175, 162, 28, 37, 202, 214, 60, -1, -52, -1, 32, -233, -34, 142, -150, 463, 97, 129, 234, 101, -55, 131, 50, 182, 19, 123, 40, -55, 57, 286, -11, 41, -56, 328, 39, -220, 111, -137, 93, -73, -286, 274, 141, -151, -183, 43, 41, -279, 172, 3, -199, -167, -144, -132, 107, -449, -102, -29, -114, 35, 31, -6, 212, -72, -51, 73, 99, 3, 42, -16, 79, -27, 44, 107, -9, 110, 93, 358, 169, 209, 120, 356, 299, 10, 301, 306, -123, -267, -158, 75, -254, -84, -82, 221, -163, -338, 66, -152, -448, 61, 255, -183, -115, 193, -10, 141, -276, -217, -334, 22, -75, 87, -179, -113, 111, -108, 8, 215, 50, 67, -4, 83, -32, -14, 158, -77, -146, 257, 67, -39, -49, 161, 314, -47, -53, 78, 250, 1, 73, 76, 22, 189, 317, -12, 150, 258, -132, -109, 98, 8, -430, -54, 518, -16, 23, -287, 192, -154, -427, -142, -38, -56, -218]
5604b18K81l47L20l39J47K2K01l76L36J01Q1Pl41J21R2Nm4J50k13j09J87J47o1
5627A50j52L2R5q6j65J88L59m63LJ95K0j8J95j86j79L4l6M9q0j38K33q2j51K40
5651E7k21r2J49P6j21K36j12j30Q5J37j69j11L1L12Q9l49o3J19K48j34j47j16
5673b26K48l4J8K28k68km2L77j85k2J87k96R1j58J27KQ7l18K69K67m73L50j36
5696I1j09J18J18k60K21q2k90M32j65P1m26J79o5J17K54k41J05Ql26L75qq7j85
5719a55L84k05j12Q5K18l10n5K30j15j29K05r7J00p6M06n12K12L4R2k41k10L26
5741G5l01L10PM9j63L24r1K01m14q3mJ16q1lK83j29l5J6N6j4R4n05J85J89l64
5766b82q8L24j71J26R6O6P4p3j13r2J09l3p8r4K17k59J13P8ML09k52J24M3n9k09
$$ y = [-218, 63, -284, 36, -303, -156, -134, 67, -309, 27, 128, 209, 216, -125, -4, 88, 93, 49, 199, -14, -123, 64, 211, 150, -2, 30, 125, 39, -126, 62, 421, -42, -39, 156, 176, 158, 353, 167, -12, 22, -14, 35, -45, -183, 50, -32, -183, 57, -164, -256, -107, -31, -152, 84, -28, -158, -73, 64, -105, -216, -185, 127, 216, -133, -196, -77, 171, 37, -110, -226, 22, -12, 6, 234, -34, -36, -78, 299, 114, 92, 279, -17, 74, -84, 43, 45, 132, -186, 83, 350, -123, 227, 91, -18, 100, 218, -42, 179, 97, -193, 239, 74, 145, -281, -102, -167, -50, 204, -37, 68, 76, -250, 125, 117, 30, -155, 229, 24, -88, -3, 215, -95, -150, 80, -35, -164, 41, -56, 44, -32, 374, -138, 74, 108, 200, -41, -251, 75, -226, 84, 91, 140, -23, 301, 210, 411, -3, -86, -90, 26, -55, -58, 225, 96, 61, 77, 133, 119, 213, -292, -107, 82, -282, -370, -46, -217, -91, 5, 71, 145, 72, -41, -133, -24, -57, -135, -229, -12, -271, -158, -80, -76, 233, -19, 105, 148, 89, -120]
5791a20J54J75k08r2L80l51K50l67M66k21l9KJ33k63J67j22j39J35Q3R4j65J25
5813G7l5l70L35J33j44J11J87l26j41j04J0L33q2j08R9Q1P7l7J49m18M31k65N
5836bO7K3k89j9N45l15R2P5j87m4J17J1j86K30k56L05n0o9k46K82j98K21k39Q9
5860d3L24m85J8J42m9j15J5J41M6L5kk50K21J77l74J32K22l10J82j25K9r8q9J43
5884a13qk7J68r7j95l8K20k64K21J78l8j40K7n2K67j68J86j0J12j75J00k05P9
5907B8l2J32Pj79K70J56l10l38r9K52J19p2J55j0L5L5j90n6L56o9j44J66n73K62
5931i9J29j75L47J1l31p1K27K7l30J60kK27j85Q4k56L74q5j15J85j56K05k92J0
5954a11J99L0l02k00L49p1K68j87R6J1r3LL06j1k04j81L19m7k73K07l65J38P4
$$ y = [-120, 34, 209, 1, -91, 289, -62, 188, -179, 287, 66, 27, 29, 162, -101, 66, -56, -195, -60, 23, 117, -48, 77, 42, -328, 7, 140, -4, 107, 294, -32, -173, -277, -267, 66, -16, -124, -25, 56, 133, 96, 245, -173, 258, -7, -2, 65, 88, -201, -220, 325, 10, 102, 177, -10, -54, 63, 74, -112, 118, -138, 167, 117, 48, -198, 84, -114, 107, -132, -43, 281, -204, -186, -44, -93, -208, -193, -52, -6, 29, 27, -223, -2, 175, -199, -67, 155, -155, 27, -98, -69, -167, -256, -113, -121, -148, 20, -77, -272, -310, -90, -354, -133, 45, 7, -133, -106, -158, 109, -59, 127, 117, 229, 54, 154, -51, 28, -4, 128, 135, -44, 226, 382, 72, -266, -365, -113, 6, -66, 89, 79, 114, 149, -41, -97, 259, 190, 46, 212, -361, -99, 30, -145, 202, 213, -118, -189, 38, 65, -265, -105, -107, 120, -65, 19, -237, 137, 52, -63, 122, -34, 171, -121, -111, 88, 118, -184, -384, -35, -106, 162, -25, 71, 82, -11, -8, 298, 287, 83, -98, 221, 174, -99, 108, -257, -119, -45]
5977d5k1J31N4j44O3k98O0M39m43J16L48k04q7k33J21P4j6L44n53q0K33k0K19
6000E8j7q2L7j41jL1k13P28n45q5L89J20k55l68M11J35j12k09J84Qj45J78N5N5
6024B16n82M07R7J06k02j97N52l34l0J36k15L24l83M7J31k64J45j65K89j68J00
6045A0m30K65R9q0j39K00q5J3j08Q8K49R6l04N5%J88o11L81j88L56j26j36L75
6068A68J7j25k8q2K34m86K12J22j39J94l1J30k10J34k66M27q8k63K36j90L33l38
6090c9K23j24L23m56p7J91J15j17L8j99j57O0K25j43J66k22p9L30j32j09j4j61
6112c58J33L47j59Q0K8q1K7K64n22K12K13L5k08j41L06k28q0M27k25m7j65lK26
6135H1O9j46p9P9J8J61k61K26k11K02j87K03j09k94K16M04l16l07N4K23p7K67
$$ y = [-45, -66, 65, 119, -25, 38, -260, -200, 239, -204, -88, 260, 56, -31, -264, -143, -69, -85, 259, -294, -374, -141, -161, 58, 41, -41, -4, -145, -146, -115, -328, 400, -145, -230, 159, 279, 24, -344, 67, 202, 90, -119, 65, 73, -72, 106, 161, 216, -366, 41, 138, 244, 42, -155, 397, 63, 33, 169, -46, 278, -105, -58, 73, -191, -46, -211, 78, -90, 10, -420, -155, -56, -136, -275, -75, -160, -147, -255, -167, 82, 178, -126, -71, -71, 117, -494, -113, -301, 55, -71, -207, 168, 185, 60, 32, -50, 184, -302, -90, 32, -107, 87, 56, 186, -24, 110, -156, 271, 183, -80, 156, -34, 299, -39, 184, 60, 383, -73, -150, 41, 156, 39, 77, -122, -279, -219, 6, -137, 29, -193, -272, 58, -74, -183, -197, -358, -225, 122, -37, 43, 71, -10, 17, 281, -241, -29, 184, 219, 11, -130, 176, -52, -132, 295, 70, 23, -142, -145, 81, 150, 4, -75, 4, 22, 183, -78, 148, -63, 139, -48, 155, 46, -248, -32, 372, 56, -251, -197, 26, -51, 216]
6157B16l33k1J62p0PJ58k20J30n0o8L59o4j90oO2j81J25K07l5j63J01l18K88j13
6181a7jJ45M7mj33R4r7K19j98J39l18J84l2R9P1J2j09l41N42o05K72J68K76m18
6205eJ66P5m93QL7L91m59J23J00K05j44ml34J76J46j99M60k90l90L44L21m49K99
6228H4k1r7jk50M24j87j43K45r1K21j2l47J99k7K62j31k09N1J7K47q1m8l1O8r2
6253E0J32J53n87M48k32q9L19k33j51R4jK0J35j16J39j08j90J00rm8K02j19r7
6276a88q8L92J53l16K39j29o2l4J33j88Qn5l15M97O6j43Q0n7QJ11J53l9r1j10
6300B5Pp1J44k74M66k3j88K2j7j5m0J79k44L9M9k08J22j59M15O9j39j70Q9j38
6324f0R3N6j74K00l00K62K90n43k7N5L76m38o2N82n39K82r0n3J71k64K27r3j1
$$ y = [216, -117, -138, 24, -46, -39, 119, -101, 29, -21, -89, 270, 206, 16, 10, 72, -109, 16, 223, 188, 25, 126, -192, 96, -17, -18, 127, 174, 170, 37, 131, 34, 253, 55, 194, -124, 60, 28, 127, 198, 210, 101, -240, 302, -303, -31, 137, 413, -5, 161, 236, -257, -249, -212, 179, -280, -157, -57, 148, 4, 0, -334, -158, -12, -211, 249, -41, -431, -87, 234, -215, 84, 63, -34, -35, -285, 139, -48, -191, 54, -37, 184, 172, -175, 24, -3, 259, 128, -81, -30, -13, 234, 153, 105, 74, 142, 50, 182, 335, -252, 196, -36, -125, 194, -39, -190, -96, -97, -77, 58, -58, 81, -27, -217, -117, -126, -174, 28, -91, -188, -276, 116, 269, -47, 192, 63, 1, -33, 100, -88, -80, -135, -450, 47, 113, -30, 50, -7, 1, 112, 265, 226, 135, 25, 32, -39, 105, -169, 297, 274, 86, 108, 91, 76, 36, 215, -29, 10, 59, -149, -27, -186, 229, 298, 159, -11, 78, -60, 33, 89, -85, 115, -185, 77, 367, -176, -203, -148, 228, -210, -272, 310, -229, 53, -37, -90, 81, -183, 44, -49, -60]
6347f0L05m53L59j39j11L1k65N16k28j10K45j81N0K71q9j87J39j60L86j08j15
6368I6K0J12K0j95k51N56l99N1K33l58K86k69o0QK36j60j44M09k48L99l68L7M5
6391E6q3j94M24k81l61M41K3j31J19j01K43j22O5j72K49j11k78M56j90K0k74K76
6413G4o6J9nR2k47L09k38L41r6l12K85k4Q9j74J08l73J39J24k76kK88j62n3J79
6437A9M16n61J20J19J12k74k3j08J18K41o3j26j63JL02p8k1M9n54M93K89n46K37
6460ak2J23j2K7j2l41M28r6K0k99K63L84k85l02L32l29K78j22O1k28L66j13J93
6483C13m32J74Q0k2l48J84Q2p1J90J28n06J00J28M4ol6o1O1L9J17l56R9J04k5
6507b0j66K73j11K63k72R7m4j58L29r2L7qj44m24L52R5N1j34M01l88K22k40L76
$$ y = [-60, 245, -208, 151, 12, -99, -68, -333, 183, -45, -155, 90, -91, -41, 230, 141, -46, 93, -67, 319, 211, 96, 116, 228, 248, 53, -198, 358, -41, 10, 243, -115, 171, -98, -158, -150, 86, -74, -218, 191, -57, 342, -26, 11, 56, -27, -221, 203, -78, -439, 2, 25, -106, 13, -88, 155, 33, 98, -74, 175, 64, -214, 242, 52, 72, -202, 74, 8, 27, 22, 114, -133, 176, -62, 279, 183, -129, 156, 132, 221, 47, 155, -218, -79, 45, -231, -233, 55, -107, -160, 19, 435, -126, -6, 113, 225, -49, -72, -180, -62, 179, 116, -10, -173, -172, 130, 52, 31, 80, -474, 19, 308, -238, -1, -23, 100, 88, 115, 103, -238, 190, 94, 114, -185, 78, 462, 177, -125, 207, -122, 156, 34, 95, -133, 233, 120, 313, -119, 55, 135, 113, -235, -51, 31, -40, 150, 278, -228, -128, 0, 44, 38, 2, -59, 2, 41, 158, -198, -99, 5, -20, -186, 87, -24, 239, -33, 64, 20, -138, 191, 99, 136, 128, -16, -440, -88, 7, 58, -76, 325, -63, 159, -81, 295]
6530B95l29J05Pk42J59M8P3l8N6j65j08J17K01m50K64O5k8k85j03M34n4q7l1J34
6554C8j90K07m7q4J13K80n13M65k14j74J6j77K91J2Q8j94Lj0K63k27o6J35K2J33
6578A70j27j48P1j63J05J42K2k6K24l41M7J35J8J35k23j78J88k28L04r8l07K18
6600f0n3K45k55O5l55L69J9LJ08k78J20l05K46j91M6K52M7Q6j5q6P3n6j08j51
6624b34O0l3o5M73j00q4k08J28K32j68j81n3J0L97k60j6K09J03k86p1L98P3k03
6647A21K29k97j37L1J40J50l02K42N3j22m4mrr0P8q6M3j61J32J71p2m1kl80J33
6672b24L64j79M0p2k0L0l2M8L5l9J66k40K51n8l17K05K23l19j01M17j34K14m05
6695a47K38J11k14l5L26j73k9m5J65l00K01P3k32K64k39q6J29p9J04K06k67l7
$$ y = [295, -34, 71, 78, -164, -5, 43, 116, 78, 134, -31, -139, -22, 179, -271, -7, 58, 30, -255, -358, 76, 22, -65, -96, 38, -152, 55, 8, -76, 37, 317, -196, 269, 55, -119, -103, -280, 11, 23, 111, -83, -80, -90, 173, -54, -120, 15, 37, 170, 43, -105, -34, -197, -92, 50, 72, 46, 270, -71, -24, 111, 129, 264, 41, -137, 51, -177, 127, 29, -278, -60, -113, 132, -123, -58, -413, -44, -25, -22, 86, -192, -72, -377, -131, -322, -276, -24, 23, 109, 94, 8, 81, 25, -83, -234, -174, -207, -272, 201, 101, 17, -191, -63, 169, 1, -180, -233, -223, 174, -86, -102, 107, 210, -76, -147, 251, 324, 121, 350, 53, -84, -53, 87, 237, -65, 177, 230, 108, 64, 60, 51, -39, 39, -47, -4, -165, -33, 138, 66, 25, 23, -357, -224, 140, -39, 1, -71, -91, -61, -93, -45, -10, -49, 117, -123, 128, 70, -247, -42, 181, -138, -239, 178, 44, 258, -147, 91, 202, -12, -47, 279, 106, 77, 32, 197, -103, 98, 171, -61, 203, -36, -122, 7, -72, 32, 238, -29, -66]
6717f6n8J97K10l99P1J01K9J81j23k16k39O11l31Q0J11o7R8l65lK37K6P7ln7n4
6742D8P0k81K31J2l62L40j78J78j86Q6j53M24j6l44R4P5j1l11L08q6k07N62l48
6765e5J7j48j2Q8K2j62L46R6k09k76J11p8M20J5r3K6j42J13J61l78r5l2rK85o4
6790e3J73j31J32o9J10k68L66j53oj38O7K3n5OO8j26O9l4n8J32l9L4o4J30j9l79
6816b82M37j16j00Q8L85m38j46K50n8K96l98J16l7Q9j76J35J40k13M1j59R2J78
6838A24J31k86J4L19o51K91L55k00m5O8l05K94J50o62M07k25L86k87J16J57k10
6859e9L60l46K27j29j08k02M03j69n2N4N0M6k37L04k73K25R6m48R0L5J10L6j06
6882i3j41K70m7rJ91k00J17k28mJ50N8j32k9J80j17k10K48k39L81j03n8j58K51
$$ y = [-66, -124, 73, 283, -116, -45, 56, 85, 266, 143, -73, -312, 299, -32, 48, 159, 92, 190, -175, -178, 59, 85, 162, 159, 102, 48, 118, -163, 68, 80, -282, 58, -120, 58, -128, -42, -195, 229, 213, -131, -37, 38, 27, -284, 24, -62, -269, 293, -55, -38, -186, -198, -110, -88, -250, 96, 192, -17, -293, -182, -260, 160, 175, 82, 108, -34, 79, 240, -138, -233, -265, -274, 11, -53, 120, -11, 121, 52, 162, -106, 260, 107, 101, -37, 30, 53, -2, 4, 72, -54, 15, -19, -77, 55, 16, 50, -14, 116, 97, -282, 155, 39, -61, 27, 412, -26, -172, 78, 20, 316, -82, 34, -3, 86, -90, 45, 185, -28, 13, -146, -54, 124, 255, -31, -17, 302, -349, -58, 297, 97, 52, 120, -185, 109, 259, -403, 4, -221, 165, -122, -6, 151, -59, 301, -45, 182, 53, -55, -257, 146, -23, -75, -21, 29, 75, -162, 142, -131, 94, 190, -258, -168, -133, -23, 13, -93, -234, 36, -11, -20, 171, -29, 88, -140, -144, 6, 64, -68, -97, 83, -34, -244, 4, -235, 146, 43, -15, -173, 78]
6905G8j9J60k54q3K26L1k50M1K1j24J01p5J86m14L19O5Lj62O21k19j58Q4j50o5
6929c7Q1p0l9J54r8R1Q9l09O8J1k01M4QN0j38M32j23K36l56J54q8pn2J06j6j43
6955a53J49P3k02J43J5j7N1l05M6L70k29k01L67k54J13K43n61K8R2N71m05J52
6977H6k30K83J37k21k1q2J03j80J58j2L13l24r8K2q0L13k31L78l70J6r2K53k82
7000a61P1J4N12m40r6J80n5LM9Mk56K84l4j01P5j43J12n0r2jq2M13k19K17j26
7025G8j66L09k49r6J82j58j43J31J28l2P8M7O5q3j02K65Kl52P9J74k80J49J40
7048A66j71K2J1J93j14l3O0k6j50k54K76J03l4J51k59J37k04K08M4%k80P7K0J18
7072F1n2l26L47K1k4r3m7o3J00r5K28K65m61j11M91j50Q5n48K75r2K65n9j47j74
$$ y = [78, 59, 219, -35, -118, 108, 139, -111, -70, -49, -173, -72, -147, 39, -375, -56, 9, 12, -150, 471, 252, 94, 178, 28, -37, 44, -26, -65, 89, -9, 82, 171, -138, -70, -59, -260, -216, -208, -158, -296, 136, 13, 249, -107, 47, -41, -48, -100, 6, -10, -153, -4, 69, -133, 10, 25, 8, 59, -246, -200, 170, -59, -260, 107, -147, -34, 209, -352, -324, -232, 339, -66, 86, -144, 139, 276, 55, 34, -48, 55, -125, 33, 21, 334, 10, -88, -66, -146, 167, -64, 314, -56, -40, -132, 121, -161, -90, -76, 436, -4, -100, 80, 25, 28, 77, 81, -175, 109, 75, -26, 49, -94, 18, -32, -124, -125, -207, 206, -13, 204, 78, -88, 221, -28, -124, 58, -100, -243, -112, 16, -16, 62, 109, 174, 91, -11, 254, 256, -96, -17, 157, -123, 26, 166, -5, 17, 28, 221, 107, 74, 134, 108, -42, -296, -20, 83, 49, 200, -59, 78, -126, 82, 126, 126, -154, -77, -57, 61, 9, -317, 30, 51, 27, -66, -113, -176, -76, -171, 57, 322, -139, -250, 241, 91, 176, -372, -97, -189, 76, 17, -130, -304]
7096c04K04K13R7R3m27N17k88j06l9NK86m89m1J95J66n4K76m57L31j44p5N0J99
7119B08k10q8M21l13J18p1q5J1m5n2K17n0l32J12j21M44l02J07K2J88l28J86J07
7142A44j45k43M81k66J26j10K71K8l54j00N0k5O2J10o1J71k77L07j18O5l19j2
7164b15K03k7r6K9L3n5k1K10l92L39k2r5j22K08o3O0j28J06l0J76j55o9J70l69
7188c25K46M8R9j39J63k7p6J41j99L9kn4K13J14m14J96j43K31j93J28M4K5J11
7211B26k29K13j53J9k39L98n37L24o5k6J48r1J10j84n3J82k20J05J5J89k67K10
7233G5j58K70m05r0O63n93L63l16J96l04K98P6O3k37k07J36L69j22J8j80K18j75
7255d2P2k06J73r6L32o4l30Q5K21k22P9k64K44R3j67Q9q5qK5K17l6r4r2J14k59
$$ y = [-304, -100, 113, 210, 303, -124, 393, 105, -1, -40, -35, 251, -238, -279, -84, 82, 28, 304, -153, 178, 34, -41, 9, 208, -2, -90, 331, 18, 136, 65, -20, -9, -54, -106, 111, 61, -271, -159, -280, 164, -138, -31, -9, 179, -149, 37, 144, -1, -244, 237, -29, 97, -13, 258, 286, -68, -168, -118, -143, -81, 29, -32, 139, -138, 169, 51, 116, -203, -215, -12, -39, -135, -106, -73, -128, -149, 61, -331, 8, -14, -109, -231, -23, -86, -26, -154, -48, -78, 98, -57, -126, 44, -325, -79, -31, 68, -71, 92, 65, -11, 130, -69, -30, -32, -86, 127, 241, -173, 23, -120, 111, -82, 46, 90, 115, 226, -3, 210, 57, 76, -163, 235, -302, 22, -43, -69, 79, -12, 98, -86, -139, 43, -177, -72, -57, 132, -135, 75, -83, 187, -218, -308, 355, -238, 125, -191, 5, -299, -1, 75, 138, -99, -306, -170, 199, 77, 95, -85, 133, -42, 30, -176, -3, -99, 233, 169, -161, -76, 145, -77, 2, -262, -18, 75, -92, -3, -88, -96, -71, 146, 110, 16, -76, 38, -221]
7280b21J25j03n2O35k87n4R5k36P4L61p47L84j38J22O2Q2j83J49P9L7j51k3j53
7303a43L72k00j25K13l75J73l1L23k42O9pR5j40k80L79j7K08k95j53J60J55Q1
7325B20l32O8L31j84k72J60Pk62N5jn1N00m09J7K8J81k41L63j43J50r3R8r1k81
7349a82M16k13k1k16L05jJ61k23l76J36K26j04J14q7K85k08j42K30J40m88L11
7370F3Rk25L10k89NK10P6R4l28L23j79J2m11M42k8n1J53r5mj59r7J63K02k34J40
7395A02l52K31J30j51R0k75K13p1k12L05k97Q0J22K89l24L74l81K99k25k5M7q7
7417a18J98m10J38K79M9l06L12j56j65K35J40k17j7K17k84k2P2j96J23J69m3K13
7439B11l62J2K41Q8l23K18K5k57K57nj17J61o9r2l84M17k0Q8j46P2k47J62J97
$$ y = [-221, -96, -199, -251, 384, 97, 43, 138, -98, -24, 337, -410, -26, -164, -42, 20, 102, -81, 68, 147, 184, 33, 10, -143, 229, 29, -96, 117, -258, -85, -116, 207, -35, 34, 27, 122, -18, -298, 81, 64, 272, -23, -176, -16, 139, 220, -112, -44, 287, 103, -169, -9, -2, -264, -209, -210, -261, 239, -170, -153, -125, 56, -185, 178, 35, 185, 92, 190, 99, -182, 234, 21, 0, -216, 89, 88, 249, 26, -350, -214, 12, -92, 22, -65, 220, 12, -130, 100, 240, -248, 63, 72, -153, 157, -132, -127, 83, 159, 253, -75, 248, 69, 81, -330, 112, 84, 33, 186, 91, 87, -72, -169, -6, 196, -38, 102, -250, -19, 111, -40, 50, -225, -12, -83, -295, 10, -287, -207, -85, 204, -120, 254, -127, 172, -53, -78, -31, -118, 80, -330, -192, 87, 136, -170, 142, -14, -179, 56, 196, -21, -38, 179, -105, -127, -55, -251, -128, 41, -2, 211, -151, -139, 102, 190, -133, 85, 110, -147, 110, 105, -12, 149, 80, -12, -396, 21, 1, 89, -57, 15, -232, -70, 127]
7462A27k26P5o2K29j54J38j34R4j59J1Q3K7o1j29R5m9J03N8l81L06JJ86o8k08
7486i8L8l3j9j28K31J51m6J19k50KqJ62m43M53l56K63K15m76L01k18L7K48l13
7509a68M54l77j58J47L9j33K45K4k98L41k54On5K82k42J33p7J84m14K11K65l68
7531b13j75L32J6j84L96q2o3j17L94l10L03m73L58l53J51LN6Q6k87K26M1K5j32
7554bJ35j7j85p0P5j74J12J72J85m57K79M8k32O8r9Q7l15J69M10k22J73m78L05
7577c3M4l82L67j88K77j68k6k4J1J40M2n1l4J1k79L42PPj15L18q0j19j14M4L24
7602C21k67k60N0k06M16J12j33k1j69R4K35l96J66J79l19J51J2l1ko1J32J53k0
7625A36m07K83N9l84L23k7K3P3l13L3K18r6N8p2m23O60l42J91pJ06R3KL55n20
$$ y = [127, -99, -24, -86, 143, -11, 127, -7, 87, -72, -61, 22, 49, -12, -141, -46, -95, 8, 66, -315, -9, -8, 178, 110, -98, -60, -93, -112, -240, -9, 142, 96, 215, -35, -33, -41, 121, -322, 131, -225, 38, 253, -223, 78, -140, -103, 145, -168, 286, -91, -249, -102, -63, -196, 49, 73, -225, 116, -138, -132, -187, 95, -147, -14, -91, 93, -321, -110, 155, -213, -388, -56, -40, -224, 172, 90, 27, -90, 304, -6, 297, -176, 182, -171, -20, -17, 39, 125, -162, 64, 105, 130, -2, 133, 116, -69, -139, -64, -238, -126, 46, 231, -226, 53, 101, -131, -63, -162, -75, -390, -221, 189, -33, 140, -338, -33, 11, -371, -4, -192, 85, -83, -109, -133, -122, 18, 60, 9, -25, -14, -293, 49, 56, 63, -52, 266, 186, 67, -47, -3, 321, 54, -206, -156, -362, 54, 166, 33, 12, -157, -63, 172, -224, -58, 121, -198, -47, -35, -66, -68, -129, 3, 156, 136, -271, 12, 71, -313, 10, -17, 6, 79, -234, -201, 17, -79, -21, -93, -516, 144, -198, -7, -14, 92, 185, 187, 542, 22]
7649B2k13K84j19K29q3R6N3l11K06k19qP1J72l68j06M42j15J5q5j45K77k82L05
7672A18l31L46p1m5n5O6m0KR6k28r0K01j61J93j28K22kK6m59L95pj77J75j88P9
7697f3J27j40O4l9J35L8k58j2O15l47J45l08K09j56k58M90k23L3n3J27m13K49
7719c8K9J06j63M8J28j47k6r5K32K34r3j39K10j77m3j88j0J77J61j58k37J73k42
7742b58O7Q7j40L42j84J20oj31J3J37l77L50j91PJ93J43l47L62R0k97l9K23j47
7765A7j26R2O0Q2j01K25n34J98J19j56J35j35J90l24K30J95j67K85n08M78l40
7786h5pM3j43O8m2J22p3p1J29mJ06L5O4k02K75k54q1J10J72k91K62k26l6Jn2K82
7812A02j50k5l85L83lL0J35P2k53L27l32J33q9J47N9j68J39N8j5l19J33j47K95
$$ y = [22, -191, 93, -26, 203, 120, 216, 269, -42, 164, -55, -63, 8, 180, -188, -294, 148, 33, 48, -37, -182, 95, -187, 118, -213, 133, 62, 17, -38, 28, -12, -10, 86, -142, -232, -31, -192, 1, -127, 95, 93, 119, -340, 55, 48, -129, 46, -142, -63, 64, -76, -12, -51, 84, 122, -136, -148, 467, 120, 265, -43, 166, 10, -248, 242, 19, 52, -1, 126, -287, -38, -9, 97, -66, -18, 110, -37, -63, -158, 74, 308, 215, 76, 286, 109, 66, -122, -132, 45, 206, 48, -189, -16, -258, -191, -104, -244, 98, -86, 34, 28, -103, -90, 47, -330, 20, -171, -164, 29, 172, -175, 187, 277, -20, -59, 164, 17, -109, -17, 43, 125, 24, 249, -285, -87, 32, -124, 11, -124, 66, -258, -28, 167, 0, 285, -223, 255, -85, -92, -49, -192, -124, -166, -44, -117, -188, -59, -63, 43, 78, 142, -60, 215, -39, -120, -10, 162, -129, 133, -93, -129, -128, -180, 102, -48, -73, -458, -75, -78, -48, 87, 159, -94, 233, -99, 34, -55, 92, 151, -17, 122, 180, 165, -154, -21, -168, 127]
7835A27k17J01Mj25j35l4N02k87Q1L5J47k65r5J22k03J29L72l19J20l70L34p1
7857d7j73J06l01L50O9j91K92j91J2n6M3J47k63K05R7k61Q5j3K10j94O4K57m56
7880b09M37k55j46L34J5J41j95N5j15Mk9J15j03j32K71KJ28j22j81J27p0J58l7
7903A93j90n9l1M9j08J06J00j18k03J06J54M7L11l93J79p3j1j90o6ML09p4j81
7926a39k2J92r5J54jq7j40L45l81M9K02j97P7M8K16j82k19R6O4n9J02j93M84l99
7950h5R2j6pK71l02m8o6p7l1Q2N5K9J19j03q2J67N5J3j87L03o5k61j28K62K20
7975B10m09J69q7K64k78L38k54J18j17j96L46P3j62K69m33J52JO5K07j66Lr2j08
7998h7j62L99l51J12r4J93o1k37m6M51r5j03L00k33R4m12M03k66J47K3M8J27J96
$$ y = [127, -90, 11, 15, -110, -245, -279, 223, -64, 17, 52, 199, -66, -161, -39, -242, -113, 259, -60, 60, -310, 24, -47, -220, -114, -415, -65, 4, -187, 105, -86, -74, -130, -87, 60, -203, 2, 99, -162, -77, -90, 120, -74, -10, 247, -209, 228, -27, -173, 161, 176, 317, 122, 177, 62, 66, 37, 152, 49, -83, 188, 190, 318, 196, 15, 142, 72, 230, 193, 3, -56, -87, -38, -146, -40, 60, -58, -261, -155, -1, 46, 357, -36, 143, 70, 59, -131, -197, -193, 116, 42, -139, -161, 31, -64, 90, 89, 2, -138, 207, -174, -125, 77, -120, -43, 5, 221, 39, -180, -84, -20, -79, 23, -170, 314, -85, 7, -9, -16, 255, -47, -95, -161, -238, -269, -187, -132, -103, 16, -87, -169, -2, 53, 66, -121, 182, 117, -144, -272, -10, 210, -199, -30, -117, 147, -131, 207, -47, 71, -46, -242, 104, 177, 15, 284, -149, 3, 4, 69, 276, 110, 113, 21, -87, -249, 150, -201, -89, -183, 10, -51, -288, -334, 117, 22, -81, 219, -14, 80, -332, 71, -195, -48, -25, 23, 150, 346]
8021C46j07j40n1j66j3L4O1K14j05j83J93m4p2j84K92l5J75m03L74m81K48J39
8043I2j88o8J54L4J09o5j02M6J00K82k65J85m15mK97o45M33J45n6j48R2j66K94
8066A41Rl47L13N3P9m22P3r9K07J47j18j27n5K6j98K27j30L27M4k39J85K53l77
8089b8k1J40j86K6J25j13J07r8l22K20J26M62o09M39l53K07l51K57j44L21m5m6
8111A14j07k88N4J86j33k0N04l80J72m25L81j16j04M8K45m57J57L08j94j5J66
8132I6J92o08M19K2k2j82J00j23J36n5l52N32l53j75L29P6k3O9j12K64j23k01
8154i4j4LJ76K74j88j42Mk09J75j81M89J04j75k70L6J21k57J64J49j37K1k59n6
8177b66K56K7j57j45K64k2J34r4m4J3K11k83J7l7
$$ y = [346, 239, 99, 48, -118, -131, -97, -36, 178, 73, -110, 83, 39, -33, -217, 75, 40, 215, -188, 186, -295, -47, 92, -96, -164, -10, 24, 133, 68, -34, 12, 112, 394, 129, 314, -101, -105, 192, -453, -20, 125, 69, -79, 13, -153, 141, 150, -197, 116, 169, 248, -174, -101, -200, 7, 154, 36, -91, -146, -120, -318, -91, -221, 106, 150, -89, 96, 349, -28, -49, 91, -95, -69, 56, -57, 50, -48, -370, -150, -24, 438, -171, 268, -85, 122, -229, 28, -116, 205, 160, 114, 7, -281, -227, -41, -174, -194, 310, -70, 102, -323, 58, -58, -162, -114, 131, -326, -169, 139, -55, -70, 96, 288, -320, 99, 121, 99, -83, 17, -106, 30, -25, -377, 155, -198, -373, -44, 32, 9, 78, -34, 230, 107, -94, -108, -105, 71, 345, 157, 15, 19, -190, -15, -196, 293, 397, 222, -48, -12, 109, -148, 16, 165, 28, 49, -210, -266, -10, 17, -140, -285, -21, -43, 91, -3, -47, -34, 177, -106, -89, -126]
8191a26
$$ Imaginary data points
##PAGE= N=2
##DATA TABLE= (X++(I..I)), XYDATA
0@%%%%%%%%%%qJ6j6J6j6K4l2L2l9M7n5O3p2Q5r5J07j22J40j60J80k02K28k55K84
34A50l17L54l94M37m84N38n96O57p28Q08q96R94j103J231j379J548j748J990k289
53a227K667l164L851m863O496r570J7273o8545j28631J95758J29631j25618j08646
66i4588J00339M7280j10691j4234J58428J5319j88744n2610J88880Q0730j55923
77b5814q2132J29039N7294j22429l3735J40281K9279j55743m3130J57782N6974
88A07666j41246n6740J26552M2112j23025k4743J35267J8376j50201k5498J57960
99F6480L9407j53097m9250J38288M8095j22972l6968J12942J8801j15131l223
110e6628J27502l918j45901m422J55826K2536j51020m0375J29509M1564j06107
$$ y = [0, 0, 0, 0, 0, 0, 0, 0, 0, 0, 0, -8, 8, -8, 8, -8, 16, -16, 16, -23, 24, -31, 32, -40, 45, -50, 57, -65, 75, -85, 95, -107, 121, -134, 150, -167, 187, -207, 230, -254, 284, -312, 345, -383, 425, -471, 523, -580, 651, -728, 820, -928, 1062, -1227, 1440, -1724, 2127, -2736, 3760, -5810, 11463, -57082, -185713, 10045, 139676, 14058, -94588, 5751, 53031, -57660, -71894, 86534, 101853, -86891, -139501, 49379, 130109, -25814, -107946, 21093, 78387, -44042, -77777, 62504, 91783, -63960, -107090, 50692, 107666, -33580, -90320, 36232, 78344, -44681, -69424, 65843, 84219, -65982, -91480, 66480, 105887, -47210, -96460, 41828, 89923, -33049, -70017, 42925, 61726, -53405, -56628, 70874, 66956, -78945, -83367, 72459, 94995, -56025, -96400, 33109, 74673, -31434]
121c1434k4881R5400n68j05974J5148J28508j0045j44260r630J42153K5799j24300
133d4084k4931J09405J0629j07199L761J18766m738j28278l808J26527J1776j13876
145d6050n825J04822p819j08208K0034J22415j7795j32525M272J29251Q112j13482
157d2798q280R7474n678r2317K1166R8641k8817j10477K4873J16677j7456j15545
169f2537J0845J09148r978j04322J0839R9789j3849r6591J6997R2866k3581r3122
181f3496L1398R7459l5149j05378L2312J10240k4225j06702J8297R7285j9611
192C2430q7068K8679Q4381l7711q7546M2699R2707l9242r3546L7248R0646l7074
204B6603q6109L9651Q6422m1643q7404L9261Q7456l5393q1989L3986P4306l8797
$$ y = [-31434, -56315, 39085, 38517, -67457, -52309, 76199, 66154, -78106, -87736, 54417, 80216, -44084, -69015, 40390, 51019, -56180, -52419, 66347, 61609, -66669, -70477, 56050, 67826, -46050, -51875, 52947, 45128, -63080, -43046, 79369, 61574, -70951, -66679, 62572, 70684, -42798, -51078, 46396, 40718, -51599, -30433, 68208, 39391, -71086, -46213, 70464, 53008, -62537, -51692, 57456, 47478, -56844, -46005, 53784, 39935, -56656, -39659, 53207, 29626, -63496, -32098, 65361, 30212, -75166, -42854, 67386, 43161, -63541, -45244, 52041, 32430, -54638, -25959, 58422, 20711, -66835, -24136, 68571, 29329, -64217, -26969, 63677, 26603, -59506, -19855, 66567, 24924, -62480, -23219, 64237, 28844, -53145, -19159, 55147, 16350]
216A6350o9883M6403P2208n3014p8965N1293Q3978m5730q4247L9549P7273l7771
228A7444p1074M0459O5097m5367o4516M9563O4151n1501o5579N2674O6741n2590
240E502o8482N0565O8715m6392o6163M2747O0621m1755n3642M6268N0564n1848
252c300n1525N5648N7320n4085n9913M9572N9746m5469n4786M5378N1387m7372
264B601n0440M9879N1251m9436n1463M7901M9395m8625m6176N1487M5341n5655
276c940m8462N6583N1276n3432n2959M8062M8602m6155m2281M7343L7363n2845
288a0845l7426N7191M0061n9024m3247N6297M4397n3103m2817N1063L9944n0308
300g817l7215N1105L5065n1858l3321N3842L2777n5181l2829N7111L3928n5773
$$ y = [16350, -53533, -7130, 65078, 12064, -66901, -15608, 68370, 22640, -61607, -22058, 55215, 17444, -53630, -13171, 51926, 6559, -57957, -8394, 55757, 4256, -61323, -8649, 58092, 5502, -62980, -12415, 56300, 9908, -56255, -13508, 47113, 5358, -48284, -2016, 48548, -3300, -54825, 823, 58143, 4058, -55855, -6283, 53463, 7994, -46792, -1414, 49973, 2601, -47839, 2040, 53291, 3855, -47608, 293, 49688, 1063, -45113, 6374, 51715, -3940, -52402, 4181, 55457, 2025, -50934, -2872, 45730, -425, -42706, 4637, 42000, -10845, -48271, 8920, 48981, -10043, -53290, 3007, 47404, -5699, -48516, 2547, 42491, -7817, -45032, 6073, 41138, -10720, -44041, 9801, 42578, -12603, -45432, 11679, 45607, -10166]
312a0166l4723N4469L4862n2007l2206N1413K8909n1736k5989N3405K5749n4868
324a2888k5074N4118K5327n3895k4187N3176K2913n4012k2551N3372K2692n2904
336a3913k2595N0068K0313m8640j7907M8753J4883n1514j4217N3370J5540n4179
348b0038j7877N2051J8309m8735j6988M7091J3762m6739j1137M7850J0549m9368
360b1270j0195N0282J0975m9093j0901M8470J0702m7267r869M7089R541m5724
372a7260q209M5494P353m5118n766M5021N390m4863n653M5398N430m5212n428
385b3423M3824N098m2997m708M1931L406m1599l440M1014K359m0943j998M0540
398A9064J094m1257q14M0468J062m0246j656L9037J685l8448p72L7906r03l7082
$$ y = [-10166, -44889, 9580, 44442, -7565, -39771, 11642, 40551, -11185, -37174, 16231, 41980, -12888, -37962, 16156, 41483, -12412, -36599, 16577, 39490, -14522, -37073, 16299, 38991, -13913, -36508, 13560, 33873, -14767, -32674, 16079, 30962, -20552, -34769, 18601, 34141, -20038, -37915, 14136, 32445, -16290, -33278, 13813, 27575, -19164, -30301, 17549, 28098, -21270, -31465, 18817, 29792, -19301, -30202, 18268, 28970, -18297, -28166, 18923, 28464, -17260, -25469, 20025, 27378, -17740, -23506, 21515, 26905, -17958, -23611, 21787, 27217, -17995, -23423, 20401, 25499, -17498, -22206, 19725, 23131, -18468, -21908, 19106, 21465, -19478, -21476, 19064, 20158, -21099, -21913, 18555, 19617, -20629, -22285, 16752, 18437, -20011, -20783, 17123, 16220, -20862]
412b0862K041L7513k429l7911K552L8319k205l6968K127L6606k276l5426L577
425a5342L5428l922l5014M968L5110n407l4219N527L4405n867l3995N977L4073
438B1722o552l3229O565L2461p197l2304P796L1600q626l1844Q720L1390r578
451A0924l1411R476L0282r595k9892R701K8814j0483k8847J0973K8289j1551k8001
464b1321J1719K7438j1880k6478J1962K6087j2350k5110J2737K5152j2567k4719
476a9330J3312K4318j3053k3053J3134K3016j3127k2241J3948K1985j3391k1329
488a5811J3336K1334j3607k0402J3302J9854j3763j9077J4355J8405j4611j9028
500a5713J4790J8893j5359j8554J3970J8030j4226j7274J3968J5960j4665j5844
$$ y = [-20862, -18821, 18692, 16263, -21648, -19096, 19223, 17018, -19950, -17823, 18783, 16507, -18919, -15342, 20086, 16164, -18850, -13882, 21228, 15821, -18398, -12871, 21534, 15667, -18328, -12351, 21722, 15170, -18059, -11494, 20967, 13770, -18534, -10738, 20862, 12236, -19608, -10888, 20502, 10924, -20487, -11011, 19271, 9676, -20216, -10515, 18299, 7816, -21031, -10058, 18231, 6680, -21321, -9602, 17836, 5956, -20522, -8560, 17527, 5177, -19933, -7196, 17956, 5389, -19330, -6018, 18300, 5247, -17806, -4672, 18344, 5217, -17024, -3076, 18909, 5518, -15811, -2475, 18859, 5252, -15150, -1848, 18006, 4243, -14834, -479, 17926, 3315, -15713, -923, 17970, 2611, -15943, -1973, 16057, 1831, -15443, -1475, 14485, -180, -16024]
512a6024J4593J5746j5336j5618J5014J5513j5160j5482J4855J4492j4449j3894
524a5750J4980J3446j4862j2772J5015J2779j5110j2588J5582J2527j4944j1771
536a3468J5237J2128j5010j1454J4937J1565j4272j1020J5204R932j4867r522
548a0610J5229R437j5760q971J5390Q739j5241r130J5028Q375j4938p716J4039
561C871P064j4313o976J3909O192j4646n941J4536N881j5068o570J5080O094j4887
575e774n652J3878N465j3791m486J3561L979j3551l400J4198L361j4365k833J4462
589E052L341j4085k923J3941L014j3250j974J3250J608j2817n60J2971O22j3036
603d846l00J3149K1j2652o92J2641L56j2169j11J1611m02j1569M01J1149j320
$$ y = [-16024, -1431, 14315, -1021, -16639, -1625, 13888, -1272, -16754, -1899, 12593, -1856, -15750, -770, 12676, -2186, -14958, 57, 12836, -2274, -14862, 720, 13247, -1697, -13468, 1769, 13897, -1113, -12567, 2370, 13935, -337, -11357, 3847, 13779, -1088, -10610, 4619, 14056, -1704, -10675, 4715, 13454, -1787, -10917, 4111, 12486, -2452, -10168, 3871, 10935, -3378, -10354, 3555, 9747, -4899, -10840, 3696, 9577, -5491, -12061, 3019, 9113, -5774, -11426, 2452, 7917, -5874, -10360, 3201, 7180, -6371, -9771, 4427, 7788, -6577, -9410, 5052, 8393, -5692, -8615, 5326, 8340, -4910, -6884, 6366, 7974, -4843, -5403, 7568, 8190, -4846, -5146, 8003, 8024, -4628, -5320, 7321, 7677, -4492, -4603, 7008, 6606, -4963, -4562, 6587, 5267]
618E267j1301J534J1015k162j1346J955J0928k474j1222K149J0706k222j0054
631g227J869R687k558r193L696Q630m262q497M465R479m161r483L764R246l515
646A940p805L943P178l933o822M999P281n191p040N221P584n090o775M772O928
661G190n178o312N117N936n340n901N494N907n992n349N659N068o507n109O419
676A102M817o858n394O759M668o674m374O125L850o652l310O748K661p044k489
691f065O999K779p340k580P399L035p382k321O769K329o403j445O829J434p134
706c097o52P608J038p574j331P723J826p281j255P646K28p839M00Q097m38q060
722b961N24P662p55p896J104P419j573q125J796P976j784q167J375P457k051o926
$$ y = [5267, -6034, -4500, 6515, 4353, -6993, -5038, 5890, 3416, -7806, -5657, 5049, 2827, -7227, -5358, 4329, 1771, -7422, -3726, 4904, 642, -7855, -3390, 6089, 1928, -7555, -3791, 5455, 1940, -5865, -1922, 5256, 1323, -5499, -500, 6781, 1590, -5450, -229, 7355, 2265, -4510, 262, 7190, 2012, -4300, 817, 6753, 1413, -4488, 1006, 6913, 921, -4428, 1231, 6299, -208, -5317, 1102, 5919, -939, -6333, 426, 5094, -1580, -5954, 171, 4021, -2631, -5941, 807, 3468, -3576, -6065, 934, 3713, -3627, -6207, 1192, 4227, -3155, -5476, 1293, 3622, -2781, -4226, 2603, 4037, -3097, -3749, 3859, 4897, -2677, -4008, 3715, 5541, -1740, -2995, 4651, 4879, -2960, -2560, 5537, 5099, -2961, -2437, 5225, 4470, -3426, -2322, 5097, 3524, -4601, -2805, 5171, 3387, -4780, -3405, 4052, 2001, -4925]
738d925J818P551l255p737L315P906l535p879K811Q055l040p371L174P530l783
753F35p450M349P615m046p647M508P901m504p481N011Q100n372p905N614Q203
768G531n201p985O226O935n787p032O615O889p043p164P230O765p003p009O681
783F48O472o944o560P369N995p673o295P590N872p710o241Q052N412p879o443
798h335Q581O103q791n989Q588N898q792n505R011N398r467n089R959N129r345
813b646n295R754N404j0087m064J0049M461j0778l495J0929M202j0731l786J0378
827D295L722j0552l480J1170K990j1199k966J0993L263j1172l137J1017K546j0968
841c478k638J1208K155j2295k334J2060K606j2320k707J1788J828j1673j753J2218
$$ y = [-4925, -3107, 4444, 1189, -6548, -3233, 4673, 1138, -6741, -3930, 4125, 1085, -6286, -3112, 4418, 635, -6815, -2466, 5149, 1103, -6544, -2036, 5865, 1361, -6120, -1109, 6991, 1619, -6286, -672, 7531, 2330, -5655, 571, 7506, 1719, -5313, 1302, 8191, 1148, -6016, 1214, 7979, 976, -6033, 648, 7120, 176, -6384, 985, 6980, -693, -6988, 602, 6474, -1236, -7477, 575, 5987, -1892, -8335, 246, 6349, -2442, -8431, 157, 6055, -2737, -8242, 769, 6167, -3300, -8389, 1570, 6699, -2646, -7941, 1813, 7217, -2870, -6934, 3115, 7576, -3202, -6697, 4232, 8434, -2297, -6083, 4295, 8017, -2535, -6015, 5155, 8145, -3054, -6020, 4973, 8236, -2936, -6073, 4944, 7490, -3478, -6116, 5092, 7247, -5048, -7382, 4678, 7284, -5036, -7743, 4045, 5873, -5800, -7553, 4665]
855D665R08j2535j134J2855J041j2827r35J2991L99j2829J27J2821L49j2877J57
870f824J2569K41j2127o6J3310j055j2295P18J3017m43j3094R26J2568o07j2401
885e563Q36J2996j399j3164J759J3136j596j3662J657J3217k004j3636K542J3343
899H462k759j3922K381J3930k700j4135K848J3425l351j3514L550J3728m285j3871
913a0213M592J3818m550j3950M389J3765m411j3299M872J3376m977j3294N110
926d772J3989n500j3334N811J3280n533j3621O489J3686o210j3825O690J3966
939A1116o423j3728O789J3475o993j3531P738J3242p985j3457P956J3576q305
952C470j3613Q220J2993q618j2655Q255J2609q862j2670Q657J2039r126j2347
$$ y = [4665, 5573, -6962, -8096, 4759, 5800, -7027, -7962, 5029, 5428, -7401, -7274, 5547, 5896, -6981, -6824, 5745, 5986, -6141, -6207, 7103, 6048, -6247, -5529, 7488, 7045, -6049, -5123, 7445, 6838, -5563, -4727, 8269, 6870, -6294, -4535, 8601, 7005, -6657, -5000, 8217, 6213, -7423, -4881, 8462, 5703, -8219, -5838, 8092, 5392, -8743, -5895, 7530, 4179, -9335, -5785, 7943, 3658, -10213, -5621, 8197, 3647, -10303, -5914, 7851, 3440, -9859, -4987, 8389, 3412, -9882, -4772, 9217, 3717, -9617, -3806, 9474, 3941, -9680, -3191, 10495, 4285, -9540, -2850, 11116, 4693, -9035, -2246, 11229, 4236, -9295, -1557, 11685, 3700, -9757, -1801, 11775, 3470, -10143, -1923, 11070, 2452, -10203, -1948, 10661, 1799, -10871, -2214, 9825, 699, -11648]
965a1648R331J2315r841j2171R649J2589j0008j2418R459J2531r757j1646R855
978a760J1780j0465j1007J0653J1685j1270j1557J1548J1796j1035j1621J1431
990A78J1718j1127j1372J1745J0902j1404j0745J1947J0307j1977j0567J2481
1002B086J0347j2721j0250J2589J0284j2735j0116J2011R819j2180r992J2350
1014A492R708j3066r363J2872R316j3394r624J3430R406j3843r662J3821R731
1027A0824j4127r350J4128Q514j3876q208J4130P978j4241p598J4736Q177j4959
1040c872p889J5285Q002j4795p583J4658P655j4682p093J5103P028j5466o191
1053i840J5199O655j5616o326J5643O446j5828o709J5906O038j5857n929J5745
$$ y = [-11648, -2317, 9998, 157, -12014, -2365, 10224, 216, -12202, -2743, 9788, 31, -11615, -1760, 10020, -445, -11452, -799, 10886, -384, -11941, -393, 11403, 368, -11253, 178, 11896, 769, -10603, 1142, 12044, 640, -10105, 1842, 12149, 172, -10395, 2086, 12433, -288, -10538, 2051, 12335, -400, -10516, 1495, 11314, -866, -10858, 1492, 11200, -1866, -11229, 1643, 10959, -2435, -12059, 1371, 10777, -3066, -12728, 1093, 10824, -3303, -12653, 1475, 9989, -3887, -12095, 2035, 10013, -4228, -11826, 2910, 11087, -3872, -11761, 3524, 11526, -3269, -10852, 3806, 11461, -3221, -10314, 4789, 11817, -3649, -9840, 5359, 12014, -3602, -9928, 5715, 12161, -3667, -10376, 5530, 11568, -4289, -10218, 5527]
1066E527N816j6149n570J6271M664j6911m680J6841M517j7342m078J6890M233
1079A0029j6999m433J6796M065j7041l606J7187K962j6908k715J7002K698j7167
1092h130k221J7542K111j7198k442J7416K694j6923j522J6326J682j6413j200
1105h278J7156N64j6681j004J7096J273j7397m76J6781Q05j7033m00J6559M03
1119I368j6984l67J7004m61j6788K12J6710p21j6889Q49J6615j009j6944Q91J7059
1134H545j231j6662J178J6132j422j6555K214J6467k322j6706K665J6557k604
1147F256j6561K422J7074k684j6408K645J6738k925j6239L288J6411l120j6454
1160i557M165J6180m170j5902L941J6457l818j6526L922J6386m190j6151M588
$$ y = [5527, 11343, -4806, -10376, 5895, 10559, -6352, -11032, 5809, 10326, -7016, -11094, 5796, 10029, -6970, -11403, 5393, 9458, -7583, -11189, 5998, 8960, -7948, -10663, 6339, 9037, -8130, -10351, 7191, 9302, -7896, -10338, 7078, 9772, -7151, -8673, 7653, 9335, -7078, -8278, 8878, 9442, -7239, -8243, 8853, 10126, -7271, -7747, 9034, 9839, -7194, -7594, 8965, 9368, -7616, -7983, 9021, 8560, -8228, -8016, 8694, 7973, -8916, -8067, 8548, 7539, -9405, -8514, 8545, 7314, -9348, -8170, 7962, 6540, -10015, -7801, 8666, 6344, -10362, -7697, 8860, 6256, -10305, -7883, 9191, 6507, -9901, -7256, 9482, 6557, -9682, -6394, 10017, 6897, -9557, -5392, 10788, 6618, -9284, -5343, 11114, 7296, -9230, -5308, 11078, 6888, -9263, -4675]
1173d675J5834n063j5854N161J5537n366j5696N427J5710o055j5748N605J5854
1186A0671o025j5619N571J5670o318j5350O293J5376o912j5026O905J4764o763
1199C237j5511P592J5256p606j4574P502J4720p538j4499P692J4652q160j3863
1212a1100Q309J4205q307j4137R136J3745q847j3868R321J3564q805j3563R232
1225a115J3305r382j3147R616J2402r607j2767R888J2647j0117j2785R756J2831
1238A1525j0243j2560J0331J1834j0236j2484J0468J1960j0935j1529J0760J1736
1250A0627j1246j1278J0740J1628j1051j1275J0865J1476j1463j1060J1557J0506
1262A0026j0625j0791J1897R879j1501r302J1609R914j1718r863J2185R470j1373
$$ y = [-4675, 11159, 6096, -9758, -4597, 10940, 5574, -10122, -4695, 11015, 4960, -10788, -5183, 10671, 4646, -10973, -5402, 10268, 3950, -11400, -5107, 10269, 3357, -11669, -4764, 10000, 3237, -12274, -4682, 10574, 2968, -11606, -4104, 10616, 3078, -11421, -3729, 10923, 2763, -11100, -2791, 11414, 3107, -11030, -1894, 11851, 3004, -10864, -1543, 12021, 3216, -10347, -1115, 12190, 2808, -10339, -723, 11679, 2072, -10695, -807, 11840, 1723, -11062, -1306, 11525, 1282, -11278, -947, 10887, 651, -11833, -1365, 10595, -340, -11869, -1109, 10627, -619, -11897, -1157, 10471, -580, -11855, -990, 10486, -977, -12037, -480, 10026, -599, -11390, 507, 10386, -1115, -10417, 1192, 11106, -612, -10475, 1710, 11180, -193]
1275a93r563J1448R614j1711r005J1532R059j1405r214J1843Q837j2455q569J2312
1289B530Q302j2250q721J2046Q423j2427q049J2267P915j2934p602J2797P502
1302I799j3161p354J2708P119j2482p397J3098O961j3227o825J3175O885j3174
1315c875o542J3377O322j3286n952J3364N813j3145n859J3399O027j3274n751
1328i382J3586N759j3744m928J3763M808j3337n004J3740M677j3923m202J3359
1341E172M784j4038m043J3717L839j4098l555J3528L546j3750l515J3634L166
1354H387j3763l518J3754K858j3579k699J3522K356j3436k281J3077K372j3590
1367f540j989J3165K271j3341j774J3493J653j3395j337J3386J445j2992j496
$$ y = [-193, -9756, 1692, 11306, -405, -9410, 2122, 11181, -224, -9438, 2405, 11242, -1213, -9782, 2530, 10832, -1418, -10139, 1907, 10330, -2097, -10146, 2121, 10036, -2898, -10500, 2297, 9799, -3362, -10716, 1992, 9111, -3371, -10768, 2330, 9291, -3936, -10761, 2414, 9299, -3875, -10417, 2960, 9282, -4004, -9956, 3408, 9221, -3924, -9783, 3616, 9643, -3631, -9382, 4204, 9963, -3781, -8709, 5054, 9862, -3475, -8479, 5261, 9938, -3985, -8187, 5172, 9956, -4082, -8125, 5592, 9431, -4667, -8222, 5306, 8852, -4898, -8413, 5221, 8387, -5376, -8894, 4860, 7718, -5861, -8560, 4962, 7318, -6118, -8399, 4678, 7050, -6540, -8529, 4636, 6907, -6434, -8208, 5285, 6938, -6457, -7794, 5592, 7037, -5955, -7451]
1380g451J3930M65j2896m16J3198Q7j2701m98J3346J73j3212K46J3010j09j2673
1395e501L53J2560m42j2990P17J2529p28j2595R13J1937p64j2712J225J2142j197
1410E447j2598J546J1944j352j2115J165J2220j819j1763J337J2071j774j1932
1423g623J800J2119k165j1780J993J2171k205j1813K381J1782k594j1274K532
1436d676J1636k575j1253L035J1316l076j1335L531J0784k809j1351L408J1051
1449G686l381j0794L527J0716l626j0557L727J0904m241j0841L985J0386m011
1462C480j0374L948J0352m510j0452M032J0645m590j0222M567J0016m754j0091
1475g953M798R727m869r604M965R748n457r070N363R208n731r095O068Q899n424
$$ y = [-7451, 6479, 6944, -5952, -6368, 6830, 6917, -5784, -6282, 7064, 7237, -5975, -5729, 7281, 7172, -5501, -5148, 7412, 6970, -6020, -5303, 7226, 6498, -6097, -5184, 6753, 5989, -6723, -5498, 6644, 5447, -7151, -5605, 6339, 4987, -7128, -5963, 6257, 4438, -7325, -5988, 6083, 4309, -7623, -5823, 6296, 4131, -7649, -5656, 6515, 4310, -7503, -5122, 6660, 4066, -7208, -4676, 6960, 4385, -6868, -3833, 7483, 4407, -6928, -3397, 7387, 4578, -6773, -3365, 7686, 4305, -6489, -2962, 7754, 4128, -6429, -2702, 8202, 3961, -6880, -2895, 7491, 3480, -6894, -2946, 7406, 2896, -7556, -3524, 7121, 2531, -7691, -3124, 6892, 2138, -7953, -3155, 6572, 1703, -7901, -2936, 6812, 1355, -7715, -2352, 6856, 1125, -7970, -1902, 6997, 1573]
1490A573q933N503Q996n785q564N836Q650n780q265O101Q337n774q114N772Q158
1505G711o158p889N967Q024o333p675O403P435o492p526O327P467o433p727O743
1520a56P201o723o989O145O982o526o910O642O352o776o576P007O333o940o518
1535g452O796O139o589o013O777N816o059o368P258N656o832n673P343N501o803
1550e03n464P110N324p073n417P370N188o968n197P113M944o931m802P399M175
1565F268o998m477P298M206p006m783P387M306p506l857O600M078p378l699P221
1580A660L591p280l654O953L536p088l487O812L780p529l278P195L346p165l172
1595e780P333K870o984k760P239K550p189k388P459K609p309k336P199K303o817
$$ y = [1573, -7360, -1857, 7139, 1354, -7210, -1374, 7276, 1496, -6769, -668, 7669, 1895, -6219, -447, 7711, 1553, -6336, -369, 7655, 1322, -6353, 50, 7485, 993, -6533, -206, 7261, 828, -6899, -156, 7045, 322, -6667, -522, 6460, -66, -6976, -334, 6018, -758, -7334, -327, 6006, -934, -7452, -656, 5483, -1106, -7119, -342, 5474, -585, -6953, 305, 5961, -871, -6544, 799, 6300, -503, -5967, 1143, 6467, -606, -6023, 1347, 6535, -433, -5630, 1483, 6427, -504, -5306, 2093, 6268, -730, -5207, 2091, 6297, -709, -5492, 1895, 6201, -1305, -5162, 1438, 5516, -1862, -5561, 1660, 5251, -2029, -5683, 1270, 4806, -2282, -5769, 1043, 4823, -2706, -5984, 1211, 4557, -2608, -5780, 1553, 4423, -2561, -5321, 1918, 4468, -2721, -5109, 2350, 4959, -2350, -4686, 2513, 4816, -2001]
1610b001k466P372K305p336j771P182J886p053j766O936K009p555j428P044J477
1625D835p231j598P258R84o718j460O563J470p000j163O720J204p151o52O447
1640B508P98o531q90O709O60o885n48O423L79o305l44O569L71o799K00O891m70
1657B736o422j63P086j56o362L11O334j42o097L53O062k48o217N82O118p97n472
1674b494N14N906o95n779N67N691q22n665P30N659j094n565R71N683j527n371
1690c291J068N375j168n479J279N164j721n024J601N023j579n156J651M877j756
1705H64m866K054M621j907m279J710M529j802m296J510M979j765m974K571M218
1720C167k001m284K326M499k141m418K532L859k066m099K168L944k004l886K002
$$ y = [-2001, -4467, 2905, 5210, -2126, -3897, 3285, 5171, -1882, -3648, 3288, 5297, -2258, -3686, 3358, 4835, -2396, -3994, 3264, 4248, -2470, -3930, 2633, 4103, -2897, -4060, 2660, 3864, -3287, -3939, 2508, 3306, -3225, -4115, 2594, 3254, -3631, -4179, 2244, 2623, -3682, -4026, 2543, 2914, -3885, -3685, 3206, 2736, -3686, -3849, 3237, 3081, -3281, -2970, 3364, 3222, -2875, -2522, 3540, 3292, -2925, -2343, 3775, 2978, -2494, -1980, 3926, 3231, -2548, -1981, 3710, 2888, -2777, -2047, 3612, 2518, -3047, -2076, 3607, 2080, -3291, -2223, 3152, 1984, -3495, -2216, 2948, 1227, -3797, -2196, 2827, 1248, -3908, -2257, 2620, 864, -4002, -1948, 2673, 766, -3513, -1803, 2726, 924, -3372, -1862, 3117, 1352, -3622, -1051, 3167, 1166, -3118, -792, 3707, 1566, -2852, -320, 3539, 1473, -2626, -458, 3486, 1482, -2404, -402]
1735d02L975k135l891K298L459k392l548K294L493k573l652K610L499k871l536
1750c372K509L185k549l104K513L514l010l341K634L221k664l105K871L097k908
1765e09k802K946K814k936k828L147K836k756k569K868K459k627k414K769K505
1780B903k455k707L020K255k910k188L018K095k811j790K622J947k856k202K960
1795I01K023l316j497L075J196k794j764L054J100k747j628K726J618k976j597
1810b626K991J193k843j179K669J156l022j000K943J303l123p25K955P76l234
1825a766n22L043O74k775m30L114M45k985j92K677M90k689m67L182N7l005J11
1842a038K580K99k292l80K431K49k402o14K814P9k746j63K625K04k561k88K683
$$ y = [-402, 3573, 1438, -2453, -155, 3304, 912, -2636, -342, 3151, 578, -3074, -464, 3035, 164, -3372, -863, 2322, -227, -3331, -818, 2696, -314, -3655, -1021, 2200, -464, -3569, -698, 2399, -509, -3311, -365, 2449, -487, -3315, -168, 2668, -88, -2657, 211, 2670, 43, -2371, 398, 2903, 448, -2259, 761, 3016, 106, -2082, 936, 3031, 220, -1570, 1052, 2999, 143, -2059, 901, 2924, -392, -1889, 1186, 2382, -412, -2176, 878, 1978, -769, -2397, 329, 1947, -1029, -2626, 365, 1558, -1285, -2464, 205, 1361, -1661, -2661, 282, 1585, -1538, -2263, 692, 1468, -1766, -2288, 755, 1429, -1346, -1776, 1338, 1783, -1202, -1394, 1283, 1773, -916, -1383, 1799, 1856, -1149, -1038, 1542, 1841, -451, -831, 1600, 1849, -553, -1167, 1647, 1726, -1020, -1183, 1442, 1646, -915, -1203, 1480]
1859A480k94k456J18K335n99k295J54K481m85k568L32K724n26k330M03K396n73
1876B97k148O56J943l72k059O81J811m47j844J013J746n72k158J104J922r94k003
1893a424J208J726o47j835J000K090j264j818J199J710p86j992J166J700j449
1908E84j529R33J725j467j311J176J298j395j734J529J720j779j550J426J641
1923A267j701j677J755J356j522j589J773R42j201j255J993P04j628j058J667
1938a74J221j473j090J895Q94k189m16J683Q18j494q69K214N58j818o16K001P31
1955A876k056o99J757Q18k109k48K177M93k780j22J985K78j789o31K141J40k185
$$ y = [1480, 1186, -1270, -1152, 1183, 584, -1711, -1557, 924, 439, -2129, -1797, 927, 401, -1929, -1526, 870, 297, -1851, -1195, 748, 376, -1683, -1002, 809, 362, -1482, -469, 1277, 705, -1453, -349, 1573, 579, -1424, -216, 1510, 863, -972, 28, 2118, 854, -964, 235, 1945, 1159, -833, 333, 2033, 584, -945, -12, 1713, 246, -1065, 111, 1409, 14, -1720, -191, 1529, -250, -1800, -374, 1267, -434, -2111, -356, 1000, -522, -2111, -338, 604, -597, -1852, 141, 845, -783, -1841, -174, 1047, -426, -1516, 379, 1273, -916, -1332, 351, 1169, -325, -1194, 1020, 1578, -240, -856, 1145, 1876, -180, -879, 878, 1696, -413, -661, 1516, 2009, -771, -893, 1092, 1370, -419, -1050, 1091, 1231, -954]
$$ [...]
8191g7
##END NTUPLES=NMR FID
##END=
