##TITLE=1H_PR172_WF
 D2O, 8 sc, 
 7.6.2019
##JCAMPDX= 6.0         $$ Bruker NMR JCAMP-DX V2.0
##DATA TYPE= NMR FID
##DATA CLASS= NTUPLES
##ORIGIN= UXNMR, Bruker Analytische Messtechnik GmbH
##OWNER= root
$$ XWIN-NMR		Version 3.5
$$ Fri Jun  7 14:42:35 2019 Russian Standard Time (UT+4h)  she@DPX200
##.OBSERVE FREQUENCY= 200.13155
##.OBSERVE NUCLEUS= ^1H
##.DELAY= (6, 6)
##.ACQUISITION MODE= SIMULTANEOUS
##.ACQUISITION SCHEME= undefined
##.AVERAGES= 8
##.DIGITISER RES= 18
##SPECTROMETER/DATA SYSTEM= spect
##.PULSE SEQUENCE= zg30
##.SOLVENT NAME= D2O
##.SHIFT REFERENCE= (INTERNAL, D2O, 0, 15.7039)
##AUDIT TRAIL= $$ (NUMBER, WHEN, WHO, WHERE, WHAT)
$$ ##TITLE= Audit trail, XWIN-NMR		Version 3.5
$$ ##JCAMPDX= 5.01
$$ ##ORIGIN= Bruker BioSpin GmbH
$$ ##OWNER= she
$$ F:/spectra/data/she/nmr/H-F/1/audita.txt
$$ ##AUDIT TRAIL=  $$ (NUMBER, WHEN, WHO, WHERE, WHAT)
(   1,<2019-06-07 14:40:54.17 +0400>,<she>,<DPX200>,
      <created by zg, POWCHK disabled, PULCHK disabled
       configuration hash MD5:
       00 E9 B6 7A A2 85 ED C7 34 08 36 98 17 FE 4E 26
       data hash MD5: 16K
       92 79 B6 91 54 13 65 1E 92 73 3C 42 3F DD E2 9A>)
$$ ##END=
$$ 
$$ hash MD5
$$ 36 A9 E3 A2 3D 3D 05 86 38 9A CE C5 D6 86 60 C8
##$RELAX= 
##$RELAX= 
##$RELAX= 
##$RELAX= 
##$RELAX= 
##$RELAX= 
$$ Bruker specific parameters
$$ --------------------------
##$DU= <F:/spectra>
##$EXPNO= 1
##$NAME= <H-F>
##$PROCNO= 1
##$TYPE= <nmr>
##$USER= <she>
##$AMP= (0..31)
100 100 100 100 100 100 100 100 100 100 100 100 100 100 100 100 100 100 
100 100 100 100 100 100 100 100 100 100 100 100 100 100 
##$AQSEQ= 0
##$AQ_mod= 1
##$AUNM= <au_zg>
##$AUTOPOS= <>
##$BF1= 200.13
##$BF2= 200.13
##$BF3= 200.13
##$BF4= 200.13
##$BF5= 200.13
##$BF6= 200.13
##$BF7= 200.13
##$BF8= 200.13
##$BYTORDA= 1
##$CFDGTYP= 0
##$CFRGTYP= 5
##$CHEMSTR= <none>
##$CNST= (0..31)
1 1 145 1 1 1 1 1 1 1 1 1 1 1 1 1 1 1 1 1 1 1 1 1 1 1 1 1 1 1 1 1 
##$CPDPRG= <>
##$CPDPRG1= <>
##$CPDPRG2= <>
##$CPDPRG3= <>
##$CPDPRG4= <mlev>
##$CPDPRG5= <mlev>
##$CPDPRG6= <mlev>
##$CPDPRG7= <mlev>
##$CPDPRG8= <mlev>
##$CPDPRGB= <>
##$CPDPRGT= <>
##$D= (0..31)
0 1.2 0 0 0 0 0 0 0 0 0 0.03 0 0 0 0 0 0 0 0 0 0 0 0 0 0 0 0 0 0 0 0 
##$DATE= 1559904053
##$DBL= (0..7)
120 120 120 120 120 120 120 120 
##$DBP= (0..7)
150 150 150 150 150 150 150 150 
##$DBP07= 0
##$DBPNAM0= <>
##$DBPNAM1= <>
##$DBPNAM2= <>
##$DBPNAM3= <>
##$DBPNAM4= <>
##$DBPNAM5= <>
##$DBPNAM6= <>
##$DBPNAM7= <>
##$DBPOAL= (0..7)
0.5 0.5 0.5 0.5 0.5 0.5 0.5 0.5 
##$DBPOFFS= (0..7)
0 0 0 0 0 0 0 0 
##$DE= 6
##$DECBNUC= <off>
##$DECIM= 24
##$DECNUC= <off>
##$DECSTAT= 4
##$DIGMOD= 1
##$DIGTYP= 9
##$DL= (0..7)
0 120 120 120 120 120 120 120 
##$DP= (0..7)
150 150 150 150 150 150 150 150 
##$DP07= 0
##$DPNAME0= <>
##$DPNAME1= <>
##$DPNAME2= <>
##$DPNAME3= <>
##$DPNAME4= <>
##$DPNAME5= <>
##$DPNAME6= <>
##$DPNAME7= <>
##$DPOAL= (0..7)
0.5 0.5 0.5 0.5 0.5 0.5 0.5 0.5 
##$DPOFFS= (0..7)
0 0 0 0 0 0 0 0 
##$DQDMODE= 0
##$DR= 18
##$DS= 0
##$DSLIST= <SSSSSSSSSSSSSSS>
##$DSPFIRM= 0
$$ [...]
##$SUBNAM2= <"">
##$SUBNAM3= <"">
##$SUBNAM4= <"">
##$SUBNAM5= <"">
##$SUBNAM6= <"">
##$SUBNAM7= <"">
##$SUBNAM8= <"">
##$SUBNAM9= <"">
##$SW= 24.9336996594482
##$SWIBOX= (0..15)
0 0 2 0 0 0 0 0 0 0 0 0 0 0 0 0 
##$SW_h= 4990.01996007984
##$TD= 16384
##$TD0= 1
##$TE= 0
##$TE2= 300
##$TE3= 300
##$TEG= 300
##$TL= (0..7)
0 120 120 120 120 120 120 120 
##$TP= (0..7)
150 150 150 150 150 150 150 150 
##$TP07= 0
##$TPNAME0= <>
##$TPNAME1= <>
##$TPNAME2= <>
##$TPNAME3= <>
##$TPNAME4= <>
##$TPNAME5= <>
##$TPNAME6= <>
##$TPNAME7= <>
##$TPOAL= (0..7)
0.5 0.5 0.5 0.5 0.5 0.5 0.5 0.5 
##$TPOFFS= (0..7)
0 0 0 0 0 0 0 0 
##$TUNHIN= 0
##$TUNHOUT= 0
##$TUNXOUT= 0
##$USERA1= <user>
##$USERA2= <user>
##$USERA3= <user>
##$USERA4= <user>
##$USERA5= <user>
##$V9= 5
##$VALIST= <valist>
##$VCLIST= <CCCCCCCCCCCCCCC>
##$VD= 0
##$VDLIST= <DDDDDDDDDDDDDDD>
##$VPLIST= <PPPPPPPPPPPPPPP>
##$VTLIST= <TTTTTTTTTTTTTTT>
##$WBST= 1024
##$WBSW= 4
##$XGAIN= (0..3)
0 0 0 0 
##$XL= 0
##$YL= 0
##$YMAX_a= 9206
##$YMIN_a= -12334
##$ZGOPTNS= <>
##$ZL1= 120
##$ZL2= 120
##$ZL3= 120
##$ZL4= 120
##$ABSF1= 10
##$ABSF2= 0
##$ABSG= 5
##$ABSL= 3
##$ALPHA= 0
##$AQORDER= 0
##$ASSFAC= 0
##$ASSFACI= 0
##$ASSFACX= 0
##$ASSWID= 0
##$AUNMP= <proc_1d>
##$AZFE= 0.1
##$AZFW= 0.1
##$BCFW= 1
##$BC_mod= 2
##$BYTORDP= 1
##$COROFFS= 0
##$CY= 11.3945322036743
##$DATMOD= 1
##$DC= 2
##$DFILT= <>
##$DTYPP= 0
##$F1P= 18.9103706918063
##$F2P= -1.10871071338519
##$FCOR= 0.5
##$FTSIZE= 0
##$FT_mod= 4
##$GAMMA= 1
##$GB= 0.15
##$INTBC= 1
##$INTSCL= 1
##$ISEN= 128
##$LB= 0.24
##$LEV0= 0
##$LPBIN= 0
##$MAXI= 10000
##$MC2= 0
##$MEAN= 0
##$ME_mod= 0
##$MI= 1.114404
##$NCOEF= 0
##$NC_proc= 0
##$NLEV= 6
##$NOISF1= 3.799351
##$NOISF2= 2.8
##$NSP= 1
##$NTH_PI= 0
##$NZP= 0
##$OFFSET= 15.70392
##$PC= 1
##$PHC0= -8577.41
##$PHC1= 6.000189
##$PH_mod= 1
##$PKNL= yes
##$PPARMOD= 0
##$PSCAL= 0
##$PSIGN= 0
##$REVERSE= no
##$SF= 200.130013532006
##$SI= 16384
##$SIGF1= 3
##$SIGF2= 2
##$SINO= 400
##$SIOLD= 16384
##$SREGLST= <1H.CDCl3>
##$SSB= 0
##$STSI= 0
##$STSR= 0
##$SW_p= 3612.71676300578
##$SYMM= 0
##$S_DEV= 0
##$TDeff= 0
##$TDoff= 0
##$TI= <>
##$TILT= no
##$TM1= 0
##$TM2= 0
##$TOPLEV= 0
##$USERP1= <user>
##$USERP2= <user>
##$USERP3= <user>
##$USERP4= <user>
##$USERP5= <user>
##$WDW= 1
##$XDIM= 8192
##$YMAX_p= 0
##$YMIN_p= 0
$$ End of Bruker specific parameters
$$ ---------------------------------
##NTUPLES= NMR FID
##VAR_NAME=  TIME,          FID/REAL,        FID/IMAG
##SYMBOL=    X,             R,               I
##VAR_TYPE=  INDEPENDENT,   DEPENDENT,       DEPENDENT
##VAR_FORM=  AFFN,          ASDF,            ASDF
##VAR_DIM=   8192,          8192,            8192
##UNITS=     SECONDS,       ARBITRARY UNITS, ARBITRARY UNITS
##FACTOR=    0.0002004,     1,               1
##FIRST=     0,             0,               0
##LAST=      1.6414764,     0,               0
##MIN=       0,             -12334,          0
##MAX=       1.6414764,     9206,            0
$$ Real data points
##PAGE= N=1
##DATA TABLE= (X++(R..R)), XYDATA
0 0 0 0 0 0 0 0 0 0 0 0 0 0 0 0 0 0 0 0 0 0 0 0 0 0 0 0 0 5 -6 8 -8 8 -8 8 -8 8 -9 13 -14 16 -16 17 -21 22 -24 29
46 29 -29 35 -37 44 -49 55 -64 76 -90 110 -142 194 -299 596 -3173 -12334 -8387 -766 3170 3547 5892
67 5892 7143 2317 -6341 -9557 -4805 2250 5997 6909 5547 1278 -4503 -7005 -4622 67 4239 7501
83 7501 8078 3223 -5168 -9633 -6296 -36 3247 4494 6425 6005 -649 -9015 -10240 -3340 3616 5209
99 5209 3966 3134 764 -4667 -8743 -6377 701 6286 6986 3867 -859 -5331 -7318 -5386 -663 4019
115 4019 6927 7098 3257 -3696 -8726 -7168 -847 4315 5788 5510 4351 439 -5513 -8077 -3832 3337
131 3337 7057 5910 2828 -534 -4165 -6505 -4939 390 5753 7410 4812 -231 -5218 -7489 -5604
146 -5604 -815 3695 5925 5534 2452 -2858 -7398 -7309 -2246 3487 5720 4472 2002 -1210 -4984 -6825
162 -6825 -4008 2098 6548 6277 2553 -1785 -4999 -6185 -4296 447 5341 7184 5041 382 -4347
177 -4347 -6689 -5203 -648 4185 6451 5360 1901 -2339 -5552 -5735 -2131 3145 6292 5493 1884 -2220
193 -2220 -5092 -5620 -3140 1582 5727 6403 3242 -1607 -5363 -6336 -4179 124 4347 6126 4471 221
209 221 -4182 -6254 -4973 -1079 3228 5483 4533 1002 -3132 -5561 -4977 -1637 2680 5485 5235 1985
225 1985 -2490 -5551 -5488 -2376 2129 5504 6028 3540 -759 -4633 -5865 -3652 710 4645 6026 4289
241 4289 448 -3478 -5324 -4131 -483 3496 5488 4474 961 -3196 -5570 -4772 -1318 2774 5220
256 5220 4882 1916 -2317 -5555 -5898 -2942 1512 4787 5195 2863 -974 -4412 -5626 -3846 57 3800
272 3800 5100 3416 -193 -3656 -5087 -3697 -194 3448 5200 4212 914 -3019 -5247 -4411 -888 3223
288 3223 5556 5084 2243 -1623 -4642 -5056 -2432 1774 4900 5242 2862 -806 -3885 -4835 -3118 485
304 485 3887 4919 3101 -501 -3918 -5281 -3851 -321 3306 4943 3796 470 -3296 -5510 -4953 -1742
320 -1742 2302 4778 4427 1721 -1892 -4502 -4757 -2467 1270 4258 4670 2442 -1020 -3723 -4259 -2415
336 -2415 1045 4185 5109 3323 -224 -3500 -4657 -3215 150 3653 5301 4191 932 -2719 -4732
351 -4732 -4161 -1320 2254 4508 4201 1537 -2009 -4383 -4364 -2076 1352 3927 4127 1884 -1618 -4355
367 -4355 -4800 -2776 740 3773 4687 2994 -491 -3754 -4984 -3636 -395 3043 4729 3871 945 -2441
383 -2441 -4346 -3723 -1023 2307 4331 4029 1566 -1719 -3913 -3785 -1435 1928 4291 4381 2189 -1209
399 -1209 -3905 -4426 -2503 865 3792 4635 3001 -254 -3333 -4563 -3386 -398 2759 4227 3282 445
415 445 -2674 -4290 -3584 -977 2197 4082 3585 1014 -2258 -4306 -4065 -1666 1676 4110 4272 2145
431 2145 -1254 -3900 -4417 -2602 631 3520 4452 2977 -87 -2971 -4088 -2928 -136 2814 4239 3308
447 3308 491 -2538 -3976 -3163 -622 2354 4160 3749 1257 -2064 -4163 -3862 -1535 1561 3808 4042
463 4042 2144 -1066 -3654 -4141 -2404 594 3202 3957 2525 -409 -3116 -4008 -2717 -2 2726 3985
479 3985 3022 185 -2878 -4254 -3269 -605 2279 3970 3653 1337 -1965 -4160 -3906 -1540 1529 3632
495 3632 3830 2099 -841 -3349 -3897 -2152 784 3216 3881 2512 -297 -2946 -3829 -2498 235 2824
511 2824 3970 3102 476 -2557 -4106 -3214 -565 2235 3746 3425 1338 -1632 -3809 -3748 -1521 1447
527 1447 3367 3373 1641 -1042 -3315 -3807 -2092 802 3109 3600 2088 -606 -3101 -3981 -2646 173 2840
544 2840 3893 2899 414 -2412 -3947 -3225 -676 2209 3796 3374 1279 -1468 -3393 -3367 -1308 1565
560 1565 3490 3501 1686 -981 -3124 -3501 -1873 906 3233 3718 2195 -491 -2922 -3809 -2652 -41
576 -41 2583 3720 2776 286 -2352 -3682 -3045 -819 1779 3338 3012 926 -1769 -3494 -3181 -1108 1476
593 1476 3188 3221 1504 -1147 -3267 -3545 -1784 1038 3254 3693 2236 -366 -2738 -3560 -2442 41
609 41 2551 3746 2886 391 -2266 -3448 -2640 -466 1851 3214 3023 1073 -1734 -3616 -3219 -957 1610
626 1610 3096 3055 1549 -964 -3215 -3714 -2020 796 2967 3395 2046 -368 -2611 -3377 -2295 -43
642 -43 2163 3301 2671 375 -2335 -3535 -2406 -15 1991 2915 2703 1198 -1450 -3614 -3417 -861 2005
659 2005 3244 2775 1402 -638 -2806 -3602 -2075 853 3036 3260 1825 -412 -2496 -3301 -2208 182
675 182 2293 3068 2370 400 -2181 -3705 -2800 -44 2358 3011 2305 973 -1022 -3170 -3687 -1453 1902
692 1902 3527 2722 911 -737 -2203 -3082 -2195 481 3009 3370 1633 -717 -2426 -2944 -1970 194 2285
709 2285 3064 2223 250 -2043 -3470 -2881 -307 2393 3246 2195 507 -1110 -2644 -3239 -1684 1438
725 1438 3575 3047 744 -1278 -2281 -2534 -1754 341 2734 3487 1917 -726 -2683 -3059 -1836 336
741 336 2332 3038 2218 344 -1806 -3265 -2940 -613 2190 3323 2251 315 -1275 -2382 -2792 -1689
757 -1689 977 3261 3110 832 -1533 -2560 -2406 -1439 373 2407 3193 1912 -581 -2628 -3084 -1888
773 -1888 339 2385 3017 2005 147 -1635 -2773 -2611 -717 2011 3461 2508 163 -1660 -2315 -2183
789 -2183 -1243 841 2996 3279 1153 -1611 -2918 -2497 -1170 531 2244 3014 1943 -504 -2620 -3136
805 -3136 -1969 148 2153 2924 1999 -5 -1860 -2699 -2313 -698 1548 3099 2634 413 -1836 -2656 -2061
822 -2061 -768 941 2569 2992 1456 -1182 -2895 -2634 -999 852 2276 2746 1814 -283 -2298 -2927
838 -2927 -1822 277 2177 2849 1941 -48 -1940 -2702 -2078 -424 1560 2835 2466 493 -1793 -2911
854 -2911 -2360 -697 1123 2450 2647 1318 -1010 -2793 -2852 -1279 815 2325 2637 1613 -323 -2175
870 -2175 -2798 -1805 188 2071 2793 1972 52 -1869 -2684 -1997 -271 1625 2709 2374 680 -1487 -2749
887 -2749 -2378 -710 1237 2481 2475 1170 -873 -2468 -2650 -1268 801 2320 2537 1448 -443 -2160 -2677
904 -2677 -1696 266 2054 2685 1817 -35 -1896 -2733 -2079 -267 1677 2680 2220 539 -1434 -2638 -2398
921 -2398 -846 1187 2522 2434 1016 -943 -2380 -2517 -1270 721 2288 2569 1431 -479 -2109 -2580
937 -2580 -1633 265 2032 2662 1868 47 -1755 -2566 -1965 -252 1621 2625 2195 527 -1365 -2439 -2180
954 -2180 -710 1173 2426 2349 952 -997 -2346 -2389 -1115 763 2209 2458 1338 -574 -2185 -2611 -1616
971 -1616 248 1939 2534 1722 -67 -1832 -2601 -1973 -299 1539 2508 2060 463 -1392 -2468 -2160 -674
988 -674 1197 2412 2345 975 -932 -2280 -2329 -1083 781 2261 2523 1438 -406 -1969 -2424 -1503 266
1005 266 1900 2491 1719 22 -1687 -2436 -1849 -229 1524 2378 1897 364 -1414 -2432 -2137 -689 1112
1022 1112 2290 2160 795 -1055 -2325 -2343 -1129 698 2103 2348 1288 -524 -2027 -2393 -1438 326
1038 326 1893 2441 1676 -2 -1655 -2357 -1729 -79 1644 2493 2005 461 -1298 -2302 -2012 -604 1186
1055 1186 2369 2230 894 -921 -2159 -2220 -1079 670 2018 2256 1224 -531 -1992 -2339 -1419 250
1071 250 1757 2242 1470 -156 -1725 -2392 -1755 -154 1517 2314 1816 326 -1353 -2284 -1962 -572 1181
1088 1181 2270 2119 800 -934 -2083 -2059 -912 793 2101 2291 1217 -534 -1921 -2216 -1265 401
1104 401 1852 2333 1562 -54 -1685 -2357 -1709 -122 1518 2267 1781 352 -1275 -2229 -1995 -645 1092
1121 1092 2152 1984 703 -967 -2062 -2051 -966 678 1965 2162 1129 -568 -1930 -2197 -1246 397
1137 397 1763 2199 1471 -37 -1553 -2221 -1632 -52 1577 2253 1661 254 -1213 -2042 -1818 -551 1144
1154 1144 2237 2004 609 -1054 -2045 -1932 -846 729 1969 2182 1144 -569 -1955 -2217 -1241 392
1170 392 1747 2127 1381 -95 -1523 -2173 -1647 -143 1492 2217 1640 152 -1320 -1998 -1686 -530 1009
1187 1009 2115 2002 656 -1076 -2100 -1887 -737 736 1839 2017 1120 -486 -1857 -2137 -1149 450
1203 450 1745 2049 1273 -146 -1474 -2016 -1469 -30 1496 2198 1636 117 -1386 -2046 -1585 -354 1086
1220 1086 2033 1928 694 -1005 -2114 -1973 -724 810 1837 1904 1018 -486 -1793 -2130 -1230 382 1720
1237 1720 2008 1203 -237 -1546 -2035 -1445 -40 1399 2105 1605 198 -1311 -2057 -1639 -340 1126 1962
1254 1962 1796 685 -831 -1900 -1847 -721 836 1900 1879 901 -525 -1651 -1894 -1057 464 1725 2003
1271 2003 1193 -275 -1570 -2010 -1393 25 1454 2034 1453 111 -1281 -2031 -1722 -448 1097 1975 1700
1288 1700 447 -1004 -1855 -1788 -784 687 1831 1918 882 -652 -1743 -1866 -979 451 1686 2014 1250
1305 1250 -180 -1453 -1940 -1355 47 1500 2088 1490 118 -1171 -1752 -1480 -414 995 1982 1798 480
1322 480 -1100 -1878 -1584 -530 678 1617 1799 916 -651 -1903 -1997 -950 538 1593 1773 1045 -228
1339 -228 -1457 -1977 -1425 -28 1443 2038 1430 -13 -1304 -1792 -1355 -299 969 1880 1819 625 -1033
1356 -1033 -1969 -1627 -358 931 1673 1699 976 -347 -1667 -2021 -1067 591 1776 1814 930 -277 -1271 -1725
1374 -1725 -1351 -144 1310 2021 1394 -110 -1431 -1802 -1271 -220 889 1655 1616 564 -1000 -2024 -1779
1391 -1779 -454 989 1716 1525 699 -462 -1506 -1851 -1094 479 1797 1960 957 -456 -1401 -1560 -1059
1408 -1059 -17 1212 1985 1571 52 -1481 -1952 -1239 3 1069 1599 1509 635 -802 -1928 -1861 -578
1425 -578 975 1757 1494 561 -527 -1415 -1697 -1091 310 1604 1898 962 -495 -1522 -1623 -948 119 1153
1443 1153 1727 1402 167 -1320 -1971 -1355 22 1221 1651 1319 427 -727 -1642 -1708 -657 914 1875 1625
1461 1625 477 -727 -1428 -1490 -860 321 1519 1894 1054 -467 -1613 -1738 -939 223 1228 1669 1332
1478 1332 173 -1203 -1905 -1438 -119 1183 1713 1316 304 -818 -1561 -1530 -634 720 1728 1652 583
1495 583 -781 -1555 -1475 -717 388 1385 1711 1047 -311 -1522 -1784 -987 269 1272 1605 1158 106 -1083
1513 -1083 -1736 -1357 -146 1147 1719 1313 229 -918 -1553 -1393 -471 773 1653 1622 624 -737 -1605 -1551
1531 -1551 -683 513 1431 1647 976 -288 -1425 -1744 -1049 214 1298 1637 1098 -22 -1134 -1636 -1278
1548 -1278 -187 1034 1651 1323 251 -978 -1611 -1360 -406 772 1565 1529 633 -654 -1548 -1525 -650 554
1566 554 1436 1580 917 -274 -1305 -1583 -951 255 1302 1612 1065 -61 -1145 -1597 -1148 -42 1097
1583 1097 1614 1259 212 -989 -1648 -1413 -400 810 1533 1413 530 -669 -1547 -1586 -732 492 1407 1533
1601 1533 789 -379 -1333 -1571 -934 223 1272 1595 1047 -63 -1128 -1547 -1112 -33 1091 1635 1297
1618 1297 259 -859 -1507 -1294 -353 831 1545 1421 553 -612 -1415 -1405 -629 532 1385 1471 733 -431
1636 -431 -1359 -1530 -874 250 1233 1506 959 -176 -1234 -1627 -1149 -72 1035 1548 1184 171 -935 -1553
1654 -1553 -1311 -346 811 1506 1370 498 -642 -1399 -1386 -557 598 1438 1501 761 -380 -1290 -1459 -827 313
1673 313 1278 1564 1006 -86 -1110 -1499 -1079 -43 1031 1496 1150 160 -913 -1462 -1242 -321 760 1420
1691 1420 1258 373 -710 -1415 -1380 -579 563 1364 1405 664 -475 -1328 -1461 -835 279 1229 1509 943 -133
1710 -133 -1122 -1475 -1015 5 1038 1499 1153 142 -904 -1442 -1177 -244 842 1463 1291 426 -685 -1406
1728 -1406 -1362 -555 560 1361 1397 693 -399 -1245 -1435 -832 249 1169 1420 893 -140 -1085 -1412 -969 0
1747 0 984 1421 1072 93 -932 -1436 -1145 -210 833 1406 1218 388 -665 -1378 -1320 -525 587 1342 1345 619
1767 619 -427 -1211 -1359 -775 283 1189 1424 848 -212 -1117 -1397 -912 49 1004 1435 1079 122 -922 -1459
1786 -1459 -1166 -202 848 1402 1202 396 -609 -1302 -1300 -557 564 1337 1315 564 -441 -1159 -1275 -729 259
1805 259 1144 1409 815 -241 -1140 -1387 -884 80 975 1353 1006 86 -891 -1406 -1149 -228 845 1366 1109
1824 1109 269 -645 -1225 -1195 -512 555 1352 1335 519 -547 -1213 -1198 -615 301 1152 1427 885 -203 -1141 -1382
1844 -1382 -865 110 1005 1348 1016 114 -840 -1334 -1109 -243 792 1374 1109 228 -721 -1209 -1104 -463 466
1863 466 1249 1328 558 -567 -1275 -1222 -559 308 1046 1304 850 -153 -1104 -1361 -827 124 978 1284 923 54
1883 54 -835 -1255 -986 -161 801 1333 1119 244 -763 -1269 -1063 -355 543 1211 1270 597 -510 -1288 -1275 -572
1903 -572 346 1054 1239 790 -154 -1042 -1334 -850 107 958 1262 887 19 -853 -1255 -947 -120 775 1290 1098
1923 1098 283 -700 -1262 -1100 -346 577 1184 1187 559 -403 -1151 -1206 -576 367 1063 1198 699 -213 -1014 -1241 -759
1944 -759 157 945 1217 828 -32 -898 -1284 -958 -105 807 1249 1017 224 -687 -1228 -1118 -395 570 1228 1190
1964 1190 474 -470 -1092 -1112 -536 335 1047 1236 713 -239 -1034 -1210 -690 193 959 1226 846 7 -865 -1247
1984 -1247 -959 -142 790 1270 1019 177 -683 -1124 -982 -409 436 1117 1168 443 -580 -1181 -1035 -400 336 925
2004 925 1124 702 -246 -1101 -1262 -649 279 972 1160 805 19 -819 -1213 -920 -116 778 1267 1022 185 -733
2024 -733 -1134 -882 -253 466 1039 1143 525 -545 -1261 -1124 -337 474 937 1026 664 -137 -1023 -1339 -794 232
2044 232 992 1137 705 -37 -750 -1116 -882 -153 687 1174 984 173 -748 -1146 -813 -115 549 980 1037 521
2064 521 -442 -1233 -1177 -344 587 1032 977 579 -137 -902 -1241 -797 192 985 1159 691 -109 -815 -1105 -779 -71
2085 -71 665 1086 939 175 -795 -1283 -936 -92 644 959 921 470 -358 -1152 -1251 -480 551 1093 987 507 -139
2106 -139 -785 -1105 -735 162 960 1142 682 -106 -802 -1038 -696 42 752 1065 874 200 -666 -1209 -998 -123
2126 -123 728 1047 844 343 -357 -1004 -1179 -567 450 1081 995 372 -304 -823 -1022 -671 127 906 1124 650
2146 650 -195 -896 -1114 -750 31 789 1095 848 174 -631 -1135 -1010 -235 675 1101 907 305 -360 -901 -1018
2166 -1018 -512 389 1068 1033 419 -343 -861 -950 -555 179 902 1113 665 -135 -852 -1098 -756 7 771 1084
2186 1084 796 106 -628 -1062 -945 -279 575 1053 863 197 -489 -930 -930 -439 377 1007 998 403 -422 -973 -1022
2207 -1022 -560 207 902 1113 676 -131 -839 -1088 -754 -15 737 1093 840 143 -584 -964 -821 -191 581 1050
2227 1050 911 257 -492 -933 -869 -315 428 1007 1031 462 -349 -948 -999 -537 210 857 1041 652 -108 -806 -1064
2248 -1064 -733 -24 650 958 710 30 -669 -1030 -807 -159 571 983 829 193 -562 -1012 -920 -333 458 1011
2268 1011 1021 480 -313 -908 -1004 -528 234 875 1056 685 -37 -713 -951 -636 73 743 1018 741 72 -627
2288 -627 -987 -785 -122 598 1004 853 233 -549 -1009 -951 -389 372 898 925 415 -323 -913 -1017 -565 146 744
2309 744 911 534 -174 -783 -972 -637 79 734 972 682 21 -681 -1002 -758 -81 647 1069 919 287 -470
2329 -470 -939 -884 -310 434 945 959 472 -264 -809 -895 -469 232 820 944 533 -184 -778 -982 -642 53 720
2350 720 973 666 -18 -707 -1042 -842 -195 527 935 821 227 -475 -924 -881 -339 352 842 850 371 -306 -812
2371 -812 -857 -399 289 859 956 538 -164 -766 -939 -572 128 777 1039 745 70 -613 -945 -741 -137 548 951
2392 951 810 235 -464 -899 -816 -276 385 849 820 320 -393 -897 -915 -449 265 817 931 511 -194 -810 -992
2413 -992 -667 29 678 946 689 55 -598 -882 -692 -121 526 884 756 188 -469 -839 -726 -170 478 888
2433 888 868 353 -349 -853 -867 -394 330 865 960 565 -141 -736 -916 -580 47 663 927 664 3 -659 -895
2454 -895 -632 -50 514 843 721 149 -553 -974 -801 -205 463 855 816 364 -340 -892 -943 -462 257 794 894
2475 894 526 -129 -689 -844 -516 94 643 868 644 26 -620 -867 -561 74 625 866 721 209 -477 -937
2495 -937 -805 -176 538 892 794 348 -275 -793 -895 -451 247 771 821 423 -202 -730 -876 -509 121 631 806
2516 806 527 -54 -696 -994 -682 12 630 843 642 167 -442 -912 -876 -267 510 906 789 303 -236 -660
2536 -660 -766 -381 285 831 865 451 -164 -652 -762 -405 215 744 859 564 -12 -595 -918 -687 -9 654
2556 654 862 599 97 -431 -812 -837 -335 406 845 697 135 -400 -749 -775 -389 230 743 799 355 -295 -778
2577 -778 -858 -486 179 753 875 542 -17 -566 -846 -673 -35 657 942 701 135 -373 -663 -639 -205 449 884
2598 884 791 237 -359 -719 -675 -261 306 762 807 379 -266 -763 -866 -516 115 675 820 490 -103 -628 -859
2619 -859 -669 -106 500 809 563 14 -532 -778 -640 -165 430 785 702 189 -412 -794 -721 -255 399 836 843
2640 843 425 -190 -676 -790 -439 168 725 892 572 -24 -544 -733 -519 6 560 787 595 59 -486 -797
2660 -797 -648 -109 481 800 644 155 -428 -800 -807 -369 268 743 774 325 -277 -708 -780 -459 83 590 750
2681 750 453 -107 -599 -780 -481 68 615 787 535 31 -489 -791 -659 -108 561 929 727 199 -366 -695
2701 -695 -708 -327 279 773 827 388 -228 -658 -697 -365 174 630 734 424 -111 -601 -800 -542 47 647 825
2722 825 485 -49 -504 -754 -701 -245 416 847 694 109 -449 -695 -628 -303 195 659 744 315 -304 -688 -676
2743 -676 -292 242 666 745 405 -140 -585 -744 -509 54 674 930 602 -31 -514 -674 -542 -174 370 817
2763 817 759 202 -446 -710 -548 -163 269 633 695 318 -291 -752 -757 -335 222 654 720 384 -182 -642 -773 -546
2785 -546 -38 516 809 578 -23 -551 -717 -509 -120 316 669 670 201 -422 -742 -559 -84 400 673 679 317
2806 317 -258 -687 -705 -305 260 712 800 442 -135 -601 -696 -437 32 508 756 576 18 -555 -748 -484 -30
2827 -30 381 629 568 146 -451 -798 -661 -163 372 669 639 267 -282 -708 -748 -372 183 617 733 427 -106
2848 -106 -565 -673 -398 89 520 704 520 46 -465 -690 -450 65 519 730 566 148 -376 -711 -624 -144
2868 -144 399 717 653 262 -273 -656 -689 -349 187 583 665 361 -166 -600 -717 -422 85 514 662 419 -68
2889 -68 -551 -741 -535 -18 497 747 564 104 -394 -692 -608 -178 356 699 687 289 -235 -612 -605 -252 228 611
2911 611 663 360 -128 -555 -621 -342 161 580 701 433 -63 -517 -718 -513 -17 464 706 562 98 -425 -708
2932 -708 -606 -185 305 611 564 218 -292 -632 -632 -254 246 598 612 297 -203 -597 -670 -370 145 591 726 458
2954 458 -32 -507 -679 -495 -28 445 705 577 131 -345 -619 -533 -124 355 632 561 192 -279 -600 -578 -217
2975 -217 285 624 627 288 -211 -595 -685 -382 114 547 678 427 -52 -504 -678 -488 -30 416 642 488 47
2996 47 -412 -642 -523 -111 363 639 540 148 -342 -649 -603 -217 280 622 655 317 -193 -581 -664 -362 125 548
3018 548 683 437 -17 -456 -606 -416 23 453 643 482 64 -393 -607 -476 -75 389 646 567 161 -333
3038 -333 -641 -599 -224 256 598 603 279 -180 -573 -642 -366 104 492 604 353 -82 -487 -628 -411 42 454
3059 454 630 443 5 -444 -643 -497 -75 388 665 568 191 -306 -625 -584 -204 280 605 617 320 -147 -509
3080 -509 -593 -304 164 542 620 360 -81 -469 -603 -408 44 473 644 437 -6 -436 -654 -525 -103 351 608
3101 608 513 146 -312 -605 -574 -236 230 539 531 205 -211 -539 -589 -290 179 552 608 309 -126 -492 -594 -375
3123 -375 55 495 683 484 15 -410 -595 -461 -88 354 620 541 159 -293 -568 -512 -173 271 559 524 189
3144 189 -231 -525 -570 -313 136 547 627 308 -162 -519 -586 -396 -17 414 629 460 0 -438 -582 -424 -64
3165 -64 304 558 493 119 -318 -577 -506 -144 295 572 528 179 -251 -530 -543 -287 162 541 649 343 -158 -528
3187 -528 -557 -326 22 390 596 480 29 -438 -607 -402 -3 349 543 469 117 -321 -586 -505 -142 290 582
3208 582 552 198 -238 -542 -524 -259 135 484 608 356 -117 -511 -560 -300 69 370 510 415 24 -421 -619
3229 -619 -418 10 382 535 418 90 -338 -569 -503 -131 284 562 544 209 -238 -544 -521 -214 170 468 566
3250 566 350 -104 -500 -588 -282 142 439 524 367 19 -392 -599 -416 2 409 566 426 82 -324 -567 -494
3271 -494 -154 259 527 517 199 -248 -542 -528 -219 176 443 491 281 -116 -480 -568 -301 122 470 538 331 -28
3293 -28 -390 -561 -414 3 417 583 429 92 -311 -542 -454 -113 293 545 496 190 -222 -513 -501 -200 213
3314 213 486 507 245 -142 -480 -551 -315 93 453 562 347 -41 -428 -569 -415 -35 355 556 431 85 -310
3335 -310 -531 -440 -99 280 516 466 169 -224 -491 -468 -178 210 500 515 238 -149 -471 -523 -273 109 434 541
3357 541 358 -25 -407 -554 -372 17 357 515 383 57 -321 -542 -444 -89 299 511 439 127 -269 -517 -491
3378 -491 -191 205 490 525 261 -145 -481 -542 -273 116 418 508 341 -5 -379 -538 -368 21 402 515 366
3399 366 49 -290 -494 -425 -98 312 529 447 143 -266 -503 -475 -174 175 457 466 250 -133 -465 -525 -273 123
3421 123 421 466 274 -47 -367 -525 -376 24 396 534 351 9 -337 -486 -401 -91 300 532 454 145 -253
3442 -253 -485 -464 -171 203 465 478 242 -134 -443 -511 -263 153 445 494 282 -46 -351 -489 -353 10 387
3463 387 540 369 13 -311 -483 -391 -95 271 496 431 121 -252 -491 -454 -165 213 436 436 181 -150 -441 -486
3485 -486 -260 128 435 485 255 -111 -401 -491 -338 4 373 532 372 12 -333 -499 -373 -63 280 492 423
3506 423 128 -245 -471 -433 -149 224 476 464 212 -143 -431 -459 -244 130 444 495 290 -88 -399 -481 -316 14
3528 14 337 484 338 9 -345 -493 -372 -67 266 456 366 75 -273 -476 -440 -162 204 456 420 160 -197
3549 -197 -454 -466 -231 130 415 486 273 -75 -383 -458 -290 65 389 512 370 25 -312 -467 -340 -37 315
3570 315 492 402 103 -238 -438 -414 -136 221 462 441 181 -196 -433 -457 -240 119 386 434 233 -114 -404 -480
3592 -480 -311 26 323 446 292 -6 -340 -480 -355 -48 285 455 356 80 -265 -454 -401 -126 228 455 439
3613 439 165 -168 -413 -430 -194 155 420 469 263 -81 -390 -453 -272 61 370 483 330 -21 -335 -468 -348
3634 -348 -34 286 445 377 76 -263 -462 -406 -131 206 428 403 142 -195 -430 -428 -198 129 399 439 236 -112
3656 -112 -378 -439 -268 73 373 462 324 -8 -323 -456 -307 -11 308 464 361 63 -254 -438 -369 -98 240
3677 240 436 397 148 -198 -428 -418 -180 150 418 441 219 -110 -377 -452 -266 65 352 442 282 -26 -329 -442
3699 -442 -324 -34 298 444 353 50 -267 -428 -370 -97 220 433 388 131 -183 -412 -403 -169 147 399 421 215
3721 215 -104 -376 -412 -230 69 347 452 284 -28 -329 -426 -298 -5 315 455 352 51 -259 -427 -353 -88
3742 -88 239 435 389 120 -205 -421 -403 -152 154 396 411 214 -108 -365 -427 -235 92 360 426 261 -34 -318
3764 -318 -418 -287 -12 304 437 329 42 -248 -414 -328 -74 220 417 373 138 -194 -421 -387 -146 168 396
3785 396 394 180 -127 -367 -428 -235 94 357 400 239 -59 -325 -429 -306 -4 288 431 317 19 -285 -438
3806 -438 -345 -68 218 405 363 130 -191 -408 -388 -129 194 390 391 188 -101 -355 -405 -222 119 380 428 245
3828 245 -33 -301 -402 -275 19 292 422 321 24 -272 -406 -322 -44 233 376 324 99 -209 -420 -389 -158
3849 -158 188 380 352 133 -145 -365 -415 -238 84 364 427 233 -75 -324 -393 -263 10 286 422 324 33 -271
3871 -271 -418 -304 -32 257 414 343 120 -170 -381 -363 -138 202 418 384 157 -145 -339 -387 -216 74 335
3892 335 421 229 -89 -323 -399 -257 11 257 376 261 14 -292 -428 -327 -50 247 381 301 64 -211 -382
3913 -382 -367 -150 186 404 371 139 -171 -362 -345 -172 88 338 403 244 -62 -314 -385 -216 61 305 404 285
3935 285 20 -250 -397 -322 -39 271 419 319 61 -216 -383 -341 -138 151 377 367 143 -171 -384 -357 -174
3956 -174 96 315 368 204 -83 -342 -405 -230 48 291 383 260 -13 -261 -398 -305 -34 260 416 317 62 -219
3978 -219 -372 -321 -107 186 375 370 144 -157 -369 -361 -150 138 344 366 201 -77 -335 -383 -227 61 325 405 264
4001 264 -9 -272 -373 -291 -41 239 393 309 59 -216 -378 -319 -92 183 349 341 123 -160 -359 -356 -155 124
4023 124 344 366 185 -82 -320 -368 -221 43 305 377 262 -21 -280 -362 -262 -21 262 376 302 52 -227 -365
4045 -365 -305 -79 197 373 345 122 -164 -358 -357 -156 124 348 382 203 -99 -324 -372 -212 44 279 373 255
4067 255 -14 -279 -378 -264 -2 248 374 277 33 -220 -371 -316 -91 205 370 327 104 -165 -352 -335 -140 132
4089 132 334 363 200 -101 -330 -349 -183 92 294 359 220 -42 -266 -376 -261 -2 260 372 261 24 -228
4110 -228 -361 -305 -82 191 360 339 114 -172 -360 -330 -134 135 320 334 172 -92 -326 -355 -200 85 302 356
4132 356 226 -11 -257 -355 -237 18 267 387 278 28 -230 -350 -281 -74 192 338 315 107 -179 -337 -321
4153 -321 -125 148 324 317 146 -120 -318 -351 -190 83 306 344 200 -52 -290 -357 -245 13 258 370 264 38
4175 38 -230 -339 -267 -51 209 361 313 112 -153 -335 -302 -118 169 328 332 146 -106 -313 -341 -173 92 304
4197 304 361 203 -51 -284 -343 -232 -5 239 330 245 21 -230 -353 -275 -65 207 332 266 64 -187 -346 -315
4219 -315 -112 150 340 328 135 -117 -318 -327 -153 93 307 351 219 -42 -265 -329 -216 39 272 358 246 8
4241 8 -217 -343 -252 -31 217 356 291 67 -184 -333 -292 -104 152 320 321 142 -128 -313 -330 -146 76 272 318
4264 318 185 -48 -266 -318 -208 34 242 337 225 -17 -241 -327 -240 -24 212 345 282 69 -189 -335 -291 -91
4286 -91 154 331 308 142 -109 -308 -310 -149 108 304 328 173 -64 -273 -330 -192 30 272 356 238 -1 -243
4308 -243 -328 -247 -28 213 335 274 72 -172 -321 -282 -78 148 311 288 109 -115 -298 -310 -135 103 296 307
4330 307 161 -78 -275 -319 -190 45 266 338 217 -3 -245 -333 -226 -26 208 316 257 44 -177 -317 -272 -66
4352 -66 175 322 291 113 -132 -301 -301 -124 126 317 325 166 -71 -277 -316 -185 58 255 324 214 -15 -233 -335
4375 -335 -248 -28 201 315 247 47 -193 -318 -271 -84 148 307 272 88 -153 -308 -287 -121 114 288 318 162
4397 162 -82 -285 -317 -186 63 255 313 191 -14 -237 -327 -215 0 215 306 231 22 -203 -309 -256 -51 187
4419 187 306 300 102 -146 -304 -305 -115 106 281 309 156 -72 -274 -300 -165 63 257 306 184 -28 -231 -304 -219
4442 -219 4 213 318 239 32 -204 -317 -239 -54 162 297 286 99 -139 -295 -289 -114 115 273 281 137 -73
4464 -73 -277 -311 -171 65 262 305 175 -47 -239 -312 -207 0 231 323 244 31 -209 -322 -256 -44 166 297
4486 297 270 113 -129 -294 -282 -93 137 277 286 131 -69 -251 -288 -161 74 269 313 172 -40 -224 -286 -211 -3
4509 -3 211 311 220 17 -193 -314 -243 -50 159 279 237 81 -137 -286 -271 -113 137 291 273 97 -108 -254
4531 -254 -278 -164 74 274 332 179 -50 -232 -291 -172 16 213 314 246 26 -192 -295 -217 -24 184 300 239
4553 239 52 -131 -270 -263 -100 127 302 273 93 -115 -273 -281 -166 57 240 312 179 -63 -246 -297 -185 -7
4575 -7 191 275 202 9 -198 -285 -216 -18 193 293 233 40 -156 -273 -253 -89 120 299 293 117 -113 -249 -256 -128
4599 -128 66 234 299 180 -48 -236 -293 -168 26 216 288 201 2 -209 -295 -223 -31 185 305 250 46 -167
4621 -167 -277 -248 -92 112 272 285 121 -99 -260 -252 -113 71 228 277 160 -46 -233 -269 -163 49 231 281
4643 281 189 -17 -219 -282 -221 -29 178 287 234 48 -168 -279 -235 -64 124 269 259 118 -107 -274 -259 -102
4665 -102 85 254 272 140 -68 -241 -287 -163 44 235 295 192 4 -194 -276 -208 -18 180 282 237 51 -162
4687 -162 -279 -227 -67 128 259 237 92 -100 -261 -246 -97 97 248 255 137 -78 -246 -282 -173 33 215 279
4709 279 186 -7 -216 -279 -208 -8 174 264 201 37 -163 -264 -227 -66 149 272 238 83 -139 -270 -252 -106 108
4732 108 260 275 143 -55 -236 -265 -151 46 214 282 198 -6 -190 -275 -201 -17 172 266 206 31 -163 -266 -214
4755 -214 -54 137 264 234 70 -128 -263 -252 -111 89 233 261 130 -76 -240 -270 -160 18 196 249 151 -27
4777 -27 -195 -250 -180 12 191 279 188 15 -175 -273 -209 -24 154 275 254 92 -104 -260 -252 -101 116 260 256 142
4801 142 -61 -199 -240 -131 48 217 252 154 -28 -204 -258 -170 -1 180 256 208 11 -199 -270 -226 -58 132 222
4824 222 213 61 -126 -263 -255 -104 79 230 237 111 -90 -227 -239 -119 57 217 263 153 -33 -216 -256 -160 31
4847 31 203 276 213 36 -156 -256 -205 -30 163 260 236 78 -104 -231 -231 -70 95 228 230 103 -99 -238 -245 -126
4871 -126 55 200 243 148 -37 -232 -278 -196 -6 153 236 169 11 -163 -258 -209 -36 138 230 196 54 -128 -246
4894 -246 -194 -59 125 237 247 112 -84 -240 -245 -109 93 223 260 156 -25 -207 -253 -167 17 191 256 177 20
4917 20 -141 -244 -203 -35 147 242 194 40 -145 -250 -225 -77 108 233 216 102 -85 -233 -250 -128 61 204
4939 204 240 130 -38 -182 -245 -164 24 190 229 164 2 -157 -223 -163 2 174 250 207 57 -122 -235 -198 -63
4962 -63 124 255 238 96 -86 -220 -233 -119 75 209 219 130 -42 -185 -234 -146 26 187 246 151 -13 -176 -238
4985 -238 -192 -26 163 257 206 41 -143 -236 -223 -77 108 231 226 101 -79 -214 -228 -112 79 223 223 114 -49
5008 -49 -193 -223 -131 38 192 257 172 -9 -159 -235 -179 -2 174 246 209 42 -133 -234 -190 -68 107 221 219 96
5032 96 -86 -211 -204 -88 91 212 237 105 -60 -197 -235 -142 28 190 248 174 9 -172 -230 -173 -17 150 234 203
5056 203 46 -109 -214 -178 -51 120 231 217 66 -89 -209 -210 -70 104 209 236 105 -58 -209 -243 -134 42
5078 42 195 247 152 -22 -180 -249 -183 -35 132 218 160 7 -141 -224 -186 -50 131 223 204 68 -116 -240 -216 -89
5102 -89 106 231 243 123 -44 -190 -227 -133 45 202 246 171 12 -139 -201 -148 -1 161 231 167 23 -154 -212 -181
5126 -181 -29 127 219 184 45 -117 -226 -214 -98 85 218 216 94 -62 -201 -237 -149 23 165 208 124 -34 -172
5149 -172 -202 -130 -1 161 243 171 10 -158 -223 -165 -5 138 251 219 87 -81 -212 -203 -77 91 210 225 114
5172 114 -55 -180 -206 -104 41 187 224 122 -55 -180 -221 -144 0 142 212 160 8 -180 -247 -185 -39 114 219
5195 219 190 63 -109 -220 -211 -83 81 192 203 98 -64 -191 -192 -101 71 194 230 144 -30 -186 -222 -133 39 184
5219 184 240 207 50 -129 -215 -175 -25 139 224 195 76 -78 -201 -197 -69 97 189 198 85 -79 -209 -208 -115 56 185
5244 185 215 116 -33 -193 -239 -143 20 153 208 157 32 -133 -222 -178 -38 131 207 169 41 -101 -201 -184 -52 111
5268 111 219 205 87 -82 -206 -197 -97 73 207 232 139 -9 -174 -235 -151 27 176 212 148 22 -121 -213 -165 -19
5292 -19 137 210 169 22 -119 -207 -198 -73 93 200 193 70 -81 -221 -229 -113 53 168 200 130 -22 -173 -213 -139 25
5317 25 168 209 138 0 -113 -195 -149 -9 152 231 171 32 -121 -204 -172 -36 117 230 216 85 -65 -178 -206 -87
5341 -87 78 189 194 113 -41 -171 -206 -132 22 161 202 128 -25 -148 -223 -158 -22 136 223 166 28 -130 -219 -194 -71
5366 -71 95 198 192 91 -70 -177 -185 -83 62 190 185 98 -50 -174 -189 -103 32 182 219 145 -23 -157 -224 -140 1
5391 1 145 215 173 34 -133 -208 -173 -58 89 188 180 59 -86 -181 -193 -95 60 175 186 82 -70 -178 -207 -125 31
5416 31 174 229 141 -12 -157 -199 -155 -8 155 220 174 38 -112 -186 -160 -38 103 186 170 52 -87 -188 -178 -62
5440 -62 69 186 201 88 -68 -176 -206 -118 32 175 201 134 -16 -156 -211 -141 -8 131 203 153 21 -118 -198 -161
5464 -161 -46 123 193 166 59 -96 -194 -194 -62 90 199 195 92 -46 -170 -198 -124 28 176 208 131 -11 -152 -191
5488 -191 -143 -4 129 193 141 5 -131 -183 -150 -26 119 185 162 37 -102 -191 -192 -76 76 195 192 77 -66 -166
5512 -166 -186 -106 35 170 207 117 -17 -147 -178 -124 10 148 207 150 19 -123 -195 -150 -7 134 211 182 67 -79
5536 -79 -185 -180 -74 73 196 197 85 -63 -153 -171 -87 35 157 194 113 -27 -148 -190 -100 6 135 208 142 3 -132
5561 -132 -201 -162 -25 114 200 165 41 -104 -190 -177 -65 59 183 184 70 -67 -177 -159 -80 48 163 183 115 -44
5585 -44 -162 -192 -119 38 155 220 153 8 -115 -182 -152 -6 117 205 165 54 -89 -169 -154 -51 84 165 178 78
5609 78 -61 -180 -176 -82 59 162 179 109 -46 -178 -194 -133 15 138 195 124 -11 -142 -198 -147 -27 109 184 159 31
5634 31 -105 -184 -151 -33 108 190 172 75 -68 -181 -165 -64 66 184 203 115 -15 -135 -180 -107 38 148 200 145
5658 145 8 -121 -174 -141 -23 110 181 151 38 -107 -175 -146 -50 91 176 156 64 -78 -184 -188 -94 69 165 177 95
5683 95 -45 -153 -181 -122 10 145 177 115 -1 -117 -169 -114 1 132 178 154 28 -92 -173 -155 -38 101 191 171
5707 171 77 -64 -164 -178 -72 63 176 176 92 -25 -137 -167 -100 27 137 196 118 -9 -138 -189 -122 2 120 185
5731 185 138 26 -115 -182 -152 -42 94 165 164 53 -76 -167 -157 -75 50 156 161 89 -32 -151 -165 -87 47 136 187
5756 187 104 -6 -139 -174 -113 5 125 195 150 26 -107 -176 -139 -27 104 175 159 58 -62 -162 -154 -72 80 167
5780 167 164 77 -47 -146 -174 -91 41 146 177 109 -11 -144 -185 -129 -3 108 173 126 13 -112 -165 -138 -40 91 165
5805 165 152 42 -80 -172 -152 -56 81 171 161 75 -53 -141 -163 -79 55 159 185 106 -11 -127 -168 -113 17 124 187
5830 187 138 24 -95 -162 -111 -2 118 163 133 55 -83 -176 -166 -52 78 167 158 72 -54 -153 -166 -100 26 149 172
5855 172 98 -25 -136 -166 -112 15 122 173 114 16 -106 -164 -115 -5 115 172 152 39 -72 -159 -141 -56 93 166 154
5880 154 59 -63 -148 -165 -86 31 147 170 102 -21 -133 -157 -109 12 132 179 118 4 -115 -172 -131 -6 111 181
5904 181 141 43 -85 -165 -144 -55 74 168 163 71 -56 -136 -143 -75 43 140 157 101 -31 -120 -159 -89 27 125 174 122 13
5931 13 -108 -163 -122 -8 115 184 135 27 -87 -146 -138 -45 59 148 148 69 -71 -156 -143 -60 46 152 155 98 -31 -136
5957 -136 -161 -96 31 135 166 116 8 -100 -146 -104 -7 105 180 145 32 -87 -156 -121 -34 72 148 154 65 -65 -150 -147
5983 -147 -59 51 141 157 87 -28 -123 -164 -92 21 137 162 116 -6 -117 -153 -102 -9 110 163 136 33 -102 -146 -125
6008 -125 -35 88 150 142 69 -44 -136 -151 -55 69 153 157 87 -27 -123 -150 -82 40 143 164 119 -10 -99 -148 -106 6 110
6035 110 156 126 35 -78 -148 -113 -17 87 139 146 55 -61 -139 -147 -55 55 134 152 73 -39 -126 -145 -81 21 120 159 91 -8
6063 -8 -117 -165 -110 2 123 153 112 18 -85 -147 -115 -32 84 169 145 62 -56 -128 -139 -60 54 155 168 85 -28 -115
6089 -115 -134 -74 42 133 151 101 2 -114 -152 -106 -6 109 154 112 10 -103 -150 -124 -40 75 144 113 38 -67 -148 -130
6115 -130 -63 49 140 143 71 -39 -119 -136 -70 19 128 157 97 -7 -107 -144 -91 16 116 161 127 22 -79 -133 -113 -16
6141 -16 99 151 142 47 -65 -139 -129 -52 75 137 138 74 -42 -124 -138 -77 26 120 143 90 -20 -118 -139 -115 -8 104 150
6168 150 111 5 -100 -152 -118 -28 84 141 119 41 -56 -129 -135 -60 66 136 137 72 -40 -105 -135 -78 39 138 163 101 -3
6195 -3 -115 -137 -92 24 106 152 95 16 -100 -143 -121 -5 92 143 119 30 -56 -130 -124 -46 48 145 136 58 -46 -122 -136 -63 37
6224 37 125 141 91 -12 -126 -135 -90 23 100 151 107 18 -73 -127 -107 -13 95 151 125 25 -64 -116 -134 -44 70 142 140 58
6252 58 -33 -122 -127 -50 41 144 151 92 -16 -107 -131 -87 23 121 157 97 4 -90 -124 -97 -9 89 157 120 28 -78 -135 -124 -49
6281 -49 62 131 132 55 -47 -120 -119 -72 45 119 140 71 -22 -102 -119 -83 27 107 156 97 6 -81 -130 -95 -15 92 158 121 26
6310 26 -79 -119 -112 -33 78 139 134 60 -56 -128 -126 -48 45 126 142 75 -22 -110 -126 -94 21 111 140 86 5 -73 -127 -97 -4 98
6340 98 138 127 18 -77 -118 -110 -25 74 125 130 53 -49 -117 -114 -47 50 126 141 69 -12 -107 -127 -72 13 110 140 89 -13 -100 -133
6370 -133 -94 -4 90 133 99 24 -75 -139 -116 -33 69 131 116 44 -52 -130 -124 -44 47 120 135 70 -18 -101 -124 -67 30 114 139 91
6400 91 -7 -93 -124 -92 4 94 125 103 13 -83 -131 -104 -30 70 126 114 29 -59 -114 -119 -58 46 115 119 60 -40 -112 -127 -77 30
6430 30 95 139 87 -8 -93 -127 -74 7 99 142 112 27 -72 -124 -95 -18 84 138 114 50 -48 -118 -116 -44 45 123 121 66 -22 -98 -123
6461 -123 -79 16 108 125 85 -13 -99 -132 -90 -11 82 130 100 4 -81 -136 -94 -35 48 124 113 44 -59 -129 -121 -38 50 116 126 61
6491 61 -29 -111 -115 -72 31 104 135 89 -12 -93 -119 -74 4 97 136 103 24 -78 -125 -98 -15 87 122 112 37 -64 -115 -114 -39
6520 -39 46 120 122 55 -31 -98 -117 -73 17 115 110 74 -19 -101 -131 -76 12 94 121 88 12 -88 -130 -81 -13 70 118 112 37 -56 -120
6551 -120 -111 -49 54 120 118 57 -25 -96 -101 -49 22 106 123 71 -14 -104 -125 -72 22 91 122 106 11 -77 -132 -95 -15 88 132 87
6581 87 40 -63 -118 -117 -49 47 110 127 43 -43 -105 -119 -56 26 88 117 65 -16 -90 -130 -81 16 91 116 83 5 -81 -130 -101 -17
6611 -17 83 115 101 26 -61 -114 -99 -32 61 121 121 52 -41 -103 -92 -34 37 104 125 73 -18 -92 -110 -69 12 102 127 92 14 -78
6641 -78 -106 -92 -6 70 127 108 28 -64 -116 -88 -26 49 115 119 52 -50 -109 -102 -56 43 102 116 69 -24 -86 -118 -66 15 92 130 92
6672 92 -10 -76 -102 -89 -3 74 116 100 22 -77 -118 -97 -22 56 106 115 50 -45 -111 -120 -31 42 113 125 80 -17 -89 -103 -74 24 101
6703 101 112 89 1 -76 -104 -87 -2 71 120 95 32 -63 -117 -91 -26 60 118 87 45 -40 -119 -112 -46 32 111 112 55 -20 -94 -98 -65
6734 -65 23 91 112 72 -3 -82 -118 -90 0 83 121 97 30 -59 -108 -88 -17 70 126 116 44 -34 -90 -86 -31 49 117 131 51 -29 -88
6765 -88 -109 -65 17 97 116 64 -11 -93 -112 -77 3 90 106 88 13 -70 -117 -96 -22 59 96 90 36 -49 -100 -101 -34 44 111 111 56 -30
6797 -30 -81 -95 -42 36 100 129 82 -6 -77 -101 -65 12 84 131 102 29 -58 -120 -86 -9 57 108 85 33 -49 -98 -96 -32 50 99 103
6828 103 52 -31 -90 -109 -63 33 103 120 66 -14 -94 -110 -85 3 71 92 88 6 -82 -113 -86 -1 51 108 85 33 -54 -99 -96 -35 53
6859 53 103 114 33 -41 -100 -104 -51 39 92 118 75 -20 -89 -120 -64 4 78 108 81 6 -74 -109 -93 -3 79 112 90 27 -59 -112 -93
6890 -93 -41 42 109 97 34 -49 -99 -97 -56 23 90 107 65 -17 -93 -107 -74 20 78 110 82 6 -78 -117 -104 -16 75 112 86 34 -41
6921 -41 -104 -86 -27 47 117 102 42 -36 -89 -89 -37 34 112 111 78 -14 -88 -103 -67 25 86 107 74 -5 -70 -118 -85 -10 65 115 91
6952 91 25 -58 -106 -98 -37 38 106 102 46 -50 -101 -103 -48 24 92 100 54 -26 -94 -109 -54 18 92 101 71 -1 -72 -110 -84 -6 58 114 86
6985 86 15 -63 -97 -83 -15 61 99 101 36 -41 -101 -100 -42 47 102 102 54 -5 -79 -100 -62 19 84 118 71 4 -62 -102 -75 -5 70 105
7017 105 78 11 -61 -87 -80 -20 51 94 92 44 -40 -104 -96 -61 40 83 100 64 -16 -81 -95 -58 9 96 108 61 -19 -88 -102 -55 7
7048 7 77 119 95 19 -66 -104 -72 -12 69 98 99 49 -52 -97 -104 -37 48 96 102 55 -26 -87 -95 -48 24 77 108 67 -7 -87 -104 -75
7080 -75 -8 63 95 77 10 -70 -108 -92 -30 63 98 78 35 -47 -97 -94 -44 33 92 94 46 -27 -94 -89 -59 31 83 104 71 -7 -71 -88
7112 -88 -57 13 78 109 89 21 -59 -97 -76 -13 58 99 88 21 -44 -94 -92 -31 39 86 109 45 -33 -91 -103 -62 19 72 98 71 -13
7143 -13 -74 -113 -69 0 71 97 73 3 -54 -98 -77 -23 58 98 80 20 -42 -94 -81 -29 43 100 91 52 -37 -94 -96 -49 20 92 113
7174 113 71 -5 -71 -93 -66 5 74 100 75 14 -72 -107 -76 -3 66 96 87 25 -49 -99 -94 -37 41 95 94 38 -32 -91 -94 -53 16 73
7206 73 103 67 -13 -65 -100 -53 21 63 101 78 0 -65 -96 -68 -11 66 97 84 32 -46 -93 -87 -21 60 109 100 49 -24 -73 -87 -42
7237 -42 32 79 104 54 -14 -64 -94 -59 11 73 93 72 14 -68 -93 -77 -4 57 97 78 19 -48 -87 -94 -36 38 92 93 50 -30 -92
7268 -92 -90 -39 28 75 100 48 -10 -75 -90 -55 19 79 94 52 -3 -73 -101 -72 -14 64 107 66 16 -46 -65 -74 -10 44 85 88 35 -28
7300 -28 -92 -86 -39 38 78 96 45 -28 -77 -96 -49 13 87 105 59 -3 -59 -89 -73 -16 58 105 76 10 -48 -88 -77 -38 57 87 86
7331 86 32 -46 -98 -92 -46 32 89 89 32 -22 -77 -83 -72 10 81 99 66 -12 -76 -87 -66 6 61 93 64 22 -58 -88 -70 -22 54 92
7363 92 86 23 -40 -90 -96 -45 25 76 97 52 -26 -76 -89 -62 20 64 100 52 -14 -66 -94 -69 -3 57 81 70 3 -58 -98 -73 -19
7394 -19 46 82 79 24 -45 -99 -100 -46 17 78 78 37 -23 -87 -93 -40 13 65 87 65 -14 -71 -86 -53 0 66 95 75 23 -56 -98 -70
7426 -70 -16 58 97 104 38 -37 -83 -88 -36 18 88 81 34 -30 -90 -100 -52 5 71 86 36 -11 -78 -96 -66 -8 64 96 68 -3 -57 -107
7458 -107 -79 -27 41 72 69 25 -54 -94 -90 -30 28 76 77 38 -29 -73 -89 -41 35 70 78 48 -11 -85 -83 -58 -4 62 95 69 -1 -60
7490 -60 -100 -67 -12 42 77 83 20 -40 -88 -84 -33 27 84 76 34 -38 -90 -93 -46 16 61 91 47 -16 -75 -104 -60 -5 56 94 62 8
7522 8 -62 -79 -68 -6 56 78 71 21 -49 -86 -86 -28 51 90 84 30 -36 -77 -98 -35 22 77 99 55 -11 -71 -93 -59 12 54 88 74
7554 74 10 -67 -97 -69 -11 44 96 61 10 -49 -99 -84 -37 43 70 79 26 -46 -78 -93 -47 7 72 77 51 -15 -67 -93 -47 15 52
7585 52 82 46 0 -51 -86 -77 2 56 79 64 13 -32 -87 -85 -29 42 91 98 37 -27 -85 -81 -36 14 72 84 40 -11 -72 -82 -48 10
7617 10 65 82 51 1 -57 -93 -70 -15 56 80 74 11 -35 -87 -76 -27 27 80 81 33 -31 -72 -72 -33 25 71 83 44 -14 -64 -96 -52
7649 -52 17 63 72 41 -18 -54 -96 -71 -23 56 94 75 9 -51 -81 -72 -22 45 81 75 23 -40 -83 -68 -29 40 76 89 40 -18 -70 -80
7681 -80 -54 -7 76 97 52 -4 -53 -82 -60 -13 48 96 65 9 -39 -81 -64 -8 33 74 69 27 -41 -77 -76 -38 24 74 71 28 -23 -73
7713 -73 -84 -59 3 65 88 57 -5 -57 -69 -55 -7 53 84 60 10 -47 -71 -81 -23 51 90 79 33 -25 -74 -94 -52 28 86 96
7743 96 51 -24 -66 -79 -46 -2 67 90 60 -4 -60 -75 -53 2 47 70 54 -1 -61 -96 -86 -18 48 80 71 20 -38 -89 -85 -36 22
7774 22 75 78 36 -26 -68 -82 -48 16 67 81 51 1 -56 -84 -44 8 65 81 64 5 -54 -80 -76 -14 45 77 68 21 -33 -86 -81 -39
7806 -39 20 75 82 46 -29 -65 -72 -39 17 50 79 46 -8 -67 -81 -59 -4 65 86 59 14 -60 -77 -71 -24 45 76 74 26 -45 -70 -71 -32
7839 -32 25 69 84 37 -17 -75 -75 -20 27 78 87 65 -11 -55 -74 -56 18 68 99 78 2 -39 -77 -74 -19 49 85 65 26 -44 -74 -60
7871 -60 -31 35 78 65 22 -34 -80 -80 -46 15 68 79 47 -16 -58 -87 -54 -6 50 82 58 10 -42 -68 -60 -15 38 74 69 26 -34 -71
7903 -71 -74 -23 24 79 80 42 -30 -76 -81 -49 16 72 82 45 -10 -67 -83 -49 -6 59 74 59 7 -60 -72 -52 -6 53 76 58 7 -48
7935 -48 -84 -80 -30 33 61 64 35 -28 -74 -72 -38 23 64 83 58 3 -61 -71 -48 10 72 76 58 6 -51 -77 -63 0 47 85 77 20 -44
7968 -44 -79 -74 -26 21 77 71 34 -26 -78 -75 -44 17 67 78 49 -9 -59 -75 -51 18 69 91 59 4 -49 -86 -65 -4 42 76 73 14
8000 14 -52 -83 -66 -23 33 70 75 37 -28 -68 -70 -28 30 74 69 36 -17 -51 -73 -50 7 58 77 52 -18 -52 -69 -75 -10 53 89 73
8032 73 7 -39 -81 -68 -27 41 75 67 17 -17 -88 -72 -39 22 83 65 31 -13 -56 -80 -50 13 76 90 45 0 -42 -69 -63 5 46
8063 46 69 71 14 -41 -66 -61 -7 37 63 60 23 -30 -69 -65 -10 34 71 79 24 -11 -64 -72 -34 15 60 83 52 -8 -55 -74 -49 2 52
8096 52 74 53 29 -40 -80 -58 -21 41 70 60 27 -36 -77 -68 -32 16 84 80 34 -17 -61 -73 -48 15 67 77 57 2 -49 -72 -53
8127 -53 9 62 83 57 10 -44 -68 -60 -15 49 66 69 24 -43 -71 -65 -32 27 68 77 44 -22 -64 -63 -44 12 53 66 51 -7 -57 -67 -50
8160 -50 0 52 78 65 -6 -57 -72 -61 -16 48 73 72 31 -40 -75 -69 -33 33 57 72 27 -17 -66 -78 -52 8 52 78 33 -13 -59
8191e9
$$ Imaginary data points
##PAGE= N=2
##DATA TABLE= (X++(I..I)), XYDATA
0 0 0 0 0 0 0 0 0 0 0 0 0 0 0 0 0 0 0 0 0 0 -1 8 -8 8 -8 8 -8 8 -9 15 -16 16 -17 21 -24 25 -29 33 -34 40 -42 48 -54
43 -54 58 -64 71 -79 88 -99 112 -126 143 -164 191 -225 272 -340 450 -651 1160 -5159 -5372 6402
63 6402 6912 4334 1995 1192 -4357 -9537 -8243 453 7095 7576 3703 -211 -4419 -7032 -5608 148
79 148 5302 7146 5953 2735 -3153 -8572 -8031 -530 6629 7800 5178 3278 552 -5175 -9455 -5652
95 -5652 3692 9206 6801 1699 -1174 -3162 -5937 -6139 -818 6143 8227 4215 -1820 -6089 -7334 -5288
111 -5288 -533 4396 6530 5177 1434 -3713 -8346 -8662 -2925 4582 7621 5214 1392 -1531 -4530
126 -4530 -7073 -5407 1316 7555 7606 2578 -2335 -4644 -5128 -3803 302 5527 7904 5346 -186 -5073
142 -5073 -6872 -4871 76 5160 7238 5569 1773 -2559 -6060 -6698 -2864 3485 7310 5796 1216
157 1216 -2652 -4704 -5452 -3907 792 5868 6779 2654 -2966 -6183 -6130 -3673 393 4703 6635 4495
173 4495 -488 -5195 -7105 -5361 -799 4203 6687 5262 1083 -3230 -5626 -5332 -2207 2673 6353
188 6353 6081 2032 -2744 -5320 -4932 -2185 1933 5614 6541 3624 -1516 -5475 -6027 -3332 1080 4999
204 4999 6448 4572 243 -4176 -6185 -4712 -665 3652 5801 4689 914 -3329 -5636 -4907 -1540
219 -1540 2654 5246 4805 1506 -2887 -5828 -5667 -2426 2089 5320 5518 2668 -1689 -5219 -6154 -3884
235 -3884 566 4630 5938 3935 -140 -3999 -5543 -4115 -392 3643 5634 4508 969 -3018 -5188
250 -5188 -4333 -782 3432 5789 5089 1872 -2212 -5038 -5164 -2310 2135 5505 5767 2910 -1264 -4528
266 -4528 -5404 -3530 265 3914 5223 3414 -453 -4038 -5345 -3862 -366 3216 4781 3539 168
281 168 -3521 -5525 -4641 -1160 2988 5338 4597 1341 -2503 -5011 -5035 -2429 1718 5044 5443 2842 -1119
298 -1119 -4071 -4615 -2658 880 4172 5283 3478 -216 -3591 -4719 -3154 370 3874 5360 3983
313 3983 462 -3269 -5179 -4375 -1241 2689 5120 4609 1482 -2385 -4853 -4840 -2457 1160 4024 4465
329 4465 2189 -1531 -4316 -4672 -2614 750 3687 4512 2728 -776 -3981 -4947 -3222 261 3651 5108
345 5108 3889 573 -3037 -4820 -3934 -887 2726 4927 4504 1770 -1827 -4174 -4008 -1533 1879 4308
361 4308 4430 2136 -1397 -4090 -4415 -2289 1189 4024 4646 2758 -759 -3993 -5100 -3551 -194 3147
377 3147 4629 3538 439 -2971 -4766 -4064 -1220 2181 4163 3734 1208 -2073 -4168 -3923 -1485 1849
393 1849 4173 4153 1873 -1477 -3978 -4257 -2176 1241 4061 4763 2977 -369 -3395 -4434 -3026 55
409 55 3179 4538 3466 527 -2621 -4212 -3385 -667 2411 4139 3567 925 -2342 -4331 -3932 -1427
425 -1427 1866 4086 4060 1760 -1619 -4191 -4520 -2505 814 3600 4362 2746 -415 -3316 -4328 -2982
441 -2982 -50 2848 4118 3136 382 -2671 -4117 -3155 -415 2510 4053 3509 1048 -2118 -4149 -3813
457 -3813 -1281 1983 4065 4002 1929 -1176 -3669 -4109 -2223 919 3478 4077 2506 -424 -3108 -3976
473 -3976 -2577 263 2902 3899 2824 128 -2821 -4244 -3226 -362 2615 4015 3295 932 -2082 -4181
489 -4181 -4022 -1543 1763 3858 3726 1708 -1187 -3495 -3975 -2263 786 3290 3801 2240 -551 -3054
505 -3054 -3893 -2517 352 2986 3902 2783 215 -2541 -3990 -3175 -398 2643 4071 3326 1041 -1710
521 -1710 -3605 -3588 -1436 1691 3757 3593 1548 -1174 -3181 -3548 -1945 902 3268 3648 1948 -815
537 -815 -3159 -3836 -2512 260 2931 3856 2601 -57 -2714 -4015 -3257 -710 2255 3820 3176 844
553 844 -1891 -3572 -3420 -1400 1484 3513 3448 1469 -1230 -3172 -3368 -1700 1041 3315 3763 2144 -623
570 -623 -2952 -3586 -2299 330 2898 3899 2829 257 -2413 -3652 -2865 -528 2071 3483 2982 851
586 851 -1793 -3463 -3221 -1124 1584 3247 3000 1118 -1403 -3320 -3538 -1812 999 3211 3528 1875
602 1875 -807 -3046 -3678 -2406 187 2616 3637 2716 277 -2362 -3605 -2716 -269 2189 3348 2794
618 2794 912 -1549 -3315 -3173 -945 1943 3528 3062 1195 -1147 -2982 -3405 -1915 902 3214 3556
634 3556 1935 -633 -2783 -3429 -2270 119 2344 3189 2371 257 -2194 -3555 -2764 -188 2359 3160
650 3160 2244 493 -1474 -3127 -3312 -1272 1927 3760 3030 805 -1328 -2677 -3086 -1991 645 3168
666 3168 3595 1842 -733 -2634 -3134 -2079 233 2498 3248 2139 43 -2058 -3300 -2815 -402 2515
682 2515 3598 2343 143 -1602 -2702 -3014 -1688 1326 3772 3467 824 -1660 -2616 -2504 -1659 219
698 219 2614 3571 2012 -840 -2806 -2953 -1676 362 2340 3103 2085 -65 -2125 -3143 -2639 -509
714 -509 2229 3628 2572 58 -1957 -2660 -2492 -1430 859 3226 3483 1141 -1818 -3065 -2442 -1082
730 -1082 500 2231 3161 2073 -621 -2914 -3240 -1729 600 2508 3094 2055 -28 -1993 -2957 -2539
746 -2539 -645 1978 3594 2818 278 -1960 -2633 -2138 -1030 760 2758 3338 1442 -1583 -3179 -2567
762 -2567 -858 821 2163 2762 1840 -494 -2736 -3266 -1877 422 2410 3040 1921 -240 -2125 -2802
778 -2802 -2211 -615 1593 3239 2849 435 -2144 -2960 -1971 -464 1019 2426 2990 1595 -1269 -3244
794 -3244 -2849 -780 1252 2411 2671 1776 -303 -2501 -3186 -1891 436 2365 2993 2019 -88 -2111 -2856
811 -2856 -2074 -361 1492 2746 2572 649 -1903 -3153 -2324 -387 1322 2297 2422 1312 -941 -2945
827 -2945 -3024 -1117 1231 2541 2499 1422 -372 -2218 -2909 -1847 367 2313 2914 1927 -100 -2020 -2759
844 -2759 -1910 -83 1745 2729 2349 594 -1677 -2986 -2425 -466 1555 2581 2365 1058 -960 -2685
860 -2685 -2929 -1358 986 2568 2614 1332 -567 -2217 -2778 -1814 235 2120 2752 1863 -85 -1989 -2770
877 -2770 -1992 -119 1755 2664 2182 518 -1489 -2744 -2425 -642 1455 2639 2390 946 -957 -2427
893 -2427 -2588 -1263 872 2472 2616 1326 -596 -2172 -2603 -1594 370 2132 2691 1765 -168 -1977
909 -1977 -2707 -1967 -136 1804 2723 2136 375 -1568 -2668 -2330 -703 1300 2592 2432 902 -1093 -2447
926 -2447 -2479 -1169 802 2333 2528 1332 -635 -2227 -2578 -1555 339 2043 2631 1744 -134 -1927 -2633
943 -2633 -1918 -153 1684 2595 2101 416 -1494 -2533 -2139 -579 1279 2456 2305 890 -1045 -2359
959 -2359 -2326 -979 949 2329 2450 1277 -621 -2181 -2512 -1446 438 2090 2591 1665 -167 -1903 -2617
976 -2617 -1891 -154 1635 2498 1969 318 -1550 -2559 -2180 -630 1225 2361 2182 760 -1118 -2411
992 -2411 -2387 -1046 841 2235 2428 1274 -578 -2108 -2435 -1438 392 2014 2530 1697 -45 -1703 -2379
1009 -2379 -1708 -35 1680 2500 1948 349 -1407 -2338 -1975 -479 1297 2369 2171 746 -1117 -2337
1025 -2337 -2285 -990 823 2147 2271 1132 -698 -2171 -2483 -1470 335 1882 2339 1474 -238 -1847
1041 -1847 -2464 -1764 -96 1621 2419 1860 261 -1471 -2376 -1974 -473 1294 2386 2214 838 -974 -2185
1058 -2185 -2131 -878 889 2180 2320 1235 -506 -1936 -2239 -1259 434 1915 2309 1466 -202 -1750 -2328
1075 -2328 -1644 -46 1580 2306 1720 173 -1511 -2371 -1965 -512 1177 2201 1984 624 -1121 -2242
1091 -2242 -2145 -896 821 2057 2153 1061 -657 -2023 -2246 -1217 507 1937 2308 1452 -184 -1701 -2285
1108 -2285 -1613 26 1682 2375 1792 265 -1348 -2186 -1851 -496 1192 2225 2017 661 -1050 -2116
1124 -2116 -2007 -804 803 1974 2079 1027 -667 -1990 -2242 -1224 453 1841 2159 1291 -263 -1673
1140 -1673 -2234 -1606 -68 1556 2260 1651 85 -1431 -2115 -1687 -419 1128 2149 1973 627 -1143 -2175
1157 -2175 -1918 -648 893 1971 2054 1037 -605 -1965 -2212 -1193 510 1873 2179 1309 -241 -1631
1173 -1631 -2123 -1497 -64 1489 2240 1685 120 -1464 -2119 -1613 -302 1118 1989 1890 666 -1069 -2182
1190 -2182 -1978 -645 937 1903 1891 935 -562 -1847 -2155 -1192 480 1821 2070 1172 -349 -1617 -2019
1207 -2019 -1358 25 1448 2111 1579 82 -1479 -2159 -1586 -159 1253 1998 1764 602 -983 -2092 -1980
1224 -1980 -686 1006 2027 1917 864 -598 -1749 -2005 -1135 431 1793 2100 1190 -348 -1627 -2018
1240 -2018 -1342 55 1428 2030 1501 96 -1400 -2138 -1660 -289 1200 1986 1664 491 -977 -1935 -1876
1257 -1876 -753 845 1922 1877 792 -697 -1738 -1845 -966 477 1738 2032 1162 -350 -1600 -1940 -1240
1274 -1240 198 1544 2098 1482 52 -1364 -1985 -1556 -289 1173 2028 1742 445 -1105 -1978 -1736 -638
1291 -638 767 1773 1825 823 -751 -1882 -1953 -950 502 1648 1898 1087 -359 -1608 -1987 -1292 75
1308 75 1433 2063 1484 42 -1366 -1890 -1379 -191 1071 1866 1745 600 -1003 -1948 -1624 -351 997
1325 997 1733 1676 821 -540 -1747 -1972 -950 670 1803 1855 937 -410 -1541 -1899 -1318 12 1373 1967
1343 1967 1416 -68 -1495 -2009 -1401 -144 1049 1687 1525 511 -992 -2030 -1839 -470 1083 1851 1561
1360 1561 632 -542 -1549 -1863 -1076 516 1874 2055 1007 -472 -1456 -1607 -1043 50 1265 1951 1538
1377 1538 84 -1434 -1949 -1238 76 1161 1614 1380 438 -892 -1904 -1820 -578 1039 1883 1552 435
1394 435 -790 -1568 -1685 -1030 317 1627 1966 1019 -571 -1713 -1745 -907 232 1193 1689 1398 177 -1363
1412 -1363 -2090 -1416 128 1380 1751 1286 366 -765 -1688 -1748 -663 958 1996 1717 489 -805 -1508
1429 -1508 -1502 -842 312 1477 1872 1087 -439 -1667 -1803 -890 358 1272 1569 1152 97 -1204 -1929 -1503
1447 -1503 -75 1342 1821 1242 117 -941 -1574 -1524 -639 745 1812 1748 530 -925 -1666 -1444 -609 461
1465 461 1377 1716 1063 -367 -1654 -1874 -949 441 1434 1636 1096 24 -1150 -1813 -1453 -144 1251 1853
1483 1853 1367 177 -996 -1577 -1390 -500 715 1635 1650 660 -779 -1695 -1556 -557 616 1410 1556 924
1501 924 -298 -1467 -1824 -1061 341 1433 1642 984 -99 -1143 -1656 -1322 -181 1117 1757 1316 121
1518 121 -1084 -1632 -1319 -354 801 1571 1516 591 -753 -1684 -1596 -600 669 1513 1593 849 -351 -1407 -1712
1537 -1712 -1023 281 1401 1716 1081 -112 -1188 -1604 -1178 -110 1054 1670 1315 209 -1033 -1673 -1371
1554 -1371 -313 852 1542 1409 518 -716 -1592 -1595 -665 590 1464 1508 753 -411 -1360 -1599 -951 274 1321
1573 1321 1625 998 -156 -1205 -1568 -1094 30 1160 1634 1235 153 -1006 -1603 -1319 -277 928 1620
1590 1620 1415 469 -735 -1532 -1516 -667 578 1453 1521 720 -471 -1422 -1579 -903 246 1254 1548 949 -190
1609 -190 -1252 -1607 -1116 -21 1087 1582 1218 146 -987 -1574 -1289 -307 857 1554 1403 464 -688 -1425
1627 -1425 -1377 -536 614 1430 1486 730 -429 -1320 -1465 -779 373 1306 1544 921 -206 -1228 -1580 -1067 34
1646 34 1109 1541 1139 75 -1036 -1592 -1297 -330 821 1478 1286 362 -773 -1502 -1415 -573 582 1400 1420
1665 1420 640 -509 -1367 -1475 -793 349 1300 1540 953 -160 -1166 -1483 -985 61 1089 1558 1167 148
1683 148 -915 -1439 -1158 -200 862 1462 1263 352 -759 -1437 -1306 -481 628 1375 1375 591 -561 -1395 -1480
1702 -1480 -772 323 1231 1442 858 -250 -1224 -1540 -1017 38 1042 1447 1055 52 -986 -1489 -1178 -199
1720 -199 873 1445 1241 356 -758 -1427 -1311 -474 647 1416 1398 650 -466 -1299 -1406 -739 327 1241 1452
1739 1452 866 -184 -1117 -1415 -924 83 1023 1409 1001 50 -982 -1448 -1106 -170 863 1405 1168 278
1757 278 -760 -1397 -1289 -484 604 1354 1343 549 -538 -1297 -1338 -710 307 1188 1387 808 -263 -1196 -1438
1776 -1438 -876 126 1044 1407 996 35 -984 -1466 -1135 -177 896 1458 1176 287 -725 -1336 -1236 -489
1794 -489 560 1339 1350 569 -520 -1245 -1247 -609 347 1144 1356 819 -240 -1158 -1401 -828 176 1071 1369 931
1814 931 22 -946 -1383 -1097 -194 832 1392 1128 195 -800 -1307 -1140 -422 516 1227 1282 518 -616 -1364 -1278
1834 -1278 -527 411 1121 1274 790 -243 -1174 -1433 -856 192 1073 1366 941 22 -894 -1324 -1036 -169 818
1853 818 1377 1177 261 -776 -1286 -1063 -292 566 1180 1234 574 -512 -1331 -1310 -527 470 1095 1207 710 -187
1873 -187 -1083 -1403 -887 149 1035 1279 842 -34 -901 -1291 -958 -125 793 1281 1061 227 -780 -1331 -1092
1892 -1092 -243 686 1194 1156 518 -477 -1262 -1316 -571 486 1190 1227 669 -224 -1021 -1322 -865 131 1016 1283
1912 1283 839 -55 -905 -1274 -941 -87 817 1246 1013 204 -753 -1293 -1113 -297 658 1216 1126 458 -477 -1171
1932 -1171 -1223 -566 418 1134 1196 620 -258 -1000 -1212 -737 190 990 1244 784 -88 -909 -1256 -910 -46 860
1952 860 1263 971 119 -782 -1264 -1070 -328 596 1198 1151 416 -561 -1208 -1162 -514 380 1036 1153 644 -263 -1054
1973 -1054 -1250 -700 238 1013 1215 784 -78 -872 -1213 -886 -41 830 1285 1036 178 -756 -1209 -962 -234 549
1993 549 1062 1087 496 -495 -1218 -1146 -380 495 993 980 530 -254 -1029 -1290 -753 276 1062 1168 664 -152 -889
2014 -889 -1217 -906 -69 794 1221 995 178 -762 -1230 -955 -140 635 1034 976 461 -415 -1168 -1216 -412 629
2034 629 1149 994 447 -227 -888 -1218 -811 186 1084 1257 686 -176 -862 -1111 -830 -105 697 1136 924 174
2054 174 -719 -1227 -948 -100 693 1000 829 322 -396 -1078 -1218 -484 600 1229 1051 374 -327 -860 -1080 -738
2074 -738 141 1019 1267 723 -168 -877 -1083 -718 29 742 1069 844 155 -684 -1208 -1018 -137 787 1131 815
2094 815 203 -434 -1008 -1177 -621 445 1225 1111 370 -391 -872 -1004 -696 59 880 1169 708 -171 -862 -1060
2114 -1060 -672 83 787 1077 765 81 -655 -1109 -968 -200 766 1233 918 170 -515 -908 -990 -545 352 1134
2134 1134 1169 420 -466 -941 -933 -533 148 834 1094 665 -209 -946 -1122 -695 82 815 1106 768 10 -717 -1112
2155 -1112 -967 -270 624 1179 958 209 -543 -943 -913 -456 308 995 1086 459 -415 -958 -933 -442 262 869 1051
2176 1051 664 -148 -887 -1089 -671 104 835 1120 808 59 -681 -1031 -850 -218 587 1088 943 214 -566 -968
2196 -968 -856 -319 379 934 1000 420 -452 -1024 -1020 -466 271 880 1032 629 -203 -928 -1139 -749 33 755 1057
2217 1057 770 62 -692 -1071 -830 -184 558 990 873 225 -552 -988 -865 -263 468 973 972 447 -369 -950
2237 -950 -987 -446 341 942 1060 649 -103 -804 -1037 -669 68 761 1017 724 46 -659 -991 -769 -113 591
2257 591 974 775 132 -627 -1051 -923 -303 452 957 922 363 -430 -1008 -1049 -558 226 855 1000 582 -155 -799
2278 -799 -1006 -655 56 744 1008 706 27 -632 -933 -708 -34 680 1042 867 232 -525 -961 -857 -243 505
2298 505 1002 972 436 -333 -892 -972 -492 232 810 927 506 -203 -820 -994 -628 57 690 919 591 -109 -770
2319 -770 -1055 -789 -104 625 985 782 134 -596 -1020 -925 -328 442 949 943 406 -324 -839 -896 -414 296 876
2340 876 972 549 -159 -736 -904 -523 163 800 1013 694 -14 -691 -997 -740 -89 618 989 819 199 -527
2360 -527 -960 -889 -328 373 837 821 308 -385 -873 -898 -431 260 776 857 427 -266 -852 -966 -558 150 778
2381 778 989 672 -18 -700 -987 -728 -72 610 973 815 226 -470 -877 -781 -216 458 901 835 339 -357 -839
2402 -839 -851 -361 346 877 923 472 -241 -829 -984 -605 96 718 948 663 -8 -678 -952 -718 -131 500 829
2423 829 692 142 -522 -897 -773 -199 450 849 743 253 -425 -898 -878 -377 341 877 930 485 -209 -787 -930
2444 -930 -558 111 705 920 661 37 -605 -908 -619 4 598 863 681 133 -512 -914 -781 -166 547 907
2464 907 776 230 -398 -874 -921 -463 278 835 893 453 -211 -750 -910 -567 82 637 806 539 -40 -632 -906
2485 -906 -640 16 643 853 588 55 -504 -871 -785 -183 567 995 803 238 -356 -769 -808 -396 283 846 917
2506 917 459 -202 -701 -812 -465 160 710 836 500 -97 -654 -904 -679 1 679 918 590 -12 -560 -865
2526 -865 -832 -334 408 908 779 183 -447 -795 -781 -413 182 723 827 402 -255 -729 -795 -417 212 730 868
2547 868 506 -93 -596 -811 -596 21 699 1005 711 50 -493 -737 -656 -231 411 890 849 237 -473 -781 -685
2568 -685 -274 262 698 771 333 -339 -834 -870 -465 157 688 832 452 -199 -730 -899 -665 -109 551 883 667
2589 667 31 -573 -805 -641 -186 357 786 774 265 -403 -769 -653 -164 396 787 808 399 -249 -720 -786 -380
2610 -380 240 770 891 548 -95 -636 -806 -563 -20 540 817 617 31 -579 -824 -623 -135 399 720 617
2630 617 112 -501 -866 -780 -283 332 752 752 297 -354 -795 -848 -471 155 675 841 533 -81 -628 -784 -490
2651 -490 41 579 818 609 68 -480 -744 -558 -40 537 860 707 168 -431 -768 -669 -242 342 787 817 365
2672 365 -283 -745 -789 -412 135 602 720 429 -129 -644 -814 -516 42 558 733 459 -110 -597 -802 -630
2692 -630 -122 477 849 711 107 -521 -803 -686 -258 283 728 806 395 -232 -706 -730 -325 224 660 754 435
2713 435 -106 -561 -714 -445 100 646 860 576 -63 -579 -731 -541 -104 408 799 766 186 -488 -804 -643
2733 -643 -194 250 591 673 325 -278 -742 -752 -319 227 618 673 324 -243 -671 -773 -470 64 577 828 588
2754 588 -49 -652 -821 -515 -47 393 712 723 283 -399 -810 -633 -82 394 661 622 322 -208 -666 -717 -277
2775 -277 303 724 746 400 -189 -664 -771 -449 59 545 764 579 17 -594 -825 -554 -38 376 584 529 174
2796 174 -397 -800 -687 -153 412 652 545 180 -327 -708 -735 -323 272 714 750 392 -179 -656 -742 -410 111
2817 111 557 735 553 65 -481 -755 -518 56 516 686 517 120 -364 -709 -653 -145 446 728 613 172
2837 172 -339 -710 -740 -355 205 623 697 360 -179 -641 -755 -462 71 501 631 418 -36 -495 -723 -515 3
2858 3 519 696 492 29 -422 -686 -585 -138 428 765 689 230 -302 -651 -654 -267 252 652 700 379 -146 -573
2880 -573 -683 -386 109 567 670 385 -92 -550 -722 -509 -5 479 708 510 15 -485 -758 -639 -186 335
2900 335 664 614 212 -294 -674 -667 -290 223 596 642 319 -171 -556 -638 -334 162 597 692 406 -83 -517 -677
2922 -677 -438 48 531 728 563 60 -434 -705 -587 -132 377 665 578 190 -300 -635 -625 -260 248 597 592
2943 592 249 -248 -626 -695 -352 135 574 674 382 -129 -581 -734 -498 3 483 694 520 69 -405 -661
2963 -661 -560 -129 358 636 562 165 -305 -603 -562 -185 294 634 620 263 -228 -603 -642 -321 174 590 684 418
2985 418 -81 -517 -677 -469 4 465 647 470 38 -415 -647 -518 -97 361 616 520 111 -382 -659 -608 -214
3006 -214 289 616 601 248 -245 -635 -676 -367 143 555 660 392 -87 -506 -644 -430 11 443 635 467 29
3027 29 -416 -621 -469 -40 404 644 538 141 -326 -630 -562 -174 315 636 621 269 -194 -581 -628 -326 149
3048 149 537 616 338 -102 -506 -624 -397 56 447 608 402 -52 -483 -681 -501 -62 395 623 498 97
3068 97 -370 -673 -617 -230 281 603 580 245 -204 -562 -598 -304 150 546 617 344 -124 -481 -564 -336 80 502
3090 502 654 448 0 -449 -616 -455 -44 401 645 530 127 -333 -604 -542 -193 265 562 535 206 -252 -550
3111 -550 -578 -289 146 511 568 270 -201 -566 -617 -370 54 470 625 446 -39 -491 -664 -463 -54 369 603
3132 603 508 141 -322 -582 -518 -144 288 580 559 210 -243 -537 -537 -241 190 551 623 323 -159 -558 -601 -336
3154 -336 85 426 602 444 17 -448 -641 -447 -30 368 535 431 97 -316 -589 -504 -134 296 567 514 154
3175 154 -287 -585 -541 -225 192 515 590 333 -149 -562 -634 -320 116 428 547 409 30 -414 -638 -462 2
3196 2 401 548 420 58 -332 -578 -499 -131 315 578 520 183 -281 -583 -543 -222 194 493 563 344 -100 -515
3218 -515 -616 -325 130 454 503 343 9 -361 -593 -451 3 443 569 373 10 -349 -554 -487 -140 294 560
3239 560 509 162 -292 -591 -570 -222 198 494 498 280 -124 -486 -607 -353 136 485 537 302 -55 -383 -564 -413
3261 -413 8 433 611 423 29 -347 -549 -459 -117 306 554 506 184 -234 -537 -537 -212 209 505 487 225 -131
3283 -131 -458 -547 -339 104 466 528 271 -107 -427 -539 -399 -22 388 575 402 15 -369 -553 -460 -103 293
3304 293 533 458 146 -245 -516 -502 -202 231 510 495 213 -165 -475 -521 -293 119 465 556 319 -84 -442 -559
3326 -559 -385 -7 380 531 393 38 -345 -549 -458 -121 280 508 429 115 -248 -505 -474 -190 216 490 492 214
3348 214 -172 -480 -533 -255 140 456 529 319 -57 -405 -548 -366 33 405 526 368 16 -325 -500 -420 -87
3369 -87 304 525 438 85 -287 -531 -475 -164 226 478 476 208 -187 -492 -556 -304 128 453 505 277 -76 -381
3391 -381 -518 -380 -13 390 541 351 -5 -340 -486 -390 -75 303 531 458 103 -273 -499 -453 -148 235 492
3412 492 473 224 -143 -450 -511 -270 136 453 501 257 -92 -387 -493 -348 2 384 518 340 -30 -379 -507
3433 -507 -390 -81 279 514 430 114 -279 -531 -481 -171 228 478 458 194 -161 -432 -475 -283 121 447 511 260
3455 260 -98 -387 -474 -321 15 368 542 384 -7 -360 -502 -358 -36 291 496 437 116 -250 -481 -448 -138
3476 -138 236 471 458 171 -187 -441 -446 -224 140 435 488 260 -130 -436 -499 -303 44 354 490 344 -20 -384
3498 -384 -538 -384 -49 289 472 389 74 -273 -504 -446 -154 210 462 444 157 -191 -437 -466 -223 139 437
3519 437 491 263 -87 -410 -469 -266 73 376 492 348 19 -319 -477 -358 -20 318 472 380 84 -269 -462
3540 -462 -394 -113 219 467 414 133 -226 -477 -479 -231 129 407 451 237 -128 -440 -499 -312 54 360 471 306
3562 306 -24 -361 -491 -363 -35 302 482 390 79 -263 -461 -393 -109 255 470 453 184 -177 -424 -428 -190 157
3584 157 434 453 246 -90 -384 -459 -267 63 363 457 287 -40 -345 -486 -352 -24 284 456 351 35 -307
3605 -307 -484 -410 -123 228 435 399 137 -205 -450 -445 -193 156 411 444 230 -103 -393 -450 -264 79 382 468
3627 468 302 -23 -343 -456 -311 -1 323 483 363 66 -272 -444 -389 -92 228 443 398 148 -194 -429 -429
3648 -429 -175 147 400 427 204 -129 -387 -454 -258 70 360 437 271 -40 -353 -450 -317 -16 317 451 353 27
3670 27 -271 -451 -369 -97 234 449 380 113 -217 -432 -420 -164 179 407 435 195 -141 -390 -445 -247 91 373
3692 373 458 286 -51 -353 -449 -299 -10 300 439 336 34 -283 -431 -370 -81 231 436 378 112 -208 -420
3713 -420 -408 -150 184 403 410 187 -125 -394 -421 -225 88 356 434 260 -59 -345 -435 -285 12 306 432 317
3735 317 26 -294 -443 -349 -64 268 422 370 119 -214 -424 -402 -149 178 389 403 182 -131 -388 -425 -225 95
3757 95 357 426 254 -54 -343 -427 -300 18 308 432 317 23 -276 -423 -331 -65 253 415 362 103 -206 -408
3779 -408 -380 -131 190 400 384 155 -135 -365 -401 -211 98 372 423 237 -83 -345 -417 -268 22 311 420 300
3801 300 5 -301 -445 -346 -64 240 403 334 82 -211 -428 -397 -155 177 393 376 132 -155 -376 -395 -228 94
3823 94 367 423 237 -93 -341 -410 -252 37 307 431 310 42 -260 -415 -302 -29 279 415 326 98 -187
3844 -187 -382 -348 -112 199 426 386 124 -177 -365 -374 -196 83 350 422 222 -108 -390 -430 -261 20 275 379
3866 379 273 3 -303 -434 -332 -55 253 402 317 56 -230 -379 -359 -118 185 414 410 160 -169 -366 -355 -160
3888 -160 106 334 420 265 -68 -338 -393 -218 61 313 391 281 10 -268 -407 -301 -36 261 407 298 19
3909 19 -265 -394 -338 -125 175 376 358 128 -204 -407 -385 -166 100 314 368 209 -100 -352 -414 -243 62 318
3931 318 394 238 -20 -272 -398 -296 -19 266 426 335 67 -244 -374 -324 -91 192 381 377 156 -150 -353 -363
3953 -363 -150 142 343 363 193 -75 -321 -401 -240 80 319 381 237 -39 -288 -385 -288 -32 261 387 297 43
3975 43 -240 -402 -317 -83 190 369 333 116 -172 -369 -367 -150 151 350 356 177 -110 -333 -385 -224 62 330 406
3998 406 248 -42 -294 -387 -284 -29 240 387 314 51 -231 -371 -304 -80 201 372 333 113 -168 -351 -348 -141
4020 -141 156 346 364 167 -114 -341 -377 -210 57 311 373 239 -27 -290 -380 -259 1 268 366 268 26 -242
4042 -242 -370 -298 -68 219 383 326 89 -182 -363 -335 -143 140 360 377 193 -109 -339 -376 -210 80 300 375
4064 375 229 -18 -271 -371 -266 16 272 379 265 9 -234 -370 -293 -72 216 368 322 97 -179 -369 -337
4085 -337 -130 141 334 336 170 -109 -324 -353 -196 95 312 353 199 -47 -283 -372 -243 4 267 381 265 6
4107 6 -244 -381 -295 -61 193 357 321 98 -192 -374 -337 -126 131 328 318 151 -110 -335 -366 -202 82 311
4129 311 340 183 -67 -284 -360 -231 10 260 363 253 13 -249 -354 -268 -38 238 358 317 97 -167 -342
4150 -342 -307 -99 164 349 329 152 -117 -316 -323 -160 87 310 354 187 -71 -297 -362 -224 12 261 347 235
4172 235 -22 -260 -382 -291 -54 203 343 285 64 -185 -343 -318 -107 158 329 299 142 -117 -316 -327 -161 104
4194 104 320 366 189 -60 -276 -346 -210 38 270 355 250 12 -227 -332 -261 -31 217 332 270 52 -202 -334
4216 -334 -297 -104 155 323 302 108 -162 -361 -346 -167 98 296 321 167 -80 -304 -354 -214 34 266 332 228
4238 228 -14 -245 -339 -260 -31 209 343 267 69 -193 -333 -292 -80 173 332 324 136 -123 -306 -323 -154 120
4260 120 315 333 186 -71 -280 -323 -186 46 261 330 210 -24 -249 -337 -230 -10 215 334 267 34 -207 -350
4282 -350 -298 -64 163 319 295 100 -144 -323 -317 -146 115 299 309 156 -88 -293 -333 -190 50 264 335 209
4304 209 -29 -262 -344 -247 -20 225 331 265 47 -194 -342 -290 -74 160 316 279 112 -132 -309 -302 -143 104
4326 104 300 305 157 -93 -284 -324 -179 70 271 324 195 -31 -256 -334 -243 -8 227 317 235 33 -199 -323 -266
4349 -266 -60 174 316 272 85 -159 -310 -300 -129 129 292 310 146 -101 -294 -324 -177 71 275 330 211 -13
4371 -13 -233 -328 -216 2 224 331 237 37 -199 -315 -247 -50 167 317 278 81 -157 -309 -286 -100 122 286
4393 286 304 137 -88 -289 -317 -171 71 261 306 173 -32 -250 -316 -213 9 231 310 227 14 -216 -317 -251
4415 -251 -30 194 308 266 85 -174 -325 -300 -106 125 294 297 135 -87 -284 -323 -169 74 265 308 177 -50
4437 -50 -228 -298 -206 6 229 321 223 14 -200 -309 -244 -35 196 307 261 91 -136 -292 -277 -91 147 302 280
4460 280 129 -87 -246 -290 -161 83 266 311 157 -59 -245 -297 -196 15 224 308 217 4 -222 -332 -263 -44
4482 -44 171 289 244 72 -151 -302 -290 -110 119 285 273 94 -104 -270 -277 -144 82 265 308 180 -56 -250
4504 -250 -304 -163 24 219 310 230 21 -201 -310 -232 -31 188 297 233 59 -152 -280 -260 -86 131 282 257
4526 257 75 -138 -292 -272 -138 69 244 294 169 -87 -263 -316 -181 26 217 295 208 16 -202 -302 -233 -29
4548 -29 190 302 235 45 -149 -276 -244 -87 135 293 296 98 -131 -279 -254 -116 65 251 294 177 -43 -255
4570 -255 -294 -177 31 215 267 194 5 -184 -280 -213 -29 193 295 227 23 -179 -285 -237 -76 124 271 286 112
4593 112 -127 -285 -273 -112 92 239 273 172 -42 -252 -312 -170 37 230 274 174 -14 -200 -283 -209 -15 185
4615 185 289 233 44 -191 -293 -235 -66 139 277 256 120 -106 -280 -273 -128 89 233 254 143 -54 -217 -276
4637 -276 -151 74 236 287 163 -25 -221 -291 -197 -1 201 289 241 32 -177 -286 -242 -54 145 258 246 100
4659 100 -121 -271 -274 -111 108 254 237 115 -87 -258 -287 -162 49 240 269 169 -28 -225 -295 -201 -5 186
4681 186 279 214 51 -161 -276 -233 -61 146 265 245 91 -109 -244 -230 -99 115 261 258 127 -74 -232 -258 -143
4704 -143 49 231 280 174 -29 -215 -297 -200 -1 186 263 202 23 -169 -275 -221 -55 141 254 219 60 -138
4726 -138 -276 -260 -95 95 251 258 122 -86 -251 -274 -163 44 223 269 171 -22 -200 -275 -186 0 185 271 207
4749 207 30 -166 -246 -199 -29 164 270 234 86 -126 -247 -230 -79 117 270 264 120 -62 -220 -251 -135 55
4771 55 223 266 158 -35 -200 -258 -172 1 171 260 184 -16 -191 -294 -216 -36 152 251 205 59 -140 -284 -263
4794 -263 -110 98 247 236 118 -79 -224 -249 -148 52 214 260 160 -40 -194 -242 -144 37 221 277 199 27
4816 27 -168 -265 -190 -24 180 273 228 76 -113 -239 -229 -89 108 229 229 93 -91 -228 -249 -127 60 195 231
4839 231 130 -63 -233 -273 -168 22 190 254 171 0 -179 -283 -209 -37 153 258 210 66 -111 -238 -209 -62
4861 -62 111 249 244 105 -83 -229 -217 -106 96 229 255 148 -33 -206 -254 -167 18 210 249 183 15 -166 -251
4884 -251 -198 -45 139 249 186 24 -143 -250 -213 -71 105 231 213 80 -114 -235 -248 -115 88 234 243 124
4906 124 -41 -194 -263 -165 27 206 265 157 8 -163 -239 -177 -25 153 253 190 36 -136 -251 -213 -59 123
4928 123 236 225 80 -98 -226 -244 -125 79 228 237 126 -52 -200 -245 -165 24 186 256 161 -13 -172 -227 -164
4951 -164 -12 171 260 187 30 -145 -248 -199 -56 132 258 234 83 -109 -231 -236 -109 75 220 244 126 -62
4973 -62 -194 -231 -131 28 182 236 160 -27 -195 -238 -172 -18 160 248 182 30 -165 -245 -214 -78 107 230 214 74
4997 74 -119 -229 -234 -110 64 211 213 103 -70 -212 -221 -130 43 196 241 153 -21 -189 -240 -157 8 179 255 193 37
5022 37 -148 -235 -207 -46 124 231 209 84 -98 -218 -211 -90 93 207 208 101 -74 -225 -227 -136 41 179 232 149
5046 149 -24 -203 -262 -183 -15 161 229 187 35 -142 -240 -195 -47 119 227 206 71 -99 -208 -196 -62 102 218
5069 218 221 107 -67 -205 -206 -98 65 221 252 150 -11 -171 -238 -164 1 168 231 176 15 -143 -224 -192 -45 121
5093 121 212 188 42 -140 -234 -222 -94 85 217 219 81 -73 -230 -248 -143 33 193 227 144 -28 -164 -226 -146 -6
5117 -6 154 229 178 24 -141 -208 -162 -13 156 246 211 72 -115 -223 -190 -55 105 242 245 108 -69 -213 -223 -126
5141 -126 43 184 223 132 -43 -187 -227 -148 8 144 192 135 -18 -186 -248 -183 -28 139 215 180 54 -118 -234
5164 -234 -217 -82 109 216 214 102 -60 -200 -210 -99 65 196 221 146 -21 -169 -204 -123 58 173 216 163 16
5187 16 -145 -234 -166 -3 163 219 201 58 -104 -224 -201 -83 82 218 180 72 -83 -199 -208 -103 48 174 183 103
5211 103 -62 -200 -245 -154 35 175 216 143 -7 -137 -239 -179 -28 148 225 188 53 -95 -206 -191 -66 95 214
5234 214 207 102 -79 -186 -196 -87 80 198 221 116 -35 -178 -213 -138 41 185 219 138 0 -122 -218 -193 -44
5257 -44 138 207 160 21 -109 -192 -189 -63 84 193 183 61 -117 -213 -218 -96 65 194 207 109 -51 -178 -238 -159 11
5282 11 174 218 149 -15 -147 -201 -165 -26 141 223 172 25 -131 -192 -174 -46 106 206 206 72 -94 -211 -220 -105
5306 -105 65 188 211 107 -45 -177 -207 -137 23 154 198 132 -31 -150 -205 -145 -27 125 195 166 5 -163 -229
5329 -229 -165 -40 105 212 190 67 -99 -205 -209 -87 70 196 204 111 -46 -171 -189 -117 24 157 219 139 -17 -161
5353 -161 -210 -132 -10 137 199 166 27 -146 -233 -190 -54 102 197 189 69 -98 -203 -202 -96 51 179 191 99 -60
5377 -60 -178 -190 -93 43 163 194 126 -15 -158 -198 -133 14 152 224 170 31 -119 -205 -168 -34 99 197 183 51
5401 51 -103 -208 -197 -85 74 165 180 75 -77 -192 -213 -115 41 166 185 111 -40 -174 -225 -150 7 144 206 155
5425 155 36 -125 -208 -173 -35 110 185 168 62 -86 -166 -162 -48 95 199 190 79 -57 -181 -187 -97 48 177 210
5449 210 119 -27 -153 -194 -134 3 147 196 146 5 -141 -205 -159 -31 111 189 147 33 -120 -214 -189 -71 88 182
5473 182 193 78 -89 -189 -205 -117 40 159 200 125 -22 -158 -184 -123 -9 129 190 147 9 -125 -197 -140 -13 135
5497 135 207 171 40 -120 -196 -173 -62 91 194 197 91 -80 -195 -190 -91 40 149 192 101 -42 -175 -199 -122 11
5521 11 128 168 115 -16 -160 -220 -157 -27 112 188 159 16 -125 -205 -176 -73 73 183 175 77 -79 -190 -194 -79 43
5546 43 159 185 110 -34 -164 -194 -105 38 142 187 124 8 -140 -189 -135 -12 133 208 166 47 -111 -195 -167 -53
5570 -53 75 166 166 87 -77 -193 -180 -84 39 161 162 80 -60 -179 -217 -137 24 144 192 118 -16 -152 -211 -162 -19
5595 -19 115 193 151 33 -111 -195 -179 -50 95 167 174 70 -77 -176 -179 -60 76 177 177 105 -35 -148 -175 -114 36
5620 36 163 189 121 -11 -142 -200 -146 -13 121 183 147 13 -120 -188 -156 -31 95 163 143 44 -88 -198 -191 -80 72
5645 72 175 182 85 -55 -167 -192 -112 18 149 189 117 -15 -122 -183 -130 -10 115 178 150 29 -103 -179 -153 -39 104
5670 104 177 158 64 -83 -170 -178 -81 65 171 180 85 -42 -148 -186 -107 25 155 177 116 -16 -139 -193 -123 0 125
5695 125 176 139 5 -125 -193 -152 -32 98 186 150 48 -89 -191 -186 -86 57 161 167 76 -64 -152 -183 -112 21 134
5720 134 188 112 -39 -152 -179 -121 5 118 173 137 4 -124 -190 -149 -29 103 188 161 50 -78 -167 -170 -71 76 173
5745 173 180 88 -52 -152 -154 -64 55 145 182 97 -20 -132 -183 -114 5 127 175 123 6 -121 -183 -156 -32 91 154
5770 154 154 44 -97 -169 -167 -73 63 149 141 63 -74 -171 -181 -92 41 147 173 97 -36 -135 -173 -125 7 127 178 136 11
5797 11 -115 -181 -137 -24 104 171 134 37 -70 -162 -147 -58 69 165 154 50 -68 -164 -166 -92 45 151 176 95 -41 -146
5823 -146 -177 -115 3 115 169 123 -3 -118 -166 -125 -24 106 170 134 33 -104 -163 -152 -54 82 172 154 65 -75 -147
5848 -147 -152 -74 36 153 177 98 -34 -141 -173 -116 10 123 159 102 3 -108 -167 -132 -11 102 169 142 41 -99 -161
5873 -161 -133 -46 89 171 168 67 -67 -152 -146 -74 48 149 165 90 -50 -138 -172 -98 26 128 156 94 -9 -131 -184 -145
5899 -145 -16 103 154 126 14 -106 -186 -137 -44 69 159 150 54 -68 -161 -160 -59 53 145 141 90 -21 -136 -156 -88 40
5925 40 135 163 111 9 -113 -157 -113 3 126 176 140 23 -95 -155 -133 -30 73 159 159 76 -71 -177 -159 -58 53
5950 53 146 159 85 -35 -159 -172 -97 26 121 153 92 -14 -121 -174 -134 -21 97 150 127 26 -100 -170 -128 -21 80
5975 80 143 131 55 -56 -149 -155 -42 66 143 151 90 -24 -125 -154 -93 31 138 166 104 -10 -107 -153 -102 3 110 168
6001 168 129 25 -101 -165 -136 -22 82 147 128 42 -65 -163 -153 -69 61 142 141 60 -55 -151 -172 -111 17 117 143 104
6027 104 -26 -126 -163 -105 -7 106 140 120 34 -94 -150 -133 -26 90 158 129 50 -63 -143 -142 -53 68 158 155 73 -33
6053 -33 -128 -138 -68 32 135 162 93 -16 -128 -151 -105 8 100 151 103 -4 -102 -158 -128 -25 84 148 118 21 -98 -156
6079 -156 -145 -73 52 126 143 61 -62 -142 -147 -86 10 129 156 96 -21 -114 -149 -99 8 110 164 115 15 -92 -146 -117
6105 -117 -12 99 155 133 38 -63 -135 -124 -44 61 135 140 54 -55 -132 -141 -70 27 127 143 86 -27 -132 -156 -99 1
6131 1 106 157 104 -1 -108 -160 -125 -18 85 145 124 37 -84 -143 -137 -63 61 155 136 61 -41 -125 -134 -67 44 126 154
6158 154 87 -23 -115 -148 -88 8 115 147 99 16 -87 -155 -113 -2 95 144 129 35 -71 -133 -130 -46 67 132 139 50 -56
6185 -56 -132 -134 -65 32 126 156 89 -25 -123 -145 -83 14 109 136 96 -3 -101 -149 -105 -16 83 142 121 11 -81 -127 -127 -55 59 134
6215 134 134 41 -69 -139 -142 -52 36 129 135 73 -21 -111 -141 -78 24 119 155 90 2 -98 -135 -103 -7 91 147 124 25 -79 -120
6244 -120 -119 -31 77 142 137 54 -54 -131 -123 -52 41 125 127 66 -28 -112 -153 -82 14 110 149 81 -20 -106 -136 -118 -31 80 150 116
6274 116 16 -98 -142 -126 -38 62 128 125 48 -55 -139 -131 -66 47 111 137 71 -30 -112 -130 -81 10 111 152 94 -7 -98
6301 -98 -132 -81 -1 91 134 109 25 -79 -130 -104 -27 72 142 117 45 -57 -136 -135 -62 50 126 116 55 -35 -125 -152 -83 12 95
6330 95 137 98 -9 -122 -144 -97 -11 80 135 100 16 -85 -137 -111 -30 73 122 124 47 -59 -118 -107 -50 52 130 134 79 -20
6358 -20 -110 -120 -55 30 115 143 100 -18 -97 -117 -75 7 99 137 99 14 -80 -143 -109 -31 66 121 105 38 -68 -127 -126 -63 34 122
6388 122 119 45 -52 -131 -139 -85 15 104 128 78 -4 -105 -140 -96 1 86 134 104 19 -72 -126 -99 -16 77 137 126 51 -52 -115
6417 -115 -104 -38 52 126 121 59 -39 -109 -118 -61 33 108 129 67 -28 -108 -127 -87 -6 87 122 90 -3 -83 -136 -105 -35 78 135 102
6447 102 33 -72 -133 -113 -40 44 121 126 65 -52 -116 -121 -63 28 111 135 83 -16 -99 -125 -78 7 86 129 114 18 -85 -121 -98
6476 -98 -8 80 133 106 27 -60 -120 -121 -40 51 119 115 43 -40 -122 -129 -62 29 102 110 73 -22 -101 -126 -82 8 93 121 89 7 -84 -134
6508 -134 -102 -24 83 118 94 24 -73 -128 -111 -37 54 115 111 48 -62 -123 -127 -67 14 106 123 72 -6 -100 -132 -80 23 95 125
6537 125 96 12 -63 -113 -89 -6 80 134 105 36 -70 -116 -89 -34 64 134 128 55 -42 -113 -119 -56 40 109 121 73 -30 -95 -127 -73
6567 -73 28 93 117 79 3 -74 -124 -113 -13 74 129 97 9 -80 -115 -107 -36 45 117 111 46 -43 -114 -107 -56 41 95 120 70 -18 -100
6598 -100 -131 -78 20 101 119 88 1 -71 -116 -83 4 86 131 93 27 -69 -112 -99 -16 51 124 116 27 -60 -117 -121 -37 36 112 113 50
6629 50 -33 -102 -122 -85 12 93 113 75 -8 -99 -125 -95 -22 63 124 84 11 -72 -129 -96 -29 64 106 102 36 -40 -124 -118 -49 38 103
6660 103 124 65 -20 -84 -104 -67 14 103 123 83 2 -78 -96 -84 9 76 110 91 25 -78 -114 -96 -19 66 112 97 41 -49 -114
6689 -114 -116 -58 30 101 109 35 -28 -110 -113 -75 9 81 98 70 -21 -93 -123 -89 2 78 118 99 15 -67 -111 -98 -8 80 117 97 38
6720 38 -44 -101 -95 -45 38 115 114 55 -31 -88 -101 -51 27 110 115 75 -21 -76 -112 -79 5 94 113 74 -4 -77 -129 -100 -30 70 109
6751 109 93 27 -62 -107 -115 -53 35 109 105 50 -35 -94 -109 -63 30 109 111 71 -3 -87 -119 -68 3 84 113 93 19 -55 -103 -94 -25 71
6783 71 109 112 37 -52 -101 -86 -35 53 114 99 43 -35 -103 -100 -51 29 97 110 56 -26 -88 -104 -68 5 74 100 77 -1 -90 -129 -85
6814 -85 -9 67 112 79 28 -53 -114 -98 -55 36 102 91 31 -55 -98 -110 -56 22 92 114 53 -29 -95 -110 -69 4 92 111 91 12
6844 12 -61 -97 -74 11 87 119 104 30 -56 -106 -89 -24 67 116 104 44 -59 -102 -98 -43 15 91 104 58 -24 -99 -120 -56 5 78
6874 78 106 69 -3 -85 -120 -101 -5 61 98 76 7 -77 -118 -106 -37 45 102 106 44 -57 -99 -102 -50 36 91 102 59 -13 -71 -101 -60
6905 -60 17 99 112 69 2 -71 -106 -75 -13 73 108 81 11 -71 -97 -86 -32 52 107 93 36 -50 -110 -103 -36 31 90 92 45 -21 -101
6936 -101 -122 -76 19 76 106 58 -17 -90 -107 -99 -20 72 119 86 17 -60 -108 -90 -31 55 102 100 49 -53 -106 -99 -37 39 82 100 49
6967 49 -24 -97 -107 -66 23 87 112 73 -15 -67 -101 -70 -14 76 90 84 20 -61 -102 -80 -11 47 103 92 17 -51 -120 -118 -45 31 91
6998 91 99 37 -57 -97 -108 -82 8 81 97 59 -26 -93 -107 -77 8 67 103 71 3 -61 -115 -81 -21 55 111 89 34 -50 -92 -104 -43
7029 -43 45 106 107 46 -18 -78 -91 -65 38 91 109 73 -14 -77 -111 -61 12 59 97 66 1 -66 -103 -84 -24 59 106 78 23 -65
7059 -65 -108 -102 -54 42 98 99 49 -48 -101 -109 -46 20 84 98 66 -20 -86 -111 -63 4 73 107 76 13 -63 -100 -90 -17 68 112 85 39
7091 39 -55 -101 -93 -36 37 102 104 41 -26 -80 -89 -48 25 83 102 49 -12 -76 -105 -68 16 67 92 65 -9 -72 -113 -84 -19 52 104 89
7123 89 16 -72 -102 -100 -37 41 92 81 18 -43 -99 -95 -48 24 80 93 53 -21 -75 -99 -75 11 70 98 80 13 -67 -91 -71 -19 56
7154 56 101 99 30 -53 -103 -83 -28 33 104 91 46 -33 -85 -99 -41 29 86 100 55 -28 -85 -107 -68 -18 64 93 67 -18 -83 -112 -83
7185 -83 -9 50 96 66 11 -65 -113 -89 -35 37 88 84 35 -51 -102 -104 -52 18 81 98 57 -9 -73 -91 -48 19 76 91 76 -4 -68
7216 -68 -101 -78 -3 63 105 74 19 -64 -86 -78 -38 53 98 92 35 -44 -88 -96 -42 33 78 75 45 -22 -88 -105 -70 5 58 88 49 -15
7248 -15 -85 -107 -81 -15 58 101 73 2 -69 -103 -76 -27 36 90 75 33 -38 -92 -88 -36 22 92 83 42 -25 -82 -91 -64 23 73 100 65
7280 65 -1 -71 -83 -58 3 60 100 99 11 -63 -82 -83 -21 28 86 86 32 -40 -99 -89 -40 32 78 86 28 -37 -95 -97 -71 5 66 94 46
7313 46 -32 -90 -100 -83 -1 54 80 66 -6 -62 -90 -78 -18 47 74 93 33 -30 -85 -70 -9 56 94 89 41 -32 -76 -85 -41 20 78
7344 78 105 65 -3 -70 -87 -55 1 58 83 74 1 -57 -98 -84 -15 43 82 69 14 -61 -96 -96 -60 21 73 75 31 -38 -97 -100 -63 22
7376 22 60 89 58 -14 -68 -98 -55 -4 64 84 69 10 -64 -93 -76 -16 56 98 83 22 -47 -79 -79 -30 38 82 92 32 -32 -77 -71
7407 -71 -45 16 74 85 59 -6 -71 -90 -49 1 69 98 69 -1 -70 -101 -76 -25 42 80 71 13 -58 -105 -101 -46 27 81 77 33 -39 -84
7439 -84 -94 -51 24 62 92 60 -19 -72 -97 -68 2 73 97 67 20 -59 -96 -79 -17 51 92 78 31 -46 -83 -68 -25 35 77 85 43
7470 43 -20 -72 -82 -42 42 84 81 50 -18 -81 -95 -53 15 68 91 73 -6 -69 -107 -71 -23 50 81 65 12 -56 -105 -88 -29 24 78
7501 78 78 24 -27 -82 -94 -50 19 79 84 42 -21 -77 -92 -73 10 69 92 64 5 -49 -78 -70 -12 49 97 75 27 -40 -88 -66 -24 47
7533 47 84 82 31 -37 -83 -80 -35 33 85 85 49 -25 -68 -90 -50 17 69 89 64 8 -66 -88 -94 -3 48 77 59 9 -59 -83 -76 -28 42
7566 42 79 75 30 -36 -84 -86 -40 30 70 90 50 -18 -64 -83 -52 11 79 96 60 5 -42 -70 -59 2 62 98 78 5 -52 -83 -58
7597 -58 -20 45 90 84 27 -31 -76 -76 -39 26 63 69 38 -20 -82 -84 -61 -1 66 85 36 -17 -80 -104 -82 -28 35 74 56 -2 -65 -90
7629 -90 -72 -30 27 74 81 22 -35 -80 -77 -33 25 80 87 51 -4 -56 -76 -40 35 88 112 58 -11 -52 -75 -52 6 64 92 72 16 -47
7661 -47 -71 -63 -29 36 67 71 26 -47 -75 -90 -48 19 72 59 22 -38 -79 -85 -70 -13 52 79 53 -16 -73 -94 -61 -11 51 82 69 23
7693 23 -54 -84 -66 -11 45 82 72 17 -33 -76 -60 -17 39 95 83 45 -20 -65 -67 -38 28 72 96 64 -6 -59 -86 -65 -12 57 67
7724 67 56 5 -64 -90 -71 -11 34 83 69 9 -57 -91 -91 -38 21 72 77 26 -38 -85 -90 -42 6 66 98 49 2 -60 -92 -60 -1 52
7756 52 77 57 6 -51 -76 -64 -16 56 89 75 24 -28 -84 -66 -21 42 86 95 38 -12 -72 -81 -37 7 58 81 47 -7 -66 -78 -42
7787 -42 17 62 83 58 -4 -63 -99 -74 -16 42 75 65 20 -36 -96 -84 -40 30 67 78 34 -29 -74 -87 -44 17 59 80 58 -17
7817 -17 -67 -81 -60 9 62 85 60 7 -58 -80 -60 -9 54 83 72 20 -39 -62 -69 -24 35 81 73 42 -17 -69 -71 -35 27 76 83 44
7849 44 -13 -70 -91 -58 6 48 79 43 -1 -56 -91 -76 -11 37 70 72 12 -59 -73 -76 -35 35 65 77 33 -35 -75 -79 -43 17 55 77
7881 77 46 -7 -69 -75 -51 -2 69 80 55 5 -53 -70 -42 -13 51 85 59 7 -41 -67 -66 -18 32 77 71 27 -36 -79 -86 -28 20 64
7913 64 68 40 -15 -76 -82 -64 -2 51 74 59 -4 -57 -93 -70 -21 50 74 56 0 -56 -90 -70 -27 28 76 72 30 -37 -79 -86 -44 24
7945 24 53 75 47 -11 -63 -69 -44 2 46 74 54 -6 -62 -64 -44 5 59 84 64 24 -41 -75 -64 -14 45 70 76 33 -24 -80 -88 -52
7977 -52 22 71 65 23 -33 -77 -87 -57 -3 46 72 42 -12 -64 -95 -75 -17 50 71 44 -1 -46 -95 -69 -27 36 73 72 31 -35 -65
8008 -65 -74 -32 12 72 84 30 -20 -65 -72 -46 0 61 89 53 -9 -54 -75 -43 4 45 81 56 1 -46 -86 -78 -8 45 66 58 12 -40
8040 -40 -79 -85 -40 15 69 61 26 -39 -84 -89 -45 2 56 70 24 -21 -68 -87 -71 -4 42 76 65 11 -54 -59 -63 -13 39 81 69 21 -25
8073 -25 -68 -54 -28 40 74 80 31 -25 -65 -90 -47 21 68 85 39 -7 -65 -84 -49 -10 57 70 58 -1 -54 -87 -63 -21 33 75 54
8104 54 13 -44 -86 -92 -43 24 61 57 21 -34 -72 -87 -53 2 72 78 50 -21 -69 -71 -67 -5 49 84 65 11 -46 -68 -54 -8 43 70 75
8137 75 24 -23 -63 -62 -18 30 76 82 32 -17 -68 -67 -48 11 59 92 39 -3 -55 -75 -52 -5 54 74 54 -11 -65 -80 -66 -21 36 80
8169 80 67 13 -44 -89 -73 -33 24 76 58 17 -25 -78 -79 -50 19 64 78 44 -12 -72 -81 -37
8191c7
##END NTUPLES=NMR FID
##END=
