##TITLE=1H_PR169_YKW
 D2O, 8 sc, 
 7.2.2020
##JCAMPDX= 6.0         $$ Bruker NMR JCAMP-DX V2.0
##DATA TYPE= NMR FID
##DATA CLASS= NTUPLES
##ORIGIN= UXNMR, Bruker Analytische Messtechnik GmbH
##OWNER= root
$$ XWIN-NMR		Version 3.5
$$ Fri Feb  7 14:08:03 2020 Russian Standard Time (UT+4h)  she@DPX200
##.OBSERVE FREQUENCY= 200.1315
##.OBSERVE NUCLEUS= ^1H
##.DELAY= (6, 6)
##.ACQUISITION MODE= SIMULTANEOUS
##.ACQUISITION SCHEME= undefined
##.AVERAGES= 8
##.DIGITISER RES= 18
##SPECTROMETER/DATA SYSTEM= spect
##.PULSE SEQUENCE= zg30
##.SOLVENT NAME= D2O
##.SHIFT REFERENCE= (INTERNAL, D2O, 0, 15.7039)
##AUDIT TRAIL= $$ (NUMBER, WHEN, WHO, WHERE, WHAT)
$$ ##TITLE= Audit trail, XWIN-NMR		Version 3.5
$$ ##JCAMPDX= 5.01
$$ ##ORIGIN= Bruker BioSpin GmbH
$$ ##OWNER= she
$$ F:/spectra/data/she/nmr/H-F/1/audita.txt
$$ ##AUDIT TRAIL=  $$ (NUMBER, WHEN, WHO, WHERE, WHAT)
(   1,<2020-02-07 14:06:03.32 +0400>,<she>,<DPX200>,
      <created by zg, POWCHK disabled, PULCHK disabled
       configuration hash MD5:
       00 E9 B6 7A A2 85 ED C7 34 08 36 98 17 FE 4E 26
       data hash MD5: 16K
       1B 2F 42 74 0E 92 D7 D0 56 3D 94 CA A7 68 F6 FF>)
$$ ##END=
$$ 
$$ hash MD5
$$ C9 BD 17 41 2F 4B 4F 25 41 47 65 18 BB 37 E7 05
##$RELAX= 
##$RELAX= 
##$RELAX= 
##$RELAX= 
##$RELAX= 
##$RELAX= 
$$ Bruker specific parameters
$$ --------------------------
##$DU= <F:/spectra>
##$EXPNO= 1
##$NAME= <H-F>
##$PROCNO= 1
##$TYPE= <nmr>
##$USER= <she>
##$AMP= (0..31)
100 100 100 100 100 100 100 100 100 100 100 100 100 100 100 100 100 100 
100 100 100 100 100 100 100 100 100 100 100 100 100 100 
##$AQSEQ= 0
##$AQ_mod= 1
##$AUNM= <au_zg>
##$AUTOPOS= <>
##$BF1= 200.13
##$BF2= 200.13
##$BF3= 200.13
##$BF4= 200.13
##$BF5= 200.13
##$BF6= 200.13
##$BF7= 200.13
##$BF8= 200.13
##$BYTORDA= 1
##$CFDGTYP= 0
##$CFRGTYP= 5
##$CHEMSTR= <none>
##$CNST= (0..31)
1 1 145 1 1 1 1 1 1 1 1 1 1 1 1 1 1 1 1 1 1 1 1 1 1 1 1 1 1 1 1 1 
##$CPDPRG= <>
##$CPDPRG1= <>
##$CPDPRG2= <>
##$CPDPRG3= <>
##$CPDPRG4= <mlev>
##$CPDPRG5= <mlev>
##$CPDPRG6= <mlev>
##$CPDPRG7= <mlev>
##$CPDPRG8= <mlev>
##$CPDPRGB= <>
##$CPDPRGT= <>
##$D= (0..31)
0 1.2 0 0 0 0 0 0 0 0.06 0 0.03 0 0 0 0 0.0002 0 0 0 0 0 0 0 0 0 0 0 0 
0 0 0 
##$DATE= 1581069962
##$DBL= (0..7)
120 120 120 120 120 120 120 120 
##$DBP= (0..7)
150 150 150 150 150 150 150 150 
##$DBP07= 0
##$DBPNAM0= <>
##$DBPNAM1= <>
##$DBPNAM2= <>
##$DBPNAM3= <>
##$DBPNAM4= <>
##$DBPNAM5= <>
##$DBPNAM6= <>
##$DBPNAM7= <>
##$DBPOAL= (0..7)
0.5 0.5 0.5 0.5 0.5 0.5 0.5 0.5 
##$DBPOFFS= (0..7)
0 0 0 0 0 0 0 0 
##$DE= 6
##$DECBNUC= <off>
##$DECIM= 24
##$DECNUC= <off>
##$DECSTAT= 4
##$DIGMOD= 1
##$DIGTYP= 9
##$DL= (0..7)
0 120 120 120 120 120 120 120 
##$DP= (0..7)
150 150 150 150 150 150 150 150 
##$DP07= 0
##$DPNAME0= <>
##$DPNAME1= <>
##$DPNAME2= <>
##$DPNAME3= <>
##$DPNAME4= <>
##$DPNAME5= <>
##$DPNAME6= <>
##$DPNAME7= <>
##$DPOAL= (0..7)
0.5 0.5 0.5 0.5 0.5 0.5 0.5 0.5 
##$DPOFFS= (0..7)
0 0 0 0 0 0 0 0 
##$DQDMODE= 0
##$DR= 18
##$DS= 0
##$DSLIST= <SSSSSSSSSSSSSSS>
##$DSPFIRM= 0
$$ [...]
##$SUBNAM2= <"">
##$SUBNAM3= <"">
##$SUBNAM4= <"">
##$SUBNAM5= <"">
##$SUBNAM6= <"">
##$SUBNAM7= <"">
##$SUBNAM8= <"">
##$SUBNAM9= <"">
##$SW= 24.9337058887773
##$SWIBOX= (0..15)
0 0 2 0 0 0 0 0 0 0 0 0 0 0 0 0 
##$SW_h= 4990.01996007984
##$TD= 16384
##$TD0= 1
##$TE= 0
##$TE2= 300
##$TE3= 300
##$TEG= 300
##$TL= (0..7)
0 120 120 120 120 120 120 120 
##$TP= (0..7)
150 150 150 150 150 150 150 150 
##$TP07= 0
##$TPNAME0= <>
##$TPNAME1= <>
##$TPNAME2= <>
##$TPNAME3= <>
##$TPNAME4= <>
##$TPNAME5= <>
##$TPNAME6= <>
##$TPNAME7= <>
##$TPOAL= (0..7)
0.5 0.5 0.5 0.5 0.5 0.5 0.5 0.5 
##$TPOFFS= (0..7)
0 0 0 0 0 0 0 0 
##$TUNHIN= 0
##$TUNHOUT= 0
##$TUNXOUT= 0
##$USERA1= <user>
##$USERA2= <user>
##$USERA3= <user>
##$USERA4= <user>
##$USERA5= <user>
##$V9= 5
##$VALIST= <valist>
##$VCLIST= <CCCCCCCCCCCCCCC>
##$VD= 0
##$VDLIST= <DDDDDDDDDDDDDDD>
##$VPLIST= <PPPPPPPPPPPPPPP>
##$VTLIST= <TTTTTTTTTTTTTTT>
##$WBST= 1024
##$WBSW= 4
##$XGAIN= (0..3)
0 0 0 0 
##$XL= 0
##$YL= 0
##$YMAX_a= 172910
##$YMIN_a= -140513
##$ZGOPTNS= <>
##$ZL1= 120
##$ZL2= 120
##$ZL3= 120
##$ZL4= 120
##$ABSF1= 10
##$ABSF2= 0
##$ABSG= 5
##$ABSL= 3
##$ALPHA= 0
##$AQORDER= 0
##$ASSFAC= 0
##$ASSFACI= 0
##$ASSFACX= 0
##$ASSWID= 0
##$AUNMP= <proc_1d>
##$AZFE= 0.1
##$AZFW= 0.1
##$BCFW= 1
##$BC_mod= 2
##$BYTORDP= 1
##$COROFFS= 0
##$CY= 11.3945322036743
##$DATMOD= 1
##$DC= 2
##$DFILT= <>
##$DTYPP= 0
##$F1P= 16.9975609425685
##$F2P= -3.02152046262296
##$FCOR= 0.5
##$FTSIZE= 0
##$FT_mod= 4
##$GAMMA= 1
##$GB= 0.15
##$INTBC= 1
##$INTSCL= 1
##$ISEN= 128
##$LB= 0.24
##$LEV0= 0
##$LPBIN= 0
##$MAXI= 10000
##$MC2= 0
##$MEAN= 0
##$ME_mod= 0
##$MI= 1.114404
##$NCOEF= 0
##$NC_proc= 0
##$NLEV= 6
##$NOISF1= 3.799351
##$NOISF2= 2.8
##$NSP= 1
##$NTH_PI= 0
##$NZP= 0
##$OFFSET= 15.70392
##$PC= 1
##$PHC0= -9794.737
##$PHC1= 21.60082
##$PH_mod= 1
##$PKNL= yes
##$PPARMOD= 0
##$PSCAL= 0
##$PSIGN= 0
##$REVERSE= no
##$SF= 200.130013532006
##$SI= 16384
##$SIGF1= 3
##$SIGF2= 2
##$SINO= 400
##$SIOLD= 16384
##$SREGLST= <1H.CDCl3>
##$SSB= 0
##$STSI= 0
##$STSR= 0
##$SW_p= 3612.71676300578
##$SYMM= 0
##$S_DEV= 0
##$TDeff= 0
##$TDoff= 0
##$TI= <>
##$TILT= no
##$TM1= 0
##$TM2= 0
##$TOPLEV= 0
##$USERP1= <user>
##$USERP2= <user>
##$USERP3= <user>
##$USERP4= <user>
##$USERP5= <user>
##$WDW= 1
##$XDIM= 8192
##$YMAX_p= 0
##$YMIN_p= 0
$$ End of Bruker specific parameters
$$ ---------------------------------
##NTUPLES= NMR FID
##VAR_NAME=  TIME,          FID/REAL,        FID/IMAG
##SYMBOL=    X,             R,               I
##VAR_TYPE=  INDEPENDENT,   DEPENDENT,       DEPENDENT
##VAR_FORM=  AFFN,          ASDF,            ASDF
##VAR_DIM=   8192,          8192,            8192
##UNITS=     SECONDS,       ARBITRARY UNITS, ARBITRARY UNITS
##FACTOR=    0.0002004,     1,               1
##FIRST=     0,             0,               0
##LAST=      1.6414764,     0,               0
##MIN=       0,             -140513,         0
##MAX=       1.6414764,     172910,          0
$$ Real data points
##PAGE= N=1
##DATA TABLE= (X++(R..R)), XYDATA
$$ [...]
3427f402J668L315M401K352L87k452m074m143j475J581L533M265K797l32k242
$$ -6402 -4734 -1419 2982 5334 5721 3269 -805 -4948 -6423 -4842 -1309 2956 5753 5421 3179
3442C179m130l331j792J297L948L981K499M5k624m086l545j512J496L855M063
$$ 3179 -951 -4282 -6074 -4777 -829 3152 5651 5696 3072 -1014 -4559 -6071 -4575 -720 3343
3457C343K489m68k349m401l228j601J539L743M127K254R5k660l730m025j102J632
$$ 3343 5832 5364 3015 -1386 -4614 -6215 -4676 -933 3194 5448 5543 2883 -847 -4872 -5974 -4342
3473d342L809L930K562k83k990m057l427j139J357L830M156K427n84k728m185
$$ -4342 -533 3397 5959 5676 2686 -1371 -4798 -5937 -4580 -750 3406 5833 5249 2521 -1664
3488a664l191j167K099L652L955K048k14k814m261l188j288K327L578L573K411
$$ -1664 -4855 -6022 -3923 -271 3684 5732 5518 2704 -1557 -4745 -6033 -3706 -128 3445 5856
3503E856p02k507m065l596j108J981M041L438K243k45k849m158l183r54K087L649
$$ 5856 5154 2647 -1418 -5014 -6122 -4141 -100 3338 5581 5336 2487 -1671 -4854 -5808 -3721 -72
3519g2L678K059o35k723m363l000p18J947L775L516K149l43k909m365l173n04
$$ -72 3606 5665 5030 2307 -2056 -5056 -5774 -3827 -52 3464 5613 5270 2361 -2004 -5177 -5681
3535e681J974L749L766J949o86k663m287l144r18K348L684L538K173o09l050l967
$$ -5681 -3707 42 3808 5757 5071 2408 -1879 -5023 -5941 -3593 91 3629 5802 5193 2143 -1824
3551a824l296m93K006L645L391K220n51l312l925k974n11K116L689L400J783j93
$$ -1824 -5120 -5613 -3607 38 3429 5649 5098 1786 -2139 -5113 -5624 -3508 181 3581 5364 5171
3567E171l186m119k894o56K277L865L429J647r05k987l906k735n51K305L749L179
$$ 5171 1985 -2134 -5028 -5684 -3407 458 3887 5534 4629 1642 -2264 -4999 -5550 -3245 504 3683
3583C683J877j085k790m053k649k76J826L726L829J337n85l282l981k773M0K004
$$ 3683 5560 4475 1685 -2368 -5017 -5293 -3467 259 4088 5425 4840 1558 -2423 -5196 -5156 -3152
3599c152L570L190K074j349k702m092l169M03K145M144K976J356p78l103l830
$$ -3152 418 3608 5682 4333 1631 -2461 -5630 -5227 -3082 1062 4038 5394 4616 1513 -2317
3614b317k853k34K425L761L105J203o42l245l861k401k30K495L438L352J550j314
$$ -2317 -5170 -5404 -2979 782 3887 5090 4448 1203 -2658 -5059 -5289 -2794 644 3996 5546 4232
3630D232l146l905k371J02K533L330L392J258j067l308l786k352k30K593L725
$$ 4232 1086 -2819 -5190 -5088 -2555 775 4167 5425 4358 1050 -2736 -5088 -5318 -2725 1000
3645A000L215J017j188k909l712k566j57K820L298L327J365j227l315l756k340
$$ 1000 4215 5232 4044 1135 -2577 -5143 -5300 -2480 818 4145 5510 4283 968 -2788 -5128
3660e128K99K369L376L519J188j741l085l558k281rK697L614K978J346j745l156
$$ -5128 -4829 -2460 916 4435 5623 3882 797 -2761 -5042 -5051 -2354 1260 4238 5584 3839 683
3676F83l554k515O27K469L463L091J206j591l176l954j863L01K412L777L145P46
$$ 683 -2871 -5386 -4759 -2290 1173 4264 5470 3879 703 -3251 -5114 -4813 -2401 1376 4521 5267
3692E267j511l404l395j916R8K404L975K795N88j249l374l380j807J9K943L480
$$ 5267 3756 352 -3043 -4959 -4861 -2457 1518 4313 4901 3652 278 -3102 -4909 -4890 -1947 1533
3708A533K686P57j296l179l580k058N36K634L754K748N21j516l426l271j874M22
$$ 1533 4219 4976 3680 501 -3079 -5137 -4601 -1967 1787 4535 5056 3540 114 -3157 -5031 -4609
3724d609K379L887K913N76j725l423l018j901L99K668L587K578O10j475l360l592
$$ -4609 -2230 1657 4570 5146 3421 -2 -3020 -4921 -4522 -1854 1733 4311 4921 3446 86 -3506
3740c506j610P64K394L778K398P09j814l140l083k014P06K725L632K450O59k122
$$ -3506 -5116 -4352 -1958 1820 4218 4927 3113 -27 -3110 -5124 -4418 -1693 1939 4389 5048 2926
3756B926k945l519j188K88K836L584K805N64k426l048l496j376P10K740L470L009
$$ 2926 -19 -3538 -4726 -4438 -1602 1982 4787 5351 2925 -123 -3619 -4995 -4285 -1545 1925 4934
3772D934K64k206l424k983j598Q04K870L233K665L55j839l283l149j512O04L015
$$ 4934 5198 2992 -432 -3415 -5013 -4209 -1339 1894 4559 4914 3075 -208 -3357 -4869 -4265 -1250
3788a250L620K261L03j715l340l473j177Q19K833L107K660j27j857l513k939j160
$$ -1250 2370 4631 4934 3219 -121 -3594 -4771 -3952 -1119 1988 4648 4521 2664 -849 -3788 -4948
3804d948P49K955L444K523N0j962l492l033j127J048K563L407K482K26j994l603
$$ -4948 -4199 -1244 2200 4723 4773 2811 -681 -3714 -4841 -3793 -1230 2177 4659 4885 2891 -712
3820g12l163j104J157K977L147K153J22j710l457l355j233J290K902L706J867
$$ -712 -3875 -4979 -3822 -845 2302 4455 4577 2867 -590 -3945 -5178 -3888 -986 2720 4587
3835D587j2k059l313k827j219J233K707L506K099k5k074l698k851q30J232K777
$$ 4587 4575 2516 -797 -3624 -4843 -3610 -903 2603 4702 4677 2603 -1095 -3946 -4776 -3544 -767
3851g67L059K014L71k093l761k790j083J878K725L051J690N5j644l874k927r61
$$ -767 2292 4306 4677 2584 -1177 -3967 -5050 -3172 -447 2604 4294 4349 2705 -1169 -4096 -5057
3867e057J678L074K913J841k21k000l502k682p35J251K694L571J651k36j993l374
$$ -5057 -3379 -305 2608 4449 4228 2228 -1274 -3956 -4691 -3440 -746 2825 4476 4240 2247 -1127
3883a127k850n21J518K769K752K200m78k217l528k579n03J807K369K909J731J26
$$ -1127 -3977 -4498 -2980 -211 2541 4741 4263 2046 -1482 -4061 -4564 -2757 -388 2521 4252 4378
3899D378k195l549k888n55J877K717L154J366l29j939l078k982p32J468L304K785
$$ 4378 2183 -1366 -4254 -4809 -2932 -215 2939 4305 3976 2037 -1041 -4023 -4755 -3287 17 2802
3915B802J740n37k307l047k570r21J727K933L136J611k89k442l482k495k13J711
$$ 2802 4542 4005 1698 -1349 -3919 -4840 -3113 -180 2956 4567 4278 1836 -1646 -4141 -4354 -2643
3931b643K665K810J614m85k243l078k698o49J842L186K813J019r6k307l316k505
$$ -2643 22 2832 4446 3961 1718 -1360 -4058 -4707 -2865 321 3134 4153 4057 1750 -1566 -4071
3947d071n94J849L002K927J080l22k152l394k271n35J619L304L012J034p99k068
$$ -4071 -4665 -2816 186 3113 4193 3871 1719 -1675 -3946 -4481 -2862 442 3454 4488 3689 1621
3963A621l534k259l60K065K441K746J868r93j903l527k404j95K072K552K891J124
$$ 1621 -1913 -4172 -4532 -2467 -26 2720 4588 3595 1692 -1835 -4239 -4434 -2362 190 3081 4205
3979D205n73k215l164k478n65J945L236K968R34p96k415k858k320k49J559L116
$$ 4205 3632 1417 -1747 -4225 -4790 -2845 391 3359 4293 3497 1082 -1776 -4096 -4345 -2786 330
3995C30K792J282n62k913l097k177J14J916K757K705J409p97k745l018j928l29
$$ 330 3122 4404 3842 929 -2168 -4345 -4231 -2315 442 3147 4556 3759 1014 -2004 -3932 -4261
4011d261K026K831K506J340r45k727k802k018KJ822K894K869O59q42k346l095
$$ -4261 -2235 596 3102 4442 3497 770 -2032 -4050 -4048 -2226 668 3537 4196 3354 1008 -2087
4027b087k346N31J739K969K499J069r18k580l330j695Q7J920K856K472J191q38
$$ -2087 -4433 -3902 -2163 806 3305 4374 3456 876 -2454 -4149 -4062 -2142 714 3186 4377 3539
4043C539k990k821j665k37K031K850K516J050j097k496l148j836L48J964L168
$$ 3539 549 -2272 -3937 -4174 -2143 707 3223 4273 3176 680 -2468 -4304 -3956 -1992 1176
4058A176K149R94j148k495l055j859J91J928L162K252O66m73k934l033j661L48
$$ 1176 3325 4319 3171 676 -2379 -4238 -4047 -2119 1043 3295 3961 3488 554 -2479 -4140 -3792
4074c792J689L129K469N60j305k324k940j690J80K534K894K221M58j113k861k457
$$ -3792 -2103 1026 3495 4055 2750 426 -2514 -4204 -4024 -1490 1404 3625 4083 2970 109 -2348
4090b348j773K70K279K674K723M36j325k570k984j659M41K102K815K587M35j148
$$ -2348 -4121 -3851 -1572 1102 3825 4261 2936 366 -2618 -4277 -3836 -1734 1081 3668 4103 2955
4106B955k842k808j178M91J984K740K329P01j637k745k985j529P95K069L001K194
$$ 2955 113 -2695 -3873 -3382 -1398 1342 3671 4372 2735 -10 -2995 -4524 -3729 -1660 1341 3535
4122C535M01j318k770k558j545N70K342K839K064N07j383k639k686j258K84K153
$$ 3535 3936 2618 -152 -2710 -4255 -3685 -1343 1496 3560 4067 2684 45 -2641 -3899 -3615 -1462
4138a462K633K491L62j169l023k506j676R86K393K666K009L43j492k675k693j130
$$ -1462 1171 3662 4024 2855 -168 -2674 -4350 -3364 -971 1695 3704 4047 2555 -120 -2813 -3943
4154c943O78J920L112J878N67j685k788k598j175Q12K130K909J783J24j348k843
$$ -3943 -3265 -1345 1767 3645 4212 2527 -261 -2859 -4034 -3222 -1092 1817 3600 3724 2376 -467
4170d67k213j526R03K380K620J717L87j174k976k689j027R39J948K828K210n0
$$ -467 -2680 -4206 -3303 -923 1697 3414 3801 2627 -349 -3038 -4065 -3126 -1178 1650 3860 3810
4186C810j531k566k890o48N91K126K875J935J45j871k682k212j030Q30K200K644
$$ 3810 2279 -287 -3177 -3825 -3234 -1108 1767 3702 3847 1976 -706 -2918 -3948 -3118 -918 1726
4202A726K152R9j897k913k073j335J205K208K718J835k38j575k715k245q42N92
$$ 1726 3878 3977 2080 -833 -2906 -4241 -3036 -828 1890 3725 3487 1912 -803 -3048 -3890 -3298
4218c298K335L253J414P7k144k522j833j142J136J809L068J532q6j636k882k172
$$ -3298 -963 2290 3704 3781 1637 -885 -2718 -3860 -2724 -915 2153 3685 3599 1963 -919 -3091
4234c091j033J515J976K709J841j78k163k736k143p14J411K265K259J783j77j486
$$ -3091 -4124 -2609 -633 2076 3917 3739 1576 -1160 -3303 -4017 -2606 -341 1918 3701 3524 2038
4250B038l118j969q83J090K565K392J479l06j839k220k407n14J018K487K919J249
$$ 2038 -1080 -3049 -3932 -2842 -277 2115 3594 3288 1449 -771 -3178 -3692 -2674 -187 2732 3981
4266C981o86j835k419k252n19J223K184K943J335m53k041k852j819n44J251K221
$$ 3981 3295 1460 -959 -3211 -3730 -2507 -323 2620 3955 3502 1461 -1391 -3210 -3754 -2503 -282
4282b82K300J635k30j763k814k153k09J035K502K357J158l62j593k868k009k63
$$ -282 2018 3653 3423 1660 -1154 -3307 -3516 -2481 21 2378 3536 3174 1581 -1287 -3296 -3559
4298c559R00K413K748J196m60k038k454j703n55Q87K647K429J393m61k446k151
$$ -3559 -2659 -246 2502 3698 3238 1200 -1254 -2957 -3512 -2625 22 2451 3844 3383 937 -1214
4314a214j961l56J320K229K422J300l70j801l071j769l91J238K607K229J221m37
$$ -1214 -3175 -3531 -2211 18 2440 3740 3370 1569 -1502 -3271 -3662 -2424 183 2412 3633 3196
4330C196k190k585j671m75J589K237K284J352o98j968k586j849j09J304K393K451
$$ 3196 1006 -1579 -3250 -3725 -2136 101 2385 3737 3039 1071 -1515 -3364 -3473 -2169 224 2675
4346B675J062q05k120k659j306k94J481K242K216J335p26k265k432j600k19J457
$$ 2675 3737 2932 812 -1847 -3153 -3447 -1966 276 2492 3827 3101 836 -1596 -3196 -3415 -1958
4362a958K367K114J046o37k063k555j716q0J530K180K426J121q03k056k617j402
$$ -1958 409 2523 3569 2932 869 -1686 -3402 -3482 -1952 228 2654 3775 2972 916 -1701 -3103
4378c103m38J614K593J988R54r00k092k434j346l09J466K620K291R25j205k170
$$ -3103 -3541 -1927 666 2654 3608 2708 616 -1818 -3164 -3473 -2007 613 2904 3829 2624 454
4394D54k221j422K5J397K154K315Q43p19k480k492j280j5J606K681J717R75o17
$$ 454 -1767 -3189 -3164 -1767 387 2702 3545 2826 346 -2146 -3426 -3441 -1835 846 2563 3538 2921
4411B921k128k609j759L20J501K305K483M49p61k300k422j283m1J980J964J958
$$ 2921 793 -1816 -3575 -3255 -1754 551 3034 3483 2722 422 -2000 -3283 -3324 -1344 620 2578
4427B578Q30q69k476k158j358L3J599K527K214O99j392k184k058j334q2K165J877
$$ 2578 3408 2539 63 -2095 -3453 -3420 -1821 706 2920 3619 2227 43 -2015 -3349 -3431 -1266 611
4444F11K191P65j213k296k070j437j47J983K285K140P64j124k204k531r27L11
$$ 611 2802 3567 2354 58 -2012 -3449 -3596 -1613 672 2812 3576 2452 248 -2283 -3210 -2899
4460b899J704J961K113O07j235j972k322j430N33J698K196K331J27q39k674k474
$$ -2899 -1195 766 2879 3486 2251 279 -2043 -3473 -2940 -1242 954 3285 3412 2573 -101 -2575
4476b575p56M87J720K189K012O05j297k306k412j278N71J918K241J578N57j038
$$ -2575 -3331 -2844 -1124 1065 3077 3682 2385 79 -2333 -3611 -3040 -1122 1119 2697 3254 2216
4492B216k248k100j219M62J704K321J955K09j125k432k169q14M28J795K361J691
$$ 2216 -32 -2132 -3351 -2889 -1185 1136 3091 3300 2175 -257 -2426 -3240 -2812 -1017 1344 3035
4508C035M08j464k218k055j107L01K022K427J669L24j168k554k157r85P67K018
$$ 3035 3443 1979 -239 -2294 -3401 -3100 -1078 1349 3018 3342 2174 -380 -2537 -3522 -2755 -737
4524g37K151J583J63r81k473k077j092R30J647K449J695j47j399j981k141r67
$$ -737 1414 2997 3160 2179 -294 -2371 -3463 -2533 -886 1563 3258 3111 1712 -269 -2410 -3377
4540c377O70J988J997K020k53j236j950k290j034N35K111K337J447L31j498k503
$$ -3377 -2707 -719 1278 3298 3045 1809 -141 -2431 -3465 -2930 -819 1518 2965 3296 1798 -705
4556g05j670r63P45J760K519J588k75j278k355j773n81M21J974K120J609k31j429
$$ -705 -2375 -3338 -2593 -833 1686 3274 2999 1721 -634 -2407 -2988 -2567 -593 1527 3136 2905 1476
4573A476k137k106n30J069J904K099J364r0j498k212j907n98L11K297K482J056
$$ 1476 -661 -2767 -3297 -2228 -324 1775 3139 3049 1551 -661 -2568 -3166 -2855 -558 1924 2980
4589B980K12j795k405j125j291J200J563K555J335m58j155k497j588p21O80K085
$$ 2980 3192 1397 -1008 -2133 -3424 -2224 -661 1894 3229 2771 1616 -881 -2469 -3190 -2510 -425
4605d25K317J278nj509k280k429l50R30K162K555R31o6j701k118k108p15J193
$$ -425 1892 3170 3165 1656 -624 -3053 -3403 -2473 -311 2244 3175 3109 1408 -710 -2818 -3533 -2340
4622b340K099K284R53J25j743k247j856n17P12K482K076J120j35j880k183j268
$$ -2340 -241 2043 2996 3121 1378 -869 -2725 -3242 -2530 -48 2028 3148 3013 1133 -1050 -2318
4638b318q29Q94J931K278J358m84j722k059k046k32J182K083J922J032p2j873
$$ -2318 -3147 -2253 -322 1956 3314 2830 1108 -951 -2997 -3229 -2047 36 1958 2990 2918 1045
4654A045j955j978l62R59K369K019J210p10j292k219j793m57R63K325J970J042
$$ 1045 -910 -2888 -3250 -2291 78 2097 3307 2597 1305 -914 -2707 -3164 -2201 124 2094 3136
4670C136o30j602k000j477j86J048J570J969J308k69j785k203j643j38J260J795
$$ 3136 2506 904 -1096 -2573 -2759 -1711 -141 1828 3136 2867 1082 -1121 -2764 -2902 -1642 153
4686A53K206M39j28j811k192j527j22Q70K391K258N08p08j668j864j701l45J556
$$ 153 2359 2798 2670 859 -1333 -2860 -2982 -2112 279 2537 3045 2337 669 -1195 -2896 -3241 -1685
4703a685J814K165J068q14j834j919j537K12P02K150J733J260p82j998j881j615
$$ -1685 129 2294 3362 2548 714 -1205 -2742 -2530 -1828 322 2055 3315 2533 535 -1346 -2961
4719b961k2R93K312J741J009o36j923k037j334j60J457K056J883O13o94j988k104
$$ -2961 -2983 -1990 322 2063 3072 2436 513 -1524 -2858 -3018 -1561 495 2378 2991 2297 309 -1795
4736a795j070K1Q11K517J973R00j167j583k032j365j09J178K056K054O17p08k062
$$ -1795 -2865 -2844 -2033 484 2457 3357 2190 607 -1425 -2790 -2899 -1721 335 2389 3006 2298 236
4753B36j930j414oJ707J918J927O50o45k092j927j223l21J595K623J165Q44r71
$$ 236 -1694 -3108 -3114 -1407 511 2438 3088 2443 351 -1576 -2799 -3120 -1525 1098 2263 3107 2136
4770B136k013j903j110J59J414J877J934O51r67j847k060j072mJ317J858K215
$$ 2136 123 -1780 -2890 -2731 -1317 560 2494 3145 2178 331 -1729 -2801 -2805 -1488 370 2585
4786B585O22r75j862k048j325M52J273K055J909L79p04k226j776j158K18J625
$$ 2585 3207 2232 370 -1678 -3003 -2551 -1278 777 2686 3065 2361 135 -1641 -2799 -2581 -956
4802i56J897J590L82p63k097j958r46M68J144K130J755L74r85k105j631j192M55
$$ -956 941 2531 2913 2150 53 -1905 -2851 -2383 -1239 891 2646 3020 2035 -70 -1701 -2893 -2438
4819b438J249K198J263O78j167j583k096r67K01J552K270J350L40q35k170j784
$$ -2438 -1189 1009 2272 2950 1783 200 -1896 -2863 -2662 -1110 1160 2510 2850 2015 -155 -1939
4835a939r25PJ871K155J406L57j239j731j890r06K99J734J981J600j40q55j943
$$ -1939 -2864 -2857 -986 1169 2575 2932 1693 -38 -1928 -2834 -2535 -801 1180 2780 2640 1785 -158
4852a58j925p38N98J388J907J569M26j452j895j522j091Q05J156K089J679K18
$$ -158 -2083 -2821 -2223 -835 1072 2641 3067 1615 -280 -1802 -2893 -2088 -932 1157 2836 3054
4868C054j479j795j713q21K57J923J699J706p6j264j750j988n35M64J414K166
$$ 3054 1575 -220 -1933 -2754 -2497 -574 1125 2831 2755 1491 -259 -2247 -2782 -2318 -904 1262
4884A262J505nj058k037j538r23M71J597J819J813j61j266j830j773l97M6J613
$$ 1262 2767 2762 1704 -333 -1871 -2794 -2323 -726 1093 2906 2745 1479 -351 -2124 -2521 -2475 -862
4901h62K056J579j71j037j954j847o72N96J373K312J387q2j124k260j356q64Q04
$$ -862 1194 2773 2602 1565 -389 -2236 -2908 -2312 -939 1373 2760 2678 1554 -706 -2062 -2926 -2122
4918b122J698J968J214J22j227k108j827m27R18J234J991J179J38j486j820k018
$$ -2122 -424 1544 2758 2880 1653 -455 -2282 -2709 -1791 -557 1434 2613 2751 1265 -555 -2573
4934b573l02R08J459K093R94j49j023k204j491o94O05K018J824J270l26j319j697
$$ -2573 -2875 -1967 -508 1585 2579 2430 1407 -797 -2288 -2982 -2377 -359 1465 2735 2409 1090 -607
4951f07j786l87P11J456K394J030l87j169j602k091l58J002J826J767P85M5j592
$$ -607 -2393 -2780 -2069 -613 1781 2811 2424 1255 -347 -2438 -2796 -1794 32 1799 2584 2629 1037
4968A037j851j749k68R89J676K076O73k22j333j578j873m31R72J831K003M59J36
$$ 1037 -814 -2563 -2831 -1842 -166 1910 2583 2361 1028 -550 -2423 -2854 -1882 -51 1952 2411 2547
4985B547j640j715j419n93Q98J758J984J051n0j778j794j689k11J205J506J653
$$ 2547 907 -808 -2227 -2820 -1922 -164 1820 2871 2821 1043 -751 -2440 -2651 -1446 60 1713
5001A713Q41j82j124k389j458l69J275J787J570R71m17j258j904j632j60J003
$$ 1713 2554 2372 1248 -1141 -2599 -2968 -1693 94 1664 2635 2218 960 -944 -2576 -2736 -1733
5017a733J694K070O75o93j160k032j160j86O66J821K017P45l11j262k307j397
$$ -1733 -39 2031 2706 2013 853 -1179 -2339 -2525 -1859 -38 1979 2724 2413 1151 -1156 -2553
5033b553L0Q44K033J470P23J06j796j840j433l00J272J442J839N41p3j316k062
$$ -2553 -2523 -1679 354 1824 2547 2653 857 -983 -2416 -2716 -1444 -2 1837 2378 2305 989 -1073
5050a073j605L2J086J737J877L45n36j510j589j465j20R88K055J999Q39q49j757
$$ -1073 -2678 -2646 -1560 177 2054 2399 1863 353 -1236 -2701 -2821 -1833 222 2221 3060 2211 454
5067D54j700j081l06J163K096J383O84m73j481k085j296K58J121J499J810M42
$$ 454 -1246 -2327 -2633 -1470 626 2009 2693 2220 739 -1346 -2642 -2384 -1263 236 2046 2488
5083B488n84j364j773j272p1J550J595J265M28k79j621j729j304O4J182J878J684
$$ 2488 1904 540 -1233 -2505 -2576 -1026 569 1834 2262 1983 362 -1367 -2671 -2607 -1425 453 2137
5100B137N07p81j586j672q29l93J448J724J523Q78r46j506j758j008k7J203J583
$$ 2137 2644 1863 277 -1395 -2224 -2617 -1169 555 2078 2956 2010 504 -1254 -2262 -2289 -1086 497
5117D97J693M17q06j355j773j359J89J297J835J700O2m74j469j974j098R7J282
$$ 497 2190 2607 1801 446 -1327 -2686 -2497 -1200 635 2335 2397 1923 454 -1520 -2618 -2521 -1239
5134a239K111J412L91r51j513j709r87j7J319J900J394N17j096j473j728p91K3
$$ -1239 872 2284 2675 1724 211 -1498 -2485 -2502 -1183 717 2111 2628 1532 59 -1669 -2460 -2437
5151b437J320J949J343O08j188j534j706j049J42J502J928J310N21j022j450j938
$$ -2437 -1117 832 2175 2783 1595 61 -1645 -2694 -2552 -1050 878 2188 2709 1687 237 -1701
5167a701r26J69J415J926J441J51q88j716j456p30p1J269K021J571K83j022j802
$$ -1701 -2627 -2458 -1043 883 2324 2475 1587 -129 -1585 -2315 -2386 -1117 904 2475 2758 1736 -66
5184f6j810p63O46J253J778J176K00q25j830j742m21M24J296J745J391k30q39
$$ -66 -1876 -2639 -1993 -740 1038 2214 2414 1589 -241 -1983 -2404 -1980 -684 1061 2452 2222 1383
5201A383j383j808p90L05J575J832J392j00q58j894j463p80N1J905J882J063J52
$$ 1383 0 -1808 -2598 -2293 -718 1114 2506 2406 1548 -346 -1809 -2589 -2538 -633 1249 2312 2464
5218B464j177j775j533m82N81J145J773J191K42j082j711j474r41N89J972J268
$$ 2464 1287 -488 -2021 -2503 -1922 -777 996 2187 2429 1347 -364 -1838 -2779 -2190 -218 1050
5234A050J413j4j343j364j485q15N17J441J769J139J12j151j597j674n52L76J641
$$ 1050 2463 2449 1106 -258 -1743 -2558 -2041 -600 1169 2308 2420 1269 -328 -2002 -2554 -2178 -537
5251e37J946Q72P6j078j791j334o52O69J024K014Q61J83j092j447j382r48P32
$$ -537 1409 2281 2357 1279 -512 -1846 -2498 -1829 -805 1209 2070 2253 1161 -286 -1668 -2616 -1884
5268a884J430J836R07j91q14j895j479m28N24J734J316J336j37q92j742j600m65
$$ -1884 -454 1382 2289 2098 1284 -611 -2090 -2518 -1994 -260 1056 2392 2255 1363 -379 -1979 -2444
5285b444R14P95J958J228p6j302j644j732j12M92J662J808R45l06j037k190p69
$$ -2444 -1530 -735 1223 2451 2375 1073 -571 -2303 -2415 -1923 -261 1547 2492 2186 1149 -1041 -1810
5302a810o18M55J977J468R66m77j066j562j308m33O16J565J635R87K9j249j865
$$ -1810 -2428 -1973 4 1472 2438 1961 895 -667 -1975 -2408 -1792 -227 1408 2395 2424 1175 -690
5319f90j599k60J123J434J463J107l22j243j779j089n46R27J347J551J070j25
$$ -690 -2289 -2549 -1426 8 1471 2578 2256 1013 -766 -1855 -2401 -1474 -127 1424 2494 2369
5335B369j426j783j232j63O30J523J390J167m59j130j707j382k45Q34J617J473
$$ 2369 943 -840 -2072 -2235 -1605 -82 1308 2475 2016 886 -821 -2203 -2448 -1614 3 1476
5351A476R05l81j140j554j313m01R00J857J081P45j29j114j854j312l37J018J666
$$ 1476 2381 2000 860 -694 -2007 -2408 -1508 349 1430 2175 2046 932 -922 -2234 -2571 -1553 113
5368A13J549O62k31j281j863r21m89J019J563J525P55l64j075k148j195m4R79
$$ 113 1662 2324 2093 812 -1051 -1972 -2461 -1442 121 1646 2401 2037 962 -1186 -2381 -2425 -1446
5385a446J569J259J154o18j362j461j005l05J161J118J653Q92l22j448k194j081
$$ -1446 123 1382 2536 1918 556 -905 -1910 -2215 -1054 64 1717 2609 2287 839 -1355 -2436
5401b436j78J445J326J294O19l93r56j704j387q0J192J399J845M35m95j155j677
$$ -2436 -2614 -1169 157 1451 2070 1677 721 -983 -2370 -2450 -1258 141 1986 2421 1926 771 -906
5418i06j384nQ08J592J912L70n43j453j460j204J66P14J700J361N82k34j550j600
$$ -906 -2290 -2295 -1487 105 2017 2387 1844 391 -1069 -2273 -2107 -1393 307 1668 2250 2016 466 -1134
5436a134j029j02J178J400J763L76q44j094j667j137q8J343J669J091P70p67j384
$$ -1134 -2163 -2265 -1087 313 2076 2452 1608 514 -1153 -2290 -2378 -1035 634 1725 2495 1728 344
5453C44j807n62J57Q49J579J520N14q20j478j773j018M82R24J614J471L78n99
$$ 344 -1463 -2025 -1868 -1019 560 2080 2594 1774 296 -1477 -2495 -2013 -1089 525 1996 2374 1775
5470A775j218j769j304M64J106J650J002N76m30j426j792q83k36J442J857J142
$$ 1775 557 -1212 -2516 -2052 -946 704 1706 2282 1852 426 -1366 -2249 -2485 -1043 814 1956
5486A956J46m08j504j734p09K05J101J863R09K31l46j551j344r70K4J283J574
$$ 1956 2102 1694 190 -1544 -2253 -2048 -947 916 1825 2056 1710 159 -1185 -2155 -2131 -848 726
5503G26J333J75p76j146j694p54q7J542J166J438M57r25j520j569p43n3J585J580
$$ 726 2059 2234 1458 312 -1382 -2136 -2223 -681 485 1923 2380 1455 -65 -1634 -2377 -2430 -845 735
5521G35J051L18n64j451j542r49L91J369J507J042J65m23j409j562q59M65J140
$$ 735 1786 2104 1540 89 -1453 -2402 -2011 -642 865 1907 2072 1649 240 -1322 -2181 -1716 -576
5538e76J631Q53O49r56j400j659r26N82O51J996J181L07p35j733j430o97L86J445
$$ -576 1055 1908 2557 1601 201 -1458 -2384 -1802 -1151 845 2026 2333 1598 -135 -1565 -2262 -1876 -431
5556d31J257J092L25q54j452j516q84P74J250J284J369k30n76j632j325o27J96
$$ -431 826 1918 2243 1389 -63 -1579 -2463 -1689 -439 845 2214 1984 1408 -224 -1549 -2176 -1980
5573a980J459J406J294Q7j068j493j501l92K23J410J689R04J81j131j393j284
$$ -1980 -521 885 2179 2266 1198 -295 -1796 -2188 -1965 -555 1134 2038 2219 1088 -305 -1589
5589a589m99k9J422J779R12o1q82j562j309m47M58J511J250Q76L72r67j600j202
$$ -1589 -2088 -2117 -695 1084 1996 1935 1053 -509 -1818 -2265 -1807 -296 954 1830 2202 1235 -365 -1567
5607a567o94K70J248J793J072K61j361j477j231o15N50J373J607J134q5j305j406
$$ -1567 -2261 -1991 -743 1050 2122 2383 1022 -455 -1686 -2301 -1751 -378 1229 2363 2278 973 -433
5624d33j491l75P74J013J967N71J07j189j527j196l80N70J510J419O69K10j121
$$ -433 -1924 -2299 -1525 -512 1455 2026 2133 944 -583 -1779 -2159 -1589 -79 1340 2009 2219 1098
5641A098j457j268n94O02J045K024O81l11q22j472j488l97P15J630J230R23J22
$$ 1098 -359 -1627 -2221 -1619 -574 1450 2131 1820 998 -474 -1962 -2359 -1644 -14 1216 2139 2261
5658B261j380j472j324l15O91J455J481N53k60o72j646j104o16R63P92J652J321
$$ 2261 881 -591 -1915 -2230 -1539 -84 1397 1950 1690 1018 -628 -1732 -2348 -1385 -593 1059 2380
5675B380l54j054j543j587l76R39J453J585P31j32j166j468j218n59J000J412
$$ 2380 2026 972 -571 -2158 -2534 -1595 -142 1443 2174 2042 876 -592 -1810 -2369 -1369 43
5691D3J363Q62j74j304j531q84o04N87J406J714N17p5j030j596j011l87Q16J256
$$ 43 1406 2268 2094 790 -741 -1625 -2229 -1642 -236 1478 1995 1920 890 -706 -1717 -2104 -1288 -32
5709c2J493P07l73j057j633j020l47J201O82J599J074k91j315j506j271k92Q44
$$ -32 1461 2168 1795 738 -895 -1915 -2262 -1061 -379 1220 2294 2003 688 -818 -2089 -2381 -1537
5726a537J478J788N05p09n73j479j466p2P42J639J377M47l73j265r64j485l47
$$ -1537 -59 1729 2234 1525 952 -527 -1993 -2065 -1323 316 1693 2140 1767 502 -462 -1947 -2294
5743b294J052J203J621P33o59j202j417p82n80R63J575J341O25m32j197j491j006
$$ -2294 -1242 -39 1582 2315 1656 454 -963 -1745 -2325 -1362 213 1554 2179 1747 550 -941 -1947
5760a947M9P57J359J347J02L69j455j666j013j23R70J445J773M71p79j144j403
$$ -1947 -1898 -1141 218 1565 1667 2036 581 -1085 -2098 -2221 -1251 194 1967 2438 1659 515 -888
5777h88j150j17P70J553J265J120p35j493j427q35n9R20J426J119P59k93j385
$$ -888 -2038 -2155 -1385 168 1433 2553 1818 325 -1102 -1937 -1996 -1076 350 1469 2228 1935 550
5794E50j669r90K50O98J326J554L46m96j046j437j149J09P12J830J026L50j19
$$ 550 -1119 -2109 -1859 -1161 165 1719 2065 1569 523 -914 -2063 -1954 -1242 588 1614 1964 1845
5811A845j294j677p94l2J041J288J142M40j63j466j474q19l47J133J801J055Q79
$$ 1845 551 -1126 -1920 -1952 -911 377 1519 1959 1796 330 -1144 -1963 -2310 -1177 624 1679 2558
5828B558p73j476j357j048J07J070J294J308M54m36j313j238j312J16R93J604
$$ 2558 1785 309 -1048 -2096 -1989 -919 375 1683 2137 1701 388 -850 -2162 -2046 -1053 551
5844E51J374R2m12j320j417p54N0R14J463J306L93n68j751j237p63J19J199J149
$$ 551 1925 2017 1605 285 -1132 -1886 -1836 -922 541 1847 2240 1672 -79 -1316 -2079 -1960 -761 388
5862C88J315L31n34j421j260p60K03J151J161J034L07l75j217j991n40K82J042
$$ 388 1703 2034 1500 79 -1181 -1941 -1738 -587 574 1608 1915 1540 323 -1668 -2208 -1926 -884
5879h84J579Q88K26k57j731j249j038N00J431J209J099L39p00j422j277j010K48
$$ -884 695 1583 1809 1552 -179 -1428 -2466 -1966 -535 674 1773 2112 1412 -10 -1287 -2297 -2049
5896b049J391R63J557L52o78j574j369p83M49R05J385J116K37l55j590j064p89
$$ -2049 -658 305 1862 2214 1536 -38 -1407 -2190 -1741 -836 549 1665 1902 1547 -43 -1107 -1896
5913a896p9J463J620N87K10n20j306j503n13K17J243J367R54J50o00j389j292
$$ -1896 -1975 -512 1108 1695 1905 1385 79 -1424 -1937 -1720 -477 890 1844 1994 1394 5 -1287
5930a287r04L73J184J173J272M87j113j208j638o85O55J348J298R34J04n12j481
$$ -1287 -2191 -1818 -634 539 1811 2298 1185 -23 -1661 -2346 -1691 -343 955 1889 1993 1481 0
5947@j495o79K99J393J517P92K01p51j296j549m26L36J195J316J150k26o98j528
$$ 0 -1495 -2174 -1875 -482 1035 1827 2028 1277 -19 -1568 -1994 -1658 -463 853 2003 1777 1079 -449
5965d49j147n92N19R18J674R60J31p83j265j487o14M21J035J682J113rj001j512
$$ -449 -1596 -2188 -1669 -751 923 1883 2014 1231 -34 -1521 -2135 -1714 -679 1003 2116 2107 1106 -406
5983d06j175m23N39J055J318J183j23r44j238j442l50O19J199J235Q53J70r88
$$ -406 -1581 -2004 -1465 -410 908 2091 1968 1024 -214 -1656 -2006 -1387 -188 1047 1900 2070 1082
6000A082j376j290n11N81J159J344R60R3r85j346j409m30O45J078J381J311j24
$$ 1082 -294 -1584 -2095 -1514 -355 989 1949 2042 1057 -289 -1698 -2128 -1483 -405 976 2287 2163
6017B163j184j328j235o40P33J339J236J117j25j218j642o96o86P75R88J410R84
$$ 2163 979 -349 -1584 -2224 -1491 -152 1084 2201 2076 858 -784 -1480 -2166 -1391 -403 1007 1991
6034A991k31q29j617q53n73L80J307J655P96l75n17j612j242k87M70J455J189
$$ 1991 1760 931 -686 -1539 -2112 -1732 -425 1230 2026 1651 1134 -478 -1720 -2007 -1537 -82 1107
6051A107P18j27p47j213j116j106Q63J142J545J077K4j563j284p29o06N33J308
$$ 1107 1825 1698 951 -262 -1378 -2484 -1621 -479 1066 2143 2167 604 -680 -1409 -2015 -1482 -174
6068a74J131J352m81q55j687j014l49N55J301J200R91j41q61j846r85k83N36J320
$$ -174 957 2309 1828 973 -714 -1728 -2077 -1522 -221 979 1970 1829 968 -878 -1863 -2146 -1610 -290
6086b90J621O55j02j336j045j316P4M53J273J437N41j55j151j349j337M8N68J548
$$ -290 1331 1986 1884 548 -497 -1813 -1739 -1286 -13 1424 1965 1810 659 -690 -2027 -1979 -1411 137
6104A37J144R46n36j148j270j263J35N33J320J152Q20M7j570q92j520j1R10J338
$$ 137 1281 2227 1691 543 -727 -1990 -1855 -1322 -2 1150 1970 2017 447 -445 -1965 -1976 -1066 272
6122B72R60N54j69j050j174j143m69P54J565J463L17Q4j506j206j139J5N52J383
$$ 272 1232 1786 1617 567 -607 -1750 -2219 -1465 100 1563 1880 1964 458 -748 -1887 -1872 -1320 63
6140F3J113Q18k87j208j396j174J29J009J070J074P69j69j386j374o27m52O94
$$ 63 1176 1994 1707 499 -897 -2071 -1942 -933 137 1211 1980 1811 425 -949 -1576 -2028 -1334
6157a334J315J771K58j25j357j453j017m78J165J396J503K62j88j422j095j217
$$ -1334 -19 1752 2010 1885 528 -925 -1942 -2420 -1255 141 1644 1906 1718 296 -799 -2016
6173b016j87R50J428J255N90k77j227j472q25k57R46J340J430K93m72j133j435
$$ -2016 -2203 -1253 175 1430 2020 1743 516 -956 -1781 -2038 -1092 248 1678 1971 1499 366 -1069
6190a069n58l47J177R13J181R26n89j400j197p73k02J106J140J259M70o25j216
$$ -1069 -1627 -1974 -797 116 1297 2223 1634 234 -963 -1736 -1938 -832 308 1567 2037 1412 196
6207A96j063j074p8Q16J757J116N70q05j145j227r48P2M47J597J410L42m43j470
$$ 196 -867 -1941 -2019 -1203 554 1670 2240 1435 290 -937 -1885 -1813 -1366 231 1641 1983 1540 70
6225G0j155q68K28Q98J130J106O36q30r23j830n40L58R44J501O78P87p26j211
$$ 70 -1085 -1953 -1725 -827 303 1409 2045 1215 292 -1538 -2078 -1720 -776 725 1403 2190 1464 253
6243B53j324j028L72Q54J270J018L04l32q99j783l36l24R59J480J150M56m76k024
$$ 253 -1071 -2099 -1727 -873 397 1415 1719 1387 488 -1295 -1631 -1955 -996 484 1634 2090 1614 -410
6261d10p34r15L06Q66J339J277K27n29j117j405r05K30J017J009J491J46m87j360
$$ -410 -1144 -2059 -1753 -887 452 1729 1956 1427 310 -1095 -2000 -1770 -753 256 1747 1893 1406 46
6279D6j278r68K77J208J201J223J69m66j151j412r01L86J042J548P44L56q70j377
$$ 46 -1232 -2200 -1923 -715 486 1709 1878 1412 261 -1151 -2052 -1666 -624 924 1668 2024 1154 -223
6297b23r48p04NR28J505J399M3o09j183j372q21N0J231J290J297R7p29j420j237
$$ -223 -1171 -1875 -1870 -942 563 1962 2005 1396 213 -1159 -1980 -1930 -699 591 1888 1985 1256 -164 -1401
6316a401l12K22Q07J444J075j5p83j266j112m89J24Q60J523J415j09p51j543j179
$$ -1401 -1713 -1491 -684 760 1835 1820 1037 -229 -1341 -1830 -1706 -846 677 2092 1983 1232 -311 -1490
6334a490n66N00J081J150J003M07q03j342j517n24K70J399J391P94M71r52j788
$$ -1490 -2056 -1556 -475 675 1678 2085 1282 -60 -1577 -2101 -1831 -432 959 1753 2224 1272 -516
6351e16j183k63K43R89J513J311j92r18j307j101n33k8J364J154J172K40n79j746
$$ -516 -1699 -1962 -1719 -730 783 2094 1902 984 -323 -1424 -1957 -1985 -621 533 1705 1945 1366 -380
6369c80j101m01K37J187J116J063K62j024j295j065n09J97J256J455Q89j0p54
$$ -380 -1481 -1882 -1645 -458 658 1721 1983 959 -336 -1401 -1910 -1713 -457 998 1887 1877 1123
6386A123j253j314o17N26J157J346Q24k10m90j542j060m58M68J025J276J136k
$$ 1123 -130 -1444 -2061 -1535 -378 968 1792 1582 1092 -450 -1510 -1968 -1500 -475 801 1937 1935
6403A935o94j498j438n72N64J369J300Q08j86m78j288j325j84K04J416J227P93
$$ 1935 1241 -257 -1695 -2267 -1703 -334 966 1774 1588 1110 -178 -1503 -1687 -1483 -67 1160 1953
6420A953m2j005j406r05m40M21J148J423P99j57j042j354q56n43O05J086J423
$$ 1953 1911 906 -500 -1405 -1845 -1424 -276 1147 1946 1789 747 -607 -1463 -2006 -1401 -315 1108
6437A108N76L99j307j201j246j62M34J604O56J094k83j068j189q96l62M21J248
$$ 1108 1684 2083 776 -425 -1671 -1833 -1399 205 861 1955 1672 604 -585 -1481 -1843 -1422 -174
6454a74J266Q72k91q14j467p57n72Q46R57J318O45o2j032j323j060j00L31J563
$$ -174 1092 1964 1673 859 -608 -1365 -1937 -1091 -134 1184 1829 1767 735 -588 -1648 -1748 -1417 146
6472A46R73O58k17r69j399q29k30L65J268J426Q37l77j062j338p54n37Q59J108
$$ 146 1119 1777 1560 591 -808 -1637 -1867 -1502 -234 1192 2029 1652 590 -748 -1502 -2039 -1180 -72
6490g2J386R31n08j340j061r38k46N51J165J456O39k82r97j420j061j07M38J506
$$ -72 1314 2245 1737 397 -664 -1602 -1848 -1297 -132 1324 1963 1681 684 -736 -1797 -1904 -1466 40
6508D0J349L71J43j448j127r70k74Q43J265R74M53j62r77j340p39k13O38J271
$$ 40 1389 1760 1903 455 -672 -1642 -1916 -1073 192 1166 1619 1457 480 -860 -1599 -1812 -1174 97
6526I7J452K42m0j145j466j047k76J266J114J161M40p6j544r64q91J36J42J618
$$ 97 1549 1791 1751 606 -860 -1907 -2183 -917 197 1358 1798 1722 178 -786 -1677 -1541 -1399 219
6544B19J150M78p7j148j823o79q3P49J449J328J84q0j219j555m38m42R94R11J493
$$ 219 1369 1847 1770 622 -1201 -1880 -1963 -1214 235 1563 1747 1667 448 -1107 -1545 -1987 -993 -82 1411
6563A411K75K3j025j557j041J48P28J085J563L26l02j282j427o35J38M22J467
$$ 1411 1686 1709 684 -873 -1914 -1766 -1038 47 1610 1936 1634 352 -1075 -1710 -1572 -1150 317
6580C17J207L10l2j566j132r88j30R77J298J234M31l84j445j009q97PQ74J373
$$ 317 1524 1834 1802 236 -896 -1884 -2014 -1037 261 1495 1926 1542 97 -912 -1809 -1802 -928 445
6598D45J035N20p42q12j210q61L4N64J458J230K32o13j252p37q83l80J071J196
$$ 445 1480 2000 1258 446 -764 -1625 -1591 -1027 431 1661 1893 1280 28 -709 -1592 -1972 -901 295
6616B95R74O95p05j064j398p29K31Q16J294J205L17n72j241r37j277K38R91J349
$$ 295 1269 1964 1259 195 -1203 -1932 -1701 -885 409 1614 1931 1359 118 -819 -2096 -1858 -867 482
6634D82J247J47m77j101j298r28J6J214J278J017K10o19j093q15r72j2Q60J234
$$ 482 1729 1876 1399 298 -1000 -1928 -1912 -698 580 1597 1807 1188 95 -720 -1692 -1704 -844 390
6652C90J271N5m66j302r03r72L05J204R16J075M33o46j174j024m62n45J095J351
$$ 390 1661 1716 1250 -52 -955 -1927 -1622 -418 498 1573 2006 1360 186 -838 -1300 -1845 -750 601
6670F01J181J82q52r65j398l46l17R16J470J285j73n06p41j473p03M2J059J355
$$ 601 1782 1964 1112 147 -1251 -1597 -1914 -998 472 1757 1584 1078 337 -1136 -1839 -1797 -738 617
6688F17R43K68o45j321q67p68J13J018J252J166O1p39j132j120o44L39P64J057
$$ 617 1560 1828 1183 -138 -1005 -1773 -1660 -642 610 1776 1837 1098 -34 -1154 -1798 -1459 -695 362
6706C62J263J59o09j406r82q12N83J119R22P35M58r46r11j015r49M03J439J071
$$ 362 1625 1784 1175 -231 -1213 -2025 -1442 -323 599 1334 1792 846 -65 -1080 -2029 -1626 -187 884
6724H84P84J65p90j368r70o22K96Q43J388R35K49o69j281j279l45K39R05J449
$$ 884 1668 1833 1043 -325 -1295 -1917 -1621 -778 610 1545 1794 1125 -156 -1435 -1780 -1541 -636 813
6742H13Q58M6r84o97j514J16j14R15J649M02L08r08j114r19o62J47J365R61Q92
$$ 813 1671 1717 733 36 -1478 -1362 -1476 -561 1088 1490 1798 890 -224 -1143 -1805 -1658 -293 668 1560
6761A560j2n55j128j398m63J03J573J301J065k38r81r59j282l43L74R42J652M59
$$ 1560 1548 993 -135 -1533 -1996 -1893 -320 981 2046 1808 827 -132 -1414 -1757 -1383 -441 1211 1670
6779A670p1o11j397q75o81P40R12J205R88mr67r98j701j12M41R97J345O26J66
$$ 1670 1599 988 -409 -1284 -1965 -1225 -313 892 1880 1876 909 -89 -1790 -1902 -1461 -464 881 1507 1673
6798A673q45j079j318m31O35J213J291M80K25j184j088j025l06K94J296J413K65
$$ 1673 828 -251 -1569 -2000 -1365 -152 1139 1619 1844 660 -428 -1453 -1759 -1465 -169 1244 1509
6815A509M17j205j163p31o66O57J239P76J110j90j231r75q87k09K43J011J152
$$ 1509 1926 721 -442 -1173 -1839 -1182 57 833 1943 1753 522 -453 -1340 -1549 -1306 -295 857
6832H57J256o31n09j307r30m90M07J123J082Q58j71p39j191j425l3O37Q72J236
$$ 857 2113 1482 973 -334 -1264 -1754 -1347 -224 858 1716 1545 806 -385 -1810 -1843 -1206 -334 902
6850I02Q61l23n32j230j082l47K72J160J524N82k03j093r95o47m42L26J050J514
$$ 902 1763 1440 908 -322 -1404 -1751 -1479 -319 1205 1787 1584 491 -504 -1151 -1593 -1267 -217 1297
6868A297L18J57j054j152j270q0P99J029J065P59o04m33j303j241m5O88J035J377
$$ 1297 1615 1772 718 -434 -1704 -1784 -985 44 1109 1868 1264 831 -472 -1713 -1758 -1070 -35 1342
6886A342K97k00r32j161o30o15P15J050J266L72J0p26j546p69k10N19J351J119
$$ 1342 1639 1439 507 -654 -1284 -1899 -1184 -134 1132 1504 1514 788 -758 -1527 -1737 -1218 133 1252
6904A252Q39o17q11j277j032j42P37J136J067N29l21p74j650l60k66N28J455J084
$$ 1252 2091 1474 663 -614 -1646 -1788 -1051 85 1152 1681 1360 586 -1064 -1424 -1690 -1162 293 1377
6922A377J97m39n11j154q21m37P39J006J378N21o72o97j532o51n3Q50J162R28
$$ 1377 1574 1135 624 -530 -1351 -1788 -1049 -43 1335 1856 1184 487 -1045 -1696 -1749 -899 263 1191
6940A191K51nq13j564o61p0Q69R34J119L75j10j083j140o94j70P61Q85J223N70
$$ 1191 1442 1437 624 -940 -1601 -1671 -802 132 1251 1626 1516 433 -707 -1401 -1571 -810 75 1298 1868
6959A868p02p23j324p55o6M32J655Q00O38n18q45j384m23O4M63P30J574J25k65
$$ 1868 1166 443 -881 -1636 -1702 -1270 385 1185 1823 1305 460 -924 -1347 -1283 -820 -90 1484 1609 1344
6978A344j145q32j085o4J112P26J059M93j93r83j207q57J12N74J069J429L33m60
$$ 1344 199 -633 -1718 -1782 -670 56 1115 1608 1415 432 -775 -1632 -1520 -946 123 1552 1885 1425
6996A425q99j491r90J22J217J039R92L10m22j028j112p32JN91J215Q54R01m93
$$ 1425 526 -965 -1955 -1833 -616 423 1415 1725 1303 275 -837 -1569 -1568 -977 238 1092 1993 1500
7014A500j198j262n26k26P60J264J099N28p72j012j173q16J62Q71J143J154J93
$$ 1500 302 -960 -1486 -1712 -952 312 1411 1939 1167 155 -1018 -1834 -1672 -801 342 1496 1689
7031A689k62j107j049j032L36O60J157J186M80q90j079j364m35j3Q36J539Q25
$$ 1689 1427 320 -729 -1761 -1425 -765 392 1578 2058 1168 89 -1275 -1710 -1723 -887 652 1477
7048A477M78q02p05j440p30L82Q29N75R52L65l53p43j423l44R8O22J552Q50j01
$$ 1477 1955 1153 448 -992 -1722 -1340 -511 64 1016 1381 1028 285 -1138 -1482 -1384 -762 790 1640 1539
7067A539l05j364j208m55J10J146J101O87L21m91j020j004m62k45J180J155Q41
$$ 1539 1234 -130 -1338 -1793 -1683 -537 564 1251 1572 1081 61 -943 -1405 -1650 -470 685 1526
7084A526J74m90j008j699j77L09N39J555R03k76l53j034j048n81R1J061J003R62
$$ 1526 1700 1210 202 -1497 -1674 -1365 -826 729 1632 1356 1003 -31 -1079 -1660 -1569 -508 495 1457
7102A457J02m60j039j086o58J78R11J378Q92q6n91j393q60o33M92J063J097R03
$$ 1457 1559 1099 60 -1026 -1684 -1506 -595 783 1675 1589 998 -395 -1255 -1888 -1396 -333 764 1667
7120A667J8n00j160j125r11R01N54J112J164jp98r46j393k52K51Q26J109R49L10
$$ 1667 1685 1185 25 -1100 -2011 -1110 -556 556 1720 1719 921 -25 -1418 -1670 -1419 -593 516 1465 1775
7139A775p89j213r25n35L83R17J234O89l1j020r33r13k53L83Q69J352P82k80n16
$$ 1775 986 -227 -1152 -1687 -1304 -387 847 1536 1505 485 -448 -1361 -1614 -1231 -362 990 1772 1492 976
7158I76j280q78m69L61R27J297N09K31q51j017q15p11M31P23J233J053k38n01
$$ 976 -304 -1182 -1651 -1290 -363 934 1443 1674 823 -194 -1009 -1720 -1289 -566 667 1720 1482 981
7176I81j009j353m14K22J266J431P10J31j145j112r83l94O66J049P42Q36m08o20
$$ 981 -28 -1381 -1795 -1573 -307 1124 1834 1965 820 -292 -1275 -1669 -1003 46 788 1624 1216 596
7194E96q41j015m27N11P81J490M74L33q65j347r95n08N11R83J209R26k85p65j412
$$ 596 -245 -1260 -1687 -1176 -395 1095 1569 1902 1037 -310 -1305 -1813 -1302 -319 890 1816 1531 766 -646
7213f46o78o15N70J192J068O76o6n95j217j204MM87R98J259M28J86j047j436o03
$$ -646 -1324 -1939 -1369 -177 891 1567 1501 906 -311 -1515 -1511 -1024 -26 1233 1661 1847 800 -636 -1239
7232a239p08Q26J036R16O54L0p55j283j039J17M37M30J610P60j99q35r70j094
$$ -1239 -1947 -1121 -85 831 1485 1515 760 -523 -1562 -1445 -1008 -578 1032 1792 1593 758 -212 -1306
7250a306l13M49P62J282O26K70j213j049j110PN47J145R98O00m31p35q28j063
$$ -1306 -1619 -1170 -408 874 1500 1770 557 -492 -1602 -1595 -1048 97 1095 1695 1264 529 -299 -1362
7268a362j06K97J088J058N97j15o38j436j073J41M57R58Q63Q60k08j033r30q29
$$ -1362 -1468 -1171 -83 975 1572 1457 819 -617 -1690 -1549 -1092 -134 729 1589 1381 348 -582 -1411
7286a411m05N95J342O79J081l33j080j153r12J2P57Q43J072O44j57q98j584m10
$$ -1411 -1816 -1221 121 800 1881 1548 468 -685 -1597 -1585 -828 15 1087 1731 1574 676 -908 -1318
7304a318m3K82Q95J264L79L1j000r91j023m70J172R31J233J01j04p88j174o07
$$ -1318 -1361 -1079 -184 1080 1459 1490 490 -501 -1524 -1994 -822 109 1342 1443 1339 551 -623 -1230
7322a230l73O99J193O04N49Q1j156j014p79l54R63M83J636L02j39r29j450m52
$$ -1230 -1603 -904 289 893 1442 1523 367 -647 -1426 -1780 -817 -334 1302 1604 1465 536 -914 -1366
7340a366k55P43R74J142L40m30n36j384q46p1Q73J008J028L39l44o82j306o06
$$ -1366 -1621 -878 96 1238 1578 1148 612 -772 -1618 -1689 -816 192 1220 1559 1215 533 -773 -1379
7358a379j75M68J472N99P72n93q20j117o24j33P58Q13J110O14m13j049j191p72
$$ -1379 -1554 -1086 386 985 1757 1164 344 -773 -1397 -1530 -772 41 1151 1765 1352 303 -888 -1660
7376a660l4J126P93O97O65k71q75j283j055J77Q01J163J064O06n92j148j162m57
$$ -1660 -1694 -568 225 922 1587 1316 441 -842 -1897 -1720 -919 244 1308 1914 1322 174 -988 -1445
7394a445o6P80P46J397K84o35q21j025j157M46P45J364N88N40l61j120r66p57
$$ -1445 -1511 -731 15 1412 1696 1061 240 -785 -1942 -1496 -751 613 1201 1741 1380 260 -706 -1463
7412a463M44R5J699P09J79n27r31j060r24L17O17J278J081j02j77r14r61j175
$$ -1463 -1019 -924 775 1484 1663 1136 205 -855 -1779 -1462 -845 433 1514 1412 1235 321 -640 -1815
7430a815J55J042J014J209j41l61j076r22o95L89P54J074P24K43m01r89j365l99
$$ -1815 -1660 -618 396 1605 1464 1103 27 -895 -1590 -1201 -447 627 1351 1594 1193 204 -1161 -1560
7448a560L60L11J233R57M58o17q59j399m70L9J173Q98Q78L49q31j116q86l79R4
$$ -1560 -1200 -889 344 1301 1759 1142 283 -1116 -1586 -1547 -374 524 1402 1751 920 -196 -1082 -1461 -1367
7467a367Q94J008R71j36l76r69j227m51N23O42J055Q86N7n47r46j064p02N63L51
$$ -1367 -473 535 1506 1370 994 25 -1202 -1653 -1130 -488 567 1453 1510 963 17 -1047 -1749 -1186 -835
7486h35J550L95M48l63j362q14m92j64J172Q87P91M59j036m96j134o53L97R18
$$ -835 715 1110 1558 1195 -167 -981 -1473 -1637 -465 422 1213 1672 636 140 -994 -1647 -1250 -332
7504c32Q54P49L98o74p44j352n85K61J012R77Q54N5n17r53r25q16N83P86J229
$$ -332 522 1271 1669 995 251 -1101 -1686 -1425 -413 564 1418 1473 956 3 -922 -1738 -1155 -369 860
7523H60O19q2n30j193q22n59M01R23J058O80K28o84r27j211j40J04P37J303R58
$$ 860 1479 1397 867 -326 -1148 -1707 -1306 -383 675 1355 1583 899 -28 -1239 -1379 -1275 -538 765 1723
7542A723K0p97j098q94o20L79R74J065Q04n3n76j212p44n03K03J180J020P83l79
$$ 1723 1743 946 -152 -1046 -1666 -1287 -313 752 1556 1503 927 -285 -1029 -1532 -1329 -149 871 1654 1275
7561A275j59j379o54o70N34R15Q37Q41k14o31o93j152n84R04N56Q50J048k46o11
$$ 1275 1116 -263 -917 -1587 -1053 -138 699 1540 1326 695 2 -1150 -1734 -830 -274 576 1624 1378 767
7580G67q83j138l67N24R17P60J027l96o24p96j280k90N77R26J398M01j95o04p94
$$ 767 -116 -1254 -1621 -1097 -180 580 1607 1211 587 -209 -1489 -1779 -1202 -276 1122 1523 1328 724 -70
7599g0j171k18L93O76J374N37p3p52r57j073q4J58Q52J156R30Pj019j180r75K47
$$ -70 -1241 -1459 -1066 -390 984 1521 1448 696 -261 -1334 -1418 -1260 -408 748 1678 1685 666 -514 -1489 -1242
7619a242J96P41Q92R99M0j144o97j107o7j04J303J079N62k3r97r59q16n21P67
$$ -1242 -1046 -305 587 1586 1626 482 -215 -1322 -1389 -1493 -190 889 1451 1428 431 -528 -1344 -1865 -1098
7638a098R11J226O29k50p95p96j227l00O45J030Q94N89L4q61q89j044j95L31J046
$$ -1098 -187 1039 1668 1418 623 -173 -1400 -1700 -1055 -25 869 1458 1492 631 -258 -1302 -1497 -1166 -120
7657a20Q54R12Q9r19j297q10m87Q11J066P89O20k02n46j495o18j52M34J181P42
$$ -120 734 1646 1735 816 -481 -1291 -1778 -967 99 888 1508 1306 760 -735 -1353 -1505 -1071 110 852
7676H52P73j86p81j171p14j60M05R54Q72P20q9r82p96r72m54Q22R34J085L68l4
$$ 852 1625 1439 658 -513 -1227 -1387 -982 -28 844 1564 1475 493 -303 -1275 -1729 -907 27 1112 1480 1446
7696A446j010j046q20K74j26J338J040K40Q6p54j399p54k34P23J308P02M94j71
$$ 1446 436 -610 -1430 -1156 -1282 56 1096 1336 1422 668 -731 -1485 -1719 -996 312 1014 1508 1337
7714A337j185o40r84k47Q67J090Q14N60m19o43j067p30l76R17O72J118N12k75
$$ 1337 152 -488 -1472 -1719 -852 238 1052 1612 1193 550 -517 -1247 -1623 -706 -34 1084 1596 1321
7732A321j016j327k56m27Q59Q65J026M25l03p77j082p29K3P21N54J115O65m95
$$ 1321 305 -1022 -1278 -1705 -846 19 1045 1470 1167 390 -692 -1421 -1398 -677 -123 992 1657 1162
7750A162n93r92j267J08O11J001J265J22l42n86j183r31L29M06J105R56M44l26
$$ 1162 569 -423 -1690 -1582 -971 30 1295 1417 1075 489 -694 -1625 -1296 -890 215 1171 1615 1289
7768A289r61j132n22R5N85J132P14J22K08j521o06r24J07M58J036J206J44k94
$$ 1289 328 -804 -1326 -1231 -646 486 1200 1322 1530 9 -597 -1521 -1414 -956 80 1286 1430 1136
7786A136j087q99q57M01M77J020J164N6j73q79j248n31K4P30R66Q33N17p05p18
$$ 1136 49 -850 -1707 -1306 -829 191 1355 1411 1238 359 -889 -1420 -1396 -666 300 1133 1650 945 227
7805B27q83p62O7P85J039P33N62k86j108j108q03mR97P15R24M53m04j362n76l81
$$ 227 -656 -1418 -1351 -566 473 1206 1768 1482 374 -734 -1537 -1541 -544 171 1095 1548 1144 -218 -794 -1175
7825a175n77J173R50R04J08l87r06q44n36L3N64J384M46L35l73p19j155o14n8
$$ -1175 -1752 -579 371 1275 1383 996 90 -754 -1290 -1257 -693 691 1137 1472 1099 380 -775 -1389 -1447
7844a447Q01J193N20M60l52r60j232l48K64L18J052J129L5k72j200j067l77N10
$$ -1447 -646 547 1067 1527 1175 215 -1017 -1365 -1101 -783 269 1398 1433 1161 -39 -1106 -1483 -973
7862i73L89J029P36P45q21r84j014n05n4P47R99J003L6l90j183q17n89M31O85
$$ -973 -584 445 1181 1926 1105 121 -893 -1398 -1452 -705 294 1297 1333 943 -240 -1057 -1646 -1215 -530
7881e30Q85J074R6l18j288q78n73L15N47J153R66R6n52r18j087m06K26Q15R01
$$ -530 355 1429 1525 1207 -81 -959 -1532 -1217 -670 483 1449 1545 993 75 -1012 -1418 -1192 -377 524
7900E24O80L12m81j010r73o83L45O93R68J098k8p55q03j079l53R2J122Q21R16
$$ 524 1204 1516 1035 25 -948 -1631 -1286 -593 375 1473 1445 690 -113 -1192 -1545 -1453 -331 490 1406
7919A406J06n25j017j199m7K38O32J007R11l35m46o05j054p04M28P77Q33J133
$$ 1406 1512 987 -30 -1229 -1276 -1038 -406 601 1512 1177 731 126 -928 -1632 -1204 -427 406 1539
7937A539n0n77j190q94j18K08Q49P79P42K56o61j143q44m06J72P55J589L46K30
$$ 1539 1489 912 -278 -1172 -1290 -1082 -233 546 1288 1544 883 -260 -1104 -1510 -1338 -583 1006 1352 1582
7956A582p27q37r82m06K3Q58J017N08K74o99r48o83n80N69O01J207M29K60p52
$$ 1582 855 18 -964 -1370 -1347 -489 528 1036 1310 611 -337 -1020 -1600 -1031 -430 777 1206 1466 714
7975G14j066p01n73M87R04R06K87O83r79o48j271k29M85P56J187K52K31n53j060
$$ 714 -352 -1053 -1626 -1139 -235 671 958 1641 662 14 -1257 -1486 -1001 -245 942 1194 1425 872 -188
7994a88j139k6J48Q47J512N83l75m17j020j203L9K47J084J040L49l35m24j041
$$ -188 -1327 -1353 -1205 -358 1154 1737 1362 945 -75 -1278 -1239 -992 92 1132 1481 1146 722 -319
8012c19r08l11L57J026R33O46K7o07j084j042j60M33J007P44N25J84o60j255q11
$$ -319 -1227 -1538 -1181 -155 778 1424 1451 844 -240 -1282 -1442 -1009 -2 742 1267 1451 791 -464 -1275
8031a275j22J35J256O82R38j91o27j193p04j97L96Q29R28O20j49o05j135o84j98
$$ -1275 -1397 -1262 -6 676 1614 1423 796 -397 -1101 -1298 -902 -73 855 1475 1326 721 -414 -1098 -1296
8050a296O56P04O72R23k34n41j247p10r3K41P97J005M64j43m54j250o51l82P01
$$ -1296 -640 64 736 1659 1425 884 -363 -1073 -1166 -925 -128 877 1341 1198 744 -506 -1157 -1539 -838
8069h38N55J259K48N4r21q58n70k35L99P73J314L06m8j067q04q44L1J63J042R43
$$ -838 -283 976 1224 1278 357 -501 -1071 -1306 -907 -134 1180 1486 1438 371 -433 -1277 -1246 -1083 -41 902
8089I02O31rr23j246n68k39N13O73J015R08k55j012q78p99k45O56Q72J167J5N7
$$ 902 1533 1524 601 -645 -1213 -1452 -939 -266 749 1657 1402 390 -488 -1287 -1532 -876 -4 1163 1178 1235
8109A235o93r88p29l12O81O67J099M16m1j062r23p22J74J33J286N40P30l60r69
$$ 1235 542 -446 -1175 -1487 -806 -139 960 1376 1335 273 -650 -1372 -1198 -1065 221 761 1491 1131 162
8128A62o08p15j22M94J119N54M92j43j123q99l27k82O34O89J018N20k59q05r15
$$ 162 -446 -1161 -1283 -789 330 884 1376 1233 110 -789 -1116 -1398 -764 -75 943 1463 1204 399 -516
8147e16o50N1O73K23J259M97n64n31j021p10k74O74J266P43L00m61o25j146n16
$$ -516 -1166 -1115 -442 -219 1040 1537 973 442 -579 -1289 -1563 -889 377 1120 1420 959 334 -812 -1328
8166a328J46L38J011R81L64m50r52q29l82j44N83R52P26J46l59o74q59o07j03
$$ -1328 -1182 -844 167 1148 1512 1062 110 -719 -1101 -1245 -662 290 1016 1162 803 129 -730 -1337 -1440
8185a440P43O94R90M37o52o49
$$ -1440 -697 -3 987 1424 772 123
8191A23
$$ Imaginary data points
##PAGE= N=2
##DATA TABLE= (X++(I..I)), XYDATA
0@%%%%%%%%Oj4J6j6J7k5L3l6M4n4O3p6Q8j00J17j36J59j82K06k36K67l03L41l81
$$ 0 0 0 0 0 0 0 0 0 6 -8 8 -8 9 -16 17 -19 25 -29 34 -42 46 -54 63 -73 86 -96 110 -126 141 -162 179 -202
32b02M29m81N38o00O67p40Q20r12J013j119J239j374J522j686J870k082K327k608
$$ -202 227 -254 284 -316 351 -389 431 -481 532 -587 652 -722 800 -886 984 -1098 1229 -1379
50a379K937l330L809m407N183o231P732j0082J4321k4403R3389R5371j28407q8060
$$ -1379 1558 -1772 2037 -2370 2813 -3418 4314 -5768 8553 -15850 77539 172910 44503 -43557
64d3557l1211K0592j8263N54O3440J12981M1779o1559j09457o1040r303J9700
$$ -43557 -74768 -54176 -72439 -71885 -8445 104536 146315 84756 -24701 -85741 -95044 -75344
76g5344L4726O4900O4702K0161m0670o5743o1471m1950p056N7076R9416O9510
$$ -75344 -40618 24282 88984 109145 68475 2732 -58739 -100689 -107745 -50669 48747 118257
88A18257j7279o7656n0472k0353l1084l4650K5652J07600J01779l273r3452q0374
$$ 118257 100978 33322 -17150 -37503 -68587 -103237 -77585 30015 131794 128521 35069 -45305
100d5305j5389N879j4671M067P1797R8722K8498p0938r8067m7539M207J8210K7164
$$ -45305 -60694 -54815 -69486 -65419 6378 105100 133598 62660 -35407 -82946 -78739 -60529 -33365
113c3365N3155O2671K1849m0903p2895n9008k6083J2089N2611P5238N1242q807
$$ -33365 19790 82461 104310 63407 -9488 -68496 -94579 -82490 -29879 45359 96601 87794
125H7794n0960m9747l3421k9619j3267L8376R1053P2383r586p4032o3725k0052
$$ 87794 36834 -12913 -46334 -75953 -89220 -50844 40209 112592 103006 28974 -34751 -54803
137e4803m527q596J7817P0139P9007J3457o5628q2339l8849L072J6290K6625N0485
$$ -54803 -59330 -67926 -50109 20030 99037 112494 46866 -35473 -74322 -71250 -54960 -28335 22150
150B2150N6800J7672m2587p1088n3608j5447K0062M6815N8915M1693j276l9937
$$ 22150 78950 96622 54035 -17053 -70661 -86108 -66046 -19231 39684 81377 80101 40164
162D0164n2322m2620k4816M967M6070P1260N0117q100n3392n4814l0863j2766
$$ 40164 -12158 -54778 -79594 -74627 -28557 42703 92820 84720 31328 -23486 -54349 -67115
174f7115K261L2353O4032N7491L129n3312o6451l7844m078J5176L2904N0348M7426
$$ -67115 -64854 -32501 31531 89022 92151 38839 -27612 -65456 -69534 -54358 -21454 28894 76320
187G6320R510m0898o4033m7801j1568K1622M3551N0760L6024J537l5473n3414
$$ 76320 85830 44932 -19101 -66902 -78470 -56848 -13297 37463 73487 75024 39551 -13863
199a3863m5201j8881J5918M6520N7374L6137m649m0423n0835l8695j5420J3131
$$ -13863 -59064 -77945 -62027 -15507 41867 78004 73355 32932 -17903 -56598 -72018 -58887
211e8887M1035N5618L9411j468m1697n4809l9376j1089J7530M0004M9936L6389
$$ -58887 -17852 37766 77177 75709 34012 -20797 -60173 -71262 -53732 -13728 36208 72597
223G2597P43l7287n4829m2236j2233K0106M3808M8258L1594j591l4568n0907m2356
$$ 72597 73340 36053 -18776 -61012 -73245 -53139 -9331 38927 70521 68930 34362 -16545 -58901
236e8901j4540K0303M4840M8820K9898l642l4626m9469m0922j3329J9645M4356
$$ -58901 -73441 -53138 -8298 40522 70420 66778 32152 -17317 -58239 -71568 -51923 -7567
248g567M7631K9525l694l4889m8938m0744j2745K0822M4541M6832K6970m436l3720
$$ -7567 40064 69589 65895 31006 -17932 -58676 -71421 -50599 -6058 40774 67744 63308 29588
261B9588m7528l9600j2774K0021M4579M6823K6684n678l4294m6601l8231j1778
$$ 29588 -17940 -57540 -70314 -50293 -5714 41109 67793 62115 27821 -18780 -57011 -68789
273f8789K0377M3884M5265K6139n011l4073m7239l8241j0693K2310M3339M3718
$$ -68789 -48412 -4528 40737 66876 61865 27792 -19447 -57688 -68381 -46071 -2732 40986
285D0986K4145n302l2569m6171l8442j1423K3151M4708M3523K2010p510l2504
$$ 40986 65131 59829 27260 -18911 -57353 -68776 -45625 -917 42606 64616 57106 24602
297B4602m3566l7022j1590K2038M4256M4863K1947q823l3712m3746l4614r675
$$ 24602 -18964 -55986 -67576 -45538 -1282 43581 65528 56705 22993 -20753 -55367 -65042
309f5042K1295M2709M3124K2875p940l4727m4582l4308p583K2553M1788M1689
$$ -65042 -43747 -1038 42086 64961 57021 22294 -22288 -56596 -64179 -41626 162 41851
321D1851K1615p877l3335m4198l4661p038K3049M2624M0538K0162r256l2641m3175
$$ 41851 63466 55589 22254 -21944 -56605 -63643 -40594 2030 42568 62730 53474 20833 -22342
334b2342l3048p606K2822M2770M0559J9506j0007l3875m1812l2148o270K2983
$$ -22342 -55390 -62996 -40174 2596 43155 62661 52654 18779 -23033 -55181 -61451 -38468
346c8468M1219M0249J9505j0173l4354m2074l1150m923K3099M0747L9308J8997
$$ -38468 2751 43000 62505 52332 17978 -24096 -55246 -60169 -37070 3677 42985 61982
358F1982j0496l4610m2271k9611m277K3396L9969L8755J8239j0673l4329m1897
$$ 61982 51486 16876 -25395 -55006 -59283 -35887 4082 42837 61076 50403 16074 -25823
370b5823k8990l567K3538M0219L7135J7759j0571l4378m1513k8995k474K3924
$$ -25823 -54813 -58380 -34842 5377 42512 60271 49700 15322 -26191 -55186 -57660 -33736
382c3736L9881L6991J6350j1283l4076m0615k8137k360K4213L9394L6546J5829
$$ -33736 6145 43136 59486 48203 14127 -26488 -54625 -56985 -32772 6622 43168 58997
394E8997j1967l3978l9589k7566k051K4298L9149L5878J5635j2484l4091l9300
$$ 58997 47030 13052 -26537 -54103 -56154 -31856 7293 43171 58806 46322 12231 -27069
406b7069k7134q65K4145L8841L4931J5033j2348l3745l9770k5491p73K4880L8060
$$ -27069 -54203 -55068 -30923 7918 42849 57882 45534 11789 -27981 -53472 -54245 -29365 8695
419H695L4126J4514j2926l3328l9352k5406P7K5349L8058L3204J3153j2801l3053
$$ 8695 42821 57335 44409 11081 -28271 -53677 -53600 -28251 9807 43011 56164 43363 10310
432A0310l8140k5917K96K5789L8862L1871J2010j3099l2249l7598k5549j15K6466
$$ 10310 -27830 -53747 -53451 -27662 11200 43071 55081 41982 9733 -27865 -53414 -53529 -27063
445b7063L9189L2139J0501j4723l2104l5578k4102l90K5176L8912L2636J0567
$$ -27063 12126 44265 54766 40043 7939 -27639 -51741 -52131 -26955 11957 44593 55160
457E5160j5489l2771l5613k2912Q74K5649L7084L1147J0584j3617l2839l6683
$$ 55160 39671 6900 -28713 -51625 -50751 -25102 11982 43129 53713 40096 7257 -29426
469b9426k3668K632K7742L7095K8550Q016j3139k9674l5752k5475Q91K8983M0195
$$ -29426 -53094 -50462 -22720 14375 42925 50941 37802 8128 -27624 -53099 -52208 -23225 16970
482A6970K8211N114j6469k8170l1751k3899j374K6502M0618L1384N176j8951l0932
$$ 16970 45181 50295 33826 5656 -26095 -49994 -51368 -24866 15752 47136 52312 33361 2429
495B429l0619j9986P31K3688L7827L0518P770j6943l2674l3562j9789L875K7370
$$ 2429 -28190 -48176 -47445 -23757 14070 44588 52358 35415 2741 -30821 -50610 -46735 -19365
508a9365L5768K6059N727j3747k9022l4123k3667K819L0644L9263K5052P05j6564
$$ -19365 16403 42462 48189 34442 5420 -28703 -52370 -49551 -18907 20356 45408 46113 29549
521B9549k5579k9363k3316j720K8269M2012K8759L44k1612k7950k6149j8655o55
$$ 29549 3970 -25393 -48709 -50429 -22160 19852 48611 48955 27343 -607 -26756 -45411 -46066
534d6066K3900L8430L0051M333k0465l1958k9589j6375M586K5693L4806K4919
$$ -46066 -22166 16264 46315 50648 30183 -1775 -31364 -47739 -43153 -17460 17346 42265
546D2265M995j6043k9476l2343k0143N276L0411L6959K1867k76j6622k4787k8674
$$ 42265 47260 31217 1741 -30602 -50745 -45469 -15058 21901 43768 43492 26870 2083 -26591
559b6591k1975J506K8741M1024K5385k657k1896k6497k3901j7492K17K4586L8250
$$ -26591 -48566 -47060 -18319 22705 48090 45433 23537 -2960 -26861 -44353 -44136 -19550 18700
572A8700K8646J134k2494l1087k6032j3677M839K4362L3890K4997K967j8446k9991
$$ 18700 47346 48480 25986 -5101 -31133 -44810 -39971 -15609 18281 43278 46245 27799 -2192
585b192k9805j6005P504K8012L4179K0966L83j7614k6764k8089j7500M225K8781
$$ -2192 -31997 -48002 -40498 -12486 21693 42659 43042 25428 -1336 -29425 -46925 -42700 -13919
598a3919L6929K2408k340k0550k6654k4706j5432L835K5855L5576K4403m35k1565
$$ -13919 23010 45418 43078 22528 -4126 -28832 -44264 -40429 -14574 21002 45405 44970 23405
611B3405k9545k5510j2342O560K5006L2258K2998J699j9921l0154k7209j2620
$$ 23405 -6140 -31650 -43992 -37432 -12426 19832 42830 44529 24608 -5546 -32755 -45375
623d5375Q338K6549L1403K1242N55j8546k9546k6809j2705Q405K6451L1376K0627
$$ -45375 -37037 -10488 20915 42157 42712 24166 -5380 -32189 -44894 -36489 -10038 21338 41965
636D1965O18j9119l0075k6506j1543R627K6172L0037J9488J412j8181l0175k7596
$$ 41965 42583 23464 -6611 -33117 -44660 -35033 -8861 21176 40664 42076 23895 -6280 -33876
649c3876j1618J1230K7328K9174J7991K2j8011k8443k6743j1586J0098K6679L0374
$$ -33876 -45494 -34264 -6936 22238 40229 40251 22240 -6203 -32946 -44532 -34434 -7755 22619
662B2619J8894l38k0171k9605k4874q926J0646K4125K7455K0292K724j9334l3211
$$ 22619 41513 41175 21004 -8601 -33475 -42401 -31755 -7630 19825 40117 42841 23507 -9704
675i704k7565o136J5278K4193K3284J6857M515j5075l2388l1283r180J8068K8458
$$ -9704 -37269 -43405 -28127 -3934 19350 36207 40722 25647 -6741 -38024 -47204 -29136 -678
688f78K4064J2229N60j3926k7361k8831j2061J3480K9470K8233J4867k826j8640
$$ -678 23386 35615 36175 22249 -5112 -33943 -46004 -32524 -3054 25179 40046 37220 18580
701A8580k8106k3843p110J1356K3260K6313J9228K357k0857l4699k5883j556J7883
$$ 18580 -9526 -33369 -40479 -29123 -5863 20450 39678 42035 21178 -13521 -39404 -40960 -23077
714b3077K2360J7888J5945P424j3945l5586l3290m829K3484K8963J7714P412K769
$$ -23077 -717 17171 33116 40540 26595 -8991 -42281 -47110 -23626 5337 23051 30463 33232
727C3232r879k7333l2315j1891J8499L2233K5306R035m514j6077k5044k3853q162
$$ 33232 23353 -3980 -36295 -48186 -29687 2546 27852 36887 32373 16296 -8748 -32601 -40763
740d0763J2685K4734K6012J6704n40k1204l2925k3192Q6J8453J9969J7006J5559
$$ -40763 -28078 -3344 22668 39372 38832 17628 -15297 -38489 -38403 -19950 19 17025 32584
753C2584P683j5567l7158l1416j017K6429K6789J3209O067M385p949k9402l3664
$$ 32584 40267 24700 -12458 -43874 -44891 -18462 8327 21536 27603 31988 24039 -5363 -39027
766c9027r662K2883L3541K1131M254n116j2252k2796k5509r645J4655K8020K6168
$$ -39027 -48689 -25806 7735 28866 33120 28004 15752 -7044 -32553 -42198 -27543 477 26645
779B6645J2241m638k0869k8726k0365m37J6109K0719J8453J5216L922j8342l5438
$$ 26645 38886 34248 13379 -15347 -35712 -36149 -20040 679 19132 34348 38270 19928 -15510
792a5510k7141J540K5200K4336J2203O646N038r976l0432l2497n923K4601L3066
$$ -15510 -42651 -41111 -15911 8425 20628 27274 32312 22336 -8096 -40593 -46516 -21915 11151
805A1151J6866K168l998j0853k2894k5586r411J6846L0255K4044Q401p204j9337
$$ 11151 28017 30185 26187 15334 -7560 -33146 -42557 -25711 4544 28588 36989 29785 10448
818A0448k4832j8972k640J4922K2953K0535J3171j025j9691l2202k2161K475K1428
$$ 10448 -14384 -33356 -35996 -21074 1879 22414 35585 34560 14869 -17333 -39494 -37019 -15591
831a5591K3005J3652Q553J928j3234l0274k7847k509K4273K9118J5812K683l763
$$ -15591 7414 21066 29619 31547 18313 -11961 -39808 -42317 -18044 11074 26886 29569 25806
844B5806j2096k3351k4486o822J8123L0350K2028N194q358j7670k2439j8304l430
$$ 25806 13710 -9641 -34127 -40949 -22826 7524 29552 34746 26388 8718 -13721 -32025 -35455
857c5455J4763K4518K1498J0595n267k0765k7273j8231R92J8227K2368J7552Q609
$$ -35455 -20692 3826 25324 35919 30652 9887 -17386 -35617 -34625 -16398 5970 23522 32131
870C2131k410j7203k8099k1851n2K1084K5943J6600M581m835j5072k3908k1400
$$ 32131 29721 12518 -15581 -37432 -37484 -16400 9543 26143 30724 25889 10817 -13091 -34491
883c4491l062J8579K7504K0218M820q823j7717k1965j7380k210J5179K5356K1651
$$ -34491 -37553 -18974 8530 28748 33568 24745 7028 -14937 -32317 -34527 -19348 6008 27659
896B7659P163q297k0219k3752j6050P06J6732K2700J8831Q004o268j9571k5165
$$ 27659 34822 26525 6306 -17446 -33496 -32790 -16058 6642 25473 33477 27209 7638 -17527
909a7527j6685Q61J8039K3880J7585O132p058j8185k3385j7122m16J7490K5265
$$ -17527 -34212 -33351 -15312 8568 26153 32285 25227 7042 -16343 -33465 -33881 -16391 8874
922H874J8934N129r411j8413k1966j5364k51J5852K4702J9475O350r507k0341
$$ 8874 27808 32937 23526 5113 -16853 -32217 -32468 -16616 8086 27561 33911 24404 4063
935D063k2010j4188R99J5840K3077J9381O200r078k0297k2718j4105K239J6061
$$ 4063 -17947 -32135 -31136 -15296 7781 27162 33362 24284 3987 -18731 -32836 -30597 -14536
948a4536K2804J8534N972r103j9996k2041j4120K038J6327K3092J7977N740r623
$$ -14536 8268 26802 32774 23671 3675 -18366 -32486 -30448 -14121 8971 26948 32688 23065
961B3065j9915k1835j3258J962J6359K2822J8179N418r993k0280k1476j2710K390
$$ 23065 3150 -18685 -31943 -29981 -13622 9200 27379 32797 22804 2524 -18952 -31662 -29272
974b9272J5961K2854J7812N226j0396k0229k1109j2346K719J6057K2164J7779
$$ -29272 -13311 9543 27355 32581 22185 1956 -19153 -31499 -28780 -12723 9441 27220
986B7220M951j0486k0571k0823j1486K627J6376K1756J7501N071j0690k0462k1251
$$ 27220 32171 21685 1114 -19709 -31195 -28568 -12192 9564 27065 32136 21446 984 -20267
999b0267j1310L448J6475K1608J7226M203j0169k0388k0690j1211L342J6504K1542
$$ -20267 -31577 -28129 -11654 9954 27180 31383 21214 826 -19864 -31075 -27733 -11229 10313
1012A0313J7009L722j0632j9894k0661j0717L428J6565K1337J6723L751j1247
$$ 10313 27322 31044 20412 518 -20143 -30860 -27432 -10867 10470 27193 30944 19697
1024A9697j9976k0248j0436M080J6621K1449J5957L110j0888j9872j9851r889
$$ 19697 -279 -20527 -30963 -26883 -10262 11187 27144 30254 19366 -506 -20357 -30246
1036c0246L910J7025K0827J5402L220j0762k0456j9324r883M360J6521K1070J5514
$$ -30246 -26336 -9311 11516 26918 30138 19376 -1080 -20404 -30287 -25927 -9406 11664 27178
1049B7178K587j1306k0340j8852r469M626J6573K0842J5080K774j1497k0063j9253
$$ 27178 29765 18459 -1881 -20733 -30202 -25576 -9003 11839 26919 29693 18196 -1867 -21120
1062b1120q831M872J6529K0810J4711K091j1293j9995j8946q781N000J7068K0715
$$ -21120 -29951 -25079 -8550 12260 26971 29062 17769 -2226 -21172 -29953 -24953 -7885 12830
1075A2830J4412J381j1575j9573j8297q845N154J6703K0723J4101J320j1738j9581
$$ 12830 27242 28623 17048 -2525 -20822 -29667 -24513 -7810 12913 27014 28334 16596 -2985
1088b985j8281p911N223J6528K0366J4216J592j2525j9714j7922p698N475J6815
$$ -2985 -21266 -29177 -23954 -7426 12940 27156 28748 16223 -3491 -21413 -29111 -23636 -6821
1101f821J9712J3892J503j2344j9957j7724p309O490J6303J9147J3625J489j2533
$$ -6821 12891 26783 28286 15942 -4015 -21739 -29048 -22558 -6255 12892 26517 28006 15473
1114A5473j9361j7941p236O575J6623J9728J2435R11j2560j8713j7341p201O224
$$ 15473 -3888 -21829 -29065 -22490 -5867 13861 26296 27207 14647 -4066 -21407 -28608 -22384
1127b2384J6649J9372J3424K47j3098j9217j6290o188N635J5987J9120J4323K12
$$ -22384 -5735 13637 27061 27308 14210 -5007 -21297 -27485 -21850 -5863 13257 27580 27792
1140B7792j3545k0448j6416m440O402J5547J8139J3157J471j3136k0771j6981
$$ 27792 14247 -6201 -22617 -27057 -20655 -5108 13031 26188 27659 14523 -6248 -23229
1152b3229m832Q152J6308J7203J1992O76j2322j9407j6983n748P515J7199J7967
$$ -23229 -28061 -19909 -3601 13602 25594 26270 13948 -5459 -22442 -28190 -20675 -3476 14491
1165A4491J2143j012j3380j8699j4972n005O177J5590J8505J3921m63j5403k0708
$$ 14491 26634 25622 12242 -6457 -21429 -26434 -20257 -4667 13838 27759 27296 11893 -8815
1178h815j3711k447P416J3295J6602J3933J589j4390k2550j5869j330R991J4605
$$ -8815 -22526 -24973 -17557 -4262 12340 26273 27862 13472 -9078 -24947 -26277 -16286 -1681
1191a681J4511J1124K212j2126k1003j7294l789J0189J6888J6189R957r35j2758
$$ -1681 12830 23954 26166 14040 -6963 -24257 -28046 -17857 -969 15220 25177 24242 11484
1204A1484j8484j5009m130P107J5878J8335J2623k010j6231j9888j2133r87P434
$$ 11484 -7000 -22009 -26139 -19032 -3154 15181 27804 25794 9563 -10325 -22458 -23445 -16011
1217a6011J1870J6046J4790J624j6491k3598j4058J562J0899J2428J2462J1636
$$ -16011 -4141 11905 26695 28319 11828 -11770 -25828 -24266 -13367 -939 11523 23159
1229B3159L523j2845k2731j7277r59J2765J6030J3049Q482J47j1815j8974j5527
$$ 23159 26682 13837 -8894 -26171 -27130 -14365 1665 14714 23196 23343 11528 -7446 -22973
1242b2973l420R474J6368J6828J0120k779j5317j9177j1501m15P536J2399J5931
$$ -22973 -26393 -16919 -551 16277 26397 23618 8301 -10876 -22377 -22792 -15256 -2857 13074
1255A3074J3867M7j7392k2856j2464L486J0976J0854J1492J2053L409j3945k3805
$$ 13074 26941 26988 9596 -13260 -25724 -22238 -11262 -408 11084 23137 26546 12601 -11204
1268a1204j6056J429J3831J5302J0677P694O77j1239j9850j5777j649J1235J7064
$$ -11204 -27260 -25831 -12000 3302 13979 21673 22350 11111 -8739 -24516 -26165 -14930 2134
1281B134J4637Q185l129j4696j8016j1537m60Q433J3443J5752J1728j928j7271
$$ 2134 16771 24956 21827 7131 -10885 -22422 -22882 -14449 -1006 14746 26474 24546 7275
1294G275k1295j0545L693J0189J0908J1842J1548J677j4956k3398j4376L854J3966
$$ 7275 -14020 -24565 -20872 -10683 225 12067 23615 25292 10336 -13062 -27438 -23584 -9618
1307i618J3399R972P812L12j1636k0480j5026o4J2718J6441J3162O213l112j3318
$$ -9618 3781 13753 21565 21877 10241 -10239 -25265 -25329 -12611 3830 16992 23205 20093 6775
1321F775j8042j1426j70R488J4978J4886Q888l614j6055j9523r860K678J0336
$$ 6775 -11267 -22693 -22863 -13375 1603 16489 25377 21763 5708 -13815 -23675 -20997 -10661
1334a0661J2393J2526R644j508j4844k1233j1871L414J2819J3293J0927P008j236
$$ -10661 1732 14258 23902 22394 7550 -13683 -25554 -22140 -9321 3972 14899 21907 20671
1347B0671j2805j9230j3229J103J2517J5871J2123N238l498j3217j7072j1557
$$ 20671 7866 -11364 -24593 -23490 -10973 4898 17021 22259 18761 5544 -11528 -23085
1359b3085L80J1153J4944J3951O676m844j4846j6979j0119J709J0545J3884J3205
$$ -23085 -22705 -11552 3392 17343 24019 19175 4329 -12650 -22769 -21060 -10515 3369 16574
1372A6574O956l929j5113j7797j0282K066J1969J4053J2410N900l970j4048j7147
$$ 16574 23530 19601 4488 -13309 -23591 -21525 -9556 4497 16907 22807 18837 4789 -12358
1385a2358j0770J396J1594J5099J2661N298n103j4318j5888j0308J326J1057J5256
$$ -12358 -23128 -21732 -10138 4961 17622 22920 17817 3499 -12389 -22697 -21371 -10314 4942
1398D942J3030N184n690j4220j6060r589J248J1109J5391J2991M149o025j3639
$$ 4942 17972 23156 17466 3246 -12814 -22403 -21155 -10046 5345 18336 22485 16460 2821
1411B821j5383r702R79J1295J5819J3049M232p110j4538j4146q603R18R821J5912
$$ 2821 -12562 -22264 -21285 -9990 5829 18878 23110 16000 1462 -12684 -21287 -20369 -10548 5364
1425E364J3562M586p710j4963j4393p934J925J0203J4831J2810M701o933j4486
$$ 5364 18926 23512 15802 839 -13554 -21488 -19563 -9360 5471 18281 22982 16049 1563
1438A563j4955q832K140J1761J5187J1840L054o916j3383j4296q532P05J1091
$$ 1563 -13392 -22224 -20084 -8323 6864 18704 21758 14842 1459 -12837 -21369 -20664 -9573
1451i573J6651J3218J961q993j3477j2051p744J44R445J6648J3709L475r373j5352
$$ -9573 7078 20296 22257 13264 -213 -12264 -20008 -19864 -10419 6229 19938 23413 14040 -1312
1465a312j2864n948K066R188J4478J3123M169p933j5513j4074o995L118J1153
$$ -1312 -14176 -20124 -18058 -8870 5608 18731 22900 14967 -546 -14620 -21615 -18497 -7344
1478g344J4588J1547K503p632j3275j3635p905J243J1702J6473J2131R48r392
$$ -7344 7244 18791 21294 13662 387 -13248 -21153 -19910 -8208 8265 20396 21344 11952
1491A1952j3101j1401o656m0R907J6718J3371K289j0555j5245j1130n163J695
$$ 11952 -1149 -12550 -19206 -19246 -9339 7379 20750 23039 12484 -2761 -13891 -19054 -17359
1504a7359R031J4498J3200L318r204j5569j3282n146L753J0342J3770J1410J808
$$ -17359 -8328 6170 19370 22688 13484 -2085 -15367 -20513 -16760 -6418 7352 18762 20570
1517B0570p682j3734j3197o849K755J1792J4984J1168N90r251j2892j1739o042
$$ 20570 12888 -846 -14043 -20892 -18137 -6345 8639 19807 20397 11146 -1746 -13485 -19527
1530a9527J562J0418J5900J2143R38j0944j3819j0816m562K292R549J4399J2165
$$ -19527 -17965 -7547 8353 20496 21434 10490 -3329 -14145 -18707 -16415 -6866 7533 19698
1543A9698J891r825j5266j2121m198L836J0655J3529J0475J880q676j4124j3145
$$ 19698 21589 11764 -3502 -15623 -19821 -15985 -5330 8199 18674 20554 11878 -2246 -15391
1556a5391n163L974J1759J4440R391L72q466j3434j1992n806L307J1644J5082
$$ -15391 -20554 -16580 -4821 9619 19010 19382 10916 -2518 -14510 -20316 -17009 -5365 9717
1569I717R936k8r539j3467j1102m897L452J0598J4147J0611P62r996j4189j1380
$$ 9717 19653 19625 10086 -3381 -14483 -19380 -15928 -5330 8817 19428 20190 10194 -3995 -15375
1583a5375m210M486J1048J3010R608J186r206j4164j1919m291M628J1799J3311
$$ -15375 -19585 -15099 -4051 8959 18567 19753 10547 -3617 -15536 -19827 -15199 -3400 9911
1596I911Q730J70q575j3446j1899m824M580J2184J3237Q746n56q720j3554j0983
$$ 9911 18641 18811 10236 -3210 -15109 -19933 -15353 -3169 10068 18814 18258 9538 -4016 -14999
1610a4999m673M961J1532J3354Q814m15r148j3684j1179m083N033J1729J3106
$$ -14999 -19672 -14711 -3179 10175 18989 18574 9426 -4258 -15437 -19520 -14487 -2758 10348
1623A0348Q439m61r375j3215j1259l754N104J1616J2953P907l08r263j3174j1107
$$ 10348 18787 18326 8951 -4264 -15523 -19277 -14173 -2557 10396 18303 17995 8732 -4442 -15549
1637a5549l838N583J1807J2700P806q39q966j3540j0605l833N474J2025J2680
$$ -15549 -19387 -13804 -1997 10703 18509 17670 8704 -4836 -15441 -19274 -13800 -1775 10905
1650A0905P372j079q724j3291j0685l812N644J2170J2767P240j404r678j2631
$$ 10905 18277 17198 8474 -4817 -15502 -19314 -13670 -1500 11267 18507 17103 7425 -5206
1663e206j0237l672N706J1919J2934P121j373r441j3134j0393k875N474J2061
$$ -5206 -15443 -19115 -13409 -1490 11444 18565 17192 7751 -5383 -15776 -18651 -13177 -1116
1676a116J2524P046j609r496j2958j0340k791O091J1911J2112O982j680r570j2733
$$ -1116 11408 18454 16845 7349 -5609 -15949 -18740 -12649 -738 11374 18356 16676 7106 -5627
1690e627j0423k677O113J2281J2229O374k337r413j2236j0481k069O024J1966
$$ -5627 -16050 -18727 -12614 -333 11896 18270 15933 6520 -5716 -16197 -18266 -12242 -276
1703b76J2308O479k730r451j2674r758k357O400J2032J1812O491k388r844j2552
$$ -276 12032 18511 15781 6330 -6344 -16102 -18459 -12059 -27 11785 18276 15888 6044 -6508
1717f508r444k101O279J2156J1582O310k630r811j2425r369k058O459J2237J1343
$$ -6508 -15952 -18053 -11774 382 11964 18274 15644 5833 -6592 -15961 -18019 -11560 677 12020
1731A2020O042k700j0201j1829r370j762O788J1737J1580N524k558r887j2374
$$ 12020 18062 15362 5161 -6668 -16038 -17800 -11012 725 12305 17829 15271 5384 -6990
1744f990q912j588O577J1828J1503N563k923j0221j2080q922j363P080J1628J1391
$$ -6990 -15902 -17490 -10913 915 12418 17981 15058 4837 -7243 -16165 -17528 -10448 1180 12571
1758A2571N473l553j0001j1997q649p74O730J1722J0723N489l198r960j2375q014
$$ 12571 18044 14491 4490 -7507 -16156 -16930 -10200 1522 12245 17734 14536 4576 -7799 -15813
1772a5813r65O669J1832J0612N406l296j0441j1620q175j224P180J1604J0822
$$ -15813 -16778 -10109 1723 12335 17741 14445 4004 -7616 -15791 -17015 -9835 1769 12591
1785A2591N137l521j0291j1994p794p86P138J1648J0610M932l608j0406j1818
$$ 12591 17728 14207 3916 -8078 -15872 -16658 -9520 2128 12738 17670 14062 3656 -8162
1798h162p617q98P461J1813J0390M054l541r966j1553q072k31P129J1819J0431
$$ -8162 -15779 -16677 -9216 2597 12987 17041 13500 3534 -8019 -16091 -16322 -9193 2626 13057
1812A3057M128l979r971j1511p789l20P334J1918J0088M283m171j0305j1261p577
$$ 13057 17185 13206 3235 -8276 -16065 -16385 -9051 2867 12955 17238 13067 2762 -8499 -16076
1826a6076J93P460J1530J0003L598l772r728j1601q093L35Q009J1823R186L692
$$ -16076 -15883 -8423 3107 13110 16708 12936 3208 -8393 -16486 -16151 -8142 3681 12867 16559
1840A6559m139r763j0784p913l87Q027J2285J0080K396m807r373j0406p452m13
$$ 16559 12420 2657 -8127 -16040 -16427 -8400 3885 13965 16361 11554 2181 -8225 -15677 -16090
1854a6090P716J1928J0334L130n150j0633j0055o408j08P441J1445R655L235m130
$$ -16090 -8374 3554 13888 17018 11868 1235 -8820 -15228 -15336 -7895 3550 13205 16440 12310
1868A2310j0061j1790o895P98Q934J1362Q451K518l957q927j1110q181J34R155
$$ 12310 2249 -9541 -16436 -15638 -6704 4658 13109 15627 11670 2743 -8367 -16548 -16414 -7259
1882g259J2869Q902P15n376q262q875p833j083Q167J2934J0296J213o488r410
$$ -7259 5610 14512 15227 9851 1589 -7286 -15119 -16202 -8035 4899 15195 16408 9920 510
1896E10r126n978J24O961J1737R805K487n595j0341j0116o343J370Q723J1425
$$ 510 -8616 -14594 -14470 -7509 4228 14033 16520 10925 584 -9532 -15875 -14505 -5782 5643
1910E643P683J258l806q776j0640q250N71J0289J2997P780q34n521p506q073p793
$$ 5643 13326 14584 10778 2002 -8638 -16888 -16317 -6028 6969 14749 13915 8394 888 -7185 -14978
1925a4978j499Q866J4252R659q78p715q643p134n544q54O853J2407J0414J189
$$ -14978 -16477 -7611 6641 16300 15422 7707 -936 -8070 -13614 -14468 -7615 4792 15206 16395
1939A6395p053j0077r176n118J626Q198J0701P827J172m381q983j0269p562J367
$$ 16395 9342 -735 -9911 -15029 -13403 -5205 5496 13323 14495 10114 1131 -9138 -16700 -15333
1953a5333J0613J2669O427j271n433o707q160p976j224R907J4779Q328j983q691
$$ -15333 -4720 7949 14376 13105 7672 965 -7195 -15171 -16395 -6488 8291 16619 14636 5945
1967E945p455o233n266j283P155J3060J0361k70q349j0153p694m069J690P627
$$ 5945 -1510 -7743 -13009 -14292 -7137 5923 16284 16014 7665 -2488 -10182 -14251 -12561 -4934
1981d934J0797Q357L68n638r363r662o036K281J0367J1753N931j485n688o916
$$ -4934 5863 14220 14588 8950 -413 -10075 -16111 -13830 -3463 8290 14221 12736 7048 132
1995A32q160p499J29J0208J4416P293l334p768p093o143n511j069P709J3732R685
$$ 132 -8028 -15527 -15398 -5190 9226 16519 13185 5417 -1676 -7819 -13330 -14399 -6690 7042 16727
2010A6727j101r859r215o325l451J167O941J1273Q260M20o862j0257q560m241
$$ 16727 15626 5767 -3448 -9773 -13224 -12057 -5116 6157 14417 14837 7975 -2282 -10842 -15083
2024a5083K575R643J1179N487j116n830p765q523o259J630J0222J3058O569k986
$$ -15083 -12508 -2865 8314 13801 12685 6855 -910 -9433 -15692 -14062 -3840 9218 15787 12801
2038A2801p798p213o275m884l10Q690J3273Q381k765q484r149n995k880J003P317
$$ 12801 5003 -2210 -8485 -13369 -13679 -4989 8284 16665 13900 5416 -3733 -9728 -12608 -11605 -4288
2053d288J1140P850l10p663j0082p684l226L099Q730J0170O100j235o123q728
$$ -4288 6852 14702 14392 6729 -3353 -11037 -14263 -11164 -2434 7736 13836 12601 6478 -2250
2067b250p996m425K237J0134J1304N644k518p115p634o969m572J831R074J2056
$$ -2250 -10246 -14671 -12434 -2300 9004 14648 12130 5015 -2619 -9588 -14160 -12329 -3255 8801
2081H801O770k356q690q628o208k471J607Q181J0655O929r98p914r675p430k441
$$ 8801 15571 13215 4525 -4103 -10311 -12782 -11175 -2994 7661 14590 13592 5678 -3997 -11427 -13868
2096a3868L479Q616R658O098r49o899r628p607l417M142Q930J0643N099k267o830
$$ -13868 -10389 -1773 7885 13983 13034 6135 -3493 -11100 -14517 -10375 -1445 9198 14297 12030 5200
2111E200q381p487k885K968Q815J0793N786k144q012q753o764k841L558Q518R913
$$ 5200 -3181 -10668 -13553 -10585 -1770 9023 14809 12665 4653 -4100 -10864 -13705 -10147 -1629 8284
2126H284O514k071p689r687o340k589M051Q519R463N379j549p419r310p039k216
$$ 8284 14798 12727 5038 -4649 -10989 -13578 -9527 -1008 8455 13834 12285 4866 -4444 -11483 -13699
2141a3699M420Q818Q937N438k066o834r288p233j737L873Q767R483M743j557p524
$$ -13699 -9279 -461 8476 13914 11848 5014 -4274 -11507 -13244 -9371 -604 8879 13622 12065 4541
2156D541q987o792k194M512Q619Q930M868j537p588r085p034j545M406R072Q818
$$ 4541 -4446 -11238 -13432 -8920 -301 8629 13497 11960 4372 -4713 -11747 -13292 -8886 186 9004
2171I004M700k098o940r605o615j722M720Q720Q627M691k022p357q953p084j022
$$ 9004 13704 11606 4666 -4939 -11554 -13276 -8556 164 8791 13482 11460 4103 -4850 -11934 -12956
2186a2956M597Q839Q616M031j728p517r022o845j066N143Q947Q184L988j813p203
$$ -12956 -8359 480 9096 13127 11399 3882 -5140 -11985 -13051 -7908 1039 9223 13211 11398 4195
2201D195r391o763r48N171Q772Q187L782k365o930r091o311j090N091Q604Q454
$$ 4195 -5196 -11959 -12907 -7736 1036 9223 13005 10640 3710 -5381 -11692 -12782 -7691 913 9367
2216I367L580k434p387q915o140p36N032R075P802L678k098p270r368o426l03
$$ 9367 12947 10513 3126 -5789 -11929 -12665 -7633 1442 9244 12922 10824 3554 -5814 -12240 -12543
2231a2543N561Q560P523M083k654p282r230n854p74N608Q807P739L362k661p357
$$ -12543 -6982 1578 9101 13184 10530 3248 -5982 -11836 -12610 -7002 1805 9544 12906 10245 2888
2246B888q904n977n22N636Q799P773L064k536p583q885n931k01N889Q363P871
$$ 2888 -6016 -11993 -12515 -6879 1920 9693 12757 10221 2638 -6247 -12178 -12379 -6490 1873 9744
2261I744K928k928o995r003n717R4N437Q355P584L287l005p369q776n646L08N484
$$ 9744 12672 9744 2749 -6254 -11971 -11877 -6440 1915 9499 12786 9781 2412 -6364 -12010 -11702 -6218
2277f218Q587P468K666l062p553q764m937k7N849Q572P148K930l416p202q794
$$ -6218 2369 9837 12503 9441 1888 -6876 -11813 -11840 -5991 2581 9729 12659 9243 2041 -6753
2292f753n198K76N986Q243P327K703l537p502q385n231N46N997Q562P337K078
$$ -6753 -11951 -11675 -5689 2554 9881 12584 9047 1545 -6840 -12071 -11525 -5528 3034 10371 12449
2307A2449l535p575q356m851N19N603Q463P302K598l625p980q097n018J070N865
$$ 12449 8914 1339 -7017 -11868 -11349 -5746 2717 10019 12617 8992 1012 -7085 -12103 -11033 -5168
2322e168Q362O630K424l253p776q450m745J138N954Q181O617K281l675p638q244
$$ -5168 3194 9824 12248 8995 1219 -7231 -11976 -10838 -4884 3297 9914 12195 8520 882 -7362
2337g362m599J097O083Q158P243J206l498p711q034m295R41O140Q069O880J753
$$ -7362 -11961 -10864 -4781 3377 10620 11826 8328 617 -7417 -11712 -10771 -4631 3438 10318 12071
2352A2071l849p705p943m032J198N723Q222O607J744l924p575q203m263J675N951
$$ 12071 8222 517 -7426 -11458 -10260 -4537 3685 10292 12036 8112 537 -7666 -11929 -10254 -4303
2367d303Q110O293J560l455p819q177m307J850O230Q171N985J287m007p273p845
$$ -4303 3807 10100 11660 8205 386 -7791 -12098 -10248 -4018 4153 10138 11425 7418 145 -7700
2382g700m085J616O216Q259O151J212m282p496p493m083J751O293P520O385J483
$$ -7700 -11785 -10169 -3953 4306 10457 11669 7387 -109 -7602 -11685 -9934 -3641 3879 10264 11747
2397A1747m370p452p928l783K014O499P650N863J162m255p496p583l840K015O605
$$ 11747 7377 -75 -8003 -11786 -9772 -3273 4377 10240 11402 7147 -349 -7932 -11772 -9757 -3152
2412c152P293O120J109m227p695p563l468J825O625P901N475R62m505p570p391
$$ -3152 4141 10261 11370 7143 -552 -8115 -11583 -9758 -3133 4768 10243 11205 6700 -870 -8261
2427h261l469K180O863P616N203Q53m433p741o953l421K278O299Q009N486L22
$$ -8261 -11730 -9550 -2687 4929 10132 10985 6552 -1189 -8142 -11563 -9285 -2986 5023 10509 10831
2442A0831m308p640p111l300K390O636P429N216O53m296p312p594l252K590P027
$$ 10831 6523 -1117 -8228 -11528 -9138 -2502 4927 10143 10796 6500 -812 -8406 -11658 -9068 -2041
2457b041P363M753K90m169p361o976l429K483O961P914M452j28m326p104o743
$$ -2041 5322 10075 10365 6196 -1165 -8141 -11570 -9087 -2126 5788 10240 10112 5786 -1318 -8061
2472h061l313K288O782P816M907J02n001p385o525k825K476O818P570M440L35
$$ -8061 -11374 -9086 -2304 5512 10419 10521 5520 -1865 -8390 -11215 -8739 -1921 5649 10089 10424
2487A0424n143o771p047k663K862O876P220M186lm315p169p091k649K691O986
$$ 10424 5281 -1490 -8537 -11200 -8338 -1462 5758 9944 9941 5626 -1543 -8634 -11283 -8592 -1606
2502a606P628M110l86m818o667o541k816K488P090P719M367o72n046o765o347
$$ -1606 6022 10132 9746 4928 -1739 -8280 -11096 -8608 -1518 6201 10568 9896 4850 -1915 -8262
2517h262k652K688P007P228M031q1n081p269o358j876K787O884P028M153q46m562
$$ -8262 -10914 -8226 -1219 6009 10040 9959 4878 -2391 -8749 -10625 -7838 -954 6074 10227 9381 4819
2533D819p164o297k430L355O936O788M279j090m776o937o181k141L358O588P403
$$ 4819 -2345 -8642 -11072 -7717 -781 6007 10286 9196 4420 -2517 -8698 -10839 -7481 -893 6510
2548F510L724j327m365p158n984k179L390P030O582M179q48n304p169n820j749
$$ 6510 10234 8907 4542 -2616 -8600 -10779 -7389 -359 6223 10402 9554 4250 -2919 -8739 -10488
2563a0488L254O701P057L730j211n084o935o042j345L275O639O986L929j440m969
$$ -10488 -7234 -533 6524 10254 9043 3959 -2976 -9018 -10363 -7088 -449 6537 10466 9026 4057
2578D057p354n491j268L319O500O451M135r63n360p499n662j001L551O679O404
$$ 4057 -3297 -8788 -10056 -6737 -237 6214 10349 9386 4026 -3473 -9135 -10136 -6585 94 6498
2593F498L792j444m854p282n790j141L577O978O453L457j498n441o801n200j400
$$ 6498 10290 8846 3992 -3290 -9080 -10221 -6644 334 6787 10244 8746 3305 -3496 -8696 -10096
2608a0096L531O712O665L456j418n807p281m506p94L568O009O046L798p19n779
$$ -10096 -6565 147 6812 10268 8850 3043 -4238 -8744 -9538 -5970 39 6085 9883 9164 3385
2623C385p586n221q5L881O482N594L022o10n264p593n440m65M210O793N458K878
$$ 3385 -4201 -9422 -9507 -5626 856 6450 9472 8862 3598 -3995 -9435 -9900 -5690 1103 6561 9439
2639I439j134n382o918m929o38L486O629O496L289j674o536o782m120r8L405N639
$$ 9439 8305 2923 -3995 -8924 -9562 -6076 553 7049 10338 8664 2128 -4654 -8774 -8872 -5467 172
2655A72O131L805j293o235p628m597N61M610N514N206K879m84n623p663m992j98
$$ 172 6303 10108 8815 2580 -5048 -9645 -9084 -4474 1040 6246 9125 8641 3018 -4645 -9637 -9835
2671i835M992O724M797K699j761m938o863n066n9M023O683N882K551k093o148
$$ -9835 -4843 1881 6678 9377 7616 2678 -4185 -9251 -9310 -5287 1396 7278 9829 7736 1588
2686A588o398m051R7L703N860O186L021j505o687p698l596J009M438N845M204
$$ 1588 -4810 -8861 -8764 -5061 799 6985 10006 8501 1814 -5884 -9480 -8471 -4033 1812 6016
2701F016L476j330n725p926m512P65N363N796M730K151j450n080p181m472M14
$$ 6016 9492 8162 2437 -5489 -10001 -9236 -3873 1923 6653 8804 7354 2274 -4907 -9379 -8965
2716h965M540O254N631J653j912o079o106l847J63M370N858N472K987k319o476
$$ -8965 -4425 1829 7460 9113 7201 1122 -4984 -8831 -8668 -4298 1560 7032 10019 7700 1224
2731A224p199l234J454M387M809N167K576j357o385p262m081J425N483N343M289
$$ 1224 -5975 -9209 -7755 -3368 1441 6608 9184 7827 1442 -5820 -9901 -8476 -2993 2350 6639
2746F639K169j961n378o668m199N66N075O483M710J297k304n533o492l243K83
$$ 6639 8808 6847 1469 -5199 -9398 -8832 -3757 2726 7436 8733 6429 896 -5596 -8839 -8556
2761h556M716N987N216J977k658o180o321l013J257M337N518M631K187k328o071
$$ -8556 -3840 2147 7363 9340 6682 502 -5819 -8832 -7575 -3238 2280 6911 9098 6770 699
2776F99o597l750J692N067N733M444J570k258n631o601l725J149N031O276M328
$$ 699 -5898 -9648 -7956 -2889 2844 7288 8858 6600 969 -5632 -9357 -8208 -3177 3099 7427
2791G427J342k665n456o230l420J215M626O179M567J342k844o140n981k816J355
$$ 7427 8769 6104 648 -5582 -9002 -7787 -3161 3018 7585 8927 6083 -57 -6038 -8854 -7499
2806g499M441N925M477J321k580o024o048k890J403N095N353M201J158k218n711
$$ -7499 -3058 2867 7344 8665 6085 61 -5987 -8877 -7474 -2379 2974 7175 8333 6115 404
2821D04o275l057J551M683O108M311R06l015n712n585l154J663M419O251M119
$$ 404 -5871 -8928 -7377 -2694 3414 7725 8631 5616 -96 -5681 -8835 -7172 -2753 3498 7617
2836G617J086l148n784o066k539J650M360O207M086P67k864o176n012l041J766
$$ 7617 8703 5555 -229 -6295 -8834 -7184 -2824 3383 7469 8236 5372 -804 -5816 -8857 -7091
2851g091M708N829M248O21l169n679n362k740J652M642N931M206K45l275n291
$$ -7091 -2383 3446 7694 8315 5146 -533 -5895 -8635 -6983 -2341 3590 7796 8041 4766 -525
2866e25n698k330J552N019N531M164N42l373n740n314k540J851M748O029L980
$$ -525 -6223 -8553 -7001 -1982 3549 7713 8255 4882 -858 -6172 -8712 -6861 -2113 3916 7896
2881G896L83l373o047m914k511J630M901N993L824M43l742n494n238k012J561
$$ 7896 8279 4906 -1141 -6055 -8566 -6936 -2035 3958 7782 8225 4483 -1011 -6249 -8261 -6700
2896f700M519O099L936K22l642n718n121j965J606N229N629L828j14l634n420
$$ -6700 -2181 3918 7854 8076 4434 -1284 -6405 -8370 -6764 -1535 4094 7922 7808 4174 -1246
2911a246n121j836K156M224N894L762l48l218n878m778j973J837N182N788L410
$$ -1246 -6367 -8203 -6047 -1823 4071 7833 7485 4267 -1611 -6389 -8362 -6525 -1343 4445 7855
2926G855o5l600n731n000j267J622M935N504L579l21l757n443m494k189K179M962
$$ 7855 7790 4190 -1541 -6541 -7808 -6186 -1251 4253 7832 7511 3754 -1689 -6183 -8372 -6193 -1231
2942a231N445L641k11l874n437m885j650K471M668N560L102k1l842n485m603j691
$$ -1231 4214 7855 7644 3770 -1667 -6552 -8202 -5731 -1063 4497 7599 7578 3736 -1749 -6352 -8043
2958h043K297M935N294L365m02l687o020m266j530K191N233M897L222l26l598
$$ -8043 -5746 -811 4483 7848 7446 3759 -2261 -6527 -8057 -5866 -633 4264 7486 7160 3562
2973C562n417m684j611K639M937N287K957o13l616n377m649j389K213N055N595
$$ 3562 -1855 -6539 -8150 -5511 -574 4713 7670 7057 3441 -1936 -6585 -7974 -5761 -706 4889
2988D889K898r39l635n772l980j408K622M798N419K833o36m051n399m435j005
$$ 4889 7787 6848 3213 -2559 -6539 -7947 -5325 -527 4892 7725 7089 3038 -2361 -6796 -7801
3003g801K611M788N143L025p86m314n479l869j183K814N023N054K452n47m045
$$ -7801 -5190 -402 4741 7766 6980 2666 -2813 -6682 -7865 -5051 -28 5026 7478 6931 2886
3018B886n404m084j531K620N495M923K658r80m021m949l965j491K865M876M974
$$ 2886 -2518 -6602 -8133 -5513 -18 4905 7563 6583 2562 -2387 -6352 -7843 -4978 -102 4872
3033D872K781j023l907n530l808j140K979M843N021K321p29m443n272l687m45
$$ 4872 7653 6630 2723 -2807 -6615 -7755 -4776 67 5088 7409 6680 2237 -3035 -6722 -7167
3048g167K473N216M432K464r03m169m894m274q25K761N298M774K223j122m087
$$ -7167 -4694 522 4954 7418 6515 2346 -2548 -6822 -7647 -4886 412 5186 7409 6287 2200
3063B200n204l615p05K599N133M956K192j486m213m970l457o51K816M661M994
$$ 2200 -3004 -6619 -7324 -4725 408 5364 7556 6070 1857 -3113 -6570 -7221 -4405 256 5250
3078E250K533j645m225n194l664NK715M938M555K393j454m459n220l339n05L386
$$ 5250 7783 6138 1913 -3281 -6945 -6940 -4225 713 5268 7661 6207 1748 -3472 -6811 -7316 -3930
3094c930M965M415K077j742m321m637l642m15L288M949M516J907j579m205n163
$$ -3930 1035 5450 7527 5785 1464 -3173 -6815 -7230 -3942 1007 5523 7430 5851 1646 -3517
3109c517l418j26L053M641N021K207k008m712m509l213k34K828M883M424K218
$$ -3517 -6935 -7061 -4008 633 5654 7861 5853 1141 -3368 -6581 -6815 -3987 896 5320 7538
3124G538j798m738m903l064K07L255M328M418K391k035m396n057k962M77K576
$$ 7538 5740 1002 -3901 -6965 -6758 -3503 825 5243 7634 5599 1203 -3854 -6816 -6339 -3763
3139c763N262M131J644j750m481m745k649k40L158M798M283J848k114m558m793
$$ -3763 1499 5630 7274 5524 1043 -3702 -6351 -6591 -3433 1365 5648 7496 5382 824 -3969
3154c969k792J43K758N009M784J602j937n004m755k362J68K893N029M080J729
$$ -3969 -6761 -6618 -3860 1149 5933 7535 5598 594 -4161 -6523 -6355 -3462 1567 5647 7376
3169G376j611m949m735l113P14L077M592M491J110j967m277m646k657K69L256
$$ 7376 5765 816 -3919 -7032 -6318 -3241 1351 5842 6952 4985 708 -3938 -6595 -6326 -3070
3184c070M879M121J276k147m665m435k365M13K989M533M429J286k271m932m566
$$ -3070 1809 5930 7206 5059 394 -4041 -6406 -5993 -3004 1529 5958 7244 4973 41 -4525
3199d525j812O61K909M448M363J136k222m680m769k364R95L246M567L690J494
$$ -4525 -6337 -5676 -2767 1681 6044 7180 4958 278 -4491 -6855 -5860 -2614 1953 5643 7137
3214G137k350m379m849k433O34L657M824L547J089k444m467m310k260P12L166
$$ 7137 4787 408 -4441 -6874 -6240 -2583 2241 5788 6877 4433 -34 -4344 -6604 -5892 -2726
3229b726M689M208R80k833m649m128k061Q99L340M344L887J048k259m670m885
$$ -2726 1963 6171 7151 4318 -331 -4459 -6520 -5621 -2281 2063 5950 6998 4739 69 -4816
3244d816j796J016L270M557L435R33j935m618m481k303J137L440M435L622R21
$$ -4816 -6612 -5596 -2326 2231 5666 6599 4664 46 -4435 -6738 -5601 -2161 2274 5896 6817
3259F817k742m444m246k080J239L127M743L837N82k575m987l967j656R56L622
$$ 6817 4075 -369 -4615 -6695 -5456 -2329 2414 6251 6833 4258 -729 -4696 -6352 -5396 -1774
3274a774M124L927M33k453n014m146j570J292L394M513L242Q23k982m430m479
$$ -1774 2350 6277 6710 4257 -757 -4903 -6473 -5181 -1787 2726 5968 6791 3809 -621 -5100
3289e100j366J303L215M641L097O92k676m660l894j674J054L925M370L033O34
$$ -5100 -6466 -5163 -1948 2693 5790 6482 3806 -854 -4748 -6422 -5368 -1443 2927 5960 6594
3304F594k630m874l728j914J310L645M404L170M09k726m967l673j473J304L839
$$ 6594 3964 -910 -4638 -6552 -5242 -1597 2807 5977 6386 3660 -1307 -4980 -6453 -5149 -1310
3319a310M291L307k20k586m286m043j540J630L456M426K754N01k984m482l701
$$ -1310 2981 6288 6068 3482 -804 -4847 -6387 -4757 -1301 3125 5879 6380 3396 -1086 -4787
3334d787j660J236L841M310K955K42k794m523l652j644J583M096M182K387L38
$$ -4787 -6447 -5211 -1370 2940 5895 6137 3343 -1180 -4832 -6476 -4893 -797 3385 5772 6110
3349F110k950m486l755j706J655M086M258K695o2l032m229l619j339J494M123
$$ 6110 3160 -1326 -5081 -6787 -5132 -1046 3212 5907 5845 2813 -1416 -5035 -6374 -4880 -757
3364g57M121K969m09l027m197l437j514J501M122M196K634l94l290m088l469r66
$$ -757 3364 6333 5924 2897 -1300 -4737 -6251 -4750 -628 3568 6202 5808 2518 -1570 -5039 -6005
3380f005J444L593M343K736n65k786m300l600j095J611M202L891K424m49k979
$$ -6005 -4561 -968 3375 6111 5546 2760 -1540 -5140 -6235 -4624 -422 3469 5893 5444 2465
3395B465m093l471r61J445M235L843K885r48l053m320l363p38J610L806M369K054
$$ 2465 -1628 -5099 -6060 -4615 -380 3463 6348 5400 2347 -1973 -5336 -6074 -4464 -658 3711 5765
3411E765o9l371m048l432p88J684L918M236K065m93k976m341l492j065K296L987
$$ 5765 5696 2325 -1723 -5155 -5943 -4259 -341 3895 5960 5467 2491 -1850 -5342 -6407 -4111 -124
3427a24L892K148p71k745m228l088j205J939M161L773K461j056l423l273l780
$$ -124 3768 5916 5145 2400 -1828 -4916 -6121 -4182 -21 3752 6213 5157 1734 -1539 -5319
3442e319m07J926L878L713K352q63l336m268l022q74K457L891L849J977p19l155
$$ -5319 -5726 -3800 78 3791 6143 5280 1944 -2324 -5346 -6220 -3763 128 3977 5954 5235 2080
3458B080m243k968r02J895M262L779J918p51l332m104k966n11K126L706M228J932
$$ 2080 -2163 -5131 -6033 -4138 124 3903 5821 5070 1738 -2366 -5332 -5843 -3717 -11 4217 6149
3474F149j113l672l822l038j70J994L989L977J917j341l362m011k951l58K448
$$ 6149 5036 1364 -2458 -5496 -5666 -3672 317 4294 6211 4870 1508 -2503 -5454 -5812 -3364
3489c364L819L742J632q74l481l918k985l68K656L839L557J466j014l376l844
$$ -3364 455 4197 5829 4955 1474 -2444 -5429 -5797 -3141 698 4255 5721 4707 1331 -2513
3504b513l006k29K266M447L277J810j315l685l596l025L5K188L943M041J237q95
$$ -2513 -5519 -5748 -3482 965 4242 6052 4737 1052 -2544 -5569 -5534 -3346 597 4638 5875 4980
3520D980l736l915k606k09K163L929L558J553j379k830l922k844j99K168M255
$$ 4980 1244 -2671 -5277 -5486 -3323 606 4164 5717 4338 1508 -2414 -5258 -5457 -3289 966
3535I66L167K009j575l610l570k508n53K522M358L392Q84q76l649l915k644K07
$$ 966 4133 6142 4567 957 -2613 -5121 -5674 -3152 1206 4598 5482 4606 957 -2958 -5602 -5395
3551e395K318M068L434J157j432l194l967k511Q6K681M047L228R58j303l247l679
$$ -5395 -3077 991 4425 5582 4150 956 -3011 -5522 -5436 -2755 1292 4520 5478 4175 928 -2751
3567b751k766K02K913L703L292R56j703k919l753k914L29K564M163L285R80j373
$$ -2751 -5517 -5315 -2402 1301 4593 5549 3846 927 -2826 -5740 -5411 -2847 1316 4601 5581 4208
3583D208l602l604k560K41K812L672L242J289j603l652l584k372L17K962L886
$$ 4208 606 -2998 -5558 -5317 -2505 1167 4409 5698 4095 443 -3141 -5513 -5196 -2234 1652
3598A652K929O80j410l340l857j985J75K928L817L421K75j538l213l736k207N72
$$ 1652 4581 5261 3851 511 -3346 -5331 -5156 -2228 1589 5010 5285 3747 534 -3202 -5409 -4837
3614d837K494L917K961P24j695l329l305k594P93K667L959K763P42j470l496l886
$$ -4837 -2343 1574 4535 5259 3564 235 -3070 -5664 -4871 -2204 1755 4518 5260 3790 294 -3592
3630c592j941R06K450L819L044P63j659l738l568j742J7L318L636L031O20j832
$$ -3592 -5533 -4627 -2177 1642 4686 5449 3790 52 -3516 -5258 -5241 -1923 1713 4744 5364 3532
3646C532l568l266k134P51K919L542K890O85j919l458l440j881J011K837L265
$$ 3532 -36 -3302 -5436 -4685 -1766 1776 4666 5351 3432 -26 -3466 -5347 -4336 -1499 1766
3661A766L173M59k147l333l228j831L89K922M072K730J36j892l631l149j786N50
$$ 1766 4939 5398 3251 -82 -3310 -5141 -4752 -1830 2242 4972 5108 3216 -415 -3564 -5350 -4800
3677d800L328L620K592M87j857l638l364j768R76K957L295L139K25k382l084l346
$$ -4800 -1472 2148 4740 5227 3370 -268 -3632 -5400 -4424 -1467 1828 4967 5192 2810 -274 -3620
3693c620j594O11L138L576K504O91k452l282l651j298J119K866L633K755J2k025
$$ -3620 -5214 -4603 -1465 2111 4615 5306 2854 -428 -4079 -5377 -4258 -1392 2241 4996 5008 2983
3709B983l764k875j797J100L180L544K363K39k158l534l111j253R98K870L442
$$ 2983 -781 -3656 -5453 -4353 -1173 2371 4734 4973 2815 -719 -3830 -5083 -4085 -1215 2227
3724B227K792j39j976l754l307r66Q25L209L537K278Oj832l874k772j611J330
$$ 2227 5019 4880 2904 -850 -4157 -5123 -4298 -1089 2448 4726 4732 2900 -974 -3746 -5357 -4027
3740d027K817L974K044m1k197l370l253j114J189K999L481K585j28k476l199k926
$$ -4027 -1210 2764 4808 4767 2570 -800 -4053 -5167 -3978 -979 2502 5087 4959 2483 -716 -3642
3756c642j592J307L133L548J875M6k401l227k911j412J595L020L553J669J62k408
$$ -3642 -5234 -3927 -794 2754 4629 4675 2274 -953 -3864 -5276 -3681 -661 2892 4561 4723 2315
3772B315l477k853j132J324L323L287J913l0k305l436k786j126J296L194L159
$$ 2315 -1162 -4015 -5147 -3823 -500 2787 4700 4670 2365 -1071 -3857 -4983 -3687 -493 2666
3787B666K112l48k047l680k748q37J144L438L142K145m47k648l236k635q39J273
$$ 2666 4778 4430 2383 -1297 -4045 -4882 -3738 -300 2842 4987 4540 1892 -1344 -3979 -4818 -3545
3803c545L125L251J887k47k395l795k723m34J723L141L224J446l27k229l568k783
$$ -3545 -420 2831 4718 4471 2076 -1719 -4442 -4876 -3153 -12 3212 4658 4331 2102 -1466 -4249
3819d249p03J562L385L249J457p61k017l695k409r44J817L353K960J722l82k699
$$ -4249 -4952 -3390 -5 3244 4701 3940 1923 -1772 -4181 -5125 -3308 45 3005 4727 4345 1646
3835A646l187k503o48J351L311L043J924p73k446l381k445r00J906L297K997J486
$$ 1646 -1541 -4044 -4692 -3341 -30 3013 4937 4164 1718 -1663 -4108 -5008 -3102 195 3192 4678
3851D678n19k630l046k519q40K105L301K836J377r00k501k896k815o80J988L415
$$ 4678 4159 1529 -1517 -4036 -4876 -2771 530 3366 4743 3843 1342 -1554 -4369 -5049 -3061 354
3867C54L240R67p18k526l259k408l90J770L319L267J151q51k496l463k359k58
$$ 354 3594 4561 3843 1317 -1942 -4350 -4740 -2970 349 3616 4767 3916 1420 -2043 -4402 -4660
3883d660J906L529K589J226o25k600l513k277k67J992L291K832J240r58k496l008
$$ -4660 -2754 775 3364 4590 3965 1365 -2148 -4425 -4692 -2700 591 3423 4663 3705 1209 -1799
3899a799k564k58J973L266K967J035j003k596k991k467m20K033L420K941J350
$$ -1799 -4363 -4621 -2648 618 3585 4620 3617 1021 -1970 -4437 -4857 -2824 596 3537 4887
3914D887j449k601k846k139l01K270K888K684J211r23k112l841k152j35K452L007
$$ 4887 3438 837 -2009 -4148 -4449 -2179 709 3393 4604 3681 1569 -2272 -4424 -4559 -2107 900
3930I00K497R47r61k230l121k220n16K388L284K857M80j023k317k921k266j50
$$ 900 3397 4344 3383 1153 -1968 -4188 -4704 -2316 968 3825 4305 3282 965 -1956 -4222 -4372
3946d372J802L682K717N94j152k742k605k119l2J889L535K406Q91j019k503l462
$$ -4372 -2570 1112 3829 4423 3271 529 -2076 -4195 -4227 -2338 1197 3603 4494 3475 972 -2490
3962b490k034K06K428L232K422L07p33k599l348j964K35K443L056K625N08j115
$$ -2490 -4524 -4318 -1890 1342 3764 4071 3338 739 -2609 -4573 -4338 -1895 1161 3786 4294 3179
3978C179k566k819k105J57K159L295K466Q51j538k957k336k032M00K089L208K092
$$ 3179 613 -2206 -4311 -4154 -1995 1300 3766 4617 3079 122 -2214 -4246 -3846 -1757 1451 3543
3994C543R77j388k858l143j342J05K403L158K271L79j059k792l032j580L80K394
$$ 3543 4520 3132 274 -2869 -4211 -4106 -1703 1455 3726 4105 3046 254 -2778 -4358 -3978 -1584
4010a584L226K254K05j382k494k850j810K83K564L167K014Q35j700k798k666j602
$$ -1584 1642 3896 4101 2719 225 -2625 -4435 -4152 -1588 1579 3593 4428 2728 -70 -2736 -4338
4026d338L59K382L091K596K93j490k595k935j650N84K334L402J847N34j633k967
$$ -4338 -3979 -1597 1494 4090 4383 2893 298 -2637 -4287 -3703 -1369 2033 3880 4414 2781 -186
4042a86k480j621L59K674L027K343n0j303k836k709j296M17K167L367K095K55
$$ -186 -2666 -4287 -3928 -1254 1773 4116 4066 2763 -73 -2782 -4078 -3661 -1494 1873 3968 4223
4058D223j735k569k687j453N41K674K759K101P5j270l031k588j559J034K324K994
$$ 4223 2488 -81 -2768 -4221 -3680 -1006 1753 3854 3929 2659 -372 -2960 -4519 -3485 -1161 1833
4074A833K275L56j796k925k505j338M86K593K821K303j97j821k538k520j110N57
$$ 1833 4108 4464 2668 -257 -2762 -4100 -3614 -1021 1800 4103 3906 2085 -453 -2973 -4083 -3526
4090c526K296L189K122o7j750k922k485q95Q39K453K715K086j14j670l055k368
$$ -3526 -1230 1959 4081 4014 2264 -658 -3143 -4038 -3199 -746 1969 4055 3941 2271 -784 -3152
4106c152j089J017K792K700J632r4j529l194k227j011R20K649K857K080m70j984
$$ -3152 -4241 -3224 -432 2268 3900 3806 2277 -917 -3144 -4155 -3235 -586 2271 4351 3881 1897
4122A897k543k438r52R23K206L211J478nj614k647k460j380J320K542K672J893
$$ 1897 -646 -3084 -4036 -3113 -907 2304 3782 3777 2163 -484 -2944 -4324 -3004 -462 2210 4103
4138D103j24k118l018k082p40J064K324K726J872j76j948l066k119p20Q69K802
$$ 4103 3979 1861 -1157 -3239 -3979 -2915 -591 2135 4007 3831 1883 -1183 -3302 -4022 -3153 -351
4154c51K699J378L5k079k684k284o93J211K495K358J573k70j431k863k582n23
$$ -351 2348 3726 3761 1682 -1002 -3286 -3979 -2768 -273 2085 3658 3388 1957 -906 -3488 -4011
$$ [...]
##END NTUPLES=NMR FID
##END=
