##TITLE=1H_PR168_rmk
 D2O, 8 sc, 
 7.2.2019
##JCAMPDX= 6.0         $$ Bruker NMR JCAMP-DX V2.0
##DATA TYPE= NMR FID
##DATA CLASS= NTUPLES
##ORIGIN= UXNMR, Bruker Analytische Messtechnik GmbH
##OWNER= root
$$ XWIN-NMR		Version 3.5
$$ Thu Feb  7 14:55:00 2019 Russian Standard Time (UT+4h)  she@DPX200
##.OBSERVE FREQUENCY= 200.1313
##.OBSERVE NUCLEUS= ^1H
##.DELAY= (6, 6)
##.ACQUISITION MODE= SIMULTANEOUS
##.ACQUISITION SCHEME= undefined
##.AVERAGES= 8
##.DIGITISER RES= 18
##SPECTROMETER/DATA SYSTEM= spect
##.PULSE SEQUENCE= zg30
##.SOLVENT NAME= D2O
##.SHIFT REFERENCE= (INTERNAL, D2O, 0, 15.7039)
##AUDIT TRAIL= $$ (NUMBER, WHEN, WHO, WHERE, WHAT)
$$ ##TITLE= Audit trail, XWIN-NMR		Version 3.5
$$ ##JCAMPDX= 5.01
$$ ##ORIGIN= Bruker BioSpin GmbH
$$ ##OWNER= she
$$ F:/spectra/data/she/nmr/H-F/1/audita.txt
$$ ##AUDIT TRAIL=  $$ (NUMBER, WHEN, WHO, WHERE, WHAT)
(   1,<2019-02-07 14:53:55.07 +0400>,<she>,<DPX200>,
      <created by zg, POWCHK disabled, PULCHK disabled
       configuration hash MD5:
       00 E9 B6 7A A2 85 ED C7 34 08 36 98 17 FE 4E 26
       data hash MD5: 16K
       6E C7 CF 43 0E 3F F8 28 DE 90 78 C9 FB 6E DF C4>)
$$ ##END=
$$ 
$$ hash MD5
$$ C9 0A 79 2C 1D C3 F8 40 2E 47 C4 18 3F 77 65 F3
##$RELAX= 
##$RELAX= 
##$RELAX= 
##$RELAX= 
##$RELAX= 
##$RELAX= 
$$ Bruker specific parameters
$$ --------------------------
##$DU= <F:/spectra>
##$EXPNO= 1
##$NAME= <H-F>
##$PROCNO= 1
##$TYPE= <nmr>
##$USER= <she>
##$AMP= (0..31)
100 100 100 100 100 100 100 100 100 100 100 100 100 100 100 100 100 100 
100 100 100 100 100 100 100 100 100 100 100 100 100 100 
##$AQSEQ= 0
##$AQ_mod= 1
##$AUNM= <au_zg>
##$AUTOPOS= <>
##$BF1= 200.13
##$BF2= 200.13
##$BF3= 200.13
##$BF4= 200.13
##$BF5= 200.13
##$BF6= 200.13
##$BF7= 200.13
##$BF8= 200.13
##$BYTORDA= 1
##$CFDGTYP= 0
##$CFRGTYP= 5
##$CHEMSTR= <none>
##$CNST= (0..31)
1 1 145 1 1 1 1 1 1 1 1 1 1 1 1 1 1 1 1 1 1 1 1 1 1 1 1 1 1 1 1 1 
##$CPDPRG= <>
##$CPDPRG1= <>
##$CPDPRG2= <>
##$CPDPRG3= <>
##$CPDPRG4= <mlev>
##$CPDPRG5= <mlev>
##$CPDPRG6= <mlev>
##$CPDPRG7= <mlev>
##$CPDPRG8= <mlev>
##$CPDPRGB= <>
##$CPDPRGT= <>
##$D= (0..31)
0 1.2 0 0 0 0 0 0 0 0 0 0.03 0 0 0 0 0 0 0 0 0 0 0 0 0 0 0 0 0 0 0 0 
##$DATE= 1549536834
##$DBL= (0..7)
120 120 120 120 120 120 120 120 
##$DBP= (0..7)
150 150 150 150 150 150 150 150 
##$DBP07= 0
##$DBPNAM0= <>
##$DBPNAM1= <>
##$DBPNAM2= <>
##$DBPNAM3= <>
##$DBPNAM4= <>
##$DBPNAM5= <>
##$DBPNAM6= <>
##$DBPNAM7= <>
##$DBPOAL= (0..7)
0.5 0.5 0.5 0.5 0.5 0.5 0.5 0.5 
##$DBPOFFS= (0..7)
0 0 0 0 0 0 0 0 
##$DE= 6
##$DECBNUC= <off>
##$DECIM= 32
##$DECNUC= <off>
##$DECSTAT= 4
##$DIGMOD= 1
##$DIGTYP= 9
##$DL= (0..7)
0 120 120 120 120 120 120 120 
##$DP= (0..7)
150 150 150 150 150 150 150 150 
##$DP07= 0
##$DPNAME0= <>
##$DPNAME1= <>
##$DPNAME2= <>
##$DPNAME3= <>
##$DPNAME4= <>
##$DPNAME5= <>
##$DPNAME6= <>
##$DPNAME7= <>
##$DPOAL= (0..7)
0.5 0.5 0.5 0.5 0.5 0.5 0.5 0.5 
##$DPOFFS= (0..7)
0 0 0 0 0 0 0 0 
##$DQDMODE= 0
##$DR= 18
##$DS= 0
##$DSLIST= <SSSSSSSSSSSSSSS>
##$DSPFIRM= 0
$$ [...]
##$SUBNAM2= <"">
##$SUBNAM3= <"">
##$SUBNAM4= <"">
##$SUBNAM5= <"">
##$SUBNAM6= <"">
##$SUBNAM7= <"">
##$SUBNAM8= <"">
##$SUBNAM9= <"">
##$SW= 20.0189088683792
##$SWIBOX= (0..15)
0 0 2 0 0 0 0 0 0 0 0 0 0 0 0 0 
##$SW_h= 4006.41025641026
##$TD= 16384
##$TD0= 1
##$TE= 0
##$TE2= 300
##$TE3= 300
##$TEG= 300
##$TL= (0..7)
0 120 120 120 120 120 120 120 
##$TP= (0..7)
150 150 150 150 150 150 150 150 
##$TP07= 0
##$TPNAME0= <>
##$TPNAME1= <>
##$TPNAME2= <>
##$TPNAME3= <>
##$TPNAME4= <>
##$TPNAME5= <>
##$TPNAME6= <>
##$TPNAME7= <>
##$TPOAL= (0..7)
0.5 0.5 0.5 0.5 0.5 0.5 0.5 0.5 
##$TPOFFS= (0..7)
0 0 0 0 0 0 0 0 
##$TUNHIN= 0
##$TUNHOUT= 0
##$TUNXOUT= 0
##$USERA1= <user>
##$USERA2= <user>
##$USERA3= <user>
##$USERA4= <user>
##$USERA5= <user>
##$V9= 5
##$VALIST= <valist>
##$VCLIST= <CCCCCCCCCCCCCCC>
##$VD= 0
##$VDLIST= <DDDDDDDDDDDDDDD>
##$VPLIST= <PPPPPPPPPPPPPPP>
##$VTLIST= <TTTTTTTTTTTTTTT>
##$WBST= 1024
##$WBSW= 4
##$XGAIN= (0..3)
0 0 0 0 
##$XL= 0
##$YL= 0
##$YMAX_a= 366825
##$YMIN_a= -361217
##$ZGOPTNS= <>
##$ZL1= 120
##$ZL2= 120
##$ZL3= 120
##$ZL4= 120
##$ABSF1= 10
##$ABSF2= 0
##$ABSG= 5
##$ABSL= 3
##$ALPHA= 0
##$AQORDER= 0
##$ASSFAC= 0
##$ASSFACI= 0
##$ASSFACX= 0
##$ASSWID= 0
##$AUNMP= <proc_1d>
##$AZFE= 0.1
##$AZFW= 0.1
##$BCFW= 1
##$BC_mod= 2
##$BYTORDP= 1
##$COROFFS= 0
##$CY= 11.3945322036743
##$DATMOD= 1
##$DC= 2
##$DFILT= <>
##$DTYPP= 0
##$F1P= 18.9103706918063
##$F2P= -1.10871071338519
##$FCOR= 0.5
##$FTSIZE= 0
##$FT_mod= 4
##$GAMMA= 1
##$GB= 0.15
##$INTBC= 1
##$INTSCL= 1
##$ISEN= 128
##$LB= 0.24
##$LEV0= 0
##$LPBIN= 0
##$MAXI= 10000
##$MC2= 0
##$MEAN= 0
##$ME_mod= 0
##$MI= 1.114404
##$NCOEF= 0
##$NC_proc= 0
##$NLEV= 6
##$NOISF1= 3.799351
##$NOISF2= 2.8
##$NSP= 1
##$NTH_PI= 0
##$NZP= 0
##$OFFSET= 15.70392
##$PC= 1
##$PHC0= -8684.071
##$PHC1= 16.20018
##$PH_mod= 1
##$PKNL= yes
##$PPARMOD= 0
##$PSCAL= 0
##$PSIGN= 0
##$REVERSE= no
##$SF= 200.130013532006
##$SI= 16384
##$SIGF1= 3
##$SIGF2= 2
##$SINO= 400
##$SIOLD= 16384
##$SREGLST= <1H.CDCl3>
##$SSB= 0
##$STSI= 0
##$STSR= 0
##$SW_p= 3612.71676300578
##$SYMM= 0
##$S_DEV= 0
##$TDeff= 0
##$TDoff= 0
##$TI= <>
##$TILT= no
##$TM1= 0
##$TM2= 0
##$TOPLEV= 0
##$USERP1= <user>
##$USERP2= <user>
##$USERP3= <user>
##$USERP4= <user>
##$USERP5= <user>
##$WDW= 1
##$XDIM= 8192
##$YMAX_p= 0
##$YMIN_p= 0
$$ End of Bruker specific parameters
$$ ---------------------------------
##NTUPLES= NMR FID
##VAR_NAME=  TIME,          FID/REAL,        FID/IMAG
##SYMBOL=    X,             R,               I
##VAR_TYPE=  INDEPENDENT,   DEPENDENT,       DEPENDENT
##VAR_FORM=  AFFN,          ASDF,            ASDF
##VAR_DIM=   8192,          8192,            8192
##UNITS=     SECONDS,       ARBITRARY UNITS, ARBITRARY UNITS
##FACTOR=    0.0002496,     1,               1
##FIRST=     0,             0,               0
##LAST=      2.0444736,     0,               0
##MIN=       0,             -361217,         0
##MAX=       2.0444736,     366825,          0
$$ Real data points
##PAGE= N=1
##DATA TABLE= (X++(R..R)), XYDATA
0 0 0 0 0 0 0 0 0 0 0 0 -2 8 -8 8 -9 16 -16 23 -24 32 -36 45 -52 64 -74 85 -101 115 -133 152 -175 199 -224
33 -224 255 -288 324 -366 408 -457 508 -567 631 -698 775 -855 945 -1043 1148 -1266 1395
50 1395 -1538 1696 -1868 2064 -2279 2522 -2802 3121 -3493 3931 -4459 5106 -5924 6993 -8459
65 -8459 10605 -14057 20567 -37242 179260 307965 62546 1885 -20918 24699 -10031 -41355
77 -41355 -44801 54283 141239 139719 -14960 -210170 -337908 -321162 -237800 -156933 -114347 -43841
89 -43841 89297 257094 338950 276265 106031 -45404 -98532 -62368 -23751 -23330 -29116 21705
101 21705 122442 196755 157208 10066 -149360 -219363 -186943 -113527 -66883 -45232 3369
112 3369 101399 192433 194590 82147 -80274 -187782 -190504 -128565 -68382 -32923 9788 93805
124 93805 194344 236133 171532 36311 -82314 -116839 -76903 -22540 3856 17586 52008
135 52008 104512 127477 68832 -61687 -192029 -249486 -219637 -143237 -69797 -11424 55425 137257
147 137257 200110 197936 120006 9887 -64825 -72107 -32514 12103 41493 62717 89430 108696
159 108696 85627 5419 -104260 -190607 -214945 -177027 -109034 -40348 23854 84822 133200 147059
171 147059 109220 30884 -47466 -89041 -82777 -41413 11035 59401 99888 124433 117548 71913
183 71913 -3542 -83456 -136001 -145820 -117116 -62200 1968 58774 94082 97501 64758 7725
195 7725 -51290 -95258 -109773 -90407 -42130 24624 91717 134256 135997 100209 41641 -17455
207 -17455 -63063 -91134 -98299 -76936 -26845 35033 81893 88788 52562 -2664 -50480 -79312
219 -79312 -92620 -92785 -74080 -24226 50209 116946 141527 113080 51986 -5313 -39715 -59229
231 -59229 -74974 -80710 -59401 -2697 66212 103637 84144 24854 -34637 -65188 -68370 -68109 -70600
244 -70600 -55545 -3287 73041 129645 127043 66865 -6528 -50399 -59833 -58794 -66424 -69917 -39344
257 -39344 30169 98273 117053 71475 -3234 -54628 -61515 -48854 -46714 -53263 -39461 14401 85932
270 85932 121509 89633 13615 -51528 -71086 -55910 -43579 -49795 -48529 -9400 60623 114897
282 114897 107783 42182 -31411 -63590 -53022 -34227 -35435 -45784 -27916 29477 90842 103845
294 103845 53098 -24457 -71404 -66541 -39261 -27304 -34432 -28080 17071 82677 115147 82012
306 82012 5494 -57422 -69929 -44877 -24542 -29290 -34751 -7831 49800 95348 83947 17302
318 17302 -52989 -78859 -56746 -24239 -14966 -20936 -7309 40042 91176 98400 46987 -28171 -72461
331 -72461 -64267 -32016 -14453 -19069 -17877 13377 63055 85543 53470 -13926 -68005 -73775 -42838
344 -42838 -13531 -7781 -8230 12354 55504 88366 75773 17986 -44200 -68833 -51605 -22438 -10358
357 -10358 -13476 -5857 26411 61560 64291 22895 -37231 -72056 -62957 -30279 -5491 2016 8429
370 8429 32617 66823 80072 51209 -5256 -52287 -62030 -40477 -16024 -6650 -4660 7954 33535
383 33535 51373 38098 -5652 -50168 -66145 -48959 -18481 3012 11959 22613 43034 60410
395 60410 55352 21620 -23199 -51599 -48708 -27085 -6526 5226 12935 25771 39781 39617 16240
408 16240 -20734 -49904 -55815 -39604 -16382 1108 13774 26296 37959 40427 25383 -4237
420 -4237 -32454 -43697 -35038 -14401 7411 23949 37621 46325 44988 29414 1876 -28073 -46979
433 -46979 -49545 -38691 -20793 -1501 14681 24816 26465 16159 -2220 -20574 -31862 -32273 -20666
446 -20666 -1421 21730 42783 54972 52060 35516 11344 -13115 -31584 -42280 -44466 -36862 -18966
459 -18966 3761 22131 27509 18167 1702 -11534 -18039 -19298 -17892 -12074 2285 24670 43906
472 43906 48474 33573 7365 -15685 -27927 -32785 -35944 -35947 -26074 -2712 26400 44050 40069 20268
486 20268 121 -9544 -10017 -11170 -16449 -17733 -6303 15902 32166 28139 3573 -23559 -36345
499 -36345 -33147 -25280 -21661 -18678 -4597 24584 53819 62254 44693 14288 -7740 -12235 -9337
512 -9337 -13237 -23675 -27648 -13573 10314 23562 11983 -15551 -36178 -35957 -20170 -6792 -4192
525 -4192 -2430 12942 40685 62234 58169 28329 -5969 -23289 -21643 -16015 -20997 -31133 -29392
538 -29392 -8716 17578 27186 11649 -14529 -28176 -19236 -601 8804 5758 4558 17522 40790
551 40790 51523 34454 -1775 -32408 -40795 -30610 -21687 -24410 -28292 -17790 8675 34109 37306
564 37306 16140 -8136 -14977 -2171 12915 14613 5579 1750 13572 29820 29966 6615 -27365
577 -27365 -47418 -43093 -26515 -15773 -15639 -14496 85 25710 42759 36256 11637 -9920 -12001
590 -12001 536 11039 8085 -950 -1336 10840 22781 17838 -5935 -31494 -40286 -29283 -12060
603 -12060 -3483 -3936 -1840 12088 29630 34236 19420 -5954 -22022 -20011 -7006 1115 350 -2520
617 -2520 2874 16624 24595 15918 -5013 -22904 -24600 -11830 1513 5504 3748 6135 15116 23061
631 23061 18086 -1013 -22155 -30839 -24067 -11533 -3244 -1581 1103 9953 20305 22833 12044 -4703
645 -4703 -15376 -13130 -2629 5825 8194 7734 9739 14903 15550 5860 -10090 -23288 -26384 -19244 -8809
660 -8809 -2103 1654 6190 11771 15106 11782 936 -10555 -15380 -12091 -3654 4296 8978 12595 15769
675 15769 16517 12521 3329 -7903 -15256 -15820 -10845 -4398 1373 5823 8066 7947 3867 -3217 -11282
690 -11282 -16611 -17452 -12459 -4671 4246 12780 18862 19613 15752 9094 1632 -3726 -7500 -8737 -6973
705 -6973 -2280 3907 8343 8418 2665 -5360 -11449 -14949 -15332 -13800 -10650 -4359 6404 16525 21230
720 21230 17589 9548 1363 -2381 -3537 -5736 -7924 -7502 -1624 7096 12246 9699 497 -7963 -11805
735 -11805 -10397 -7929 -8003 -7553 -1290 9139 18360 19511 10385 -1236 -7622 -7927 -5785 -6504 -9744 -7900
751 -7900 785 11946 16150 10413 -742 -8621 -7806 -2889 -917 -3727 -4935 238 10831 17658 12918
766 12918 357 -11172 -13551 -9172 -4893 -6494 -8942 -5770 5264 16161 17685 7816 -4050 -8382
780 -8382 -4824 790 1049 -3664 -5150 1340 11575 15261 7357 -6286 -14902 -13133 -5922 -2027 -4183
795 -4183 -6298 -1365 9860 17855 14902 2523 -8690 -10282 -3911 1491 453 -4149 -4089 4149 13206
810 13206 13698 3038 -9668 -14765 -9952 -1860 514 -2636 -4346 1933 11721 16117 9605 -3260
824 -3260 -11741 -9998 -2245 1878 -311 -3982 -1970 6906 13474 10450 -721 -11097 -13053 -6114 358
839 358 956 -2601 -2408 3950 11722 12834 4350 -6724 -11562 -7609 -328 2332 -245 -2422 1206 8617
855 8617 11351 5994 -4412 -11932 -10572 -3798 1175 845 -1407 339 6025 11118 8649 0 -8397
870 -8397 -10155 -5050 738 2253 -145 -96 3250 7984 7805 1242 -7045 -10562 -7033 -1392 2155 1591
886 1591 886 3068 6816 8371 4284 -3652 -8890 -8197 -3511 672 1413 773 1847 4792 6812 4525
902 4525 -1115 -6617 -7680 -4604 -329 1934 1844 2657 4185 5244 4294 -219 -6026 -8123 -6555 -2835
918 -2835 666 2285 3382 4661 6200 5434 2040 -2304 -5666 -5562 -3590 -771 1303 2500 3001 3452
934 3452 2479 -138 -3209 -5611 -5943 -3983 -1294 1539 4409 6209 6414 5357 2508 -652 -3177 -4508
950 -4508 -4752 -3973 -2155 442 2687 3536 2244 -183 -2158 -3029 -2888 -2165 -1760 -519 2847 6095 7622
967 7622 5439 1654 -1507 -3203 -3803 -4255 -4920 -4715 -2317 1902 4836 4422 2051 -1404 -2237 -1166 -45
984 -45 -132 -1013 -82 3372 5972 6243 2155 -3011 -5688 -5139 -3351 -3374 -3979 -4105 -188 5220 7553 5866
1002 5866 1548 -2005 -1585 -55 1278 -476 -2529 -1442 2349 5353 3843 -1303 -5806 -6788 -4234
1017 -4234 -1491 -1737 -2642 -1815 2548 7701 8956 4838 -543 -3126 -1733 438 194 -2322 -4173 -1995
1033 -1995 2380 4765 2173 -2897 -6419 -5152 -1008 1462 215 -1131 327 4581 8302 7023 1660
1048 1660 -3722 -5141 -2594 -90 -1001 -3798 -3912 -633 3978 5344 1794 -3383 -4962 -2255 1919
1063 1919 2684 918 -768 1031 4627 6409 3550 -2251 -6351 -5369 -1977 -42 -988 -2965 -2110 1717
1079 1717 5436 5110 849 -3197 -3950 -737 2217 2453 -11 -1157 1075 4352 4874 1162 -3950 -5963
1095 -5963 -4247 -678 724 -874 -2028 -620 3360 4970 3344 -977 -4447 -3658 -282 1507 1376
1110 1376 -354 -334 1953 4311 3771 -81 -4076 -4669 -2086 432 1049 -186 -933 603 2928 3539 787
1127 787 -2861 -4330 -3230 -528 1335 726 -122 336 2591 3781 2489 -445 -3079 -2872 -811 1056
1143 1056 1047 -35 90 928 2069 1822 -990 -3193 -3762 -2373 -245 859 938 753 1413 2399 2937 650
1161 650 -1548 -2419 -2398 -601 709 872 556 840 1530 1659 464 -1350 -2625 -2476 -1147 -190 757 1445
1179 1445 1080 1328 1071 570 -1138 -2028 -2461 -2091 -553 -23 1179 1704 1995 1623 889 16 -821 -1015 -1073
1198 -1073 -846 -195 719 1283 1440 822 -278 -1179 -1667 -2035 -1775 -1536 -809 521 1783 2777 2475 1409
1216 1409 252 -209 3 -529 -906 -772 -457 636 1645 1560 38 -1417 -1924 -1557 -980 -1014 -1497 -862 763
1235 763 2404 3061 1982 -36 -810 -563 250 158 -988 -1409 -593 1204 2043 1391 -558 -2171 -1857 -818
1253 -818 2 -539 -1306 -653 1115 2558 2770 719 -1044 -1598 -582 568 -56 -978 -1413 -289 1952
1270 1952 2523 1133 -1124 -2193 -1318 91 462 -495 -1183 -318 1458 2607 1714 -539 -2274 -2115 -367
1287 -367 265 -230 -892 -1086 868 2391 2458 652 -1448 -1967 -1000 757 387 -343 -1308 -186 1824 2367
1305 2367 1087 -1321 -2467 -1503 52 727 130 -1068 -464 1139 2824 1897 -210 -1792 -1631 -187
1321 -187 799 -6 -755 -980 127 2284 1557 89 -1680 -2172 -1164 329 643 -488 -919 -227 1489
1338 1489 2214 949 -1073 -1722 -1332 -32 873 462 -628 -575 643 1628 1283 -480 -1921 -1749 -536
1355 -536 656 299 -267 -853 85 1548 1566 343 -1184 -1727 -880 433 872 65 -236 237 1032 1508 524
1374 524 -902 -2093 -1188 -181 369 399 -388 -306 641 1248 1333 -151 -1107 -994 -493 385 633 -149 -1 419
1394 419 993 880 -410 -1012 -1380 -1117 4 -27 226 -136 226 585 1005 100 -410 -1039 -1009 -51 236 341
1414 341 303 445 406 555 567 -337 -755 -896 -812 170 -169 418 187 258 618 185 -105 -519 -655 -817 -327 51
1436 51 199 455 780 775 120 -217 -395 -462 -385 -676 94 270 510 649 678 157 -111 -469 -537 -540 -390 -338 262
1459 262 294 786 825 527 121 -322 -197 -19 -80 -315 -278 215 757 627 23 -115 -530 -361 -179 -156 -674 -558
1481 -558 165 629 914 826 -51 -405 -349 -81 382 -134 -584 -261 409 966 954 193 -473 -461 -414 -8 10 -435
1503 -435 -392 210 784 783 414 -226 -716 -251 89 171 -252 -425 186 852 1139 798 -319 -709 -380 -187 361
1524 361 -22 -505 -592 302 809 491 -24 -748 -716 -341 256 133 -99 -475 184 1136 1107 655 -450 -947 -559
1545 -559 89 432 -266 -594 -406 -77 902 415 -347 -799 -373 -188 391 292 -13 -579 422 874 956 -105
1565 -105 -539 -738 -175 337 130 -120 -448 -20 369 691 649 -321 -815 -312 179 336 -163 -411 -111 261
1585 261 1029 302 17 -966 -902 -46 30 338 -200 -365 270 798 1007 218 -245 -620 -7 213 350 101 -464
1606 -464 -343 287 478 129 -564 -1059 -803 -88 428 86 -164 -62 328 809 793 -234 -311 -552 -257 58
1626 58 -32 -297 -515 -138 299 290 177 -643 -518 109 326 493 285 179 271 578 566 225 -203 -493 -456 24
1648 24 -325 -243 -161 -287 -9 365 419 -77 -107 -169 -158 363 605 246 184 182 512 283 -318 -234 -525 -348 -311 -132
1672 -132 -102 -68 -58 194 379 211 -75 138 -42 -41 194 439 -24 149 376 -64 -39 -592 -338 -446 -283 -211
1694 -211 -287 69 -82 147 348 220 186 119 164 32 -213 53 43 18 125 226 -143 -284 -291 -371 -297 -6 -455
1717 -455 -50 310 346 238 44 36 -154 192 135 -247 -350 -216 113 178 340 34 272 -115 -22 -110 -188 -134 -10
1740 -10 189 193 428 148 -153 -393 -337 130 -104 -413 -487 -56 166 482 154 -33 134 -90 114 -158 -197 -26
1762 -26 -30 214 689 170 -35 -153 -113 -119 -123 -71 -375 -247 17 186 388 203 -172 -147 -22 -215 108 -161 -116 -5
1786 -5 514 326 245 -193 -353 -75 99 -49 -249 -381 -368 49 -112 119 35 -387 -288 -222 61 -7 -118 -216 136
1809 136 287 214 201 -229 -245 -64 38 163 5 -228 -89 247 297 219 -168 -708 -386 -47 81 69 -92 -371
1831 -371 -31 573 431 36 -307 -188 227 91 136 142 -280 -113 355 3 19 -77 -211 -316 32 30 -206 -435
1853 -435 -44 40 381 277 -40 -236 -116 -75 50 103 234 3 99 262 321 138 -87 8 -175 -124 311 -39
1875 -39 -267 -151 307 128 269 41 -397 -222 218 249 122 -137 183 218 268 149 -73 -302 -81 10 94 113
1897 113 191 -6 -56 293 -91 -41 -248 -295 -360 -139 52 255 86 13 206 200 -92 -127 -119 -123 -69 75 230 16 199
1922 199 269 290 52 -110 -198 -214 84 -414 181 -105 -165 114 210 37 29 34 280 148 57 139 -134 214 21 -20
1946 -20 0 -146 -121 -10 -167 -245 94 -332 156 -154 -232 22 185 -65 65 -52 -35 -96 89 -348 -49 128
1968 128 -6 10 242 -126 -41 -277 -329 66 112 247 172 -93 0 -204 -115 85 -8 69 -236 38 -57 277 531
1991 531 -95 17 -25 56 247 -341 -180 -115 -135 85 -94 -185 -139 -81 45 64 156 -58 -213 -135 342 312 7 2
2015 2 -159 -164 290 61 -165 -146 -96 232 181 222 41 10 -247 -38 -124 224 -183 -136 -95 195 240 -48 -167 -340
2039 -340 203 291 307 -249 -81 -164 177 207 119 -140 8 71 361 30 -48 3 250 257 311 147 -93 -27 -205 -2
2063 -2 -69 -58 -231 -386 -50 66 23 90 -23 -241 -145 143 82 241 2 101 316 209 118 -368 -181 -197 172 117
2087 117 -50 -149 -167 139 421 1 -14 -182 -40 100 161 9 228 -60 152 125 59 -98 -98 -490 28 49 -27
2110 -27 215 -87 82 227 367 210 118 -45 103 83 16 -85 -195 -299 124 35 -53 -65 -384 43 -164 108
2132 108 -107 59 99 318 388 81 290 208 4 109 -54 -105 -135 -9 -147 -31 -133 -254 -217 -349 -196 89
2154 89 142 -106 109 241 -5 45 117 68 -10 135 147 -216 -71 -269 84 131 -145 -135 -78 -27 -155 -118 38 -141
2178 -141 -146 -132 -5 8 -213 9 -276 -288 86 -273 108 -300 143 148 -82 94 66 187 -111 -83 -185 -47 5
2201 5 -23 141 -59 -147 -365 -96 -87 -222 -487 -88 23 -74 206 -102 207 55 -60 216 111 115 104 212 -156
2224 -156 194 154 72 -443 -155 -401 -225 -341 -160 -301 -217 13 -27 35 -263 32 -162 25 307 22 410 165
2246 165 -146 442 110 143 -177 -266 -23 -111 -8 5 -51 -54 62 -131 -96 -107 51 11 178 246 -200 -125 205 285
2270 285 54 -3 -111 10 -355 -56 117 239 -124 -73 84 -158 137 49 -254 -143 -194 -102 -108 339 24 50 111
2293 111 120 47 -83 175 18 -104 -80 -99 77 142 158 111 64 -51 71 -3 88 71 142 -126 -221 -95 -175 -12 -157
2318 -157 -17 17 -86 144 -24 13 -67 -69 237 159 262 -149 -167 -26 175 6 418 -291 -48 12 -82 183 -383
2341 -383 -171 -228 -133 -93 171 46 -193 20 84 214 230 199 -246 205 29 -181 177 -136 41 11 105 -10 -195
2364 -195 -97 49 12 142 3 29 -7 72 -118 -124 124 75 -43 -172 179 156 48 -315 17 -3 -119 -20 -60 43
2388 43 29 57 -109 68 -43 -126 275 -115 -111 -296 18 -166 -6 -118 198 -278 15 191 -150 1 -151 -317
2410 -317 -171 23 20 42 -12 -297 48 -78 108 239 -148 52 13 117 85 97 -3 32 308 61 0 -23 60 95
2434 95 26 165 -152 62 -127 0 -37 35 -89 153 -215 -245 113 164 64 -166 18 -43 12 59 24 62 95 72
2458 72 72 94 110 -99 240 71 -99 -110 -237 131 -196 -94 23 -80 190 -209 13 55 18 110 -141 -21 -35
2481 -35 -177 48 -6 132 -243 -44 -86 -171 -24 -381 187 -25 5 -43 -55 -136 -178 72 15 -102 56 44 -98 -151
2505 -151 369 175 -99 -125 120 167 125 52 -145 9 -129 148 6 -34 241 112 -107 -48 161 -353 -65 -139
2527 -139 65 64 39 198 -98 82 -26 39 162 146 219 7 -209 173 230 -220 82 -68 187 -212 129 -27
2549 -27 -200 346 -66 82 -112 3 168 -79 -44 -304 -93 -29 73 -116 -274 116 -164 -86 241 -48 -99 84
2571 84 61 460 -7 -24 -175 -160 43 184 -199 -52 16 -149 -279 99 -212 94 -105 -122 -115 110 90 98 124 160
2595 160 169 175 -42 104 -175 205 38 229 -99 19 -130 93 20 -47 18 -30 -65 3 -91 70 8 -14 -108 95 134
2620 134 -68 238 90 -94 -239 60 171 205 59 61 57 138 -215 -96 140 -87 40 -77 255 61 -52 -56 13
2643 13 -255 -121 -9 -60 29 115 79 211 88 -127 217 190 108 -46 13 52 -85 206 -20 230 -284 107 -279
2666 -279 -103 -109 -134 -159 233 91 -271 52 -364 100 11 -129 12 352 -98 236 -168 179 97 41 261 -26
2688 -26 61 -303 -47 -247 -250 -69 -245 -163 34 -71 302 116 177 112 -162 -68 22 -164 102 171 173 125 -37 -13 308
2713 308 21 -219 -137 -173 -370 213 -164 -89 -231 -70 -34 -22 40 -124 -56 -146 -116 18 156 74 0 53 61 -35 -57
2738 -57 -30 116 -81 13 207 -64 -129 -64 -49 -8 -306 -406 -180 108 -78 -27 -123 -73 -288 -204 70 180 243 -41
2762 -41 -93 -29 46 152 202 -164 -6 -161 46 -62 -239 -262 68 181 139 137 109 -7 42 74 -13 221 -31 -30 229
2787 229 241 200 10 89 116 -94 102 94 -208 -86 -29 80 -37 -245 46 -214 26 118 109 -180 22 123 -86
2810 -86 -171 54 256 -19 167 316 190 57 -163 -110 87 152 -144 -75 108 218 109 -181 62 191 57 -74
2832 -74 -29 72 3 14 -5 203 26 24 -21 -133 217 16 -96 145 81 50 150 -289 86 -262 79 37 63 -180
2856 -180 -90 363 -299 153 -125 -48 90 29 -90 -301 -30 198 145 84 -142 -61 -42 -21 109 81 227 64 -15
2879 -15 -27 -241 27 -119 47 -15 -180 56 46 19 82 237 22 12 -238 27 -114 -161 91 -59 150 103 248
2902 248 194 193 107 -263 -184 -32 79 -39 -72 188 224 42 -41 -27 -166 -139 150 250 202 66 183 45 229 -21
2926 -21 -33 12 -52 -102 -200 161 2 -114 -103 -149 97 -109 223 -81 36 86 -101 19 -66 -252 -22 -253 75
2949 75 -112 55 102 -77 93 -12 42 -79 -8 318 -128 112 122 126 -98 126 -25 -28 -184 -32 11 88 72 81 -130
2974 -130 -102 -67 124 187 74 142 9 87 90 -3 146 300 -83 0 19 12 -107 99 -32 144 -37 23 139 46 192
2999 192 41 -45 -49 -46 37 -149 57 -114 9 72 -63 282 132 70 126 19 102 -158 135 118 -226 -40 69 -100
3023 -100 163 -83 6 28 51 165 172 118 -250 73 130 -218 -171 -21 -67 -24 -140 50 183 73 100 122 114 48 -302
3048 -302 200 63 -277 -227 377 77 -172 -39 -19 -76 -123 121 24 66 -141 197 150 -133 -21 -284 185 4
3070 4 -89 163 25 -19 -312 -97 -73 128 41 -21 -85 28 82 39 32 99 -11 -53 132 58 -253 -98 -162 -204 -47 40
3096 40 258 -121 -202 96 301 49 128 125 129 71 -80 209 -296 -47 -164 103 193 104 76 7 193 -20 -27 9 31
3121 31 -44 -130 -44 -173 151 89 -43 125 -42 -61 92 -172 -174 -77 115 -83 -100 36 -11 -152 103 70 171 -41
3145 -41 107 79 99 -19 139 -49 66 73 -174 34 -233 -55 -178 -215 69 -8 333 59 -183 -142 -151 -117 29 81
3169 81 4 -289 -22 -34 101 -50 -15 -18 -92 29 133 -241 281 -24 -27 -124 -68 176 62 -131 21 -41 -52 -141 37
3194 37 -105 8 56 -17 -44 -7 -213 -15 221 -151 211 136 95 -165 -116 153 43 125 -56 -131 216 -106 -119 -54
3218 -54 84 23 20 -289 -121 118 105 -140 -19 36 208 258 -37 86 81 38 0 60 118 -169 101 50 19 -171 -108
3243 -108 -119 -38 -86 117 148 100 -23 -87 -93 -44 52 81 195 -95 -107 -61 -89 233 146 64 92 60 -126 -153 87 177 -296
3270 -296 95 -164 305 158 -176 110 56 102 -223 8 -249 -63 -104 -266 165 67 -94 86 -80 0 -145 130
3292 130 34 -35 112 22 39 191 201 221 1 -228 -81 -257 63 -76 -190 220 -329 353 -26 -182 -137 -86 -95
3315 -95 -37 20 30 -194 36 0 -69 -37 -110 148 -245 100 54 41 -145 74 -22 104 -119 -214 262 -219 25 161
3339 161 -243 -132 -216 239 206 -70 157 -124 -40 -45 164 -141 -215 -78 169 -208 157 209 13 202 37 -67
3361 -67 -172 61 -300 85 137 142 143 -214 -156 -283 -263 -90 13 457 -147 -40 49 51 -327 40 -117 -19 19 59 90
3386 90 -187 183 15 14 -243 -200 -164 22 -169 207 156 102 -124 169 -116 58 88 -228 38 139 176 181 -196 55
3410 55 116 -197 -110 98 189 175 246 208 288 -156 69 -36 266 16 -146 239 109 -62 -57 87 -50 -16 -83 -39
3434 -39 87 32 12 251 165 -32 235 -10 -125 17 -51 -106 -62 60 -16 -50 85 -255 -45 148 46 37 -200 93
3458 93 -202 -117 -62 -103 -148 244 -70 150 245 299 -91 85 8 -72 95 -32 -153 -110 53 143 123 132 91 -72 70
3483 70 -232 -314 -8 80 -69 -6 -142 38 26 -179 294 -13 15 233 71 -38 -7 -137 63 -86 23 -50 -86
3506 -86 393 -53 197 -6 -20 273 115 -103 144 265 91 60 -62 76 28 -100 176 -86 -158 -142 -10 155
3528 155 94 352 25 -118 -148 241 153 -100 38 5 43 83 95 26 -389 161 49 65 58 101 -154 39 -5 -87 51
3553 51 56 59 41 167 48 164 92 3 249 -225 -91 -117 -203 62 -33 -66 38 -10 -221 -69 21 -160 15 -49 -137
3578 -137 42 81 -125 -177 -167 -63 38 51 108 -399 48 -211 0 12 -254 59 73 -55 148 -156 -179 235 196
3601 196 -133 29 112 94 133 96 -24 -37 234 27 -185 43 160 142 446 6 -144 -99 47 -186 208 222 350
3624 350 -27 40 -3 158 -9 37 -173 26 36 -269 161 99 182 4 -136 -49 -146 23 157 28 -147 35 150
3647 150 17 -206 242 12 -197 61 -31 -105 248 -225 36 -3 3 24 -152 100 -29 176 148 26 -121 -56 -32
3670 -32 128 29 -28 -71 136 85 55 -65 -8 76 -154 35 -177 -247 -80 48 92 275 169 131 60 -157 -258 322
3694 322 6 141 215 -30 25 -119 98 0 111 187 80 -90 -208 243 42 43 46 -117 124 210 151 -106 -99 121
3718 121 -99 -32 -112 -85 49 -128 -191 358 158 -171 52 175 168 -47 -168 -98 27 205 -125 -39 188 189 -83
3741 -83 -178 119 -42 -101 172 22 -177 37 -44 147 100 105 71 11 173 36 -17 134 24 -166 -131 30 291 -79
3765 -79 -174 -114 165 -109 84 47 7 -160 78 -231 35 138 -27 131 -15 -38 142 235 101 34 -113 40 129
3788 129 72 -40 -28 310 77 261 3 17 16 -56 95 -387 -98 167 8 -37 79 -360 -154 50 -175 31
3810 31 -49 118 219 225 -170 76 -164 12 -163 196 -158 -11 -382 -89 -19 15 -60 -58 -120 -222 44 -7 24 -192
3834 -192 110 -279 131 93 -89 127 34 -53 -209 -271 170 -168 61 -114 83 -82 175 -85 88 51 100 84
3856 84 122 -33 373 -5 -90 32 70 164 -55 100 -138 -82 93 -222 130 -178 -137 -69 -112 -153 208 -78 64
3879 64 292 -193 36 -171 202 76 -323 -135 -119 8 -11 -200 70 184 -99 -60 -238 -167 113 1 -102 111
3901 111 24 -13 -80 110 185 -233 157 -4 -40 -85 -3 -245 316 -9 -6 -191 98 -115 -76 -62 9 35 -162 -38
3925 -38 -141 -67 -40 -144 1 -170 -59 87 22 -212 -207 88 -119 54 68 1 -24 -60 -153 68 37 -281 -32 -20
3949 -20 -286 182 -220 131 163 -37 10 -98 94 190 114 327 -167 -128 120 -16 -228 -265 137 -159 53 142 -240
3972 -240 -57 238 59 -100 -129 23 -102 -167 -285 -298 -202 -65 66 11 -33 -116 20 132 -105 129 166 -157 134
3995 134 74 60 -165 -66 -89 105 99 -198 -167 -107 194 -72 184 9 -96 352 -211 -15 -69 -195 -167 -44 321
4018 321 -303 -31 -39 -2 -90 17 199 49 -16 -2 -107 -94 -141 -118 100 -98 -257 294 -100 52 -4 116 143 -25
4042 -25 -96 -300 -14 236 100 -147 -194 -141 -43 215 0 -21 242 -143 23 188 -374 156 100 -193 -73 -295
4064 -295 117 -44 -19 -110 232 21 -153 266 85 250 -66 194 26 182 86 -79 -85 -173 -112 16 -101 128
4086 128 -267 -7 -37 65 35 -116 -348 -169 91 108 -11 -88 -209 -259 87 -112 -147 -69 -177 -104 112 -189 -151
4109 -151 46 0 0 253 47 -212 181 -93 25 85 -57 106 -115 -60 135 212 -251 3 -137 10 218 19
4131 19 285 62 78 154 100 -82 -94 45 -75 105 -64 7 33 -8 92 -134 -62 -215 -26 5 -54 -132 194 10
4155 10 -80 -29 -12 -48 -81 94 -300 -108 84 201 202 43 10 30 197 -137 -81 191 61 69 50 2 -33 -33 -150 323
4181 323 -72 175 107 63 -243 -10 34 -88 -64 88 -85 -144 -77 59 -88 119 -197 105 -321 -76 -69 209 -102
4204 -102 -69 41 204 47 -159 -112 -124 -58 -202 -10 -260 -14 -145 -356 -45 125 -5 -32 86 65 96 173 111
4227 111 -189 -78 221 291 66 43 -49 39 -86 -26 -210 -48 -59 102 -209 -7 -263 -14 60 116 201 -242 -332
4250 -332 169 175 -125 49 -140 140 -98 17 -171 -365 334 285 187 -37 58 49 109 96 -111 -212 226 24 -185
4273 -185 92 -78 87 47 326 -168 32 -56 -208 -309 -225 7 -295 73 2 -16 -140 -28 29 68 91 44 -82
4296 -82 39 213 -23 -91 166 -4 356 -133 3 4 142 -148 -156 -200 -145 -77 122 -144 -158 -51 37 -120 -130 234
4320 234 -73 14 139 288 -31 -16 -25 -18 27 196 189 183 15 372 -49 121 -2 146 -29 -49 189 -51 95 3
4344 3 -124 -138 190 95 -14 -12 87 76 100 -358 174 0 -102 -48 -181 -55 136 -68 67 202 -239 199 -31
4367 -31 -51 -84 -52 -125 118 244 -36 -52 -134 -82 -94 52 116 136 87 177 63 69 66 -276 19 53 23 24 -86 47 -71
4394 -71 -267 -90 155 -53 -104 189 -56 124 10 -106 -301 -92 -179 66 -14 -162 -16 45 32 -47 -39 127 -2
4417 -2 -234 159 -32 148 -51 -260 -212 -6 216 -199 -104 297 -42 57 -28 -134 198 -14 -243 -22 -130 105
4439 105 -131 50 -170 -15 160 -113 15 57 -109 -228 107 -11 -27 -312 -232 -14 -35 -47 60 334 -3 34
4461 34 114 77 -188 248 -133 118 -13 -229 257 3 -191 -88 81 129 86 -70 -132 -126 -71 -382 -125 -193 7
4484 7 -218 367 -10 -81 41 -165 75 -34 -66 70 119 8 56 -195 2 18 -94 178 -250 -169 -69 -175 -162
4507 -162 -13 8 91 -4 204 46 -76 6 -88 -77 107 156 -104 -21 172 -26 239 38 -136 63 -35 -101 -158 -212
4531 -212 34 63 -35 79 50 81 197 -233 63 -28 -57 29 -31 163 -71 -157 -91 -12 50 0 63 211 -146 -62 -70 -40
4557 -40 -117 -135 317 307 4 -112 49 -93 -197 10 -68 85 -27 101 65 -33 -119 59 -19 -92 185 -28 -12 -58
4581 -58 -181 315 -23 -34 -52 -53 325 -125 -288 51 161 55 24 230 -53 -376 -224 -208 -86 -76 309 -29 -22
4604 -22 86 85 113 -104 217 -40 259 180 -148 226 -146 -167 -102 -211 -81 29 -61 258 114 -9 -192 54 106
4627 106 -18 73 138 51 -116 -24 28 -66 99 50 43 165 -63 -56 -111 107 177 123 -128 108 -84 22 80 -53 118
4652 118 39 125 -94 86 5 42 80 198 110 43 255 62 -72 -194 -23 -324 38 -104 -76 -144 -23 -68 56
4675 56 38 61 67 303 118 -141 -74 -53 -30 36 20 -234 -227 108 168 -13 -310 -18 120 10 -58 34 131 -100 -84 69
4701 69 4 -32 76 91 -77 205 -8 65 114 134 5 -104 -82 10 163 -120 -186 -13 -117 -177 -75 98 8 26
4725 26 -184 -124 325 -79 -73 -12 -80 197 319 355 173 -79 116 -91 -81 -36 100 73 -181 19 -175 -18 27 135
4749 135 -74 -53 -255 -104 -149 423 87 22 186 204 -147 343 127 43 152 23 -186 150 132 108 0 -146
4771 -146 -127 -11 -123 -107 146 -147 202 -45 157 -40 -3 -45 76 53 -128 -158 -15 -324 -1 249 166 16
4793 16 156 -4 -39 146 142 43 -108 197 195 163 76 -63 38 15 109 -115 245 -64 -106 106 86 -162 -47 -87 115
4818 115 -36 -34 90 -264 226 -113 193 -35 -34 -135 -128 47 -320 24 -189 197 53 55 161 56 -150 16 -88
4841 -88 94 -21 100 48 -70 185 73 -138 -5 -47 171 127 142 101 120 161 -145 19 -217 14 -101 96 37
4864 37 59 -251 -100 -164 59 -196 -19 -38 1 -23 -125 245 -56 155 -63 -218 -204 -284 -17 59 36 6 -64 -133
4888 -133 -61 -48 99 -68 -86 -149 -84 136 349 -101 122 -129 -24 -55 118 -190 123 244 125 93 235 -89
4910 -89 -173 -67 1 279 147 -31 -25 -119 -233 -8 -88 -50 45 96 -42 84 -157 -234 171 -134 265 -45 -78 -21
4934 -21 132 -66 -145 -52 174 86 -4 -29 77 142 138 54 29 -238 -66 -49 8 -86 -162 -103 -41 -160 55 -111 159 270
4960 270 109 -81 71 -15 80 136 -182 65 27 -24 11 161 -82 186 211 3 65 -132 217 -135 -6 80 139
4983 139 -66 -166 -203 -79 132 31 -82 164 49 -34 136 110 -134 75 -309 -269 -131 -243 94 -220 -212 312
5005 312 47 204 156 128 195 118 -235 -10 3 -8 -55 -17 -111 -84 -215 118 98 -183 37 15 -68 -42 28 243 -61
5030 -61 24 376 -12 -172 -13 65 10 169 -97 97 -7 34 88 -111 -54 165 -89 -330 202 -180 41 98 -92
5053 -92 -3 -49 90 312 234 -190 85 -177 68 115 -127 -169 180 -73 10 60 -434 -185 -193 182 193 -42 -15 46
5077 46 44 -42 84 6 -196 -22 -136 -145 153 6 -37 -70 -44 -69 114 73 60 32 32 98 107 -130 -285 -102 -26 -12 27
5104 27 -164 -50 -123 -447 210 39 -168 207 37 -128 -185 68 -98 324 -76 76 292 89 122 52 142 -158
5126 -158 102 -73 -124 258 -272 -23 169 45 151 -49 255 -18 54 -234 24 40 -55 -149 71 205 10 -136
5148 -136 -117 76 139 -350 114 -227 -140 -269 194 -49 -137 89 78 -268 -13 -18 -174 235 82 -182 -278 -184 47
5171 47 5 -192 34 -128 95 -76 -158 75 69 120 -402 -87 -205 -90 -74 120 2 74 -157 124 59 64 17 24 274
5196 274 40 -3 -358 184 30 -88 -73 68 -323 -107 -82 259 -43 181 18 130 40 -8 88 50 6 -133 -2
5219 -2 -191 -271 83 -190 -95 -19 66 -116 -164 -8 102 45 -68 43 21 -186 238 -196 86 131 162 62 11 -119
5243 -119 51 193 -159 -80 62 -71 -118 39 119 33 -7 -58 -20 99 -143 -107 -304 -172 -79 69 233 50 -87
5266 -87 133 63 -150 169 -50 -16 93 -102 68 -23 -111 -221 59 -87 226 174 98 53 36 -11 -12 56 -28 166 23
5291 23 -253 -173 74 -8 -98 266 33 -161 44 -78 359 -38 -2 168 155 -39 -9 159 -45 104 249 156 156
5314 156 220 -293 16 82 141 30 84 -198 -66 -56 -88 -115 -249 -186 199 102 -71 -58 -317 272 108 147 169 67
5338 67 -35 142 -37 -219 291 96 54 37 53 90 -24 -6 -111 133 -162 64 -44 -50 -75 -360 234 -59 27
5361 27 256 28 72 369 19 70 33 14 81 -17 222 14 180 -37 117 169 70 -41 -149 -106 -53 34 -350 141
5385 141 -91 76 198 -65 135 -2 -33 95 -160 22 169 -78 -120 -33 -59 -104 -50 3 -3 -18 193 77 198
5408 198 28 85 -51 48 192 23 89 -9 -120 68 12 114 -63 -100 207 -63 -228 -127 -21 -62 -24 -87 39
5431 39 -31 325 -169 -97 -415 -73 -7 -127 -40 200 -110 174 192 -44 169 42 15 -427 -93 66 -217 161
5453 161 -18 12 61 -128 -78 16 93 -43 -206 150 156 -228 19 -77 171 -60 -24 -56 -180 -39 103 163 243 51
5477 51 51 125 187 3 163 19 -133 32 0 48 -86 178 -87 258 -73 122 -208 58 251 23 -85 -192
5499 -192 -60 123 87 -94 -5 200 76 120 -51 9 -319 -1 -331 4 -51 8 159 -298 63 106 -70 -161 -76
5522 -76 77 126 233 92 123 -87 104 -172 218 140 -236 68 119 6 18 25 -64 151 39 -206 -137 41 -208
5545 -208 359 -80 -43 -15 154 -192 102 52 -16 -150 16 254 11 241 90 -125 -44 0 -328 -14 54 -25 -35
5568 -35 -8 12 152 -6 -6 112 -17 128 39 -83 58 -354 60 128 39 3 192 -108 140 -1 54 125 -64 -11
5592 -11 75 133 220 77 89 -45 -19 -70 79 17 185 187 131 -79 6 -129 -158 -40 -121 -23 67 274 -237 -62 12 99
5618 99 117 99 127 -55 18 270 -89 294 85 -94 -12 -256 82 202 -142 -53 127 186 -107 110 -166 -36 43
5641 43 -34 68 -52 -91 -104 62 -49 173 174 -171 -9 103 -76 170 164 -34 245 -122 272 163 77 -178 -18
5664 -18 18 113 165 135 47 -29 -68 19 1 117 -69 94 205 39 -27 -1 116 -142 81 107 -31 33 208 22 55
5689 55 15 41 52 255 -49 -110 -120 -54 24 -38 145 263 179 -1 96 64 -7 56 70 96 194 -18 347 145 -236 214
5715 214 -107 -24 -192 184 -75 -89 -230 84 190 -147 -87 -107 90 198 -242 -148 -9 -76 190 -8 -190 -328
5737 -328 224 -125 28 150 -100 146 -141 33 -206 27 -129 -42 73 171 -60 301 -52 -139 -33 -191 -49
5758 -49 93 117 -17 214 -28 -50 -65 -72 -109 167 70 -20 204 -77 -58 189 -5 218 -11 89 5 -239 25 -183
5782 -183 -175 30 -73 -178 -240 -1 99 -252 117 198 160 48 17 -72 80 -242 61 82 154 -59 157 46 -238
5805 -238 -113 144 37 -83 -122 -56 -287 90 -149 250 1 -43 -203 95 -52 92 24 136 7 16 66 -82
5827 -82 -196 1 75 219 -84 102 3 92 -112 -118 -4 -63 3 77 -100 97 142 58 -72 153 -5 -182 18 122
5851 122 88 77 45 185 -30 116 -123 -120 10 107 209 64 38 -220 -219 168 -340 -212 236 211 60 -247 -160 -193
5875 -193 59 15 56 -157 17 -66 -52 10 -151 37 41 33 236 -46 21 -167 102 -222 92 -135 -121 266 -34 -88
5899 -88 25 -281 -98 -357 -182 58 285 38 -22 -199 -37 13 14 18 -40 -64 -35 -59 -75 109 -56 -103 -137 61 -99
5924 -99 -104 -170 -213 119 -125 -34 49 103 -131 -102 -5 87 -13 -303 114 -78 134 -98 7 240 66 140 264 -40
5948 -40 -88 113 -45 -12 -34 -102 -137 -53 135 2 -4 92 72 49 -27 57 -98 46 -83 -155 20 -192 194 -88 157
5973 157 68 129 -111 251 93 147 -152 60 36 96 -125 103 178 195 -92 -82 -160 -110 36 125 106 -45 -69 -273
5997 -273 -146 -84 167 27 157 60 -82 267 -22 149 -35 -141 -12 41 -69 64 27 -62 -124 142 77 -230
6019 -230 231 -25 237 36 251 262 -105 -309 -137 -179 -32 128 -59 60 -115 80 14 40 38 220 141 40
6041 40 -202 57 164 215 -30 116 -29 -55 -108 -140 182 -39 -92 -164 11 -163 23 -59 -35 -233 -40 -93 178
6064 178 -101 -52 33 -48 96 -172 105 0 168 187 6 -111 -6 -218 -229 -235 177 50 -50 36 72 -33 111
6087 111 -106 -95 -120 46 69 26 -170 -239 -218 47 -132 -416 -113 -205 -92 -194 -196 86 -101 77 241 78 189
6110 189 -135 -55 -107 127 157 -48 -167 159 86 -18 -132 -57 -220 109 -104 198 34 -2 151 78 205 -149
6132 -149 -178 -224 -139 -96 125 3 -112 60 261 -44 59 -34 66 -218 -46 119 224 138 146 264 -65 -27 -17
6155 -17 174 307 34 -162 172 130 190 67 -136 -323 139 2 -29 -3 -123 406 192 145 -176 19 -236 163
6177 163 2 238 189 349 202 174 107 -179 -22 32 72 80 193 -196 47 -213 -83 22 89 -123 46 -104 -99
6200 -99 -70 -67 -183 -69 24 -27 156 -33 124 -111 98 -66 -139 -308 60 219 85 176 41 -240 17 140 101
6223 101 -112 -151 -172 -188 52 97 56 -142 200 -48 -188 -283 100 7 190 -32 -213 53 16 -185 285 25 -362
6246 -362 -136 204 -176 187 -83 -263 -3 -140 34 0 -287 73 243 -240 283 -127 409 155 -51 188
6266 188 -253 -30 -320 97 78 164 -112 60 -245 -198 68 -134 3 88 100 337 -22 90 -38 181 93 -47
6288 -47 -39 244 -76 -65 164 -92 -23 117 27 50 -60 166 -73 -75 190 77 215 -24 71 84 -62 -274 135 90
6312 90 136 -78 123 -16 42 131 98 14 -123 -12 139 77 113 35 -183 143 -124 120 -131 -74 40 96 -122 -6
6336 -6 -6 287 162 -96 111 90 -256 13 -151 -50 -101 82 -116 70 -23 118 1 -140 116 -159 216 -38
6358 -38 23 138 -26 -162 -78 -3 -62 -135 21 -115 255 70 -298 48 -23 -73 -92 -65 214 -103 -403 224 247 7
6382 7 -156 33 73 -41 15 -146 8 118 160 -21 77 -74 -121 -82 56 -114 -148 130 147 28 176 -24 -78 -139
6406 -139 -74 -125 -27 44 -19 -115 151 60 96 -63 145 217 44 -161 -77 294 -47 177 -32 -71 -52 -81 5 27 -73
6431 -73 15 -44 21 -151 25 130 260 115 26 120 5 -113 -73 76 185 -262 321 8 -99 54 -2 -36 -167
6454 -167 -73 -93 -191 -28 42 -137 -156 150 -218 52 -29 -53 33 -78 154 -2 14 -24 -222 -263 -399 -81 138 -192
6478 -192 50 109 217 105 45 93 129 22 141 49 -34 143 33 60 83 -108 79 9 96 -347 118 3 -165
6501 -165 83 133 32 -159 43 41 -35 -40 43 -221 81 52 -104 166 -54 78 8 49 -232 -29 40 -180 -88 -154
6525 -154 11 125 -63 29 -198 125 48 65 -40 -38 242 65 131 -8 -76 -54 44 -243 -6 -102 9 208 -170
6548 -170 13 115 -47 73 144 111 -95 204 -102 -134 1 -107 -71 58 133 24 -34 -384 -181 78 96 189 127
6571 127 261 -34 -193 -104 -79 131 -132 -82 -10 -15 -113 -34 -66 40 88 -277 -27 -46 376 -78 25 56 -92 53
6595 53 48 303 49 175 129 -245 100 111 284 121 185 78 -173 200 -18 -47 260 -121 -60 -249 -34 134 -76
6618 -76 238 -167 130 -12 -194 149 -1 97 81 -62 190 -270 -53 -24 55 239 118 231 45 -56 -10 134
6640 134 66 -101 129 -135 -80 -162 7 -201 200 -13 -203 -187 -189 100 61 -55 97 -66 211 313 6 46 -138
6663 -138 117 -21 52 130 -113 55 360 -67 -140 -86 -3 -10 -16 -86 113 -73 -203 202 18 -5 -139 -175 113 10
6687 10 59 95 0 -60 -193 176 132 181 25 -177 -41 55 129 -38 -81 -114 -165 14 -70 197 120 12 -78 40 21
6712 21 -64 158 -122 -248 -17 95 136 -129 -28 191 -181 -275 -30 132 -40 70 -90 -101 145 -7 0 -173
6734 -173 -41 158 -51 -284 -124 -123 80 -115 123 105 -65 -22 43 -21 118 -182 -233 92 -10 284 67 -105
6756 -105 79 -36 143 -278 -185 -101 72 305 10 -341 242 -315 42 240 218 18 70 -65 -122 223 55 160
6778 160 229 52 73 -98 146 42 197 124 -14 44 32 -121 149 79 -26 87 -191 115 292 294 -141 177 103
6801 103 -124 3 -50 -163 120 -25 105 -82 86 111 -73 114 168 84 -161 -99 -172 -139 90 168 224 67 -3
6824 -3 5 5 -228 -127 -169 -65 -3 -86 143 -129 -66 -16 42 -365 202 207 162 65 38 -31 -83 -155 8 -49 -43 116 282 -20
6852 -20 -41 -148 28 -46 173 47 253 -40 252 8 32 377 -32 93 23 160 67 158 12 212 -15 38 -34
6875 -34 88 130 -7 288 -162 -3 112 -132 296 127 -93 151 -14 108 163 -197 61 -13 -1 161 -12 66
6897 66 137 363 -241 64 16 24 -48 43 310 205 -148 -166 100 192 182 -296 -152 174 203 100 132 -14 27 160
6921 160 240 -73 21 -80 -142 256 319 -199 -9 -85 -27 -82 -54 10 -156 160 -8 107 136 -39 -75 -70 150 174 -29
6946 -29 158 -372 -95 125 -149 198 296 -33 228 11 -189 15 149 -149 -91 206 -284 -106 51 -182 64
6967 64 6 -217 -254 10 -105 95 166 95 147 156 67 196 144 -56 162 178 -215 -2 62 -225 -439 139 -40 90
6991 90 -165 33 82 -51 -52 -33 82 228 64 380 -173 266 301 455 68 88 -349 98 75 -113 54 -159 -79
7014 -79 -25 207 -110 70 60 -24 -5 -20 20 -44 -153 -61 -28 -227 -90 -7 128 -118 60 117 78 -115 -147 200 166
7039 166 23 -4 50 70 -54 8 36 -42 84 -101 184 -69 -142 69 -133 -30 -44 -92 78 138 194 51 -54 -77
7063 -77 -129 -37 -301 -95 6 160 -68 -23 51 -218 0 -12 -217 -59 32 -34 24 15 -78 -26 5 37 11 161 116 -39
7089 -39 -22 355 81 -150 -124 94 215 -275 12 -12 169 -128 0 328 185 -315 -70 170 37 75 104 12
7111 12 27 89 -93 -73 -140 -159 -63 32 -61 13 -225 -121 311 -120 -41 -254 -142 -58 -25 107 -140 -76 -5 -152 234
7136 234 -360 -144 -146 -51 -110 41 148 -87 225 -117 -287 -162 -43 -104 13 37 -59 88 207 -157 -127 -107 -147
7159 -147 95 306 -153 83 174 140 54 40 -21 -48 58 -119 -6 -70 -202 293 -108 -103 -223 115 64 103 -140 26
7183 26 84 77 -63 -134 210 -11 225 -177 -104 209 21 224 90 116 3 265 25 -130 -28 -263 72 48 -11
7206 -11 -171 217 -141 183 -239 152 -88 -5 385 80 183 37 51 6 386 -261 -175 326 308 94 -80 -132
7228 -132 -61 30 154 40 140 56 69 -105 146 -255 -42 189 157 82 -220 105 -116 -41 -130 205 -238 -325 123
7251 123 -23 -44 -169 4 10 251 151 -75 -27 330 -96 -34 167 137 2 -134 203 -73 -132 5 -122 97
7273 97 30 155 84 125 -282 26 43 43 21 74 198 119 -10 -265 -72 -126 -86 -143 -26 34 6 -84 -43 83 -134 106
7299 106 -63 81 59 -73 -20 27 -252 83 -194 -44 -74 -146 -27 -206 19 -231 -280 -14 10 -63 181 -15 -53
7322 -53 -119 -27 -76 -252 8 344 -205 -36 -46 35 15 150 83 -156 202 233 38 108 277 -70 -233 192 -161
7345 -161 -70 -49 31 -251 -97 220 -31 -4 -199 138 -203 -159 -38 57 -89 172 -89 143 -37 -10 -53 314 87
7368 87 -182 179 55 219 48 -185 255 -30 73 -244 -156 135 148 128 24 205 58 63 -48 -67 105 -44
7390 -44 262 -90 -200 -109 -139 -255 146 92 -227 -103 72 166 125 161 -287 -223 9 -37 214 -103 106 -114 267
7413 267 105 269 -89 13 71 -198 19 4 -151 -216 -21 261 -131 181 187 -92 95 -139 159 -235 -71 -184
7435 -184 108 183 -45 -102 -161 -133 -214 93 -20 38 -18 -58 40 -100 -209 -28 -132 -263 103 -124 -59 130 -29
7458 -29 -228 -153 45 85 -99 -52 -64 96 -226 166 -41 -83 119 227 -179 -96 26 -197 -48 30 38 -82 -108 -25
7482 -25 191 -377 -3 -39 -16 4 323 -153 214 171 -66 -105 47 -192 -52 -31 -117 64 233 198 -65 -62 160 -86
7506 -86 188 -5 -46 109 27 -163 30 -236 137 67 -41 10 274 -3 226 186 -19 -23 -21 45 15 161 229 125
7530 125 -374 -153 -72 80 258 -99 149 12 -222 175 153 128 38 86 -81 158 74 -247 233 146 -70 29 -31
7553 -31 32 45 252 -144 -172 -74 -38 -15 52 109 61 -160 -35 -128 -175 -138 42 -183 -105 390 -44 98 -16 -18 136
7578 136 107 -153 152 -245 -38 123 -48 197 -74 -161 11 -116 295 -95 35 -128 239 -7 -106 123 -53
7599 -53 261 96 57 -28 163 302 254 -355 69 155 -3 70 105 171 -108 64 -137 48 207 176 -66 25 -119
7622 -119 239 360 129 -118 -64 -95 -89 -143 76 -192 71 58 24 30 31 141 -210 55 224 -20 -150 131 97 27
7646 27 -213 -221 -75 155 97 -105 72 -131 76 -222 -109 33 -177 -323 -148 -151 -194 77 -101 -128 44 -140 -40
7669 -40 -250 -127 -33 1 131 -12 -185 62 -138 203 149 2 -107 -16 14 -107 120 8 -1 -128 -142 48 -98
7692 -98 87 84 -151 24 -268 -82 -142 -197 92 -81 32 -85 -102 32 14 172 -74 -145 -63 -238 45 35 242
7715 242 -113 -111 198 -80 149 210 129 326 5 100 202 -209 291 -42 144 11 -81 -22 10 -83 -91 30 -58 172
7739 172 24 168 57 132 -41 -138 44 -37 235 -129 97 56 -74 182 -29 226 45 -54 41 -216 64 -96
7761 -96 -41 150 21 225 -154 -40 48 -2 82 40 284 -348 -173 -33 -58 53 70 32 188 84 122 168 -14 4
7785 4 3 73 -70 -109 -95 21 -196 175 45 -138 70 6 -80 -150 -199 -7 40 -4 -374 99 -32 43 -80 -176 12
7810 12 -185 87 -239 88 39 -156 5 164 137 -132 15 -158 -54 -195 282 26 173 -139 -174 -97 276 -109
7832 -109 -92 -66 209 -52 -40 -8 -15 127 30 111 94 -43 36 43 -121 47 -30 175 -98 217 -142 -172 66 0 -255
7857 -255 -60 66 -45 -39 218 -132 -67 223 249 -153 223 167 -37 -370 -341 -21 -153 -71 -60 97 -139 -171 -59
7880 -59 -119 396 -104 15 219 -171 21 25 -10 71 143 -173 -159 -15 1 -33 187 -74 -251 166 -48 -85 -205 109
7904 109 26 -171 69 -74 -72 -90 24 -44 -4 121 96 -94 139 58 115 204 222 -103 94 31 84 206 24 310
7928 310 4 56 -16 -366 259 4 -223 54 102 20 208 265 -153 -16 -301 -117 -176 20 89 44 -56 -87 -190
7951 -190 250 -215 311 6 -182 -74 86 -158 -214 59 -71 -12 153 34 -66 244 25 201 296 -70 17
7972 17 67 -238 221 -37 104 -67 -23 -34 82 -24 -6 217 -11 -46 171 25 62 -9 -46 -185 -216 59 -26 -50
7996 -50 -31 -58 73 19 122 -62 -126 16 143 184 -84 -45 41 347 16 -47 -69 109 125 -235 17 24 64 59 49 180
8022 180 102 28 -6 124 58 -12 -52 4 -155 -45 -15 43 72 -303 115 -61 45 22 145 133 166 -39 69 144 -65
8047 -65 299 95 -146 78 -229 -74 -52 21 77 -107 149 -191 239 52 335 -322 -11 -75 -23 172 -86 15
8069 15 -210 46 -171 -31 93 -44 -113 33 82 -194 56 18 89 -201 27 211 43 -280 60 -75 -256 -228
8091 -228 197 8 -127 225 43 197 -22 -111 -91 207 -29 113 -154 -90 -217 107 -60 -224 8 121 -142
8112 -142 -71 -116 -99 -248 -38 135 297 -83 -135 -190 -123 4 56 -154 -28 -86 45 -82 -17 108 206 92 118 -75
8136 -75 -17 84 -7 -103 203 17 -172 179 -5 297 198 -7 -136 -245 -43 -39 -182 6 -116 109 144 179 135
8159 135 42 -117 -57 -13 -161 8 142 -74 -212 75 -42 42 -7 23 232 252 105 168 -54 -20 93 -21 20
8182 20 169 -92 76 60 10 -41 -15 -100 -77
8191g7
$$ Imaginary data points
##PAGE= N=2
##DATA TABLE= (X++(I..I)), XYDATA
0 0 0 0 0 0 0 0 0 0 0 0 0 -5 2 -8 8 -8 10 -16 16 -19 24 -31 35 -42 49 -58 66 -75 89 -100 115 -131 148 -169
34 -169 189 -214 239 -268 299 -334 372 -410 457 -507 558 -619 682 -752 828 -912 1006 -1106
52 -1106 1222 -1347 1489 -1651 1832 -2045 2288 -2578 2928 -3361 3909 -4630 5628 -7103 9521
67 9521 -14185 26582 -135776 -361217 -233669 -66267 117678 190193 237025 285128 366233
78 366233 366825 243370 12102 -179437 -241195 -164993 -70329 -30192 -44905 -37532 13816 64094
90 64094 22235 -113631 -253659 -280218 -173612 -8618 106785 145062 156650 194388 232535
101 232535 202247 67417 -110790 -218868 -192799 -79100 27313 69640 71618 89207 130262
112 130262 134237 50810 -95575 -211825 -218017 -120192 -3834 57728 63201 60624 77983 86403
124 86403 31850 -87291 -198934 -221082 -133444 4669 111883 155465 167022 181064 187464
135 187464 145442 37090 -94534 -171413 -152147 -68371 11744 43035 34264 22256 16640 -8536
147 -8536 -75456 -162665 -212848 -180611 -73963 49009 134642 172162 180974 176151 149907 82894
159 82894 -15630 -101878 -130696 -93178 -20697 39518 63773 60734 44372 14819 -35046 -102590
171 -102590 -161396 -174836 -129058 -42915 46295 109888 137769 136018 109835 58126 -9982 -73052
183 -73052 -105822 -92563 -39895 26758 82845 113266 111506 78306 20553 -47945 -106835 -135456
195 -135456 -126954 -86473 -26855 35252 82612 102401 85045 35034 -26299 -74066 -91746 -77390
207 -77390 -41437 5946 59309 108990 135768 122014 66274 -11995 -77450 -107534 -103659 -81050
219 -81050 -50208 -11886 36039 79829 91895 56332 -9450 -69830 -93109 -75598 -41067 -9346
231 -9346 21697 62060 106245 128167 99557 23629 -58858 -104497 -101197 -70330 -41023 -20259
243 -20259 9629 57015 98365 96199 39927 -41594 -94678 -91655 -52797 -14681 4849 21002
255 21002 54337 96603 108314 61324 -24853 -96803 -111868 -74358 -28003 -3718 6935 31169
267 31169 74512 105075 82875 7246 -73423 -105020 -78302 -27991 2932 6739 15409 48346
279 48346 85483 84352 26089 -56916 -105196 -89308 -35533 7285 18915 19107 39780 78850 93826
292 93826 52256 -28918 -95524 -102460 -56139 -5350 13018 9556 18200 51419 80618 63447 -5560
305 -5560 -78178 -101365 -63491 -4332 28996 27561 24020 45532 75244 72472 16555 -62304 -106171
318 -106171 -86072 -28462 16525 24655 16082 25150 54954 67813 33107 -36359 -90746 -88365 -35322
331 -35322 19378 39488 31406 28150 46615 64493 45721 -15424 -78553 -96870 -60896 -4947
343 -4947 27482 26284 18169 29121 49288 47238 5375 -54675 -85845 -64115 -10220 33288 44167
356 44167 34316 33865 48243 51076 19428 -38423 -83835 -83550 -41272 6013 26878 23490 19470 28883
370 28883 39520 25297 -17218 -60754 -69931 -37322 12129 44401 47117 38312 37408 40343 29244
383 29244 -7556 -53776 -77798 -61688 -20480 15909 29243 24539 21258 24806 22018 363 -34166
396 -34166 -58128 -51712 -16986 21675 42060 43021 36475 32222 26025 7718 -23408 -50338 -54322
409 -54322 -32658 1496 27132 34949 31440 24965 16809 804 -23725 -48382 -56949 -42363 -13009
422 -13009 15520 32773 36876 33664 26311 12004 -7532 -26520 -34619 -26326 -3998 20791 38191
435 38191 44193 38795 23733 2107 -23036 -44756 -55594 -51654 -35036 -11760 10919 27880 35145
448 35145 31404 16743 -1819 -16337 -21468 -15674 -3329 10862 25658 37673 41985 33183 11187
461 11187 -17859 -41255 -50163 -45506 -33592 -18736 -2249 17126 35734 42424 31571 8731 -13871
474 -13871 -23619 -19551 -9829 -3084 2098 11135 23183 30285 21022 -4678 -31648 -43275 -35734 -17859
488 -17859 -2711 6752 17717 34357 49078 47504 24250 -10173 -34219 -36939 -25380 -15321 -13265
501 -13265 -12932 -2926 14383 23636 12208 -13499 -33710 -31973 -10214 13019 23372 23811 28437
514 28437 40486 49139 36977 2235 -34635 -51626 -43483 -25246 -14588 -15708 -14539 247 20554
527 20554 28342 13354 -13568 -28031 -16824 8228 25919 26727 19516 20093 30235 33147 13754
540 13754 -22374 -52546 -56382 -36470 -12972 -3436 -4403 445 18278 37181 37523 14462 -13746
553 -13746 -23676 -9764 12462 21333 12979 2156 3534 13251 12240 -8448 -39930 -56689 -45197
566 -45197 -16283 7632 14638 12728 17926 33813 44820 34156 5504 -20668 -25242 -8666 8692
579 8692 10068 -1148 -9454 -4728 4872 2388 -17710 -40185 -44144 -24926 3989 21748 21834 17911
593 17911 21847 31576 33331 16213 -11175 -29544 -25535 -6744 8223 8570 -264 -3289 3985 10757
607 10757 3665 -15419 -31841 -30168 -10239 11740 20312 16038 10682 12038 16727 12496 -5828 -26177
621 -26177 -32785 -20275 545 14225 14667 10061 10041 15206 15562 4699 -13538 -24426 -18525 -1911
635 -1911 11522 14088 7854 2806 3125 3370 -4200 -18193 -29265 -26712 -11031 6797 16718 17509 14484
650 14484 14668 14970 10879 -995 -13670 -17670 -10561 2095 11227 11955 8183 5014 2863 -1150 -9188
665 -9188 -19317 -23510 -17985 -5556 6006 12528 12883 10560 8472 4565 -2041 -9290 -13421 -11156 -2255
680 -2255 8391 15459 17541 15745 11099 4593 -3036 -11507 -16512 -16494 -11577 -4753 2041 6305 7267 5124
696 5124 -369 -7218 -11508 -12537 -9257 -2731 4327 11621 17825 21319 19481 12031 1381 -8201 -12533
711 -12533 -12506 -10437 -7588 -4417 330 5593 7998 3767 -4270 -11949 -14270 -10026 -3229 1543 5246
726 5246 9539 15468 19670 16625 5887 -6995 -14006 -13644 -8619 -4458 -3548 -1887 3651 10427 12313
741 12313 6141 -5424 -13908 -12319 -5148 1669 3202 2478 4729 10734 14513 8981 -3127 -15147
755 -15147 -17669 -10681 -1837 1152 492 1821 8120 15261 14881 5048 -8412 -13731 -9174 -664 3720
770 3720 1615 -1496 943 7772 10371 3284 -9796 -18487 -15411 -4477 4087 5328 2335 3758 10415
785 10415 16389 12499 -326 -12615 -14823 -6925 2331 4232 207 -2121 1875 8670 9433 -441 -13164
800 -13164 -17249 -10936 1084 7788 5862 2107 3902 10277 13283 6709 -6622 -15946 -13666 -3044
814 -3044 5111 5557 759 -906 4125 9746 6990 -3465 -14213 -15554 -6149 4675 8023 4197 736
829 736 3738 9154 9952 1551 -10062 -15164 -9987 715 6796 4777 456 343 5190 8447 3621
844 3621 -6867 -14510 -11724 -2024 5880 7330 3308 1370 4432 8305 6430 -2391 -11292 -12552 -5401
859 -5401 3482 6925 4018 575 1469 4833 5360 -692 -8835 -12211 -7717 1410 7164 6570 3048 1931
875 1931 4486 5262 1893 -5585 -10933 -9112 -1932 4553 6154 3674 1079 2219 4160 2134 -3154
890 -3154 -8567 -8987 -3524 3255 6506 5412 2824 1932 2884 2033 -2546 -7582 -9116 -5739 435 5381
906 5381 6043 4157 3120 3029 2331 -802 -4919 -7782 -6060 -1549 2833 4641 4072 2382 1464 765 -1461
923 -1461 -4410 -6050 -5696 -1869 2650 5463 6236 5613 3922 1969 -683 -3775 -5845 -6345 -4384 -1279
939 -1279 1531 3054 3738 2918 1261 -1048 -2799 -3681 -2995 -1044 1154 3209 4779 6096 5132 2555
955 2555 -1341 -4461 -6094 -5731 -4542 -2522 -952 1104 3580 4873 4062 1013 -1841 -3045 -2280 44
971 44 941 1389 1889 3256 4641 3741 -221 -5028 -7421 -6632 -3581 -974 -174 431 2707 5972 6857 4787
989 4787 -90 -3821 -3986 -1710 586 590 -773 -808 1602 3365 1936 -2217 -6703 -7440 -3600 859 2298
1006 2298 1866 1966 4240 7018 7526 3157 -2984 -6027 -4832 -1064 807 -729 -2591 -1882 1710 3828
1022 3828 2080 -2955 -6584 -5006 -409 3718 3821 2141 1641 3956 6369 5449 -454 -5690 -7816 -4763
1038 -4763 -475 678 -992 -2299 -499 3342 4903 2107 -3246 -5048 -2762 2262 4656 3249 416
1053 416 356 2714 4042 1710 -3694 -7928 -6917 -2375 1600 2096 79 -740 1761 5136 4968 1159
1069 1159 -3636 -4796 -1281 2892 4100 1333 -1146 -1027 1780 2999 -372 -5138 -7235 -4864 22
1084 22 3477 2601 360 358 3120 4733 3371 -1251 -5015 -4173 -88 3017 2827 280 -1297 47 2216
1101 2216 2130 -1584 -5264 -5652 -2519 1584 3190 1903 180 412 2062 3077 926 -2910 -4785 -2977
1117 -2977 544 3188 2592 482 -272 1253 2683 1177 -1820 -4389 -4119 -982 1947 2658 994 -599
1133 -599 -33 1087 983 -1248 -3495 -4078 -1614 1632 2981 2437 1136 1064 1656 2245 263 -2379 -3540
1150 -3540 -2642 -37 1592 1796 671 -170 -64 471 -350 -1900 -3244 -2413 -312 1671 2752 1968 1022
1167 1022 819 632 161 -1213 -2476 -2228 -1186 894 1597 1829 1398 862 462 -2 -1058 -1761 -1520 -1220
1185 -1220 77 913 1406 1310 615 186 -713 -1632 -1940 -1604 -954 141 999 2010 2621 2269 1656 461 -538
1204 -538 -1413 -1193 -1263 -557 -444 156 475 1342 892 -191 -1785 -1847 -1480 -247 50 635 1200 1673 2291 2688
1224 2688 1565 -761 -1677 -1915 -800 -404 -451 -724 -94 915 1438 910 -877 -2245 -2213 -869 511 755
1242 755 656 428 1278 2447 2405 413 -1735 -2249 -1455 -17 276 -49 -589 -161 1383 1781 732 -1640
1260 -1640 -2557 -1482 230 1117 819 -307 -64 1184 2157 1503 -672 -2324 -2313 -976 1005 893 -69
1277 -69 -434 624 1701 1993 35 -1969 -2649 -1090 663 1323 389 -536 -55 1554 2079 701 -1528
1294 -1528 -2923 -1617 124 1566 1216 -57 -47 720 2195 1583 -448 -2359 -2521 -662 1183 1141 -286
1311 -286 -813 185 1603 1714 80 -1875 -2507 -1028 959 1552 551 -348 72 1097 2033 1104 -1024
1328 -1024 -2459 -1624 -128 1395 915 -167 -436 145 1316 1067 -344 -1967 -2165 -666 1358 1415 272
1345 272 -463 151 1321 1561 279 -1371 -1987 -1199 474 1383 676 -232 -481 404 985 301 -1178 -2052
1363 -2052 -1338 221 1140 1076 216 -305 558 1025 1036 -23 -1521 -1557 -326 722 1034 593 -385 -279 67
1382 67 447 -547 -1046 -1543 -935 345 956 1034 131 -40 273 766 322 -775 -1205 -870 -7 754 467 335
1402 335 -95 49 212 204 -487 -978 -1090 -334 370 864 499 522 23 186 171 -259 -971 -997 -584 35 652 462
1424 462 418 198 257 25 -389 -680 -658 -539 -137 514 622 497 362 221 48 -385 -699 -412 -271 -14 172
1445 172 540 459 564 615 -135 -163 -303 -506 -147 -377 -138 149 -50 513 605 269 -229 -742 -708 -583 247 -76
1467 -76 -110 480 384 899 451 -233 -332 -457 -403 3 119 13 -30 398 524 501 -26 -941 -972 -436 3 -185 -46
1490 -46 82 406 926 594 352 -561 -939 -467 -72 532 166 -207 -127 562 836 540 -211 -870 -926 -12 386
1511 386 38 -232 -237 95 716 842 103 -772 -600 -371 495 724 -68 75 -153 647 841 191 -653 -1022 -722
1532 -722 -120 290 236 -315 -294 336 511 534 -251 -827 -849 -62 730 573 34 -107 124 439 802 162 -984
1553 -984 -1165 -596 141 405 159 -385 -509 550 894 87 -411 -942 -672 247 508 238 -86 -226 -10 498
1573 498 502 -223 -1064 -1012 -55 489 961 87 -362 -17 410 763 133 -531 -914 -383 317 700 124 -253 -141
1594 -141 83 483 223 -430 -923 -326 220 554 483 -143 -16 76 511 529 -219 -632 -984 -261 221 322 76
1615 76 -393 -117 269 363 112 -405 -522 -225 266 746 352 31 88 176 431 202 -382 -540 -641 -163 433
1636 433 239 76 -435 35 535 194 11 -350 -337 34 223 529 352 -221 117 19 474 -134 -760 -763 -278
1657 -278 -65 221 383 -12 272 410 294 460 148 -83 -193 441 32 368 18 -83 55 -118 -141 -300
1677 -300 -501 -676 -288 70 370 295 445 158 473 311 251 111 -93 -279 195 -66 -111 160 102 -266 -221 -586
1699 -586 -394 -100 -166 132 145 161 195 152 290 -55 -315 -164 57 25 -141 -131 -58 100 127 -100 -34 -233 -143 -323
1723 -323 -41 176 27 24 148 227 268 -60 -446 -464 -503 28 194 -186 -101 6 87 428 337 24 -361 -44 267
1746 267 436 -52 61 -116 -29 185 323 -36 -622 -198 -320 255 231 -9 -294 -132 295 607 55 -251 -275
1767 -275 -254 115 450 89 -131 -36 351 154 288 -110 -462 -525 -281 208 4 -183 -198 127 151 427 106 -99
1789 -99 -708 168 192 -37 97 -145 -224 709 323 329 -119 -357 -363 125 446 65 -224 -25 -13 62 201 -140 -201
1812 -201 -419 109 252 79 -25 -46 214 376 319 41 -276 -85 -409 -32 152 43 -173 -131 53 283 132
1833 132 -353 -645 -275 126 64 297 -45 -107 323 611 511 77 -148 -233 38 313 297 110 -191 65 155 88
1855 88 63 -558 -430 77 200 152 84 18 140 12 273 82 -113 -328 -139 9 94 261 155 -64 221 -161
1877 -161 177 -61 -353 -260 -6 136 168 -151 114 -85 311 22 -13 -284 -339 -195 -148 175 156 -184 -159 90
1899 90 -27 50 -87 -344 -216 185 39 99 162 -40 -122 110 -38 -284 -300 -204 -149 285 130 -59 52 118 -37
1922 -37 115 156 -204 68 166 168 174 68 36 -226 -10 255 -280 -124 -181 -120 43 -169 -91 87 -31 183 34 111
1946 111 36 -34 -195 176 19 184 -229 273 314 -86 -26 -197 -265 -343 -220 24 -63 83 27 237 99 -10 -86
1969 -86 12 162 -33 94 71 283 52 209 195 -73 -427 -101 149 79 -61 0 -61 239 68 45 -290 -145 -238
1992 -238 -249 61 -140 -86 93 239 -62 -121 155 -105 -256 -462 -4 -7 46 -66 -104 324 -86 180 -176 -75
2014 -75 -62 15 -26 -176 -35 -108 -30 53 175 145 -177 -144 27 -71 258 -95 22 105 77 -82 8 -7 -33 -161 234
2039 234 225 -24 -153 -82 209 305 201 -104 -384 -302 86 49 404 -394 -166 -22 80 190 334 -112 -84 -118 401
2062 401 145 -12 -296 -39 142 79 252 -154 -460 -288 -188 -17 -18 202 148 48 403 446 -68 -217 -76 18
2084 18 427 90 -15 -135 -182 46 101 -345 -230 -267 24 80 334 -56 -116 -56 47 248 505 -440 -252 -117
2106 -117 -71 -210 -86 -171 -284 -57 -398 118 -71 -191 -111 -220 182 422 184 272 363 418 16 -39 -316 -88
2128 -88 -522 -402 0 -322 -404 -152 40 268 -155 -241 -66 -9 234 342 77 -42 -32 116 230 -33 262 -89
2150 -89 -25 -275 -3 206 -243 157 -333 -168 28 -145 -384 -157 315 262 81 168 25 98 31 193 1 -45
2172 -45 -122 -172 18 -126 308 -277 12 89 -17 -43 -185 -105 -80 -152 -92 -418 78 99 -82 41 131 -24 80 116
2196 116 -27 -80 188 172 351 291 -30 93 -147 94 23 -224 -264 -103 -133 -59 -275 -266 -172 -182 -85 76 151 -67
2220 -67 53 116 173 119 99 316 324 8 40 116 125 -132 162 -200 -184 -31 -175 -304 -315 -40 93 -35 -101 -85 -8
2245 -8 343 69 -49 -176 172 20 206 -144 208 287 -290 177 138 -80 4 13 120 44 -45 -60 -254 18 28 -99
2269 -99 155 -216 -139 155 -52 92 279 8 6 52 107 366 128 -3 -50 -176 -119 -52 -114 -254 -192 92 77 -123
2293 -123 -168 84 -370 90 231 173 -142 6 -91 182 -185 192 27 -143 95 310 21 31 67 -162 161 108
2315 108 48 -187 -281 116 -221 -62 35 38 -276 -84 77 -235 201 -280 119 164 -5 94 -69 104 91 -17 376
2338 376 -164 -19 -158 -123 93 25 -69 -294 -1 -28 139 -60 -203 -208 187 200 60 82 362 -26 263 278 18
2361 18 -53 -35 34 32 7 106 -29 -281 -313 -80 134 -330 -272 -176 -252 -114 89 153 -74 100 -153 201 123 32 -175
2386 -175 -16 -25 81 4 221 67 -10 -162 2 -338 -337 -71 -105 -30 -46 -10 -67 -18 240 129 138 -91 -260 -14 113
2411 113 9 15 -273 -77 109 -19 -21 129 -113 -110 -30 -63 95 -82 41 -19 299 97 180 -35 -332 -139 -25
2434 -25 144 173 98 32 158 -28 159 56 -19 -112 -176 215 -62 134 147 -19 -174 -137 27 -167 -132 -18 -34 -135
2458 -135 67 140 -107 55 -151 14 -131 225 16 113 169 47 1 -120 -106 -117 -59 -155 -161 -27 -24 -77 120 -81
2482 -81 -32 20 65 74 154 172 -18 -170 -115 40 155 21 280 -118 -94 114 32 284 248 -131 126 51 53 -3 -337
2507 -337 67 -83 -13 98 135 -15 -31 38 239 -1 -64 -208 15 116 -372 0 96 362 120 -99 -99 -94 -178 -54
2531 -54 -76 -300 91 -36 400 151 134 143 146 -143 160 -143 -93 49 167 -86 -185 -56 -109 243 102 142 -49 -24
2555 -24 -30 114 -241 -61 -381 -137 124 150 162 -31 -59 164 107 -126 -54 -66 74 -363 298 268 158 -110 -79 341
2579 341 215 179 -101 -122 -51 -41 137 -11 71 -136 -25 270 -52 -19 -152 -22 -56 -130 -136 -51 69 196 162 295
2603 295 91 55 -90 39 4 -226 -160 -120 116 128 375 -169 194 -34 -171 55 51 -49 34 -17 72 33 -46 48
2627 48 -16 179 83 -238 -53 100 24 280 107 30 -97 -156 35 109 -23 5 -252 48 -192 128 -376 -248 34
2650 34 -301 -89 75 83 291 224 -212 218 -157 175 75 91 162 177 203 -93 -71 -64 16 178 -142 -99 -125 -251 -118
2675 -118 -145 -89 -211 -1 -16 243 210 49 8 164 85 36 -73 187 191 265 105 27 -18 30 -46 -213 -6 -367 -5
2700 -5 -126 -43 221 16 141 28 -55 -229 83 -8 -27 5 232 92 -106 99 200 75 -79 -77 -6 -44 -319 148
2724 148 -160 -38 3 -164 -197 -325 -142 0 -26 263 -34 40 -12 199 122 -76 287 101 146 72 41 59 8 198
2748 198 77 7 19 -75 -81 -63 -105 38 -165 -74 -82 -371 -30 -47 -159 212 75 -151 28 34 71 183 -43 -34 4 234
2774 234 -102 -185 -132 -136 -147 109 126 -187 -61 -174 80 160 -67 61 -124 272 274 -157 -190 219 27 51 106 171
2798 171 -103 -67 -63 -23 -120 -87 -178 -81 -24 -199 -2 -247 -22 3 -127 27 -226 -252 -45 87 138 252 1 198
2822 198 -147 -82 -3 144 -9 -1 -16 -128 159 -194 -150 -97 -8 78 -38 -248 209 199 87 40 112 210 155 -210 50
2847 50 -98 212 -283 112 104 -8 -180 -190 -154 -81 -190 17 283 86 127 -141 -121 4 -93 91 -15 7 -17 -2
2871 -2 -113 -89 42 198 62 175 142 97 116 -268 -1 -56 151 -79 -14 -175 -221 -135 -141 -12 -140 -299 -21 41
2895 41 -119 -72 93 -126 143 96 -120 -42 -281 32 196 148 -135 7 14 94 -43 -33 48 -3 165 153 31 -121
2919 -121 20 -19 128 -300 -176 198 128 -224 -128 154 -118 42 -75 13 76 3 -61 -165 -1 -154 -106 -17 -50
2942 -50 -64 73 -87 -178 -101 -86 116 -6 -93 33 -74 -253 -46 26 21 88 -153 184 12 -84 -115 -151 -54 177 155
2967 155 34 -14 82 194 -197 -300 -192 -106 -156 -100 -112 12 59 84 39 -157 100 -33 -8 269 120 -105 83
2990 83 -124 36 -3 14 37 55 30 143 128 -56 -163 15 -289 -153 -76 -65 31 255 -97 -193 -56 -50 19 -291 43
3015 43 10 68 186 296 -20 243 -61 -30 -311 94 247 180 123 21 209 -29 -86 -285 -198 14 -179 -197 84
3038 84 77 244 214 -67 -289 103 -89 -79 90 -149 -186 -104 -264 -17 -237 192 0 -209 -65 262 -173 -234 133
3061 133 197 139 -130 -76 69 -85 -228 -137 -122 -80 182 77 -204 12 96 19 49 -53 -332 72 158 51 75 -64
3085 -64 93 239 205 69 -66 -115 -140 -37 216 65 11 137 -37 255 17 91 -5 -162 181 0 149 -143
3107 -143 -306 -160 -69 215 -149 237 11 41 135 -77 56 83 -76 -72 -114 -112 189 -148 148 -143 -42 -60 168
3130 168 49 -92 82 165 72 -6 275 -91 -175 -74 -32 -142 -71 67 264 -168 -17 -135 -2 165 -81 157
3152 157 -10 -169 -1 129 14 45 26 2 9 -141 169 282 227 -60 -363 306 82 83 -58 -105 24 56 247
3175 247 -23 118 36 -258 19 -8 -143 -56 60 24 258 -311 110 118 -20 74 -41 54 87 -102 -152 80 -125
3198 -125 -78 -22 -74 39 -201 -171 -122 290 83 127 -129 167 138 -167 -105 57 -174 68 -186 89 -14 -75 -51
3221 -51 -19 31 -264 151 -106 115 76 -35 68 18 11 -132 -78 -39 208 285 -102 -164 84 152 -18 11 -37 82 -34
3246 -34 104 248 -41 -66 -53 57 21 103 -62 155 129 5 -6 -26 -24 91 -139 49 107 271 -230 -3 200 98
3270 98 -2 56 44 130 184 -234 44 61 -213 164 201 -76 -345 46 -133 120 90 -116 -197 93 -85 -17 -60 -182
3294 -182 -99 3 -114 73 -205 164 -159 -292 -241 -284 187 89 64 267 15 169 -126 -80 -19 -10 298 -3 -90
3317 -90 208 -253 -168 -44 -97 74 -181 44 -10 107 -5 92 29 104 241 -37 -109 -7 -10 -71 75 -61 -74 -33
3341 -33 -6 -12 16 -355 -129 14 92 57 -52 98 34 -62 89 63 14 -24 -226 22 -122 104 -17 131 108 -101
3365 -101 -96 -235 -122 -66 64 -90 60 -134 -137 -155 79 -96 -19 36 -33 -11 -291 187 -349 -210 27 10 165 6
3389 6 46 -17 -83 10 76 14 62 39 -240 -69 -188 -174 -353 16 -101 -44 203 -40 -37 -207 169 -138 2 -110 240
3414 240 -147 14 65 73 81 28 -122 5 166 -329 25 310 -237 21 -91 -305 -316 -5 117 -63 47 38 -202
3437 -202 -333 -88 -251 -56 -219 -3 -222 -186 -232 168 42 -41 89 186 -4 29 -43 135 160 -49 25 -252 -161
3460 -161 77 -24 -44 9 -48 106 -106 -343 52 -217 -180 62 -36 110 -14 215 39 61 7 -221 -78 83
3482 83 -165 6 -170 -154 115 -72 -118 132 -33 112 154 -14 -20 35 28 -63 -150 58 -26 -28 -83 -137 14 122 -51
3507 -51 49 -79 12 -27 -9 81 122 124 -70 68 -102 38 -42 106 54 -123 87 61 23 -84 154 -72 -58 31 -116
3532 -116 81 -5 137 -180 -58 13 6 -77 62 -115 57 -83 174 -420 148 -209 -147 -343 -93 110 42 67 31
3555 31 82 -30 -147 -73 329 153 -112 107 -100 -33 270 138 -79 209 132 -111 108 -126 -108 -137 -87 -3 50
3578 50 -6 -249 -172 174 131 -3 -346 94 -186 67 -152 129 -34 -58 269 246 -170 70 -2 229 16 -83 84
3601 84 -143 -181 -217 111 -59 -160 191 -26 62 32 7 150 85 -137 53 125 -15 292 281 42 49 -127 -141 -115
3625 -115 -66 66 -175 145 -94 -188 158 126 326 142 -218 72 266 92 134 271 25 66 -218 -170 194 69
3647 69 -36 -91 -126 115 -208 -9 -166 -132 -299 20 16 40 225 65 255 -3 228 213 279 -125 -103 -37 -7 189
3671 189 86 -62 147 -165 -283 41 -146 169 29 35 198 103 -49 -41 38 -17 141 110 -82 -150 -209 41 48 -516
3695 -516 19 -111 -101 94 -27 185 -186 22 11 -13 -72 172 -111 145 -7 -176 61 130 319 135 -20 -27
3717 -27 -49 -110 -194 29 231 97 -203 -122 -126 -377 -93 63 -178 238 188 34 -20 172 -165 307 -91 -60 115
3740 115 306 36 11 -62 67 -18 79 -26 204 -205 -206 144 73 -177 -8 -78 -180 -16 -52 -222 -59 85 85 -232
3764 -232 -11 101 -7 -99 243 51 81 -223 -81 160 133 35 -6 103 -78 93 0 -77 -195 -75 71 208
3786 208 -245 -92 312 -37 154 11 43 -172 283 -181 113 -22 98 -74 88 -86 150 -121 -10 -212
3806 -212 -81 -155 178 254 59 197 168 -73 134 -19 -164 339 -36 -56 205 100 -163 60 46 -127 -35 101
3828 101 27 132 67 -47 88 -17 149 137 -164 -189 -183 -313 79 41 67 -113 36 -13 -47 41 160 -25 -111 70
3852 70 31 43 -79 -446 -82 -25 20 -24 -87 170 130 2 194 201 264 296 -229 296 121 47 21 241 53 92 37
3877 37 264 139 151 -174 -204 311 147 -18 21 -80 -157 -11 -183 -56 141 58 -139 55 -314 47 -6 26 281
3900 281 34 65 170 -93 -54 16 -1 112 -289 -79 -65 -203 -127 -183 0 -140 45 80 -36 70 68 54 85 239
3924 239 -142 136 -112 -84 248 131 -89 -93 226 -218 34 107 -43 -22 -8 -107 125 131 -300 57 -118 124 16
3947 16 -166 -52 27 120 -165 19 -27 296 -1 -120 -163 5 136 -121 -118 83 8 -76 -260 -73 -84 83 -65
3970 -65 19 -178 94 -258 261 129 -79 163 -47 -131 -178 -157 20 33 137 -108 300 49 36 -244 70 315
3992 315 113 301 -148 -227 -54 169 52 -98 -116 42 9 29 -86 17 50 -19 123 -112 213 285 -84 -57 187
4015 187 -199 51 -51 215 95 21 -177 -29 -213 -185 66 -245 -44 277 19 31 -81 81 21 -339 231
4036 231 73 100 -89 -160 31 154 -59 -189 -87 36 -292 -7 108 3 41 14 66 -36 -92 70 -161 27
4058 27 -121 156 -62 104 -368 -41 -45 -13 -22 -114 -65 26 88 -78 151 -67 68 119 241 -87 240 90 -17 -135
4082 -135 363 162 -73 -28 71 240 21 -161 -364 -155 -84 119 39 47 11 89 50 -61 80 -43 -1 -115 133
4105 133 -116 -30 97 211 -182 171 -546 118 300 -79 281 -145 124 98 18 -57 -37 -74 15 -240 334 45
4127 45 60 -121 108 138 -115 -101 17 71 2 8 77 -113 56 -226 16 -16 -155 -120 48 -162 -88 114 -166 164
4151 164 -323 247 -152 158 -164 -234 -122 238 220 -233 25 -61 154 180 -56 -42 118 38 -160 -67 273 -15
4173 -15 38 175 -37 69 1 48 89 -122 118 52 -221 29 15 193 -101 17 -70 20 -103 -95 -60 -147 181 129 -365
4198 -365 -95 -42 69 19 -180 -95 119 151 56 60 33 100 55 -6 -11 224 116 243 -9 59 -244 -34 -24 3 -100
4223 -100 -156 -11 -94 86 -37 33 -154 82 -179 -71 -2 291 65 -98 176 -15 193 -49 16 115 24 -56 162
4246 162 213 102 -107 82 -103 -286 -110 -210 7 79 95 -185 -92 230 25 58 -282 12 -165 227 -118 -168
4268 -168 -192 120 -87 154 71 -80 -100 -70 -99 -63 -70 115 -134 -232 -5 -144 36 98 -61 -45 34 -159 5 159
4292 159 182 324 192 286 -93 -137 237 0 154 174 -108 45 175 8 218 -15 229 -147 101 131 -70 71
4314 71 -118 -277 -73 90 -46 44 -184 -119 -231 126 -125 252 26 -32 -110 -150 149 33 303 72 110 55 66
4337 66 180 -106 74 146 37 0 12 32 -113 52 -147 -39 283 -156 -29 75 119 132 -64 -78 97 -190 37
4360 37 -155 -33 112 -12 119 20 70 -89 -320 72 148 86 92 94 -147 172 -295 -79 78 227 -177 -170 154 -6
4384 -6 163 72 67 -111 124 174 -87 37 187 129 197 -127 -61 54 -25 114 208 -74 -81 -5 77 91 -293 -195 -86 -34
4410 -34 -155 37 -128 94 225 -96 -56 -41 -211 115 227 -54 -77 -288 26 22 42 -69 40 277 -47 185
4432 185 -8 70 258 -97 115 -92 33 72 -85 0 224 34 58 -94 59 -62 184 148 261 133 91 217
4454 217 -17 -30 -225 24 215 194 -62 -125 -51 -21 177 -189 -44 143 -87 -91 119 300 15 -9 4 240 111
4477 111 -313 -75 245 12 170 -60 -227 10 114 176 -17 -2 -214 34 -69 -141 -41 -281 -232 -119 -52 69
4499 69 -21 186 -377 -1 -82 180 -24 97 21 -166 100 -59 -6 -23 -79 121 48 75 -114 88 -81 -53 -35 -111
4523 -111 224 -51 68 -264 112 -70 49 -57 59 -25 51 -3 55 -17 60 -260 -34 -63 53 -187 94 128 -282
4546 -282 160 90 -58 154 170 237 79 106 -247 147 -64 196 86 114 -137 29 -169 -51 -48 -39 57 -81 -6 143
4570 143 93 158 -77 121 -89 -71 -308 -214 -219 -129 -40 46 21 -164 2 81 215 -242 83 74 -53 -156 46 -63
4594 -63 -160 -232 388 120 41 233 212 -9 -79 5 90 -85 -126 91 -90 -174 49 -26 190 -44 -221 -130 -95 -219
4618 -219 -25 -35 -247 263 51 -115 -92 -60 -108 -93 -118 -80 56 -95 93 135 -107 -180 65 -102 -134 77 71 156
4642 156 -134 106 -187 -352 -52 205 105 72 -376 -105 63 -20 140 218 -105 39 -133 93 -70 3 106
4663 106 161 171 94 -150 -207 97 -119 30 133 -106 -269 -127 -104 -161 -230 49 -21 -130 97 -40 -149 -370 -123
4686 -123 116 -200 336 66 95 -2 52 145 -167 220 164 -1 51 -154 -16 -139 -66 -64 93 -34 226 -3 -54
4709 -54 14 -63 51 1 35 -6 114 -150 -63 -40 -137 -116 -277 174 -51 139 3 35 -25 -132 -119 -32 -47 49 12 93
4735 93 246 165 -111 -249 -22 -142 48 10 -146 126 170 75 -114 -59 -108 215 -54 -206 -269 104 86 77 -13 -215
4759 -215 189 34 -97 14 101 -27 -236 92 33 -228 -140 -90 219 -61 -101 280 17 -109 129 310 -144 -179
4781 -179 93 -206 101 -187 142 118 78 -142 -218 -129 -37 -26 -141 254 -323 192 -147 -192 70 160 74 46 119 84
4805 84 267 -32 -40 -157 197 -28 -80 -4 -36 91 -59 68 -107 333 -174 242 -71 108 20 46 30 -110 -14
4828 -14 -80 -95 45 46 -83 17 -18 127 131 277 -60 279 415 -20 4 25 83 86 -72 -2 -305 124 198 -98 41
4853 41 19 -81 63 -19 -99 -131 -6 -157 -200 31 -195 -170 -57 213 119 80 46 37 -28 197 -215 -74 273 -184
4877 -184 19 41 198 -5 -39 138 132 15 537 -221 167 -16 -30 -160 8 136 155 -6 -187 -34 -3 214
4899 214 -98 -109 -30 -116 -169 38 -23 -52 -107 -155 -87 13 -38 130 116 -75 -237 37 -98 101 102 122 -43 -35 102
4924 102 85 117 132 175 96 -147 -249 7 370 28 -127 34 -109 78 57 68 -108 -52 -47 133 41 121 -19 -96
4948 -96 170 -258 -10 -38 -15 -135 129 219 -99 -154 389 -125 134 201 49 69 41 27 -72 -143 53 125 -133 -43
4972 -43 -97 197 73 -140 -4 -43 -112 24 -491 -69 -53 -84 -26 -189 -24 -90 85 18 -103 -30 241 50 83 79
4996 79 -210 -41 -7 31 -77 -25 -14 26 38 94 -58 -84 183 -78 72 -55 -40 77 73 9 210 -57 -25 201 34
5021 34 -58 235 2 40 -174 20 121 -195 -248 -141 83 -13 68 132 274 299 -140 -125 -47 -245 -168 35 -61 67
5045 67 -99 -14 -27 -124 127 73 -89 -59 36 -161 -51 204 71 26 -97 -241 -39 371 30 -7 -82 48 -46 169
5069 169 155 92 137 -19 145 -37 -203 21 -108 109 195 -102 0 78 -14 31 239 149 -197 -143 116 104 33 -340
5093 -340 142 -2 66 170 -166 -167 33 -29 -51 173 -37 -94 -112 -156 73 2 26 -163 1 -72 51 -21 96 6
5117 6 -55 -120 167 140 -85 -127 51 19 129 -16 -76 -15 7 -280 163 -25 202 -224 -10 298 -296 71 103 239
5141 239 -110 -250 -1 167 -21 214 2 42 0 -229 155 -211 -57 -94 174 -110 64 15 -230 -16 -48 220
5163 220 -389 29 -103 -104 175 213 -37 -95 25 -343 -72 116 -20 -8 69 -24 74 234 -171 195 -56 32 180
5186 180 61 511 3 -94 -50 103 -6 -35 -102 80 -36 -90 106 120 69 183 -161 8 -44 -363 0 62 -153
5209 -153 -68 -33 -228 195 -272 8 -92 208 -156 -3 -162 -200 -268 -1 -241 -132 50 -73 -209 -214 -107 -1
5231 -1 -113 -136 -85 -265 122 104 -303 -63 -88 62 -2 -149 124 153 55 -117 101 3 -88 43 215 -58 -102 -252
5255 -252 9 292 -22 -93 -18 161 49 53 100 -42 45 7 50 -64 17 94 124 217 -30 -41 -141 -257 -76 9 27
5280 27 94 66 403 82 -51 126 -70 -1 61 -301 184 -210 133 -21 -41 46 -85 -140 168 -87 -172 -93 -120 -200
5304 -200 5 85 -179 177 73 91 31 -72 35 -109 167 207 137 -35 -263 36 -45 -128 -22 -70 169 76 -178
5327 -178 -270 33 -8 -36 4 -85 161 94 -45 -41 -176 -109 -159 153 -146 4 -266 -12 146 -211 -45 40 -167 -489
5351 -489 -103 -58 30 -332 -97 -99 -26 -7 52 75 247 -111 257 -54 -45 25 -236 71 258 176 188 135 54 -149 259
5376 259 -152 -151 -204 -221 99 -29 -20 -58 -72 341 -96 -11 161 -72 136 -28 -150 71 -72 10 65 120 69 -55
5400 -55 -109 64 -59 31 211 -98 -45 -127 -81 -48 262 -40 32 -326 173 127 121 94 -196 60 -239 -81 0 -29 -56
5425 -56 157 264 -47 184 -30 137 -79 -15 82 22 31 -161 98 -73 -11 53 -2 -64 -165 45 -51 -9 -126 46
5449 46 -113 36 307 -10 5 -100 101 -194 20 7 127 26 -99 -64 155 90 -37 -26 123 142 52 -248 -56
5472 -56 -206 60 -158 94 -26 -110 -41 -199 304 141 106 45 -149 -26 -288 77 -205 -149 -232 -209 -14 156 163
5495 163 -33 74 -147 153 -9 115 188 -237 40 -121 114 -85 -194 -76 73 114 29 83 15 -86 203 -271
5517 -271 -41 33 -146 -136 -61 11 -1 -155 -59 23 21 95 224 -23 -321 -10 -59 73 -134 74 369 9 -273 90
5541 90 61 -27 -111 97 128 -205 -136 -133 145 39 -9 -195 -65 65 -53 129 52 -32 -9 -126 15 -222 118 -146
5565 -146 -89 -49 271 135 79 -45 24 112 -182 46 -189 307 -15 179 133 363 2 3 190 -14 46 -39 -231
5588 -231 272 81 13 -104 -303 -204 142 -25 93 10 62 43 67 -66 -103 -62 171 86 0 51 65 76 -57 187
5612 187 -56 -77 36 -44 49 -90 294 -438 -78 -82 85 206 -65 -264 -36 168 -213 178 -230 -25 319 -49
5634 -49 27 -24 213 30 141 151 58 -31 -39 23 -55 231 -141 157 -149 -140 -55 -92 172 -28 69 -56 11 75 -68 71
5660 71 -338 -204 1 -2 12 -284 59 -218 140 233 -175 -171 -283 257 -151 -266 16 -89 119 208 -24 170 -26
5683 -26 52 2 -165 94 33 59 -86 1 250 91 -114 24 178 132 49 1 -331 178 226 -105 184 333 83
5706 83 82 43 -84 124 -8 -31 27 24 71 230 61 -88 -24 61 -35 -81 -130 -50 180 -186 -16 -113 31 -109 8
5731 8 -34 -20 -173 -57 2 -76 154 -60 -54 -87 -60 -29 136 -104 -99 154 -167 64 -29 107 -32 49 172 -137 95
5756 95 -346 -81 141 38 -125 -219 16 -185 -95 89 -126 31 -95 126 28 -182 -192 -59 -126 -104 -194 101 142
5779 142 -47 21 -152 -394 43 173 -200 290 -90 -195 -163 -12 58 121 -22 139 84 17 70 -102 85 -121
5801 -121 38 -12 13 -106 91 106 143 -64 -21 -242 -128 198 -153 111 -80 -24 -161 -4 81 -156 -208 -145 -359
5824 -359 43 14 80 -156 -155 30 66 -96 -279 122 290 -265 133 176 -29 -39 -8 147 -330 -71 67 80 94
5847 94 -17 131 -64 -110 325 270 -94 -130 136 -152 219 60 146 395 -191 156 148 120 -205 14 69 -320 -179
5870 -179 83 -97 26 -15 -113 16 -207 46 122 -129 140 -152 -119 85 -80 203 114 -124 -290 -127 -199 -334
5892 -334 -94 233 -2 156 -208 -93 15 -73 21 104 46 121 65 -153 51 -133 42 -57 -225 207 -150 -148 10
5915 10 -344 14 -30 13 131 -12 16 -112 84 177 -159 227 -67 -74 73 148 -93 238 65 -28 49 266 -105
5938 -105 294 -60 19 -111 74 -133 -85 22 152 111 -68 41 22 104 22 172 39 -331 422 -101 -191 -172 -117
5961 -117 -211 -23 41 -348 3 93 -85 101 -11 -115 -148 114 17 96 -195 -213 21 -32 94 36 -88 -307 50
5984 50 -179 38 -195 151 16 -70 199 258 130 -79 -35 56 182 -210 -105 219 43 -191 42 52 44 -117 -180
6007 -180 195 -14 52 243 -65 -136 -231 4 -115 74 -55 311 85 161 -20 134 -135 -97 26 120 47 185
6029 185 70 92 16 82 183 121 25 37 258 -183 47 119 12 -36 -95 181 -29 21 145 172 -173 -95 6 -138
6053 -138 -20 339 20 193 -4 42 97 -200 -119 9 29 -64 -225 -131 25 -56 -130 -26 226 19 -242 -85 -178
6076 -178 -7 86 -35 -61 13 267 45 -10 -62 -107 15 -90 5 -122 -6 -143 -16 4 68 -144 259 -5 219
6099 219 244 -78 -58 -99 -71 109 200 -93 -175 -4 -42 22 -64 -296 -76 108 -70 -174 -148 -128 87 -68 -68 68
6123 68 -17 237 109 75 -308 -145 -103 -217 -193 -57 -254 180 -69 -255 -92 50 10 -119 184 55 -92 -5
6145 -5 -35 -12 152 9 118 -64 -237 10 -155 12 73 85 -183 -54 233 177 171 92 -202 7 -19 15 18 94 67
6170 67 28 -62 -145 -134 -50 189 -79 -15 18 76 -188 -97 -27 109 -38 27 -93 -13 -34 22 -112 252 -202 -43 -14
6195 -14 -46 26 192 -99 -200 -145 107 117 -19 115 123 -96 -36 -354 -45 -69 -17 -112 37 235 -138 -217 70 38
6219 38 60 160 43 -290 -50 159 106 -42 -198 -21 52 -51 78 -6 -75 140 -117 -224 6 157 50 -33
6241 -33 -262 -21 114 -191 48 87 177 -37 -96 70 -145 -277 144 -24 81 -11 60 51 -181 -8 43 -321 -119
6264 -119 -70 -59 130 138 17 -59 129 -9 -100 61 165 -10 251 -42 -162 -107 13 104 123 10 136 141 -21 -12
6288 -12 103 115 -269 -230 20 -119 92 -55 103 -230 253 -9 113 56 21 -59 -350 187 138 96 71 29 -23 189
6312 189 90 114 64 -101 12 29 105 -59 -70 -81 -73 -295 -305 -82 -118 124 -246 -222 163 -39 245 -26 -247 67
6336 67 130 -81 -82 -25 -142 171 47 -25 80 -81 156 31 161 -167 116 -106 123 -163 361 -1 -17 89
6358 89 -134 -85 305 86 -116 159 -23 168 -114 195 -140 -7 152 -108 -239 -131 -194 -42 -98 -163 39 -182
6380 -182 -14 -44 -71 43 -128 -215 164 -28 109 -9 -56 -129 -1 -4 -45 61 52 76 -136 -166 -174 -199 159 -83 71
6405 71 156 -115 -64 -36 -51 68 -10 -154 145 78 1 -83 193 -184 166 -33 33 -38 -235 234 22 26 -98 -20 211
6430 211 37 -1 70 -68 174 -119 -180 -21 158 36 158 -28 188 -211 -36 288 -88 -270 92 58 -58
6451 -58 -85 -32 227 126 19 -31 -3 82 91 -122 -204 102 -348 81 -35 -100 -99 67 -193 -33 -215 -95 4 -125
6475 -125 -31 -87 -120 -264 -202 -109 -186 -230 -159 -107 27 8 -148 -97 -169 -139 -72 196 -129 94 122 -123 -48 -100 -122 74
6501 74 -161 -49 46 169 136 -110 36 54 -43 -189 -125 151 -57 36 -2 -93 -36 -274 151 47 238 -52 12 214
6525 214 -168 -19 7 63 207 84 104 -170 82 -136 -128 200 -141 -88 23 177 -108 -248 -16 101 -30 -60
6547 -60 71 -64 105 -144 -132 -95 112 -109 29 188 -39 -10 -153 183 50 -39 13 -224 78 10 -142 -78 -223
6570 -223 112 -34 -88 -70 241 131 -94 -113 44 -70 -79 78 -72 72 -125 41 -177 88 -1 -122 50 -50
6592 -50 -251 158 70 113 113 -27 67 126 57 -106 64 -134 70 -110 49 204 91 80 -254 -119 85 107 -173
6615 -173 69 -197 -7 -188 53 -57 -3 12 -247 195 55 150 -166 -81 331 -33 80 -44 79 -82 -8 -170
6637 -170 -1 -120 30 -70 101 -4 27 27 89 103 60 59 94 66 -48 -120 -12 131 31 248 32 -8 149 26
6661 26 -5 355 -167 214 -26 79 -32 11 -43 95 57 67 108 136 -220 -276 142 144 59 -191 323 34 -53 20 -223
6686 -223 31 101 -51 95 121 -211 -221 28 22 -296 -25 55 -79 63 6 315 47 6 -60 -87 -1 138 4 -47
6710 -47 -25 -119 -132 206 -42 -45 -46 117 -119 20 99 123 25 285 -14 -55 2 16 -148 8 -159 -257 205 110 -119
6735 -119 83 -164 -119 130 -116 389 3 -8 -39 -75 46 -58 -79 -95 131 -252 -63 13 133 171 174 -208 110
6758 110 131 158 -416 75 -108 -37 26 -93 40 33 331 9 -103 185 -105 -79 124 -33 199 -149 59 -170
6780 -170 80 92 -103 -90 59 -2 -36 -29 46 122 -170 -15 -188 -14 136 69 112 57 -70 27 218 1 -113 -78
6804 -78 223 -15 -246 -75 -256 43 -122 130 436 86 38 -44 -163 -283 28 88 197 15 -318 -295 102 8
6826 8 36 -256 -92 -179 84 -170 65 -51 -82 108 84 34 203 -32 -123 87 90 56 -67 -316 285 -48 163 314
6850 314 -41 -240 -85 40 -220 190 132 -110 27 -122 -117 149 19 -26 -63 7 -86 -54 -180 162 108 -72 -168
6873 -168 179 -117 -123 28 -54 -60 115 89 142 -56 -56 -145 -170 32 12 -297 132 -85 150 -128 -171 283 49 -123
6897 -123 -175 20 123 34 206 109 29 254 -14 149 55 -32 -4 -123 -164 45 47 1 144 -107 -18 -19 -23 -373 45
6922 45 47 171 -128 96 -118 -271 -315 -212 -56 106 -68 -277 -188 39 95 212 -117 28 16 99 -61 9 43
6945 43 -1 -194 -94 -214 182 94 -71 94 102 172 -56 -59 184 191 -37 214 0 183 143 -83 -171 170 83 91 68
6970 68 -167 113 73 -214 -296 -192 -104 97 -105 -58 119 81 -75 233 123 85 25 -138 -173 9 91 -109 47
6993 47 -66 -46 74 71 91 113 -34 -11 20 -119 187 102 148 128 232 -176 307 22 322 -133 26 -147 250 93
7017 93 -52 -83 99 -66 -76 -146 162 45 28 84 -108 -34 -151 115 -236 61 72 62 -316 -132 -155 5 33 43
7041 43 7 -90 153 59 -22 91 82 139 53 -59 -262 17 -257 8 193 -64 -131 -250 181 -295 188 -53 -59 124
7065 124 77 88 119 187 52 145 3 243 -5 2 -45 166 42 -86 -104 -139 -99 164 -142 -248 -58 91 3 -149
7089 -149 201 -57 40 59 5 247 134 -228 88 -1 123 56 -139 135 85 -245 -257 123 -10 -51 -229 141 -7
7112 -7 72 -15 -140 -41 -12 9 101 267 67 19 -304 100 -26 2 -2 56 -78 -240 -58 163 -175 46 -89 -5 158
7137 158 -88 -74 158 -94 -14 123 175 -298 80 1 -218 18 141 47 109 -139 50 -330 -2 -45 27 333 86
7160 86 -101 -50 135 -153 157 12 63 195 -146 209 26 -77 -123 25 -143 48 -162 -223 -20 -75 238 -214
7182 -214 -209 -14 -113 168 94 -91 65 -59 52 126 -75 -51 39 -252 103 -53 54 -197 -23 -384 -139 -126 112
7205 112 -124 -4 72 -29 88 -128 -114 55 2 -41 -12 -81 256 241 -134 -4 60 -212 44 110 229 106 131
7228 131 43 122 35 187 208 -70 223 127 -178 -193 -64 343 159 140 41 -16 -120 234 -129 -109 72 -194 -37
7251 -37 41 -20 -158 -61 123 -16 -56 178 -127 51 -96 18 -144 -31 185 6 -164 62 -102 8 227 -59
7273 -59 180 127 14 98 36 -58 -75 114 -95 45 214 25 -151 35 26 125 59 -180 2 -126 164 134 -235 -183
7297 -183 -61 -35 2 26 223 114 74 84 64 -209 -337 -54 -43 21 -144 -12 -138 30 -101 -50 136 -72 221
7320 221 -18 152 71 123 -116 136 76 52 125 -86 -49 -146 118 142 33 -234 -336 10 -68 -34 29 -181 -154 136
7344 136 84 -101 -158 -263 -163 36 230 189 112 361 -95 -176 -86 -23 -74 -44 189 232 228 -160 -189 -198 159 -42 -79
7369 -79 -79 -13 221 161 11 -124 255 174 44 -81 75 -32 78 -226 349 63 180 281 -164 72 -14 -232
7391 -232 -201 -400 -30 -290 -93 48 -375 -128 95 -100 138 138 24 233 -177 -9 -55 65 9 -96 -57 -229
7413 -229 211 287 -239 40 -43 10 -14 107 -103 -53 24 -114 -12 -12 -119 158 229 10 -36 162 -68 -487 -76
7436 -76 -97 -106 71 -268 -110 -67 -142 113 -16 75 -84 -27 -87 -113 58 -309 -38 -175 190 -92 13 73 -108 55
7460 55 18 -50 85 104 99 -77 -112 22 118 -168 204 -198 -26 251 -268 228 -192 -45 29 -93 248 -92 -233
7483 -233 139 -113 66 116 -52 15 121 -70 60 -136 271 -119 88 -17 114 67 -115 -230 -18 162 -134
7504 -134 -214 302 -71 323 -160 18 155 -150 -26 233 155 151 -170 -244 -70 -75 212 -168 226 -255 135 -25
7526 -25 113 54 45 192 158 174 -67 57 -161 49 -33 13 -11 -92 124 165 -50 205 28 -30 105 -81 150 406
7550 406 59 60 -56 59 -34 14 -153 -114 129 109 79 116 45 6 127 166 -156 -79 5 10 -175 113 278 -154 -115
7575 -115 -130 311 128 110 -125 104 105 198 47 -263 137 198 -30 -143 138 10 81 -1 -21 -28 27 36 -236 113 4
7600 4 -76 -129 -31 -48 33 -64 -70 -214 192 0 -113 -106 -48 -235 -205 -152 -4 105 42 106 448 -12 -98 204 -172 -88
7626 -88 -50 -180 -147 -3 -82 51 89 22 7 -29 -298 -146 45 -194 291 -298 -223 -43 -263 11 185 -6 19
7649 19 31 -83 -104 -67 25 347 196 303 -3 -37 -84 -34 86 159 -73 -78 -11 37 24 60 164 97 -40 -23 144 -54
7675 -54 64 17 -59 -95 -159 -101 185 -232 136 44 -32 7 142 -130 -135 41 -15 -99 26 -34 -174 142 -129 -106 -240
7700 -240 -39 -33 -249 -77 34 86 -284 -221 105 -226 -235 -70 -95 -100 108 -3 -11 10 -26 -289 -23 1 -7 151 92 -125
7726 -125 102 -32 129 36 22 77 -178 36 -54 -85 165 -231 114 163 -142 -9 238 -63 266 -26 -225 -20
7748 -20 91 -7 -68 232 55 -40 53 -23 -165 65 146 -166 113 -78 44 71 -59 -79 156 -191 184 168 325
7771 325 44 -52 -28 49 69 -81 81 -230 -28 88 292 155 6 -20 227 -231 326 -114 -146 -64 -80 -85 50
7794 50 162 50 -137 -199 78 219 252 -192 161 48 42 231 30 -153 72 48 -151 113 249 88 -174 60
7816 60 90 -107 219 -8 -124 54 -35 -16 -289 30 -139 176 -40 42 -105 -263 184 -74 18 -63 51 11 103
7839 103 204 -139 -19 -184 41 -53 72 -155 190 -60 -166 140 68 -142 45 0 -50 -7 71 -76 127 134 81
7862 81 60 187 153 8 -26 25 177 14 69 105 142 -17 120 118 28 -93 24 -184 -107 119 76 -10 -131 -3 -37
7887 -37 86 -174 69 390 -128 -247 -1 71 47 -62 29 -177 -18 86 -87 19 142 -77 -338 36 -103
7908 -103 64 -312 -85 -93 91 32 -98 -175 -84 74 28 55 148 -240 0 -272 -175 107 -300 153 40 -119 -363
7931 -363 89 -170 -355 81 63 -227 -232 -116 -290 59 -14 -167 -186 155 -85 -14 -63 -127 96 186 195 45 -11 11
7955 11 -45 -68 -22 111 27 -272 273 -21 0 127 93 70 -37 145 -154 140 104 89 -262 -91 -104 50 -161 114
7979 114 -53 -209 233 -249 -12 23 215 -114 -12 -312 -39 -249 -6 40 -34 130 73 -118 88 157 90 -79
8001 -79 -64 -16 -66 147 39 92 121 -129 -261 67 -5 133 53 -100 -100 115 225 171 -17 -74 118 -82 -38 47 177
8026 177 -11 -168 -35 -53 -39 -141 -252 -308 156 -30 -103 -124 -51 -142 58 42 -130 170 47 -195 78 -99 174
8049 174 -52 -114 -271 171 184 -9 -35 142 21 136 -366 247 -163 103 70 39 -22 -145 24 -350 319 60
8071 60 -18 1 -37 -129 155 95 -29 -60 -126 258 -1 306 77 -23 -227 -165 42 -149 98 165 127 297 218 -84
8095 -84 -3 -136 180 98 2 21 -130 -166 -106 163 107 -18 -131 237 265 -118 66 -57 176 -132 -179 -211 -221 -89
8119 -89 64 -209 75 -94 -202 -74 72 174 16 3 -15 273 -8 -109 -31 -74 19 -106 -69 -44 -87 -57 215
8142 215 16 21 -7 -71 24 -231 -1 -31 42 35 -142 85 -171 249 355 -218 -197 -200 211 -70 1 -209 18 12 -84
8167 -84 315 16 -31 -29 53 142 -121 -362 49 -103 27 0 142 123 110 -3 -150 247 -177 -292 107 -34 96
8190 96 -256
8191b56
##END NTUPLES=NMR FID
##END=
