##TITLE=1H_PR168_k
 DMSO-d6, 8 sc, 
 15.2.2019
##JCAMPDX= 6.0         $$ Bruker NMR JCAMP-DX V2.0
##DATA TYPE= NMR FID
##DATA CLASS= NTUPLES
##ORIGIN= UXNMR, Bruker Analytische Messtechnik GmbH
##OWNER= root
$$ XWIN-NMR		Version 3.5
$$ Fri Feb 15 14:06:48 2019 Russian Standard Time (UT+4h)  she@DPX200
##.OBSERVE FREQUENCY= 200.1313
##.OBSERVE NUCLEUS= ^1H
##.DELAY= (6, 6)
##.ACQUISITION MODE= SIMULTANEOUS
##.ACQUISITION SCHEME= undefined
##.AVERAGES= 8
##.DIGITISER RES= 18
##SPECTROMETER/DATA SYSTEM= spect
##.PULSE SEQUENCE= zg30
##.SOLVENT NAME= DMSO
##.SHIFT REFERENCE= (INTERNAL, DMSO, 0, 15.7039)
##AUDIT TRAIL= $$ (NUMBER, WHEN, WHO, WHERE, WHAT)
$$ ##TITLE= Audit trail, XWIN-NMR		Version 3.5
$$ ##JCAMPDX= 5.01
$$ ##ORIGIN= Bruker BioSpin GmbH
$$ ##OWNER= she
$$ F:/spectra/data/she/nmr/H-F/1/audita.txt
$$ ##AUDIT TRAIL=  $$ (NUMBER, WHEN, WHO, WHERE, WHAT)
(   1,<2019-02-15 14:05:11.92 +0400>,<she>,<DPX200>,
      <created by zg, POWCHK disabled, PULCHK disabled
       configuration hash MD5:
       00 E9 B6 7A A2 85 ED C7 34 08 36 98 17 FE 4E 26
       data hash MD5: 16K
       F1 3D C3 08 E2 CB 2F D9 49 85 AA 22 DF 7C 9C B3>)
$$ ##END=
$$ 
$$ hash MD5
$$ 2C 79 A5 0B 6F C2 1E 6F 8D 04 09 FD 4A B0 6B C4
##$RELAX= 
##$RELAX= 
##$RELAX= 
##$RELAX= 
##$RELAX= 
##$RELAX= 
$$ Bruker specific parameters
$$ --------------------------
##$DU= <F:/spectra>
##$EXPNO= 1
##$NAME= <H-F>
##$PROCNO= 1
##$TYPE= <nmr>
##$USER= <she>
##$AMP= (0..31)
100 100 100 100 100 100 100 100 100 100 100 100 100 100 100 100 100 100 
100 100 100 100 100 100 100 100 100 100 100 100 100 100 
##$AQSEQ= 0
##$AQ_mod= 1
##$AUNM= <au_zg>
##$AUTOPOS= <>
##$BF1= 200.13
##$BF2= 200.13
##$BF3= 200.13
##$BF4= 200.13
##$BF5= 200.13
##$BF6= 200.13
##$BF7= 200.13
##$BF8= 200.13
##$BYTORDA= 1
##$CFDGTYP= 0
##$CFRGTYP= 5
##$CHEMSTR= <none>
##$CNST= (0..31)
1 1 145 1 1 1 1 1 1 1 1 1 1 1 1 1 1 1 1 1 1 1 1 1 1 1 1 1 1 1 1 1 
##$CPDPRG= <>
##$CPDPRG1= <>
##$CPDPRG2= <>
##$CPDPRG3= <>
##$CPDPRG4= <mlev>
##$CPDPRG5= <mlev>
##$CPDPRG6= <mlev>
##$CPDPRG7= <mlev>
##$CPDPRG8= <mlev>
##$CPDPRGB= <>
##$CPDPRGT= <>
##$D= (0..31)
0 1.2 0 0 0 0 0 0 0 0 0 0.03 0 0 0 0 0 0 0 0 0 0 0 0 0 0 0 0 0 0 0 0 
##$DATE= 1550225111
##$DBL= (0..7)
120 120 120 120 120 120 120 120 
##$DBP= (0..7)
150 150 150 150 150 150 150 150 
##$DBP07= 0
##$DBPNAM0= <>
##$DBPNAM1= <>
##$DBPNAM2= <>
##$DBPNAM3= <>
##$DBPNAM4= <>
##$DBPNAM5= <>
##$DBPNAM6= <>
##$DBPNAM7= <>
##$DBPOAL= (0..7)
0.5 0.5 0.5 0.5 0.5 0.5 0.5 0.5 
##$DBPOFFS= (0..7)
0 0 0 0 0 0 0 0 
##$DE= 6
##$DECBNUC= <off>
##$DECIM= 32
##$DECNUC= <off>
##$DECSTAT= 4
##$DIGMOD= 1
##$DIGTYP= 9
##$DL= (0..7)
0 120 120 120 120 120 120 120 
##$DP= (0..7)
150 150 150 150 150 150 150 150 
##$DP07= 0
##$DPNAME0= <>
##$DPNAME1= <>
##$DPNAME2= <>
##$DPNAME3= <>
##$DPNAME4= <>
##$DPNAME5= <>
##$DPNAME6= <>
##$DPNAME7= <>
##$DPOAL= (0..7)
0.5 0.5 0.5 0.5 0.5 0.5 0.5 0.5 
##$DPOFFS= (0..7)
0 0 0 0 0 0 0 0 
##$DQDMODE= 0
##$DR= 18
##$DS= 0
##$DSLIST= <SSSSSSSSSSSSSSS>
##$DSPFIRM= 0
$$ [...]
##$SUBNAM2= <"">
##$SUBNAM3= <"">
##$SUBNAM4= <"">
##$SUBNAM5= <"">
##$SUBNAM6= <"">
##$SUBNAM7= <"">
##$SUBNAM8= <"">
##$SUBNAM9= <"">
##$SW= 20.0189088683792
##$SWIBOX= (0..15)
0 0 2 0 0 0 0 0 0 0 0 0 0 0 0 0 
##$SW_h= 4006.41025641026
##$TD= 16384
##$TD0= 1
##$TE= 0
##$TE2= 300
##$TE3= 300
##$TEG= 300
##$TL= (0..7)
0 120 120 120 120 120 120 120 
##$TP= (0..7)
150 150 150 150 150 150 150 150 
##$TP07= 0
##$TPNAME0= <>
##$TPNAME1= <>
##$TPNAME2= <>
##$TPNAME3= <>
##$TPNAME4= <>
##$TPNAME5= <>
##$TPNAME6= <>
##$TPNAME7= <>
##$TPOAL= (0..7)
0.5 0.5 0.5 0.5 0.5 0.5 0.5 0.5 
##$TPOFFS= (0..7)
0 0 0 0 0 0 0 0 
##$TUNHIN= 0
##$TUNHOUT= 0
##$TUNXOUT= 0
##$USERA1= <user>
##$USERA2= <user>
##$USERA3= <user>
##$USERA4= <user>
##$USERA5= <user>
##$V9= 5
##$VALIST= <valist>
##$VCLIST= <CCCCCCCCCCCCCCC>
##$VD= 0
##$VDLIST= <DDDDDDDDDDDDDDD>
##$VPLIST= <PPPPPPPPPPPPPPP>
##$VTLIST= <TTTTTTTTTTTTTTT>
##$WBST= 1024
##$WBSW= 4
##$XGAIN= (0..3)
0 0 0 0 
##$XL= 0
##$YL= 0
##$YMAX_a= 133181
##$YMIN_a= -145760
##$ZGOPTNS= <>
##$ZL1= 120
##$ZL2= 120
##$ZL3= 120
##$ZL4= 120
##$ABSF1= 10
##$ABSF2= 0
##$ABSG= 5
##$ABSL= 3
##$ALPHA= 0
##$AQORDER= 0
##$ASSFAC= 0
##$ASSFACI= 0
##$ASSFACX= 0
##$ASSWID= 0
##$AUNMP= <proc_1d>
##$AZFE= 0.1
##$AZFW= 0.1
##$BCFW= 1
##$BC_mod= 2
##$BYTORDP= 1
##$COROFFS= 0
##$CY= 11.3945322036743
##$DATMOD= 1
##$DC= 2
##$DFILT= <>
##$DTYPP= 0
##$F1P= 18.9103706918063
##$F2P= -1.10871071338519
##$FCOR= 0.5
##$FTSIZE= 0
##$FT_mod= 4
##$GAMMA= 1
##$GB= 0.15
##$INTBC= 1
##$INTSCL= 1
##$ISEN= 128
##$LB= 0.24
##$LEV0= 0
##$LPBIN= 0
##$MAXI= 10000
##$MC2= 0
##$MEAN= 0
##$ME_mod= 0
##$MI= 1.114404
##$NCOEF= 0
##$NC_proc= 0
##$NLEV= 6
##$NOISF1= 3.799351
##$NOISF2= 2.8
##$NSP= 1
##$NTH_PI= 0
##$NZP= 0
##$OFFSET= 15.70392
##$PC= 1
##$PHC0= -9059.015
##$PHC1= 19.40014
##$PH_mod= 1
##$PKNL= yes
##$PPARMOD= 0
##$PSCAL= 0
##$PSIGN= 0
##$REVERSE= no
##$SF= 200.130013532006
##$SI= 16384
##$SIGF1= 3
##$SIGF2= 2
##$SINO= 400
##$SIOLD= 16384
##$SREGLST= <1H.CDCl3>
##$SSB= 0
##$STSI= 0
##$STSR= 0
##$SW_p= 3612.71676300578
##$SYMM= 0
##$S_DEV= 0
##$TDeff= 0
##$TDoff= 0
##$TI= <>
##$TILT= no
##$TM1= 0
##$TM2= 0
##$TOPLEV= 0
##$USERP1= <user>
##$USERP2= <user>
##$USERP3= <user>
##$USERP4= <user>
##$USERP5= <user>
##$WDW= 1
##$XDIM= 8192
##$YMAX_p= 0
##$YMIN_p= 0
$$ End of Bruker specific parameters
$$ ---------------------------------
##NTUPLES= NMR FID
##VAR_NAME=  TIME,          FID/REAL,        FID/IMAG
##SYMBOL=    X,             R,               I
##VAR_TYPE=  INDEPENDENT,   DEPENDENT,       DEPENDENT
##VAR_FORM=  AFFN,          ASDF,            ASDF
##VAR_DIM=   8192,          8192,            8192
##UNITS=     SECONDS,       ARBITRARY UNITS, ARBITRARY UNITS
##FACTOR=    0.0002496,     1,               1
##FIRST=     0,             0,               0
##LAST=      2.0444736,     0,               0
##MIN=       0,             -145760,         0
##MAX=       2.0444736,     133181,          0
$$ Real data points
##PAGE= N=1
##DATA TABLE= (X++(R..R)), XYDATA
$$ [...]
1895b08j08k6M07lm67J01K78O05k26o57k81P99P34l11q61l54K62O40Lo34o42M45
$$ -208 -316 -342 65 62 -405 -304 -26 579 353 -304 -585 214 948 637 -224 -578 -316 324 327 -307 -949 -504
1917e04O80M73m64o67M6O61N04k13p73L0L86K66j0o32k50O93qk64o21K24O93K90
$$ -504 176 649 185 -482 -436 225 729 516 -257 -227 159 425 415 -217 -467 226 218 -46 -667 -443 250 540
1939E40m23o55M06O02Q3k35o02o8N83J29k89p62l04P67N23j90p35j28R66P06k16
$$ 540 117 -538 -132 470 553 318 -284 -352 231 360 71 -691 -995 -228 295 105 -630 -758 208 914 698
1960F98q88j4O13N52n34r67l46P69M79m43p59k71P82O56n7r04L03Q40M30k01p53
$$ 698 -190 -204 409 961 427 -540 -886 -117 362 -81 -840 -1111 -329 327 270 -634 -331 509 939 738 -15
1981a5k34L93J159m49j010n63L77Q38l99n57q95P05Q80K32o97n16N41Q40j12m64
$$ -15 -249 144 1303 854 -156 -719 -342 496 97 -460 -1355 -650 230 462 -235 -751 -210 630 518 54
2001E4j54M64M16k26p45m45O33M38l81o13m02P51Q05l38p83k86O48J316q2j381
$$ 54 -100 364 780 554 -191 -636 -3 435 54 -559 -961 -210 595 257 -526 -812 -164 1152 1070 -311
2021c11p67Q49J362j43j131r80L66J306O04j156j164L35J306Q07o61j008k14J125
$$ -311 -1078 -229 1133 990 -141 -1121 -755 551 1155 -1 -1165 -830 476 1283 622 -386 -600 525
2039E25O15o57r81l38R04L48l86p36l87O02O71k70n91L71Q90M45m95q51M98O85
$$ 525 1140 483 -498 -836 68 416 30 -706 -1093 -491 180 -90 -681 -310 580 1025 530 -321 177 862
2059H62M65j070j150K89J060K75j013j513L28J300R26p37j073j26J413J249m04
$$ 862 1327 257 -893 -604 456 731 -282 -1795 -1467 -167 759 22 -1051 -1177 236 1485 1081
2076A081j352n80R89J181j07j571n22L45J115P8j205n45M06P08M95q35m40O29
$$ 1081 -271 -851 138 1319 1212 -359 -881 -536 579 657 -548 -1093 -687 21 516 -319 -759 -130
2094a30Q80n2p47J92K67N68k99j098l76Q20P68n51j224l33J167Q06m5j197l59
$$ -130 750 698 -49 143 410 978 679 -419 -795 25 793 242 -982 -1315 -148 658 613 -584 -943
2113i43Q49J470K77j593p99M49J269R9j360j132K56J389M14q09r72K39J118Q86
$$ -943 -94 1376 1653 60 -739 -290 979 1078 -282 -1414 -1158 231 645 -164 -1136 -897 221 1107
2131A107p28o70J99R37J39m90n88q1N06J78q04q00l20J202M54o65o01M80R81P30
$$ 1107 379 -291 -92 845 984 494 -94 -175 331 509 -295 -1095 -1415 -213 241 -424 -1025 -545 436 1166
2151A166o93q50n3J326L92q17j411JJ477L29n55j578Q8J048R36n56r34n0P87J154
$$ 1166 473 -377 -430 896 1288 471 -940 -939 538 867 312 -1266 -1178 -130 806 250 -684 -734 53 1207
2171A207l47j158l29R45N99l45r11n11Q65O20k64j180j36Q86R37l86r98o5Q70
$$ 1207 860 -298 -627 318 917 572 -339 -850 15 635 371 -809 -945 -59 878 492 -506 -571 299
2190B99J103q63p95k84P42O80l91j045n29Q29M52n6q46j34N82R46K4q69k05J6
$$ 299 1402 539 -256 -540 202 882 491 -554 -1083 -254 198 142 -704 -838 -256 690 714 -155 -360 -344
2210c44J396M5r97p06N63R59k03r82q49N81J034j62q12m81L30J039K16o79n88
$$ -344 1052 1097 100 -606 -43 916 713 -269 -1118 -537 497 335 -477 -958 -628 411 627 -52 -640
2229f40L41J204J91j088l92L15P67J07r21o32p8Q99M57p33n72j84J151J92j50
$$ -640 -299 905 1096 8 -384 -69 698 805 -116 -748 -826 73 530 -203 -775 -959 192 384 234
2248B34q03K70P56K68n56o81K70O34L25r44n28J40P49L75p20m38K31J109J43o06
$$ 234 -569 -299 457 725 169 -512 -242 392 717 -227 -755 -615 134 509 -211 -649 -418 691 834 228
2268B28p03k0P99L42m15p90j33P75N98n65q99p4P80Q05k71r65j15Q19O64k17n26
$$ 228 -475 -495 304 646 231 -559 -692 83 681 116 -783 -857 -77 728 457 -508 -623 196 860 643 117
2289A17l25M43K98k47p09j28M34K25k34o36J12P17L87o12n9q2O50K55n7r13k0
$$ 117 -208 235 533 286 -423 -551 -117 108 -126 -762 -650 67 454 -158 -217 -299 351 606 549 -364 -384
2310c84O81M60m05j050j29N48Q19l35r65l77J068N85O0o08m58N37O18l36j62p44
$$ -384 297 757 352 -698 -827 -279 540 205 -760 -1137 -69 516 576 -32 -490 47 665 329 167 -577
2330e77K60O50J22n57k46J33J88R2k86p2K09L55l9l17j01L80l9%n06k17O26O51
$$ -577 -317 333 455 -102 -348 -215 -27 65 -221 -293 -84 271 232 -85 -186 194 155 155 -351 -568 58 709
2352G09n95m89j30N91L67k20l75l69M62P33m7n00q73O48K16K05m25k63l3P90L4
$$ 709 114 -375 -505 86 453 233 -142 -511 -49 684 637 137 -736 -88 128 333 -92 -355 -388 402 436
2373D36m21l02N3P74L1m62m01l8O00Q5k59m35L13L97j92j96l70K52M38n9q14r
$$ 436 15 -287 -234 540 571 109 -292 -330 270 355 96 -339 -26 371 179 -17 -387 -135 303 244 -570 -579
2395e79N61L01J5l91j08j55N70K48n10n60M29M66P9k96m95k38Q87J77m72m45Q5
$$ -579 -18 283 298 -93 -201 -356 214 462 -48 -608 -179 287 366 70 -425 -663 224 401 -71 -516 -431
2416d31N89J39k86m38K63M54J19l61k15J83L55J30m41l34k9L65J73k55n89L44
$$ -431 158 297 11 -427 -164 290 409 48 -167 16 371 501 60 -274 -303 62 235 -20 -609 -265
2436b65J56L08l28r0j12N97L17o24l25J13P79n5m38m65K3L62N48l13o36R2Q2M37
$$ -265 -109 199 -129 -219 -331 266 583 -41 -366 -253 526 471 33 -432 -409 -47 501 188 -448 -356 -274 163
2458A63l4m52R4L76K70k22m30kL53M64k83o16M0L14N78n14m64k42N60M81j93l61
$$ 163 129 -323 -229 147 417 195 -235 -237 116 580 297 -319 -279 35 613 99 -365 -607 -47 434 241 -120
2480a20k30N34O8K09m47j97L43j80K37n43k10M42Q6J31l50k33L86K53J88n74J08
$$ -120 -350 184 252 461 14 -183 160 -20 217 -326 -536 -94 -8 123 -227 -460 -74 179 367 -207 -99
2501i9o5N69K3m16m98M59M86k07n32m62P20K01J17j130N14R8M68J72k34l05L28
$$ -99 -164 405 428 12 -486 -27 459 252 -280 -742 -22 179 296 -834 -320 -222 246 418 184 -121 207
2522B07L33J03m97l88K18K63J71m95k47k06K30O36l72l61J71L13J52j95j17J71
$$ 207 540 643 146 -242 -24 239 410 -85 -332 -538 -308 328 -44 -405 -234 79 231 36 -81 90
2542I0M49K03o72k28L04l3K38n64k72J6O58l8o19kJ29O36M19o38l80P4O15M53
$$ 90 539 742 70 -158 146 113 351 -213 -485 -469 189 151 -468 -470 -341 295 714 76 -304 -230 385 838
2564H38n34n56j73N13L19m45m92j99K16N29j70m53K33M57K62j02j01Q3J92M6o7
$$ 838 304 -252 -425 88 407 -38 -530 -729 -513 16 -154 -607 -374 83 345 243 142 225 417 463 396
2585C96n04n3Q0J85k38m17J2K66M15k62%l47P25M28k98k02k32K70L78R3q37m82
$$ 396 -108 -161 -81 104 -134 -551 -539 -273 142 -120 -120 -467 258 686 388 186 -46 224 602 695 -142 -624
2607f24M81K91j88l66k88J67O71P8q0k70J48M32K53l64l69J95J61k98J07l86j85
$$ -624 -143 148 -40 -406 -694 -527 144 222 142 -128 20 452 705 341 -28 167 328 30 137 -249 -434
2628d34L32k24Pl9K8N97J11j60k51L72Q5k4k8o48L62J29pl87m78R5L75o8J3j89
$$ -434 -102 -326 -319 -358 -330 267 378 218 -33 339 424 400 372 -276 86 215 208 -179 -657 -562 -187 -255 -242 -431
2652d31lN87K9P0q2Q7R7L96N9q19l09L93P4l46m53p7n4O12Ql34J84K00M72Q2k78
$$ -431 -434 153 182 252 170 257 354 750 809 -10 -319 74 148 -198 -651 -728 -782 -170 -162 -496 -312 -112 360 442 164
2677A64R7J05J35j40m0m10K86m2j38l63j10J60P8K77j08l07P8M66L68m51p9J00
$$ 164 261 366 501 361 321 -89 197 155 17 -346 -456 -296 -218 59 -49 -356 -278 188 556 105 26 126
2699A26L17m6m12n4q1J6k0j03j63K34Q9K35j86k25M48J08j56ql4j26J44m9j15
$$ 126 443 397 -15 -69 -150 -134 -154 -257 -420 -186 -97 138 -48 -273 175 283 127 119 85 -41 103 54 -61
2722f1P3k65j03M00j34m40J85L11L57j60j46p3P54l58L01o61R0K33n6l83j20j55
$$ -61 12 -253 -356 44 -90 -530 -345 -34 323 163 17 -56 698 340 641 -20 70 303 247 -136 -256 -411
2744d11k61L40k69K24J15K85L25r9Q5j27K91q8j20m1M6j08J54m91o6k38n8O3P3
$$ -411 -672 -332 -601 -377 -262 23 348 249 334 207 498 410 290 249 295 187 341 -150 -216 -454 -512 -449 -376
2767c76J21l6K80J72L31m67K84J47j24J00k20k75jm0k02M6J54l99J88R9M21j92
$$ -376 -255 -291 -11 161 492 25 309 456 332 432 212 -63 -64 -104 -306 -260 -106 -505 -317 -218 203 11
2789A1nL8K15K36l68J01j48K5rr1r7J65k03k40K83o3J64p5J46j06J32L27j97L46
$$ 11 6 44 259 495 127 228 80 105 96 5 -92 73 -130 -370 -87 -150 14 -61 85 -21 111 438 241 587
2813E87m47m15J22j7J49k46ol60L93M48m75j18L49L01J69l17l7J78j31O3J1j24
$$ 587 140 -275 -153 -170 -21 -267 -273 -633 -240 208 -267 -385 -36 265 434 117 80 258 127 190 201 77
2835G7j02j77j38JN48n38M0J13J95M5l53L38j26M78j56J19j81J59l00k37m1K21
$$ 77 -25 -202 -340 -339 209 -329 -289 -176 19 64 -289 49 -77 401 245 364 183 342 42 -195 -236 -15
2857a5Jm00K83q0j46L94j41k70L19J32q0K88m12K57q7M9J17k20j37j19K2K89k12
$$ -15 -14 -414 -131 -211 -357 37 -104 -374 -55 77 -3 285 -127 130 43 92 209 -11 -148 -267 -245 44 -168
2880a68j02j74M93K24m8j71J64K04k72K10k81J22k27r1Q6l57K84J0k00J67lK9
$$ -168 -270 -444 49 273 225 54 218 422 150 360 79 201 -26 -117 -31 -388 -104 -94 -294 -127 -130 -101
2902a01J56l5L53L5m04R8J76k02k64kR5O6j92J23n70L71L12p8m0k9J93K34kl75
$$ -101 55 20 373 408 4 102 278 76 -188 -190 -95 -29 -221 -98 -668 -297 15 -63 -103 -132 61 295 293 -82
2926h2J9L24l35K66j90r6q8p3L70l50J13n12N41L66l5l12J00J46R8k63Rj84J44
$$ -82 -63 261 -74 192 2 -94 -182 -255 115 -235 -122 -634 -93 273 238 -74 26 172 270 7 16 -168 -24
2949b4n1J05m9k47J51QJ5j07K2j08L00J68j11l1Q8K08k42J9J03l59j20L84k87
$$ -24 -75 30 -19 -266 -115 -107 -92 -199 -177 -285 15 183 72 41 129 337 95 114 217 -142 -262 122 -165
2972a65k24J04J35R4mn0j0L41l9O7J29j78j72M08m48k9K48k05j33K17l47j28K91
$$ -165 -389 -285 -150 -56 -60 -110 -120 221 182 249 378 200 28 436 -12 -41 207 2 -131 86 -261 -389 -98
2995i8k4N9o4J4QL85K7L4j87L12k49J8l86m7J78q3n5m6J7m0O2M41k73n6J16o8
$$ -98 -122 -63 -127 -113 -105 280 307 341 154 466 217 235 -151 -198 -20 -103 -158 -204 -187 -227 -165 276 3 -53 63 -5
3021eJ69Lj26R6L8n9o3j82P7J01j33r2qr5M8K49J98l77M4L62k6J48l41m9k8N8
$$ -5 164 167 41 137 175 116 53 -129 -52 49 -84 -176 -184 -279 -231 18 216 -161 -117 245 219 367 26 -23 -51 7
3047GM9j59k5J0j36K48l0l73L49K99O4k22q6p4kM14j42m1M3k04n6jJ76k02K0K5
$$ 7 56 -103 -128 -118 -254 -6 -36 -409 -60 239 303 81 -5 -79 -81 333 191 150 193 -11 -67 -68 108 -94 -74 -49
3073d9j91J61j0m4M12l17m5m8J23o3KK52M4m01K71Jj24N2j28L58pj44k00Q8K68
$$ -49 -240 -79 -89 -133 279 -38 -83 -131 -8 -71 -69 183 227 -174 97 98 -26 26 -102 256 249 105 -95 -7 261
3098B61j61k8q5M0Q3J22Ok88m2L46j70k70o7k1J35j20K69r5l2K47K6r8q0J09n5
$$ 261 100 72 -13 27 110 232 238 -50 -92 254 84 -186 -253 -274 -139 -259 10 -85 -117 130 156 58 -22 87 32
3123C2K34q1k46K4L02p7l70j88L01Oj34K02j90N9j82N98l07j44K76N1p4K75p22
$$ 32 266 185 -61 -37 265 188 -182 -370 -69 -63 -197 5 -185 -126 -308 290 -17 -161 115 166 92 367 -355
3146c55J29K69J81l46k02L51j40K46j69j60Q9J17%J10Qk44J56k06L48k69J22n1
$$ -355 -226 43 224 -122 -324 27 -113 133 -36 -196 -107 10 10 120 128 -116 40 -166 182 -87 35 -16
3168a6P8R0j49M3j59K70r8j94j09n4M09k00M2j03J78J49Q9k14k08L11q9J08l62
$$ -16 62 152 3 46 -113 157 59 -135 -244 -298 111 -89 -47 -150 28 177 266 52 -156 155 66 174 -188
3191a88j50M43j27q8L08k25o2m5K42K04l26j83K53K14k53k29j7P6M7j11j30J45
$$ -188 -338 105 -22 -110 198 -27 -89 -134 108 312 -14 -197 56 270 17 -212 -229 -153 -106 -217 -347 -202
3213b02J4K35j71K54Q9M9Rk03Q3q4J88J46m80R7l49j7J84J16q0l35J74J78J39
$$ -202 -188 47 -124 130 219 268 277 74 157 73 261 407 -73 24 -325 -342 -158 -42 -122 -457 -283 -105 34
3236C4k2k22K35M16k81QK1J29j95j16J01j93M1j42L7Q5m13K60l1K95OM1J62k10
$$ 34 12 -210 25 441 160 168 189 318 123 7 108 -85 -44 -186 -149 -64 -477 -217 -248 47 53 94 256 46
3260D6K70k29l23M50l27J86J99k47l34K80j2J04m61L42L63k11j79M7J4K11k52
$$ 46 316 87 -236 214 -113 73 272 25 -309 -29 -41 63 -398 -56 307 96 -83 -36 -22 189 -63
3281f3J43J31l78K60Kj04j7p8J20n4M92m20k37J35M36j03m64L02J36L31n22k4
$$ -63 80 211 -167 93 95 -9 -26 -104 16 -38 454 34 -203 -68 368 265 -199 103 239 570 48 24
3303B4P3j94K96k25j38j31pK64k73K11J49M4M5PQ5j16J34Q0l13J40j96o8j49L60
$$ 24 97 -97 199 -26 -164 -295 -302 -38 -311 -100 49 93 138 145 230 114 248 328 15 155 -41 -109 -258 102
3327A02k35q5n8J68n2L76m13L34O1J3R7j90N3O9J33m29J86j3j12k45J44k56k7
$$ 102 -133 -218 -276 -108 -160 216 -197 137 198 211 308 118 171 240 373 -56 130 117 5 -240 -96 -352 -379
3350c79N41k78K71J29j72j50N12l64J63j26l09M7r1o8Q4l1L70m39M48l92L49k6
$$ -379 162 -116 155 284 112 -38 474 110 273 147 -162 -115 -206 -274 -190 -221 149 -290 158 -234 115 89
3372H9R1m2%j97J7N40l11j98p0Rlj29j29J73RM01k73K11k33J11K19j51lP3m6r5
$$ 89 180 138 138 -59 -42 498 187 -11 -81 -72 -75 -204 -333 -160 -151 250 -23 188 -45 66 285 134 131 204 158 63
3398F3n6J28k60J6JO6J42l24J10Q6J49j21J00k87L89N2j8j94j1k20J21Lk59K03
$$ 63 7 135 -125 -109 -108 -42 100 -224 -114 -28 121 0 100 -187 202 254 236 42 31 -189 -68 -65 -324 -121
3422a21J4j29J96l1j19L07J75j88n3J77J66q9p1k30n5JQ7q5j02j12k04M18o3J14
$$ -121 -107 -236 -40 -71 -190 117 292 104 51 228 394 305 234 4 -51 -50 37 -48 -150 -262 -466 -48 -111 3
3446Cn4J7J92P1j41Q8n3L19l32Q3k61q4J20n1k36LJ70j31J69J00P8J7K01q2N2
$$ 3 -51 -34 158 229 88 176 123 442 110 193 -68 -152 -32 -83 -319 -316 -146 -277 -108 -8 70 87 288 206 258
3471B58r9j3j21Q8k08k38K12K47l0m01R8P0N6K43j13m4o0J07K08l43K10k01L08
$$ 258 159 146 25 113 -95 -333 -121 126 96 -305 -207 -137 -81 162 49 5 -55 52 260 -83 127 -74 234
3494B34k04p8q0m35M07p0j65J95K34j4J57j2r3K64l16J16R5j53R0j59P8k52k66
$$ 234 30 -48 -128 -563 -156 -226 -391 -196 38 24 181 169 76 340 24 140 235 82 172 13 91 -161 -427
3517d27J53L5j8K61Q7k25K04N5J98p6k06J77q5l0k9l91L65j28k05p4M9j40L69
$$ -427 -274 -239 -257 4 91 -134 70 125 323 247 41 218 133 103 74 -317 48 -80 -285 -359 -310 -450 -81
3540h1J3Q2R1l09K55K9J94j72q9j7K02j50k13p4J11K1J78k43o9N3J46K89j86r2
$$ -81 -68 14 105 -204 51 80 274 102 13 -4 198 48 -165 -239 -128 -107 71 -172 -241 -188 -42 247 61 -31
3564c1p0J63L10k06j98J09p8K45n49J48J5j04L2J44q2j2L78K9k66J47J99k44J12
$$ -31 -101 62 372 166 -32 77 -1 244 -305 -157 -142 -246 -214 -70 -152 -164 214 243 -23 124 323 79 191
3587A91k80J34j3J7k17J65m18J67PK3K22k93J58L03J50k20k63M25J26j04j23k31
$$ 191 -89 45 32 49 -168 -3 -421 -254 -247 -224 -2 -295 -137 166 316 96 -167 258 384 280 157 -74
3609g4M5N2p6n6Q9j16Q2o5J0J34L7jo4L3j32P3P9j02J28k83K70j89K83j55l15
$$ -74 -29 23 -53 -109 -20 -136 -54 -119 -109 25 62 61 -3 30 -102 -29 50 -52 76 -207 63 -126 157 2 -313
3634c13J71j6J68J68j75qK21M2k32K48j58l30L19k84K87m05L8R3J03N0r2L53l40
$$ -313 -142 -158 10 178 3 -5 216 258 26 274 116 -214 105 -179 108 -297 -259 -166 -63 -13 -105 248 -92
3657i2K57j89j0L2P2P7N3k18l67M74M4j26k50K51J12p1k62J12m2K02p3K45j70
$$ -92 165 -24 -34 -2 70 147 200 -18 -385 89 133 7 -243 8 120 49 -213 -101 -143 59 -14 231 61
3680F1kK19q0q8L1j08q0Q5L06m88n1l4K79K08k27P7k09K81K47l00k92J87J21N7
$$ 61 59 278 198 110 141 33 -47 38 344 -144 -195 -229 50 258 31 108 -101 180 427 127 -165 22 143 200
3704B00j13j32P8j44Q8l2j89J56r9K94J9j77J1J99k5O9l33J69J57l26J95l53J80
$$ 200 87 -45 33 -111 -23 -55 -244 -88 -187 107 126 -51 -40 159 134 203 -130 39 196 -130 65 -288 -108
3727a08M5j14K88k24m0J9K76j21L07l58J74J14k47J23j83r7k9J32Q1j78l5L25
$$ -108 -63 -177 111 -113 -153 -134 142 21 328 -30 144 258 11 134 -49 -146 -175 -43 38 -140 -175 150
3749A50j72L2j25L25j50O4q4m96M98M0k18j08K3o0K76o0k72L01R6m3K56j72K04
$$ 150 -22 10 -115 210 60 124 40 -456 42 82 -136 -244 -221 -281 -5 -65 -337 -36 60 17 273 101 305
3772C05l61J74j03j56Nj78J34oO9j9J19R7k19J06j54K34j06K84k74pJ55M8m1J07
$$ 305 -56 118 15 -141 -136 -314 -180 -186 -117 -136 -17 80 -139 -33 -187 47 -59 225 -49 -56 99 147 106 213
3796B13pn22M01L7j20l3L1k2J45r9N2k16J01J05L5N7j47J00k0jk5k03j6j21L49
$$ 213 206 -316 85 122 2 -31 0 -22 123 24 76 -140 -39 66 101 158 11 111 91 90 65 -138 -154 -275 74
3821G4r3R8n3j2J20P6k36J44j30L43k43L8k19J18j4l4k98L88L7l24J83Kj69K93
$$ 74 -19 79 26 14 134 210 -26 118 -12 331 88 126 -93 25 11 -23 -321 67 104 -220 -37 -35 -204 89
3845H9l5m5o2K4K20j10m7n4m3J60q8J17l11J70p4n8k7K86j89J3J65M3r8oL4j50
$$ 89 54 9 -53 -29 191 81 34 -20 -63 97 9 126 -185 -15 -89 -147 -174 112 -77 -64 101 144 46 40 74 -76
3871g6L56k51j26N3J8j25j2RK43k34L30j22KL5o7j02J19L8j36K9K7J81k08j02
$$ -76 280 29 -97 -44 -26 -151 -163 -154 89 -145 185 63 65 100 33 -69 50 88 -48 -19 8 189 -19 -121
3895a21j21K03j24R3O2R3l5J5k63K35q0J48n8Q0Lk86J49N6l36K04K11k66K16m6
$$ -121 -242 -39 -163 -70 -8 85 50 65 -198 37 -43 105 47 127 130 -156 -7 49 -287 -83 128 -138 78 32
3919C2J97k64J70p2o4k07K15L0k20J79k62OJ37P4Mj38J30K42l8j41J4n2M3J22
$$ 32 229 -35 135 63 -1 -208 7 37 -183 -4 -266 -260 -123 -49 -45 -183 -53 189 151 10 24 -28 15 137
3943A37M5j80J9m3K87l49K1m1r2J7J85j72rJ50O5O7j71Pm8J58j27n3j11J22o4
$$ 137 182 2 21 -22 265 -84 -63 -104 -196 -179 6 -166 -175 -25 40 107 -64 -57 -105 53 -74 -127 -238 -116 -180
3968a80J98j39o6J41OJ87M4M7j59j12K69L1l71l4Q6J9n2K63l46K3J63j08M1j02
$$ -180 18 -121 -187 -46 -40 147 191 238 79 -33 236 267 -104 -138 -52 -33 -85 178 -168 -145 18 -90 -49 -151
3992a51J92ok05J16N6m1K66k03J58l37J91n8N1j31J85j42K66o6m35J98l3N1K43
$$ -151 41 35 -170 -54 2 -39 227 24 182 -155 36 -22 29 -102 83 -59 207 141 -294 -96 -129 -78 165
4015A65j3l33K2L29j70J25k11Or8L24k35n0J06j1J4J70K1l03N18j80j6k59J85
$$ 165 152 -181 -159 170 0 125 -86 -80 -178 146 -89 -139 -33 -44 -30 140 161 -142 376 196 180 -79 106
4038A06J24Lj43j53k05n7L02J87l82j07K20K04q2k1j38L43m9J44j61j28o1j8L0
$$ 106 230 233 90 -63 -268 -325 -23 164 -218 -325 -105 99 17 -4 -142 201 152 296 135 7 -54 -72 -42
4061d2M7k01j9L97j76l6l01L80P8K43j88j85k4J09L89n49M9k98M98k33J54l90
$$ -42 5 -196 -215 182 6 -30 -331 49 127 370 182 -3 -27 82 471 -78 -29 -327 171 -62 92 -298
4083b98J05J31Q1O1k9j38K56R5m8l9j89J08j50R3l43p7K10j1J93j76J05R9Q1J3
$$ -298 -193 -62 19 80 51 -87 169 264 216 177 -12 96 -54 39 -304 -381 -171 -182 11 -165 -60 39 120 133
4107A33l75J68OM59Jo02j26L83K35r3j56l06q2K90L07l38r1L05J51o6k22k59K86
$$ 133 -242 -74 -68 391 392 -210 -336 47 282 189 33 -273 -355 -65 242 -96 -187 118 269 203 -19 -278 8
4130Hj8J34M7k49p9L18p3k16j05L1K35o0n4k08K59n0L93j04k95R5m5K00j39j85
$$ 8 -10 124 171 -78 -157 161 88 -128 -233 -202 33 -27 -81 -289 -30 -80 313 209 -86 9 -36 164 25 -160
4154a60K00jj07K23m65R6K1K56l9k12J6L07J77j96l77K37K54j30n7q3j69O8J78
$$ -160 40 39 -68 155 -310 -214 -193 63 24 -188 -172 135 312 116 -261 -24 230 100 43 -40 -209 -141 37
4177C7j88k87J28L90n4J68k09j06L26r8K45m64j25M61k46K48l38k01K55K20k04
$$ 37 -151 -438 -310 80 26 194 -15 -121 205 107 352 -112 -237 224 -22 226 -112 -313 -58 162 -42
4198d2K03k02j00L94J02m40j66L49J73r0l11j55k2J98J62j16k82M26j45K01j38
$$ -42 161 -41 -141 253 355 -85 -251 98 271 181 -130 -285 -307 -109 53 -63 -345 81 -64 137 -1
4219am2K1L08j72J25k52j6J33J24l13K31k28n3N8J27m6j69K19J97J40m05J21j63
$$ -1 -43 -22 286 114 239 -13 -29 104 228 -85 146 -82 -135 -77 50 4 -165 54 251 391 -14 107 -56
4242e6L53k85q7k67K90L99k89k23l5L29J63m03j50R8R1J53j12l8K2J22M4J21k64
$$ -56 297 12 -75 -342 -52 347 58 -165 -200 129 292 -111 -261 -163 -72 81 -31 -69 -47 75 119 240 -24
4265b4m4J94k2j3j53k64M56j78j31J56k45L02K81k52k30K14j48J50j15P5K1pJ89
$$ -24 -68 126 104 91 -62 -326 130 -48 -179 -23 -268 34 315 63 -167 47 -101 49 -66 9 30 23 212
4288B12l50K32j58j66J09m9j64L1M45j48N6k1j74J26J60J03l37J42m61M69K4Q3
$$ 212 -138 94 -64 -230 -121 -170 -334 -303 142 -6 50 29 -145 -19 141 244 -93 49 -412 57 81 164
4310A64j71l0K07p1k20P4R1K94k93l8j14J68J3j05J4j46n3J61j0J98m39K17K13
$$ 164 -7 -37 170 99 -121 -47 44 338 45 7 -107 61 74 -31 -17 -163 -216 -55 -65 133 -306 -89 124
4333A24K39k74k72M7L42K8k38l6J12j56J91j73j17Q2K87j52k44L62J6r7J03j09
$$ 124 363 89 -183 -136 206 234 -4 -40 72 -84 107 -66 -183 -101 186 34 -210 152 168 71 174 65
4355F5N8k43J43j32R6P5m1M9j20L3k09J57%M09n89K15r6N47k65N5l25J67n4Lq1
$$ 65 123 -120 23 -109 -13 62 21 70 -50 -17 -226 -69 -69 340 -249 -34 -130 417 152 207 -118 49 -5 -2 -83
4380h3j2K9O2j13Q8J70l18L24j3k55K79k42L38j46Lk59J37j60J33J81l66J94J38
$$ -83 -95 -66 -4 -117 -29 141 -177 147 134 -121 158 -84 254 108 111 -148 -11 -171 -38 143 -223 -29 109
4403A09j54j26L44k8K33k50r2q6lj02R8O2J10j96J05L9k78J97j36j19K44o0J91
$$ 109 -45 -171 173 145 378 128 36 -50 -53 -155 -57 5 115 -81 24 63 -215 -18 -154 -273 -29 -89 102
4426A02j56J1L10j31k10j04K61j4j57P3K01mm60Q0K1K31R2M1j95K2O8j83J70o5
$$ 102 -54 -43 267 136 -74 -178 83 69 -88 -15 186 182 -278 -198 -177 54 146 187 -8 14 82 -101 69 4
4450Dk7O9MP6k53J89L5k8P1j92j4L1k46L41j12J20l43J81rJ49P8m8K4j45K08m16
$$ 4 -23 46 50 126 -127 62 97 69 140 -52 -66 -35 -281 60 -52 68 -275 -94 -103 46 124 76 100 -45 163 -253
4476b53N37p02M02j77J2J12j23L41n1k64K61K7r9J26j26P1n3J00j06j12L1K04
$$ -253 284 -418 -16 -193 -181 -69 -192 149 98 -166 95 122 23 149 23 94 41 141 35 -77 -46 158
4498A58j20j9l54L69J99j07J55j89k99L15qj38pk16K04K1J0m1m0Q1J67l49LJ50
$$ 158 38 19 -335 34 233 126 281 92 -207 108 100 -38 -45 -261 -57 -36 -26 -67 -107 -26 141 -208 -205 -55
4522e5K92P0l41M3j48ll1K44q5j48Q9J48l4Ml02J68M48l91k11K94llQ4M7pk82
$$ -55 237 307 -34 9 -139 -142 -173 71 -14 -162 -73 75 41 45 -257 -89 359 -32 -243 51 48 45 129 176 169 -113
4548a13K9J54j24L8j37M39k22m5q1k8L84j43K2l18o4N01p2j27j71K78j87o3j0
$$ -113 -84 70 -54 -16 -153 286 64 19 -62 -90 294 151 173 -145 -209 292 220 93 -78 200 13 -50 -60
4571f0M7j82L06qr5J94j4j68J90N4n23K82N9p1J62r0j39K2J90j23j95O5J49Q5
$$ -60 -13 -195 111 103 8 202 188 20 210 264 -259 23 82 11 173 83 -56 -34 156 33 -162 -97 52 137
4595A37j16l51K00K44J88k81k89Q5J18J04O1k49P3J09k24L53k04o8N1J96L5j88
$$ 137 21 -330 -130 114 302 21 -268 -183 -65 39 100 -149 -76 33 -191 162 -42 -110 -59 137 172 -16
4617a6q4J83j50J99k82l7o9L90K5j94j60J07K55j1j61M9m6m2N7k63J63J26m9J33
$$ -16 -100 83 -67 132 -150 -187 -256 134 159 -35 -195 -88 167 156 -5 44 -2 -44 13 -250 -87 39 -10 123
4641A23j11j04k2K13O7k37o5j32L66j77j36K72K8p7J71k78J27j94n9J05R8l29
$$ 123 12 -92 -114 99 166 -71 -136 -268 98 -79 -215 57 85 8 179 -99 28 -166 -225 -120 -22 -351
4663c51K44J36m1o4m7P6j01K20j17J56l00J46K49j90P7j51j9N6L39m25k9n3J18
$$ -351 -107 29 -12 -76 -123 -47 -148 72 -45 111 -189 -43 206 16 93 -58 -77 -21 318 -107 -136 -189 -71
4686g1J83j71J32j21N9r5j43J23K62K2l7k34j09K37K43j94j41M6J53j25J45l12
$$ -71 112 -59 73 -48 11 -84 -227 -104 158 180 143 -91 -200 37 280 86 -55 -9 144 19 164 -148
4708a48j85L57o4J17r5j69j32L06Q4k59O2R7j16L06q0l30K76j1j6J44k60j88J35
$$ -148 -333 24 -40 77 -18 -187 -319 -13 71 -188 -126 -29 -145 161 81 -249 27 16 0 144 -116 -304 -169
4731a69J50R0l5K53j58j5k40p4N5j34J05M21k30j19J3L89o0l89J58l05M66k76
$$ -169 -19 71 36 289 131 116 -124 -198 -143 -277 -172 249 19 -100 -87 302 242 -147 11 -294 172 -104
4753a04J63k27K35k37N29o29J6J96j19J88K5l23J63J91j52O7k1j33K3J32J1J3
$$ -104 59 -168 67 -170 359 -270 -254 -58 -177 11 36 -287 -124 67 -85 -18 -39 -172 -149 -17 -6 7
4775Gk6J09r8j55L25k06j94L90L7j91N8K61l37K37k72J3P6Rk42Q8K62j69k8J46
$$ 7 -19 90 -8 -163 162 -44 -238 152 189 -2 56 317 -20 217 -55 -42 34 43 -199 -111 151 -18 -46 100
4799A00j40J79k29K33k50J9K81m44M50P2j60j99Jl8n1k5K15J13j1j82j05M55q1
$$ 100 -40 139 -90 143 -107 -88 193 -251 199 271 111 -88 -87 -125 -176 -201 14 127 116 -66 -171 284 203
4822B03j89Q8j88LR3j20K92j50j63Q1p2N4L0k20M88j50Q2m5o90L44L81l5j8n94
$$ 203 14 102 -86 -83 10 -110 182 32 -131 -50 -122 -68 -38 -258 230 80 162 117 -573 -229 152 117 99 -495
4846d95L53R4J3K08k58J92j78O1m5OjOJ30P6l12j49M04j12L3K8J09M4k29j07n9
$$ -495 -142 -48 -35 173 -85 107 -71 -10 -55 -49 -50 -44 86 162 -150 -299 105 -7 26 54 163 207 -22 -129 -188
4871a88L1Q1N7K9N6r5J16QO5n8o9o6j64K92q2oK41l24L93k22k74J84m0M9K0j43
$$ -188 -157 -76 -19 10 66 -29 87 95 160 102 33 -33 -197 95 13 7 248 -76 317 95 -179 5 -35 14 34 -109
4897a09m3L36l5j26J10k15K62j23j29m0K1M2J01j81Q9J2j9K1P4q9J7J53l53J81
$$ -109 -152 184 149 23 133 -82 180 57 -72 -112 -91 -49 52 -129 -40 -28 -47 -26 48 -41 -24 129 -224 -43
4921d3Q9l30K14MJ60m22K38J22m69M83j42Q3P7J55j41j82j13J52L43j21j48j27
$$ -43 46 -284 -70 -66 94 -328 -90 32 -437 46 -96 -13 64 219 78 -104 -217 -65 278 157 9 -118
4943a18m5J91j47l6K88j56j08J10Q0j10K42O2k41p7K10r3L1k27m0P2p5K91k22
$$ -118 -163 28 -119 -155 133 -23 -131 -21 59 -51 191 253 12 -65 145 52 83 -144 -184 -112 -187 104 -118
4966a18q5P9j01K27Q5k01O2N8j4j82M06l34O6j58M93l45koo6J31j0j00J5J63r
$$ -118 -203 -124 -225 2 87 -114 -52 6 -8 -190 216 -118 -52 -210 283 -62 -64 -70 -136 -5 -15 -115 -100 63 54
4991E4J47k02n5k2l6J89j43O5n7M5p0r9L4J68p2k9q3O4J6j25J90N8qj68M9J68
$$ 54 201 -1 -56 -78 -114 75 -68 -3 -60 -15 -85 -184 -150 18 -54 -83 -166 -102 -86 -211 -21 37 29 -139 -90 78
5017G8J40k86n7j65K65k0k46L92k07J65k18J10j7K04j13J28r8Q3J9j79K03o5k95
$$ 78 218 -68 -125 -290 -25 -45 -291 101 -106 59 -159 -49 -66 138 25 153 55 138 157 -22 181 116 -179
5040a79R0J25j92m7J24j36K52J40J29j93k23M03j71j22J85k37J8J70m26L32o6
$$ -179 -89 36 -156 -203 -79 -215 37 177 306 113 -110 293 122 0 185 -52 -34 136 -290 42 -24
5061b4j00J44O8k05k2K61L1j88J02j90K58j69Q0P7k52J20L2N4r3N4o6k11L04M
$$ -24 -124 20 88 -117 -139 122 153 -35 67 -123 135 -34 46 123 -129 -9 23 77 -16 38 -28 -239 65 69
5085F9k52P6J60J92p9j37r2n1Q4L8l5J65q4j35n9L8J82J6k59J8N7M18k22p3j6
$$ 69 -183 -107 53 245 166 29 -63 -114 -30 8 -27 138 54 -81 -140 -102 80 96 -163 -145 -88 330 108 35 19
5110A9J67l24K8J68m5j64Q3j02L43l94k5Q5n5J25J33J95j53Q8k25J47k81J13k85
$$ 19 186 -138 -110 58 13 -151 -68 -170 173 -221 -246 -161 -216 -91 42 237 84 172 -53 94 -187 -74 -359
5133c59Q9K76k2p2J01j53M5j8l7J93J09j10j23Q7r9Q4L4o0j06J09L82l08J63l24
$$ -359 -270 6 -16 -88 13 -140 -95 -113 -150 43 152 42 -81 6 -93 -9 25 -35 -141 -32 350 42 205 -119
5157a19Q8K63k48P3r2n0J28k13K09k13L34l09K94k45L8j01n3K16O0R7j56J73J18
$$ -119 -31 232 -16 57 -35 -85 43 -170 39 -174 160 -149 145 -100 -62 -163 -216 0 60 157 1 174 292
5180B92j71j98o3K09j59J8K96k60K53k11r0K3R6k80K18J0j0j28K77j03j01oL6
$$ 292 121 -77 -140 69 -90 -72 224 -36 217 6 -84 -61 35 -245 -27 -17 -27 -155 122 19 -82 -88 -52
5203e2O3J17j19N0k44L99l16n6K16o2k4R0k00J05J68k17l0N6J8O9J05l5K03k35
$$ -52 11 128 9 59 -185 214 -102 -158 58 -4 -28 62 -138 -33 135 -82 -112 -56 -38 31 136 101 304 69
5227F9R7k73K78N9l26J55%J11j08k01l1K55J34j43j15r9j54j5L19k23L91k06J04
$$ 69 166 -107 171 230 -96 59 59 170 62 -139 -170 85 219 76 -39 -138 -292 -307 12 -211 180 -26 78
5250G8q1j91K06PJ05j17j33k8L10p5J3R5k44O2J10J4q2J38m9j79j38J56k52K07
$$ 78 -3 -194 12 19 124 7 -126 -154 156 81 94 189 -55 7 117 131 49 187 138 -41 -179 -23 -275 -68
5274f8q9K07k24L93k28M9NQ4k76L12k99l2K12m0n4M1j71K33m3J43k09L6K12j36
$$ -68 -157 50 -174 219 -9 40 45 129 -147 165 -134 -166 46 6 -48 -7 -178 55 12 155 -54 -18 194 58
5298E8n7oP1Q4k00r5J8J59p4R5r1KNp0O6N8j2o7j4j18n1N19k08j97K81q9j22J29
$$ 58 1 -5 66 150 -50 -145 -127 32 -42 53 -38 -36 -31 -101 -35 23 11 -56 -70 -188 -239 280 72 -125 156 67 -55 74
5326G4L4o2q5p4K01j1J16l52K20n2J04j6o1p8j30K72j03j07K7j09M14j78j9P0
$$ 74 108 46 -39 -113 88 77 193 -159 61 9 113 97 36 -42 -172 100 -3 -110 -83 -192 222 44 25 95
5350I5m9j66J4K55l76J34J63j7j32m1K74n8k02K07k45L9j16J70K01j98J63q9M7
$$ 95 46 -120 -106 149 -227 -93 70 53 -79 -120 154 96 -106 101 -144 -105 -221 -51 150 -48 115 26 73
5373G3M7rp4K56k57m4j27J35j3PJ39k59J64k00K57p7l5o1J24p4K8n4J21j19K46
$$ 73 120 111 37 293 36 -8 -135 0 -13 -6 133 -126 38 -162 95 18 -17 -78 46 -28 0 -54 67 -52 194
5398A94k59RN5o5J83k33q6K3p6L69o1k6j51o5J47J06L3k51o1K25J7k2O8J40o9
$$ 194 -65 -56 -1 -66 117 -116 -202 -179 -255 114 53 27 -124 -189 -42 64 97 -154 -215 10 27 5 73 213 144
5423A44m06M4J22J82j16J72j03%L7j90J16M3O4j4j40m9K91j57N0r7j24qJ7J7J53
$$ 144 -262 -218 -96 86 -30 142 39 39 76 -114 2 45 109 95 -45 -94 197 40 90 -7 -131 -139 -122 -105 48
5448D8J41l94J54k3L6j04K25j05jL3n9L3m8q7K95j50k49M77p8j32p3K11r1j15
$$ 48 189 -205 -51 -74 -38 -142 83 -22 -23 10 -49 -16 -64 -151 144 -6 -255 222 144 12 -61 150 59 -56
5472e6K93l35K83k91n0K1M12l04Q3p6j8K47L9k32P6r6j71M94n22K09k33K32J9
$$ -56 237 -98 185 -106 -156 -135 277 -27 56 -20 -38 209 248 16 92 -4 -175 319 -203 6 -227 5 24
5495B4M5j61j75J79q7J24N8j11J49M5K07n5k91O1N7k93L78j18j66L51m5k38J3
$$ 24 69 -92 -267 -88 -175 -51 7 -104 45 90 297 242 -49 12 69 -224 154 36 -130 221 176 -62 -49
5518d9q6k3J69O5N8k45J52L1j25J31j16j08J32j98K89k39J34J2L0O3oqP1K4lm75
$$ -49 -135 -158 11 76 134 -111 41 72 -53 78 -38 -146 -14 -212 77 -162 -28 -16 14 77 71 63 134 158 155 -320
5544c20L10j84N9K73K5k38O6J06k28J46J41j21k84J59K52r1j73j4K75k38J80O6
$$ -320 -10 -194 -135 138 163 -75 -9 97 -131 15 156 35 -249 -90 162 71 -102 -116 159 -79 101 167
5566A67k82J05l1N2J60K2r2j88LJ5J51q5j80L35j26K51k26q8j3j00J59J25j99
$$ 167 -115 -10 -41 11 171 193 101 -87 -84 -69 82 -3 -183 152 26 277 51 -37 -50 -150 9 134 -65
5589f5q0J40j37L14o7j91j12J92l1J06k13%J36M8j11MJ03rL6j75J39J13j47o5
$$ -65 -145 -5 -142 172 105 -86 -198 -6 -37 69 -144 -144 -8 40 -71 -67 36 27 63 -112 27 140 -7 -72
5613g2q5K80J3M9k87J31q4n8J46j63q2K9J76o0K14l07K60O9l6o1M2Q8j13J77l94
$$ -72 -157 123 136 185 -102 29 -55 -113 33 -130 -212 -183 -7 -67 147 -160 100 169 133 72 114 202 89 266 -128
5638a28L5J81j15J16Q5l41J94n%j10R5L1j12R1K39k69J5j78J75J40J7j74j22q1
$$ -128 -93 88 -27 89 174 -167 27 22 22 -88 7 38 -74 17 256 -13 2 -176 -1 139 156 -18 -140 -221
5662b21L27j67J9r9P8J98p2P7K0k09Or5J10K3r4PL4J01l61J92K6J72J16j55O4
$$ -221 106 -61 -42 -141 -63 135 63 140 160 -49 -43 -138 -28 -5 -99 -92 -58 43 -318 -126 -100 72 188 33 97
5687I7Nj37J38k5l2O3m2j16k8j26L05O1o0N3k57J68j66J84Oj23N9M2K31k35k12
$$ 97 102 -35 103 78 46 109 67 -49 -77 -203 102 163 103 156 -101 67 -99 85 91 -32 27 69 300 65 -147
5712a47K71j34M39m86R7j0p3Q0o1r0j27K57O3J5P0k5k87J66J21l7M5r2J00j46
$$ -147 124 -10 429 -57 40 30 -43 37 -24 -114 -241 16 79 94 164 139 -148 18 139 102 147 55 155 9
5736Ij03o6L08j40o8ML6n0J65k23j21J64l2J24j70M22k61P6j90j10K60k58J0K01
$$ 9 -94 -160 148 8 -60 -56 -20 -70 95 -128 -249 -85 -117 7 -163 259 -2 74 -116 -226 34 -224 -214 -13
5760a3K17o7r4l47M11K0k1k05J38j90N9N5J25l37J93p3J6j75K91n6J53p3q0J61
$$ -13 204 137 43 -304 107 127 106 -99 39 -151 -92 -37 88 -249 -56 -129 -113 -288 3 -53 100 27 -53 108
5784A08o2r3K01m4m1j86J27j03m2J6K28k83Q0K26l26K0J72J16l62m0K41J65k99
$$ 108 46 -47 154 110 69 -117 10 -93 -135 -119 109 -174 -94 132 -194 -174 -2 114 -248 -288 -47 118 -181
5807a81K58m4q3jJ47J17m39L70q6p0l3NJ05j42M5p9m4j20K25R6j51J63J73j76
$$ -181 77 33 -50 -51 96 213 -226 144 58 -12 -45 -40 65 -77 -32 -111 -155 -275 -50 46 -105 58 231 55
5831E5J54k80J29j18J09J62l55K1r2J73k70M41Kk17J80l8n5L0p4R9J63l58QJ70
$$ 55 209 -71 58 -60 49 211 -144 -123 -215 -42 -312 129 131 -86 94 56 1 31 -43 56 219 -139 -131 39
5855C9q0oj11J40K60j30k62J16O4p7Q5N1j94L18k11j2j9K4k9k27K19k9J64l02
$$ 39 -41 -47 -158 -18 242 112 -150 -34 30 -47 38 89 -105 213 2 -10 -29 -5 -34 -261 -42 -71 93 -209
5879b09L46j93P1k2j22k9K04k17K3lJ43J34k38k45K18n9j2J90J03R6k07J34m8
$$ -209 137 -56 15 -7 -129 -158 46 -171 -148 -151 -8 126 -112 -357 -139 -198 -210 -20 83 179 -28 106 58
5902E8K51l70j37K38M5O1k20Q3o4k12M00p3Jj69Q9LJ94j20n8Pj48K64k2j99J18
$$ 58 309 -61 -198 40 85 146 -74 9 -55 -267 133 60 61 -108 -19 -16 178 58 0 7 -141 123 101 -98 20
5927B0M8J71m2l8K33m01j66J56J17o9m7J10J45k92j22Q5N9J2J27J3k42l7K60q5
$$ 20 68 239 197 159 392 -9 -175 -19 98 29 -18 92 237 -55 -177 -92 -33 -21 106 119 -123 -160 100 15
5951A5j31M38l94q2K28j0J1k8j01q9J3R0j37M79j56r7p7Q5m1j50K14k61M7J1R9
$$ 15 -116 322 -72 -154 74 64 75 47 -54 -143 -130 -40 -177 302 146 49 -28 57 16 -134 80 -181 -134 -123 -24
5976b4n3K0K42j7j13r4J09o6k26K93q9M0n8N7l3j20L06j65Q6q4jL2j31m1J62l46
$$ -24 -77 -57 185 168 55 -39 70 4 -222 71 -18 22 -36 21 -12 -132 174 9 95 11 10 42 -89 -130 32 -314
6002c14M40k13J11p2J44j3J09l07J83n6J50k20oJ54r6qJ8R3J47k87k5L1L40l20
$$ -314 126 -87 24 -48 96 83 192 -115 68 12 162 -58 -64 90 -6 -14 4 97 244 -43 -68 -37 303 -17
6026a7j6j43rL97k72L32l88J58L21o19J69J03j15K32j59j5k58M00Pq3o7J68k10
$$ -17 -33 -176 -185 212 -60 272 -116 42 363 -256 -87 16 -99 133 -26 -41 -299 101 108 25 -42 126 -84
6049h4m8K39k96L65q0J44o2k96Q4O8J48l36L62k41m5J76J4j1j72n1Q5Q7j3Q0o9
$$ -84 -132 107 -189 176 96 240 178 -118 -34 34 182 -154 208 -33 -78 98 112 101 -71 -122 -37 50 37 117 48
6074D8j36R5Q9K4o4k8P3p4N6k86J68n1K90l56J54L9j55L88l43k0K37l4q6n0o7
$$ 48 -88 7 96 120 56 28 101 27 83 -203 -35 -86 204 -152 2 41 -114 274 -69 -89 148 114 28 -22 -89
6099h9K15o4J20j34l8k95K90P8k01Q9K64l25K5L44l52P6J15j54p5K02j75J60k78
$$ -89 126 62 182 48 10 -285 5 83 -118 -29 235 -90 -65 279 -73 3 118 -36 -111 91 -84 76 -202
6122b02K86Oj03OQ9J68k66r6L1J38j13m0j67K64O4Kj14j74J15j44K46pJ71j48
$$ -202 84 90 -13 -7 82 250 -16 -112 -81 57 -56 -96 -263 1 65 67 -47 -221 -106 -250 -4 -11 160 12
6146A2m9J6m5K58Mk97K72k73o1K56L4j62j4J44j24J33J16k43R3p4J32k54j79J83
$$ 12 -37 -21 -66 192 196 -101 171 -102 -163 93 127 -35 -49 95 -29 104 220 -23 70 -4 128 -126 -305 -122
6170a22O7N28n68L16l80q9L87j57k7M8k63L47L2j66O1K1k08J44o6l5L9K55j4k37
$$ -122 -55 473 -95 221 -159 -248 139 -18 -45 3 -260 87 119 -47 14 35 -173 -29 -95 -130 -91 164 150 -87
6194h7K08k25J41O3N9M5l26J39L5j27jj23R1K35j15p3J15L2r4j37L1N7n4N2K89
$$ -87 121 -104 37 100 159 204 -122 17 52 -75 -76 -199 -108 127 12 -61 54 86 -8 -145 -114 -57 -111 -59 230
6219B30k68k2j49J56R2N9k72K41J01n4k13j83K40J52r9M3q8l09L07n9j33K74k47
$$ 230 -38 -60 -209 -53 39 98 -174 67 168 114 -99 -282 -42 110 11 54 -34 -343 -36 -95 -228 46 -201
6242b01J31P3k22J71J65Qk21n3J28k22K00J74k69J44m8K8m8K91l75K40K04k73
$$ -201 -70 3 -219 -48 117 125 -96 -149 -21 -243 -43 131 -138 6 -42 -14 -62 229 -146 94 298 25
6264B5P4Lj49j09M9K08n4j45K87l21J46qL0k43M14k25O4J74k66K82j0l08M0R9
$$ 25 99 102 -47 -156 -107 101 47 -98 189 -132 14 6 36 -207 207 -18 46 220 -46 236 226 -82 -42 57
6288E7j08r0K69k27K59n7K4k20Qr1J82J2J3k25K94O6r6j21k85R5L30R9k37j53
$$ 57 -51 -141 128 -99 160 103 127 -93 -85 -176 6 18 31 -194 100 166 70 -51 -336 -241 89 188 -49 -202
6312b02K01L4J56o6o3N6j49j19K83k28J69J7k08J91l44K76K5Q5k08J03Q6l05K28
$$ -202 -1 33 189 123 60 116 -33 -152 131 -97 72 89 -119 72 -272 4 29 114 -94 9 95 -210 18
6335A8J92nk28p5O7p4Q6o8J06R6r9o2K24j25N3J30l71Q1J1j34L01j33O6p5J88
$$ 18 210 205 -23 -98 -31 -105 -19 -87 19 115 16 -46 178 53 106 236 -135 -54 -43 -177 124 -9 57 -18 170
6360A70k78J97j81M6J30J00l96J22K18k78M35o94L88P8j37J43j7Q6j69K24n0r0
$$ 170 -108 89 -92 -46 84 184 -212 -90 128 -150 285 -409 -21 57 -80 63 46 132 -37 187 137 47
6382D7J53j34j2J0r5J34l06J92P6K2p2N6J31k59J78j05k13j9K42L0j17n6r1J19
$$ 47 200 66 54 64 -31 103 -203 -11 65 87 15 71 202 -57 121 16 -197 -216 26 56 -61 -117 -208 -89
6406h9K13j67j9n5N7K41k25J11L8q9M8J19j12pL8j12L9Q1j27J96j05j31q3J23
$$ -89 124 -43 -62 -117 -60 181 -44 67 105 16 64 183 71 64 102 -10 29 110 -17 179 74 -57 -140 -17
6430a7pr5J97n1P9R6m03L10J55k88K10Q0l18N3M6L9k37K4J26K5j0J28l20nJ08
$$ -17 -24 -119 78 27 106 202 -201 109 264 -24 186 266 -52 1 47 86 -151 -127 -1 24 14 142 -178 -183 -75
6455g5R0j30J6Mp6M5Q7j1J9N7j42J16p6J26j34K53p8j02r1K13j50J60j00j79J61
$$ -75 15 -115 -99 -95 -171 -126 -39 -50 -31 26 -116 0 -76 50 -84 169 91 -11 -102 111 -39 121 21 -158 3
6480CJ2J2j30L79k22j1K68k76Q8p6R1j31l9n8O2K0J07J24j16k11kJ8J83k50L00
$$ 3 15 27 -103 276 54 43 311 35 123 47 138 7 -32 -90 -28 -8 99 223 107 -104 -106 -88 95 -155 145
6505A45J24l70L9J09Q0j50j21J88n0J9Q6j79M2M6j27K63k81J10J16jQ2o0j20j92
$$ 145 269 -101 -62 47 127 -23 -144 44 -6 13 99 -80 -38 8 -119 144 -137 -27 89 88 170 110 -10 -202
6529b02O5j9L09Mj22P3K6k76L01j26qo9o0K36j18J28k34J31Q5o1q2j40m0J02J24
$$ -202 -137 -156 153 157 35 108 134 -142 159 33 25 -44 -104 132 14 142 -92 39 124 63 -19 -159 -199 -97 27
6554B7j59L25n02L70j3p9O5K33k56M4o2l6j8n9O9J07J34l31K82j19K61k02P0m48
$$ 27 -132 193 -309 61 48 -31 34 267 11 55 -7 -43 -61 -120 -51 56 190 -141 141 22 283 81 151 -297
6578b97J61K76n2k44J63j3p9J67p4k52K50J61k36M0K10l00n8R7l4p3L4K41M7j74
$$ -297 -136 140 88 -156 7 -6 -85 82 8 -244 6 167 -69 -29 181 -119 -177 -80 -114 -187 -153 88 135 -39
6602c9n4N5J14j12n5O9O6Pj95K44J66l52n5K20J98l12j84K18n9L7o3K40k37j10
$$ -39 -93 -38 76 -36 -91 -22 44 51 -144 100 266 -86 -141 79 277 -35 -219 -1 -60 -23 -86 154 -83 -193
6626a93L90l24j81M02J23q8j46j05K20r8Q9r4j6j83O9J75%j04R1Pl63L99q2J36
$$ -193 197 -127 -308 94 217 129 -17 -122 98 0 89 -5 -21 -204 -135 40 40 -64 27 34 -329 70 -12 124
6650A24j86J46k26K0O9K8N8R6l10J33l3J13j83R4L3r4M5o3R4J80k35O3P1j62r2
$$ 124 -62 84 -142 -122 -53 -25 33 129 -181 -48 -81 32 -151 -57 -24 -118 -73 -136 -42 138 -97 -34 37 -125 -217
6675b17L97r9o6m8N0n5j01M04k85J16o2J74P0l22J81L4l35J12j39M26j85j48J28
$$ -217 180 81 15 -33 17 -38 -139 265 -20 96 34 208 278 -44 137 171 -164 -52 -191 235 50 -98 30
6698C0j9j33j1J44p2M0j49K74j61K9j7k20K79pp8k06K08J99p7r7Jk15L2L59J03
$$ 30 11 -122 -133 11 -61 -21 -170 104 -57 -28 -45 -265 14 7 -71 -277 -69 130 53 -44 -43 -258 -226 133 236
6723B36Ol92r4J24J47n8j9j14K93j7k23R7M5o9J29K5l79K37j93L10k04J47j03
$$ 236 242 -150 -244 -120 27 -31 -50 -164 129 112 -111 -14 31 -38 91 116 -263 -26 -219 91 -113 34 -69
6746f9j45L72j22M1M0o9j05N0o9K8J54j14m4K09j82k22L6L28Q6k76k9K03m2N7
$$ -69 -214 158 36 77 117 48 -57 -7 -76 -48 106 -8 -52 157 -25 -247 -211 117 203 -73 -102 101 59 116
6770A16qj15j63N4K4K68j49j23k8J25o8J87R3j30j11J22m8Q6O9j50K59m63K57
$$ 116 108 -7 -170 -116 -92 176 27 -96 -124 1 -67 120 213 83 -28 94 46 132 201 51 310 -153 104
6793A04j09J33j54O6mj19j20%K45Q4k7k14K94p0m0p1KL3Rj72K73k98L35j67j5
$$ 104 -5 128 -26 40 36 -83 -203 -203 42 126 99 -115 179 109 69 -2 0 33 42 -130 143 -155 180 13 -2
6818bJ30j87M7O0P7p1j16j90J14J45J32j64P3j01J56J33l07J00j23K35j62J99
$$ -2 128 -59 -12 48 125 54 -62 -252 -138 7 139 -25 48 -53 103 236 -71 29 -94 141 -21 178
6840A78k75J1l6J50J48k60N5o5O4O2n9Q3j38j46J14J55r2j66K65Nj4l46L26j66
$$ 178 -97 -86 -122 28 176 -84 -29 -94 -30 32 -27 56 -82 -228 -114 41 -51 -217 48 53 39 -307 19 -147
6864a47j03J43K95K5k34r2n1K38k24K53J6p4k31J11K32m01L84j50K5j46J33K55
$$ -147 -250 -107 188 213 -21 -113 -164 74 -150 103 119 45 -186 -75 157 -244 140 -10 15 -131 2 257
6886B57n90K09j06K84r2O7j28P9M0n0J9R4j08O8M4J44l49K46j37p8L0p5%NJ94
$$ 257 -333 -124 -230 54 -38 29 -99 -20 20 -30 -11 83 -25 43 87 231 -118 128 -9 -87 -57 -132 -132 -127 67
6911F7j81Q7J54J18p6j77m8k7M7K55j21K73l25j46j80L90j07j1n8p7n0K16q2J90
$$ 67 -114 -27 127 245 169 -8 -56 -83 -36 219 98 371 46 -100 -280 110 3 -8 -66 -143 -193 23 -59 131
6935A31L1k22l6K86K1p7j52J33k14P0q1K1L53l85J16jj2M1K02q7j79jK09j42k32
$$ 131 162 -60 -96 190 211 134 -18 115 -99 -29 -110 -89 264 -121 -5 -6 -18 23 225 138 -41 -42 167 25 -207
6960b07J98N8n1j43K09m7k55K44M3Q6j77R2o2O3j6q4R0l91J63K43k9j39J91r0
$$ -207 -9 49 -2 -145 64 17 -238 6 49 135 -42 50 -12 51 35 -49 41 -350 -187 56 27 -112 79 -11
6984a1k41J95K3J40j08m3J50K6r2q3J16Nj5l31M41P0l91K01j76K83l02K48l8J04
$$ -11 -252 -57 -34 106 -2 -45 105 131 39 -44 72 77 62 -269 172 242 -149 52 -124 159 -143 105 67 171
7008A71j22p6l00K79R5l6J34k45J62j1k5o5mR7k0j54M9N6j4J48k24J68q6J60l32
$$ 171 49 -27 -327 -48 47 11 145 -100 62 51 26 -39 -43 54 34 -120 -71 -15 -29 119 -105 63 -23 137 -195
7033a95M54l91N7Rj39M76j38m22J32L66q7k01q5J67M4P6j0k10J42j71J47p3K50
$$ -195 259 -132 -75 -66 -205 271 133 -289 -157 209 122 -79 -164 3 47 123 113 -97 45 -126 21 -52 198
7056A98k56RQ6M8l0l16K93M9j49m0K98P1l63QJ58j40r8l9J22J1J87p4j01p4M4
$$ 198 -58 -49 37 85 55 -261 32 81 -68 -108 190 261 -102 -94 64 -76 -174 -213 -91 -80 107 33 -68 -142 -98
7081i8L60j71j06M2P6o2j65K70n5m3j76K63j07k08P2J08J46j63oJ74j02j04O8
$$ -98 262 91 -15 27 103 41 -124 146 91 48 -128 135 28 -180 -108 0 146 -17 -23 151 49 -55 13
7104A3J63j6k11K7M6Q9O6r5j33R6k3j30J27Q1p4l5j18L24j05j93J21Or6N0R8O6
$$ 13 176 160 -51 -24 22 111 177 82 -51 45 22 -108 19 100 26 -9 -127 197 92 -101 20 26 -70 -20 78 144
7130A44N6k03K9J9J02l26K82k68J63k39J39l57M36j92J4K35k40L07j87K6N1M1
$$ 144 200 -3 26 45 147 -179 103 -165 -2 -241 -102 -459 -23 -215 -201 34 -206 101 -86 -60 -9 32
7152C2n0J21n1j5j37oJ26O1j35L38j21j28p0Q6N6o8j34J74j23L53k74N9j84L25
$$ 32 -18 103 52 37 -100 -106 20 81 -54 284 163 35 -35 51 107 39 -95 79 -44 309 35 94 -90 235
7176B35k17J12R1j96n0J05m9j92K32k24J17l2J57o7Q1Q6m57K27p5K08k36j40L23
$$ 235 18 130 221 25 -25 80 31 -161 71 -153 -36 -68 89 22 103 189 -268 -41 -116 92 -144 -284 39
7199C9j9J19P4Jl98L02q4J53j31k23R3q0K04k04L06k49j8K2J39N7k17K71j38J0
$$ 39 20 139 213 214 -184 118 34 187 56 -167 -74 -154 50 -154 152 -97 -115 -93 46 103 -114 157 19 29
7223B9K8k83J3K7L06j50J4j8j08J55p0J27M0J1k55K37l45M04j13M6qrj28r5J26
$$ 29 57 -226 -213 -186 120 -30 -16 -34 -142 13 -57 70 110 121 -134 103 -242 162 49 95 87 78 -50 -145 -19
7248a9j9m2K79j56%j27O1k0K2Q2M8j05j1J87r9j55O4N0N2J50k06K92j43j28J00
$$ -19 -38 -80 199 43 43 -84 -23 -43 -21 61 109 4 -7 180 81 -74 -10 40 92 242 36 328 185 57 157
7273A57j06j31j26J98k73N06j92q8K03n4J41l66K19m4j38j27K97o5M4j32K41k19
$$ 157 51 -80 -206 -8 -281 225 33 -55 148 94 235 -131 88 44 -94 -221 76 11 55 -77 164 -55
7295e5J35O7j76J46k42J61k30K59rj46O3J58j69Q0n1L91k20l29K49j62K81j47
$$ -55 80 147 -29 117 -125 36 -194 65 56 -90 -27 131 -38 42 -9 382 162 -167 82 -80 201 54
7317E4j22P3J19j68N6j3j34J09l5j01K75m5J28j59k39J51Lk7N1n5J87J0k97J88
$$ 54 -68 5 124 -44 12 -1 -135 -26 -61 -162 113 68 196 37 -202 -51 -48 -75 -24 -79 108 118 -179 9
7341Il5J14J81j11N3n9O3l84M63m14J55k8o2K72k43l6qL95k81J33j12j33K77j20
$$ 9 -26 88 269 158 211 152 215 -169 294 -120 35 7 -55 217 -26 -62 -70 325 44 177 65 -68 209 89
7365H9Q0j83j57J7K92k65M78m03K6R1r3J92n1J33j05k29J31j88P2j68K02M8J83
$$ 89 169 -14 -171 -154 138 -127 351 -52 -26 65 -28 164 113 246 141 -88 43 -145 -73 -241 -39 9 192
7388A92p8j71j29j7R2K75k45K93m28K99N6j05k97J98O5K53l45m1Q5J30p4J99k61
$$ 192 114 -57 -186 -203 -111 164 -81 212 -216 83 139 34 -263 -65 0 253 -92 -133 -48 82 8 207 -54
7411e4m1K6M21o13K93p9j44K50n4o0j18J53K71m08J47R6p2k28N5K38q1K10j80
$$ -54 -95 -69 352 -261 32 -47 -191 59 5 -55 -173 -20 251 -157 -10 86 14 -214 -159 79 -2 208 28
7434B8k11M24l57J31m3Q7K73l33Q0j60K47k95L13m15J82J53q4p6J3O7k4J58j42
$$ 28 -183 241 -116 15 -28 59 332 -1 79 -81 166 -129 184 -231 -49 104 20 -56 -43 24 0 158 16
7457A6j45J76N5Mm9J02k49K31j55K50n74M15j30M8j5L5lj29J33Q1l03J33rj24
$$ 16 -129 47 102 106 57 159 -90 141 -14 236 -338 77 -53 -5 -20 15 12 -117 16 97 -206 -73 -82 -206
7481b06K39k30L28J2k89L39j93J6p1l1NJ73j27J48j82J18J06J8j61j5J66j02p2
$$ -206 33 -197 131 143 -146 193 0 16 -55 -86 -81 92 -35 113 -69 49 155 173 12 -3 163 61 -11
7504a1J49r0N3j53m7L7N5J78k81L45k56K43j32j06P6J79k68J51k16l5K71j20j52
$$ -11 138 48 101 -52 -99 -62 -7 171 -110 235 -21 222 90 -16 60 239 -29 122 -94 -129 142 22 -130
7527a30mK68m92K92J07L35m11Q2k09L74k42l1pL13k81K72J7l32M38o08M52j89
$$ -130 -134 134 -358 -66 41 376 -35 47 -162 212 -30 -61 -68 245 -36 236 253 -79 359 -249 203 14
7549A4n9L0RQ2j65J87pk25LM67l68L9J31j29k3J76j5l64J94j08K82Q3k08q4O4
$$ 14 -45 -15 -6 76 -89 98 91 -134 -131 336 -32 7 138 9 -14 162 147 -217 -23 -131 151 234 26 -58 6
7574FpK9J7Q6m7m5K1P3k08l5L16j35j10J90k64K76l04J91j20J10r8j37J13O8J64
$$ 6 -1 28 45 131 84 39 60 133 -75 -110 206 71 -39 151 -113 163 -141 50 -70 40 -58 -195 -82 -14 150
7599A50j67k03J74R2O6l67L88K35n10%K50K7j69j0n3J84j98K64lo8j79J61p3J10
$$ 150 -17 -220 -46 46 112 -255 133 368 -142 -142 108 135 -34 -44 -97 87 -111 153 150 82 -97 64 -9 101
7623A01j94Q1n1J06o7n5J33m6l58L29J27l1j88N5J26J2o5k17J82J1k27N9L54j91
$$ 101 -93 -12 -63 43 -24 -79 54 8 -350 -21 106 75 -113 -58 68 80 15 -202 -20 -9 -236 -177 177 -14
7647a4J10%m6n9Q9r6k28L59p0J21j26K63l35M5Q4j13N0j32P6j65N7K9J28J04J21
$$ -14 96 96 50 -9 80 -16 -244 115 45 166 40 303 -32 13 97 -16 34 -98 -22 -187 -130 -101 27 131 252
7672B52k39j10K5L9L7n1K76k76R4k28J02j00M8M7j55K31L9J5R6j03j41P2j74K46
$$ 252 13 -97 -72 -33 4 -47 229 -47 47 -181 -79 -179 -131 -84 -239 -8 31 46 142 39 -102 -30 -204 42
7696D2qk97R3J97o1R9R0l58J7J81q9J83l67M20j78J84j09J20J20K8k57p6j37k49
$$ 42 34 -263 -170 27 -34 65 155 -203 -186 -5 -94 89 -278 142 -36 148 39 159 279 307 50 -26 -163 -412
7720d12N55J5K9j75j49M43k66M8J3j32P5O6j67N9k8K3M4l7m9K47m8l2l61K99q8
$$ -412 143 158 187 12 -137 306 40 88 101 -31 44 110 -57 2 -26 -3 41 4 -45 202 154 122 -239 60 -28
7745b8j34J23K3L7r5j20K77k47K33j85J72o6J56l27Q7j07qK4J59p6K65n2j38n6
$$ -28 -162 -39 -16 21 -74 -194 83 -164 69 -116 56 -10 146 -181 -94 -201 -209 -185 -26 -102 163 111 -27 -83
7769h3J04K16o0k66O1j34J95j80jO9k18K78L48j87o4k90K08j3j59K95j7k07K65
$$ -83 21 237 177 -89 -28 -162 33 -147 -148 -79 -297 -19 329 142 78 -212 -4 -17 -176 119 102 -105 160
7792A60p1k03J41p4J50R1p0j23j08J34j37j21K79j75K57q4N3j0k5N9N2m8k53j1
$$ 160 89 -114 27 -47 103 194 124 1 -107 27 -110 -231 48 -127 130 46 99 89 64 123 175 127 -126 -137
7816a37J00K11r9j38k1m1J01m8jK80m22Q3L7N6P3k62J38j06L11j55J06j33M6k5
$$ -137 -37 174 75 -63 -84 -125 -24 -72 -73 207 -215 -132 -95 -39 34 -228 -90 -196 115 -40 66 -67 -21 -46
7840d6J06R8l29J18L13l25R9J57r2l05J11n1J16L27k13k6j25lJ89n6J06l9k19
$$ -46 60 158 -171 -53 260 -65 34 191 99 -206 -95 -146 -30 297 84 58 -67 -70 119 63 169 130 -89
7863h9J35k05Q6k4J74j75J58jr8n7J76L5k28o7M25l59K70j38J81j28J44j36j91
$$ -89 46 -159 -73 -97 77 -98 60 59 -39 -96 80 115 -113 -180 245 -114 156 18 199 71 215 79 -112
7886a12R1L5k23O0J06J04J5o0j64M5K26n9j54J8O3nK22l25K74k2k87O9J11N6j90
$$ -112 -21 14 -209 -149 -43 61 76 16 -148 -103 123 64 -90 -72 -9 -14 208 -117 157 135 -152 -83 28 84 -106
7911a06K06k11J77k23K71k2j93K94j57J74k46M3J04J32m32J20J69q1L1j99K47
$$ -106 100 -111 66 -157 114 92 -101 193 36 210 -36 7 111 243 -189 -69 100 19 50 -149 98
7932I8k44L13k15Q8P1l17p4K10J2J22l1k4O2l44N46m74M14j81J74k19j39K72R4
$$ 98 -146 167 -48 40 111 -206 -280 -70 -58 64 33 9 71 -273 273 -201 213 32 206 -13 -152 120 214
7955B14k96J36n8k08P1J76N4j01jJ02n9j10J44K32r3j48P7j21n8M0j52J42o9K69
$$ 214 -82 54 -4 -212 -141 35 89 -12 -13 89 30 -80 64 296 203 55 132 11 -47 -7 -159 -17 -86 183
7979A83r7kk24K80j49K64j79J5j92K21k39k4L19j17l01K59O0j70K35l31M2K20
$$ 183 86 84 -140 140 -9 255 76 91 -101 120 -119 -143 176 59 -242 17 77 -93 142 -189 -147 73
8001G3p9k11J14N3K73k27k76J67o6J76j63K20q2k8L5L3L6j15O4Mj91K20J67Oj98
$$ 73 -6 -217 -103 -50 223 -4 -280 -113 -179 -3 -166 54 -28 -56 -21 12 48 -67 -3 1 -190 30 197 203 5
8026EJ71k98K88q7j85L04j53j12K00j54j67K65O8j51o3J23Pk1k32J75j68K06J04
$$ 5 176 -122 166 79 -106 198 45 -67 133 -21 -188 77 145 -6 -69 54 61 40 -192 -17 -185 21 125
8049A25m3pj9L2p6J29o1j36K5J42K5m13K73k64L94j07n4O9L4j77j9J67O5j9q2
$$ 125 82 75 56 88 12 141 80 -56 -31 111 136 -277 -4 -268 126 19 -35 34 68 -109 -128 39 104 85 3
8074Ck00J89m1n1J96j54k7K13K51k47j87K03n9Q0j79j73j51K41Q8N7J83j89L4
$$ 3 -197 -8 -49 -100 96 -58 -85 128 379 132 -55 148 89 169 -10 -183 -334 -93 -5 52 235 46 80
8097H0j35J30J26l45K09j4l1n7O6o7K47r0j35k12K29rJ91k60j71K58j51J38R3
$$ 80 -55 75 201 -144 65 51 20 -37 29 -38 209 119 -16 -228 1 -8 183 -77 -248 10 -141 -3 90
8120I0j69L18k28l0J29j01J3J72k43k02M25k85J90n4j94K81k05K23j54k12M45
$$ 90 -79 239 11 -19 110 9 22 194 -49 -251 174 -111 79 25 -169 112 -93 130 -24 -236 209
8141B09k02j3k87o1J87K12j97J23j21K14r0P0m0r3Q9j6j95N05l02J42j08N5M5
$$ 209 7 -6 -293 -354 -167 45 -152 -29 -150 64 -26 44 4 -89 0 -16 -211 294 -8 134 26 81 126
8164A26k06J53o2j66J82l07K56j8K1R2k16K93l23L10j74R1K0j90K64M2q3L9k49
$$ 126 -80 73 11 -155 27 -280 -24 -42 -21 71 -145 148 -175 135 -39 52 72 -118 146 188 105 144 -105
8187a05o9n7K72J11
$$ -105 -174 -231 41 152
8191A52
$$ Imaginary data points
##PAGE= N=2
##DATA TABLE= (X++(I..I)), XYDATA
0@%%%%%%%%%%%%%%%qJ6j6J6j6K4l2L2m0M8n6O7p5Q8j04J18j34J52j71J92k16K45
$$ 0 0 0 0 0 0 0 0 0 0 0 0 0 0 0 0 -8 8 -8 8 -8 16 -16 16 -24 24 -32 35 -40 48 -56 62 -72 80 -91 101 -115 130
37A30k75L07l42L81m23M69n19N74o36P02p75Q54r39J033j138J255j386J532j694
$$ 130 -145 162 -180 201 -222 247 -272 302 -334 368 -407 447 -492 541 -597 658 -728 804 -890
56h90J878k090K337k626K970l389L913m593N514o835Q901j2626K1488q6205p3507
$$ -890 988 -1102 1235 -1391 1579 -1810 2103 -2490 3024 -3811 5090 -7536 13952 -72253 -145760
71a45760J12922R3192M7368l9272l5202N55M7609K7381j4163n2797m2238k1438
$$ -145760 -32838 60354 107722 68450 33248 33803 81412 108793 94630 41833 -405 -21843
83b1843n489j1931r552n750J225k083L465J2552K6200K4751J3482o6J115N398
$$ -21843 -27332 -39263 -48815 -54565 -53340 -55423 -51958 -39406 -13206 11545 25027 24961 26076 31474
97C1474L721o534r254k664K376j0612k7030j9920J2825L2772J5331k4000l5259
$$ 31474 35195 28661 19407 16743 19119 8507 -18523 -38443 -25618 7154 22485 -1515 -36774
110c6774j371M1673M1063n468m5286l4777J3449M1419J7961k6539l8236p629K8647
$$ -36774 -38145 3528 44591 39123 -6163 -40940 -27491 13928 31889 5350 -32886 -40515 -11868
123a1868L0641J636j9232r841J2752J7202K858r913o745J588N69p983q882j600
$$ -11868 18773 20409 1177 -8664 4088 21290 24148 14235 7490 9078 9647 1664 -7218 -8818
137h818K336k787r036m888P336J0520k19p808J503J5952J5470j254j4949o247
$$ -8818 -6482 -9269 -18305 -23193 -15857 -5337 -5556 -13364 -11861 4091 19561 18307 3358 -2889
151b889J4869J9473q02k3831k0845N253K2006P369k1578k8943m941K0777J7569
$$ -2889 11980 31453 30651 6820 -14025 -8772 13234 20603 -975 -29918 -34859 -14082 3487
164C487o946k0170l760J9069K1162K851r523l199J1119J1269l279j3075o749M482
$$ 3487 -3459 -23629 -27389 -8320 12842 15693 6170 2971 14090 25359 22080 9005 2256 6738
178F738K885j0061j5519n024Q525P440m374r201J299J4688J4479M30q926j082
$$ 6738 9623 -438 -15957 -20981 -12456 -5016 -9390 -18591 -17292 -2604 11875 12305 3379 2297
192B297J1339R132o113j6285q366N573N503p570j4062m058J0562J1940Q01n716
$$ 2297 13636 22768 16655 370 -7996 -2423 3080 -4490 -18552 -22610 -12048 -108 693 -5023
206e023J624J3143J1612j763j0172m314N367K949j0346j7083p069P686P810m765
$$ -5023 -3399 9744 21356 19593 9421 5107 10474 13423 3077 -14006 -21075 -13389 -5579 -10344
220a0344j2485j968J6867K0479L663j1255n899J2488J8603J739j7792j8526j585
$$ -10344 -22829 -24797 -7930 12549 16212 4957 -942 11546 30149 31888 14096 -4430 -6015
233f015R661J610j4116j6795k779J1286J0346J396l135K010R511R725L503n62
$$ -6015 3646 5256 -8860 -25655 -28434 -17148 -6802 -5406 -8541 -6531 2980 12705 16208 15646
247A5646q88r67l817n440k696N12k741r929j0205R20J2168R115m550j0911M35
$$ 15646 14758 13791 9974 4534 1838 2350 -391 -10320 -20525 -19605 -7437 1678 -2872 -13783 -13348
262a3348J8223J8437j420j7885j1831R006J7976J783k0144k0969m48J7531J2311
$$ -13348 4875 23312 21892 4007 -7824 1182 19158 20941 797 -20172 -20620 -3089 9222
275I222q307j7710n023J4780J8572L859j1101r940L756J2431O316n915j1123n958
$$ 9222 915 -16795 -21818 -7038 11534 15393 4292 -5648 -1892 10539 16855 10940 -183 -6141
289f141J643L478Q29k457m687m627j80O584J0091L888n712q628K197J3619J0952
$$ -6141 -4498 -1020 -191 -2648 -7335 -11962 -12142 -5558 4533 8421 2709 -5919 -3722 9897 20849
304B0849n799j7698j0059Q876J5486J694j7500j7893J746J8847J4064o948j8192
$$ 20849 15050 -2648 -12707 -3831 11655 13349 -4151 -22044 -20298 -1451 12613 5665 -12527
317a2527o187J5177K0370L175j4969j3501L554J4997P199r292j5042o036N554
$$ -12527 -18714 -3537 16833 20008 5039 -8462 -4908 10089 17288 7996 -7046 -13082 -7528
330g528Q560J322o359o392l12O009Q001M693j253n381l398L603P946L930o710
$$ -7528 1032 2354 -4005 -10397 -10709 -4700 3301 7994 6741 1360 -2038 1565 9511 13441 6731
345F731j2261n646O721J0537P47j2405j2347L117J6229J1322o090j4213m123J2954
$$ 6731 -5530 -11176 -4455 6082 6829 -5576 -17923 -14806 1423 12745 6655 -7558 -11681 1273
359A273J5755N7j4967j2096L876J3062M948r460j3307k759Q560Q945p8o695n039
$$ 1273 17028 17085 2118 -9978 -6102 6960 11908 2448 -10859 -13618 -5058 3887 3809 -2886 -7925
374g925L261P139M370j375m021k194N07K576K422r5l294n411k155L298N639J137
$$ -7925 -4664 2475 6845 5470 1449 -745 -238 2338 4760 4665 1371 -4040 -6195 -2897 2742 3879
390C879o468o953J578R912O673l854r266l215Q141J0048m92r825p356L266R101
$$ 3879 -2589 -9542 -7964 1948 8621 4767 -4499 -7714 427 10475 9983 158 -7198 -3932 5169
405E169L665p076r205q50O449N349j947o955k275M899O438R14l408j512K771K794
$$ 5169 8834 1758 -7447 -8297 -1848 3501 1554 -5401 -7676 -2777 3661 4575 1167 -345 2426 5220
421E220o30k622j355N90p62k876k088M58K542M2k804o38L205M866J370k202k135
$$ 5220 4590 1968 613 1203 441 -2435 -4523 -4065 -1523 -1481 -4285 -4923 -1718 3148 4518 2316 181
438A81J934L711J019l825n006j267K526J101l167l958L2L883L481l67j462J473
$$ 181 2115 5826 6845 3020 -1986 -3253 -727 374 -2793 -6751 -6719 -2836 645 278 -1184 289
454B89M958K778k571m185J04K672j44n401o636mM657K425k485l612R63P105O692
$$ 289 5247 8025 5454 1269 1373 4045 3901 -1500 -8136 -8140 -3483 -1058 -3543 -7155 -6192 913 7605
471G605j2m357k238L031N262p70o780o760p51K926R39l048l656j60M042M732K046
$$ 7605 7593 3236 998 4029 9291 8521 1741 -5019 -5770 -2844 -1905 -4953 -8609 -8769 -4727 5 2051
488B051J051P91P97M99P36M37q76l893n539k375K478L173r79m689k448M319Q259
$$ 2051 3102 3893 4690 5189 5925 6362 5486 1593 -3946 -6321 -3843 -670 -1649 -6338 -8786 -4467 3792
505C792M643l815n852p44O915O258l201j0642o920K830P474K129o932p390J237
$$ 3792 8435 4620 -1232 -1976 4939 11197 7996 -2646 -9566 -6736 738 2867 -4065 -11455 -10218
520a0218R500Q619l09n744k775M413O414J209n395p225m117Q20K902k32m092l889
$$ -10218 -718 7901 7592 1848 -927 3486 9900 11109 5714 -1511 -5628 -4808 -1906 -2138 -6230 -10119
536a0119j56M792O638L448j114k653K00M571N754l7o918p976j835N716M311m105
$$ -10119 -10275 -5483 1155 4603 3489 836 1036 5607 11361 11324 4406 -3570 -5405 311 4622 517
552E17r515m837O055J0065L833n713p257J359R693P148k603r225n255L329P189
$$ 517 -8998 -13835 -7780 2285 6118 405 -6852 -5493 4200 11348 8745 -480 -5735 -2406 4783
567D783K116o350p443j165O248O556J13n320m330J906N406L779j884n610l676
$$ 4783 6899 549 -6894 -8059 -1811 4745 4858 -462 -4792 -2886 2520 6299 4415 -1195 -4871
582d871J058L824L212j292n009l705K513O887M061l264o303k108N143O936M14
$$ -4871 -3813 11 3223 1931 -3078 -6783 -4270 2617 6678 3414 -2889 -4997 146 7082 7496
597G496o399p022L36O871N005k922p337l852M590P787K459n238p057n70N868M658
$$ 7496 1097 -5925 -5589 1282 6287 3365 -3972 -7824 -3234 4553 7012 1774 -5283 -5853 15 4673
613D673k105o632l694L405N710K875j921l242m03L803M291P50l087m517j690R81
$$ 4673 2568 -4064 -7758 -4353 1357 4232 2311 -931 -1334 2469 6760 7510 4423 -94 -1784 -803
629h03J889j009m533m262l76L967L845J372j585p76K730N767L977q42m624l275
$$ -803 1086 77 -4456 -8718 -9094 -5127 -1282 90 -1495 -2271 459 6226 10203 9361 4737 1462
645A462Q76K496p93o251o507q42L418L159p22k292J28M256N791L147j031j747
$$ 1462 2338 4834 4041 -2210 -8717 -9559 -6141 -2982 -3704 -5996 -5868 -1612 4179 7326 6295 4548
661D548m51J352R91k355m876l582j104P70L85q95n23J265K577L053K333J286P07
$$ 4548 4097 5449 6440 4085 -791 -4373 -5477 -4707 -4322 -5217 -5740 -4475 -1898 1155 3488 4774 5481
678E481j10m04k32o65k528l249k489j080K2K19n54N75J404K828K954J720J086
$$ 5481 5371 4967 4735 4070 1542 -1707 -4196 -5276 -5254 -5035 -5589 -5014 -3610 -782 2172 3892 4978
695D978L55J99K83m97k029k445k321j403p03j399j060Q06J350Q82P44J375K695
$$ 4978 5333 5532 5815 5318 3289 844 -1477 -2880 -3583 -4982 -6042 -5236 -3886 -3004 -2260 -885 1810
712A810K514R73q83p16Q6N58r44k583k989j634Q04J017m61j909p76J868L373K186
$$ 1810 4324 5297 4414 3698 3784 4342 3398 815 -2174 -3808 -3004 -1987 -2448 -4357 -5133 -3265 108 2294
730B294l38j979j36K630K343m21k692k496j63J503Q24j171k790j526J256K250
$$ 2294 1956 -23 -159 2471 4814 4393 1701 -795 -958 545 1369 198 -2592 -4118 -2862 -612
746f12J791j003k080l91J713L458Q94j882k341l19J871K012k12k987k890j11K588
$$ -612 1179 176 -1904 -2295 -582 2876 3770 1888 -453 -772 1099 3111 2899 -88 -2978 -3089 -501
763e01K127q35l512k328K489M140K251k220l395n74L639M025j22m479l292Q0L362
$$ -501 1626 791 -2721 -5049 -2560 1580 3831 1611 -1784 -2358 1281 5306 5184 705 -2587 -2507 855
780H55K273k305m774k262K436M429K177k773l209P17M124L646j30l605l336Q40
$$ 855 3128 823 -3951 -6213 -3777 652 2829 56 -3153 -2436 1688 5334 5204 1599 -1737 -897
796h97K947J706k029m459k840J313L647K292k081l271m24L739M869J079k993l401
$$ -897 2050 3756 1727 -2732 -5572 -4259 -612 1680 -401 -3672 -4096 -357 4512 5591 2598 -803
812h03LL186K703j713m866m021R50M154K625k688m616r06M159N633J101l507l552
$$ -803 -800 2386 5089 3376 -1490 -5511 -4561 -407 2218 -470 -5086 -5992 -1833 3800 4901 1394 -2158
829b158J235M414K981k068m836l072J278L107J295k918m378q47L154M634P19k575
$$ -2158 -923 3491 6472 4404 -432 -3504 -2226 881 2176 -742 -5120 -5967 -2813 1821 2540 -35
845c5k198R14L789K666p10l201k653L41K387J502j986l935k236J822L607J631
$$ -35 -2233 -1319 2470 5136 4426 1225 -1428 -1087 1300 2802 816 -3119 -5355 -3533 74 1705
861A705k322k839J08L749L908J95l300k489R59L160J591j913m358k146J211L366
$$ 1705 -617 -3456 -3348 401 4309 4504 1204 -1285 -326 2834 4425 2512 -1846 -3992 -2781 585
877E85P25k641l246L81L790L382l76k422j425J659K642J062j843k656j313P27
$$ 585 1310 -1331 -4577 -4196 -406 2976 2600 178 -1247 412 3054 4116 2273 -383 -1696 -969
893i69J209K50j981j815k19J938K095P69j115o65R94K034R89m34j852j448k19
$$ -969 240 490 -1491 -3306 -3525 -1587 508 1277 162 -503 491 2525 3514 3080 1228 -220 -439
910d39M80N10j480j836j021P29K090J379j010q63J122K455J570n52j564n95K18
$$ -439 41 551 -929 -2765 -3786 -3057 -967 412 -598 -1461 -339 2116 3686 3134 1570 975 1193
927A193L68j83k185j449q13N49Q98j32n25J5J913J398N09L03k7K60N70n63j219
$$ 1193 1561 1378 -807 -2256 -3069 -2520 -1622 -1754 -2279 -2264 -351 1047 1556 1859 1832 2092 2662 2099 880
946H80o02p4q08j099m50r0P13N65J72P5M45P91Q21K60k07q27l62L12J81m46j127
$$ 880 278 204 -604 -1703 -2153 -2243 -1530 -965 -793 -718 -273 518 1339 1599 1392 565 203 515 696 250 -877
967h77m24J11L50M64N0NK20M37O04K14M12n46j335n01Q26M97o12j437p07Q65J866
$$ -877 -1301 -1190 -840 -376 -326 -321 -101 336 940 1154 1566 1020 -315 -816 10 507 -105 -1542 -2249 -1384 482
988D82Q08r53j086N5J539J676K31k185j927M64J954R20j529k656o26J746K556
$$ 482 1290 337 -749 -694 845 2521 2752 567 -1360 -896 1058 1978 449 -2207 -2833 -1087 1469
1005A469k44j778j471R47K181J191j080k136j049J112J408P92j227j575n89J580
$$ 1469 1225 -553 -2024 -1077 1104 2295 1215 -921 -1970 -858 550 1342 115 -1460 -2049 -469
1021d69K202L58j304j321j54J229J631r8k502j919j87J658K006m98k263j758J694
$$ -469 1733 2091 787 -534 -688 541 2172 2074 -428 -2347 -2534 -876 1130 632 -1631 -3389 -1695
1038a695L286K017j733k845o82K799K765o98l283k676N51K540J390j445k915j206
$$ -1695 1591 3608 1875 -970 -1652 1147 3912 3214 -69 -2745 -2194 346 1736 291 -2624 -3830
1054c830K427L179P62k205k024M24K749J713j116k564j866N93J793J123q97j716
$$ -3830 -1403 1776 2538 333 -1691 -1267 1482 3195 2079 -485 -2351 -1758 35 1158 261 -1455
1070a455q14J180K447J213p31k205j204J642K394j59k427k740j48K057J995m07
$$ -1455 -2269 -1089 1358 2571 1840 -365 -1569 73 2467 2308 -119 -2859 -3007 -950 1045 638
1086F38k320j761J721L554J857j042k988j246K521K607m45l538k936P27K465J405
$$ 638 -1682 -3443 -1722 1832 3689 2647 -341 -1587 934 3541 3096 -442 -3378 -2651 -186 1219
1102A219j602k273k54J695K735R79r18j588l11J963J219q55j895k124n3R25J042
$$ 1219 -383 -2656 -2910 -1215 1520 2499 1581 -7 -318 1645 2864 2009 114 -2010 -2063 -1138 -96
1119i6m58q26r78Q43J920K015L7j484r87L89K081N78k220k768q54J378J729n58
$$ -96 -554 -1380 -2358 -1515 405 2420 2457 973 -14 375 2456 3034 814 -1954 -2808 -1430 299 -259
1137b59k156j359J361K884J758l53j604n03J755J696m0k514k045k74J274N34j178
$$ -259 -2415 -3774 -2413 471 2229 1876 272 -231 1524 3220 3180 666 -1379 -1653 -379 155 -1023
1154a023j709J43R48J574M14n6j98N45M99Q57J67o65r69p62k03L70p8p13p47k50
$$ -1023 -2732 -2589 -1641 -67 347 291 93 638 1137 1994 2161 1496 527 -235 -438 -68 -146 -859 -1606 -1856
1174a856P38P20Q40k70n10K82Q38J142o07q35q91K39P53l7r49r17K39Q28L16l89
$$ -1856 -1118 -398 442 172 -338 -56 782 1924 1317 482 -409 -170 583 546 -403 -1320 -1081 -253 63 -326
1194c26m86L14J065L19m56l20J64N76j87k88l31k65L74L31m69p03LM90N76l27
$$ -326 -812 -498 567 886 430 110 274 850 663 375 44 -221 153 484 15 -688 -685 -195 381 54
1214E4o41l02Q12K24L04k36q09M32R75M50n25p11R0OJ63j90l54p71r0J01P47r
$$ 54 -587 -889 -77 147 451 215 -594 -162 813 1263 738 27 117 123 286 96 -258 -1029 -1119 -1018 -271 -280
1236b80m81J12K47P41P31K96n50n50n3M30L74j86j068j319j56J423O46p30j521
$$ -280 -761 -649 -402 339 1070 1366 816 266 213 643 1017 831 -237 -1556 -1712 -289 357 -373 -1894
1255a894k59J385K227J67q94j083L63J134J013n62k020j058K99J216M89j490j432
$$ -1894 -2153 -768 1459 1626 732 -351 12 1146 2159 1597 -423 -1481 -1182 34 523 -967 -2399
1272b399L5J539J887J75j308p00R82J462N23o31j205j151OJ176J6p70j624o37
$$ -2399 -2364 -825 1062 1237 -71 -771 211 1673 2196 1565 360 -791 -785 391 407 -363 -1987 -2624
1290b624J243J625N67p44j029L79J622J631o13j310j161j64J104Q00q53k234q78
$$ -2624 -1381 244 811 67 -962 -583 1039 2670 2057 747 -414 -578 526 1326 473 -1761 -2639
1307b639J017K025P97j475j554P14J741J669j18j656j367O55J670M15j352k013
$$ -2639 -1622 403 1200 -275 -1829 -1115 626 2295 2177 521 -846 -191 1479 1894 542 -1471
1323a471n94J117J489J10j362j353N60J633J592k49j368p18N82J519L14n71j437
$$ -1471 -2065 -948 541 651 -711 -2064 -1504 129 1721 1472 104 -614 -32 1487 1801 1230 -207
1340b07j049O14R95O39j126j564l36R89J635K93r50j391O68J849R42l49j647p89
$$ -207 -1256 -642 353 992 -134 -1698 -2034 -1045 590 883 -67 -1458 -790 1059 2001 1652 5 -784
1358g84K02J627N38j508j724m15J536J233l96j133j014R58J501J119q50j139m9
$$ -784 -582 1045 1583 75 -1649 -2064 -528 705 309 -824 -1838 -880 621 1740 890 -249 -298
1375b98N75R58J0p76j648J03O76P91l33r59n20K63J525L50m0n53k85L80Q07J87
$$ -298 277 1235 1245 469 -1179 -1076 -400 391 58 -901 -1421 -1158 367 717 677 124 -161 219 1026 1213
1395A213l58r37q45K19R42l8o51j352L14J178R31K97j057l99N76J195L36n80j056
$$ 1213 855 -82 -927 -708 234 196 -455 -1807 -1493 -315 616 913 -144 -543 33 1228 1564 984 -72
1414g2l27O63L67k13r85q21J78J011J87l54m19L88O80N75l95l49M83j85L5j54
$$ -72 -399 264 631 418 -567 -1388 -1210 -199 -12 -366 -785 -397 283 858 463 114 597 412 447 293
1434B93j27O8m34j34q1J62L13k17j48l2MM40M78k91m4k26K0K77R6n27o14M14K25
$$ 293 166 234 -200 -334 -415 -253 60 -157 -305 -337 -333 107 585 294 250 24 44 321 417 -110 -724 -310 -85
1457h5L53p36k19L18L24K24l62J63L80K41K9n97J61L03K5k22m18j68J71K5K49
$$ -85 268 -468 -687 -369 -45 179 -183 -20 360 601 630 33 194 497 522 300 -118 -286 -115 -90 159
1478A59n92l87p0P79O30L9p95k89Q34R32o0r12m03j24J125k19m85p43l90L45P38
$$ 159 -433 -820 -890 -111 519 558 -237 -526 308 1240 1180 268 -135 -259 866 647 162 -581 -971 -626 112
1499A12l9l85m66J44P05K78K71m42j97m4L97L24p4o20n50J50L12M66K86r74q34
$$ 112 73 -312 -778 -634 71 349 620 178 -19 -63 334 658 584 -36 -586 -436 -124 342 628 -346 -1180
1520a180M40J077Q49n16j389n2N82J302k33j087r76K10J075N53j77j007p21P79
$$ -1180 -740 337 1186 670 -719 -771 -189 1113 880 -207 -1183 -973 102 655 478 -529 -1250 -471
1538d71J522M2o81j316N35Q98P27j13j368p49M72N59Q9m64p69k87M39J022O07
$$ -471 1051 1093 412 -904 -369 529 1256 1143 -225 -974 -502 57 146 -318 -1087 -1374 -935 87 694
1557F94m08o98j14P03Q88J24n02q37o1L89Q69l44j074q04K35Q06P76k51j453m77
$$ 694 286 -412 -526 177 1065 1189 687 -150 -211 178 1047 703 -371 -1175 -940 -134 642 391 -1062 -1539
1577a539Q21J452N09j095j152J42J182J315m50j427o15Q44Q10K55o86r63k05Q05
$$ -1539 -718 734 1243 148 -1004 -862 320 1635 1185 -242 -857 -13 797 1052 366 -597 -802 3
1595CQ92l82r23o20J83Q52N76m38q18J45J82N42M79l66l02k54K4P61M20k84j065
$$ 3 895 513 -410 -1030 -847 5 581 143 -675 -530 -348 194 673 307 5 -249 -225 536 956 672 -393
1616c93k73N37P26P7o76j083%J115O11l27q64o27M94R68O18r12r08K62J104P53
$$ -393 -666 -129 597 674 -2 -1085 -1085 30 641 314 -550 -1177 -683 285 903 -9 -917 -655 449 1202
1636A202j24j079o07P86O50n8q60m01J46L00J11k57m51j90P4K86J32L41m00L33
$$ 1202 1078 -1 -608 178 828 770 -90 -491 -345 -45 66 -191 -642 -832 -758 -472 -340 1 -399 -66
1656f6R4L81J72L69m35l46k39K10N21J03q51n99r7P50K86o28o21j28Q96P27k8
$$ -66 28 409 581 950 515 169 -70 140 661 764 -87 -686 -783 -33 253 -375 -996 -1124 -228 499 471
1677D71q72j22L87Q49j24n22l08K70L16J32k27m02j34K81K45k66j66l19M98J46
$$ 471 -401 -523 -136 713 589 67 -241 29 345 477 250 -152 -286 -5 240 -26 -192 -511 -13 133
1697A33m64j69J65L75O6m56K64l5M84J23l12l17K50K71J91l03m93K10J01k23J22
$$ 133 -331 -500 -335 40 106 -350 -86 -121 363 486 174 -143 107 378 569 266 -227 -17 84 -139 -17
1718a7m23J67RL56n6l38O3J54J05p9l32M83L27M0l36k13N1O18K67o39p43J36Q69
$$ -17 -440 -273 -264 92 36 -302 -239 -85 20 -59 -391 92 419 459 123 -90 -39 579 846 207 -536 -400 469
1741D69j74m60p07J76N49L33p4m69m23K30R01J37n07j73J67L44P12m86n34N0J43
$$ 469 295 -165 -872 -696 -147 186 112 -357 -780 -550 351 488 -19 -192 -25 319 1031 545 11 61 204
1762B04k1q8m78q7n5j5M1L06K24k87k59J13R36J82j79m72k43N61M31K7o42p61
$$ 204 183 95 -383 -470 -525 -540 -499 -193 31 -256 -515 -402 534 716 537 65 -178 383 814 841 199 -562
1784e62Q1O71J39j4j002l51Q54Q18o3o22m65j41Q07M63m15m89o9K29N35l0l44
$$ -562 -481 190 329 315 -687 -1038 -184 634 571 -51 -516 -657 150 613 198 -291 -360 -131 404 374 30
1805C0j48k1K21J22J95m0l51m39L73M72L5m73m79OJ31P32k81l18m85K51J112O1
$$ 30 -118 -139 82 204 399 359 8 -431 -58 414 449 -24 -503 -497 -366 366 85 -233 -718 -467 645 706
1827G06m87n82k09N98O31J33r24o08K16J020K18o93q13J07N12M01jn21j12J94
$$ 706 219 -363 -572 26 657 790 -134 -742 -526 494 712 19 -794 -687 -175 226 225 -296 -408 -214
1847b14L41M22m5l46l59J58K92J43Q8n52k07l3J04M82jp17k39K36Q27K01l20j058
$$ -214 127 549 504 158 -201 -43 249 392 480 -72 -279 -312 -208 274 273 -444 -683 -447 380 581 261 -797
1869g97j37J061R46m28j023l82P44Q30l88k53q34J9P99O7j0p81J80K34M45N6k18
$$ -797 -934 127 1073 645 -378 -760 -16 814 426 173 -661 -642 157 224 214 -567 -387 -153 292 348 130
1890A30l44L39L41j59l33K14J1j53j14j36L42O7k05o66r5R04N20k65o42k03O88
$$ 130 -214 125 466 307 -26 188 199 46 -68 -204 138 205 0 -666 -761 143 663 398 -244 -447 241
1911B41N19k97m89m59M86M95k57m11n89J4Q64K00n16n27J34R83J05k55l66j0O39
$$ 241 760 463 -26 -485 1 496 239 -172 -761 -747 117 317 -199 -726 -592 391 496 241 -125 -135 504
1932E04K56o83n36J91N94m9n51o83N01O48L16o32L0M5P07o0k37p09J75N64J83
$$ 504 760 77 -459 -268 326 277 -274 -957 -456 192 508 -124 -94 -49 658 598 361 -348 -173 391 574
1953E74q28p07L21O17K20l22p20L65P14N89n03o01N03M05N74q21q92K36O70K5
$$ 574 -254 -961 -640 -23 197 -125 -845 -480 234 823 320 -281 222 627 1201 380 -512 -276 394 419
1973D19p71p50R7P02O09m05j063L10R96O05k78o40k47R17R11o33r76l80N82O83
$$ 419 -352 -1102 -1005 -303 306 -99 -1162 -852 144 749 471 -169 -416 501 1412 779 -197 -577 5 688
1993F88l76r89m23P48L36K6q15K32P34K84J60q62q6P75L34m44o88j1O85K54m85
$$ 688 312 -677 -1100 -352 -16 10 -805 -573 161 445 605 -257 -343 432 766 322 -366 -377 308 562 77
2014G7p83k65R83O14m21o43m38P89J208Kj292q62P56J130R2j625n56O86J016N08
$$ 77 -706 -971 12 626 205 -438 -876 -87 1121 1123 -169 -1031 -275 855 947 -678 -1234 -548 468 976
2034I76j355n82K32R81P54q59o05J78R90O46j008m40l45Q26J09p60q17L46O57
$$ 976 -379 -961 -729 252 1006 147 -458 -280 710 1356 348 -92 -437 389 498 -262 -1079 -733 -76
2053g6L11o39p62J041R01o8o51p27Q18J150l1j132q25M29J192Q3j124j450K80
$$ -76 235 -404 -1166 -125 776 708 57 -670 148 1298 1267 135 -690 -261 931 1014 -110 -1560 -1280
2072a280J423N99p78j304P7J070J481l47j193l87Q51J244k70j310n89N17P54j19
$$ -1280 143 742 -36 -1340 -1263 -193 1288 941 -252 -639 212 1456 1186 -124 -713 -196 558 439
2090D39j252j15L33R94o09m97o5R91N23k21r92L18R72M32p02j162k98J066P52
$$ 439 -813 -928 -595 399 -210 -707 -772 219 742 521 -471 -153 819 1251 549 -613 -911 155 907
2109I07r92j076j91R74J173k67j310k15J035J515l09j383p05Q75J324o3j597r45
$$ 907 -85 -1161 -1352 -378 795 528 -782 -997 38 1553 1244 -139 -844 31 1355 1292 -305 -1250
2127a250L96J017J18q24p76M94J129K53o72j62K87R85J30r81n24O71N53m16r25
$$ -1250 -854 163 281 -543 -1319 -825 304 557 -115 -277 10 995 1125 144 -380 291 844 428 -497
2146d97q08N72R11L2j177n49R72J230M03j077o92L46J844J29j284j265N22R87
$$ -497 -1305 -733 178 210 -967 -1516 -544 686 1089 12 -680 -334 1510 1639 355 -910 -388 599
2164E99J78j098q55m1J194O20o06q36N4J178Q32p48p90o3J009L57m98r80k73R62
$$ 599 777 -321 -1176 -1217 -23 597 -9 -845 -791 387 1219 471 -319 -382 627 984 486 -494 -767 195
2184A95L99n75r35oR14O91n46r29J89J183L10n5j079L9M95M63n96p65k41P09O26
$$ 195 594 19 -916 -922 -8 683 137 -792 -603 580 890 835 -244 -205 290 753 157 -608 -849 -140 486
2205D86k07j013j66P99O85k48j188K72Q73J063q18q65r7O65Q49m91q19n41N82
$$ 486 279 -734 -900 -101 584 336 -852 -580 293 1356 538 -327 -424 241 1090 599 -220 -761 -179
2224a79Q43n17p64l69O89J132l83j143j62O81J009J3r99n09L45R83Q9q14q04L82
$$ -179 664 147 -617 -986 -297 835 452 -691 -853 -172 837 850 -149 -658 -313 670 759 -55 -859 -477
2244d77O56N98j197l77J27J098j06n16n96P57M75J10q11l46O40N49P7r16l65J73
$$ -477 179 777 -420 -797 -670 428 322 -194 -790 -33 442 552 -259 -605 35 584 661 -255 -620 -447
2264d47Q91r9p88n12O27Q48N11j018l07Q5P67N16p23r35p1P06O35m67j170j66
$$ -447 444 345 -443 -955 -328 520 1031 13 -294 -209 558 1074 351 -584 -655 51 686 219 -951 -1117
2284a117J292L91m39m98J05Q60J39l07m93R6M50k4n13j62k42N83R9n31o29L83
$$ -1117 175 566 127 -371 -266 594 733 426 -67 29 479 455 -58 -220 -462 121 220 -311 -940 -557
2304e57P57N8r2p36L51Q05K23m07n84j01P99K23n47r77J03P27M92o36m90j80P88
$$ -557 200 258 166 -570 -219 586 809 402 -182 -283 516 739 192 -785 -682 45 537 -99 -589 -769 19
2325A9M99j20q89K7L33N91O1o05k57L09J89r9k41l60M24K84l4m02J5L62J50K0
$$ 19 518 398 -491 -464 -131 460 521 -84 -341 -32 157 58 -183 -543 -119 165 131 -271 -256 106 256 276
2347B76n62O0L90L22n75n99K52N70L26n48l09l53P23M60q7o46j88N06N60k2p70
$$ 276 -286 -226 164 486 -89 -688 -436 134 460 -88 -397 -750 -27 433 346 -300 -488 18 578 556 -214
2368b14m82N64O45j71n29l08L45K11J70m83k50K74L95J37m48k07K10M64k73o5
$$ -214 -696 -132 513 342 -187 -495 -150 61 231 -252 -502 -228 167 304 -144 -351 -141 323 50 -15
2388a5k91M48K70l21j81n32O11M72k76n01k09L94L03k12j57k8Q9M47J7m23o69
$$ -15 -306 142 412 91 -90 -622 -11 461 185 -316 -525 -131 172 -40 -197 -225 -136 311 328 -95 -764
2409g64O22O49M9m80m70J15O87j6n69l40K62L82j38j43j99L47M87k57n7j67J9
$$ -764 -142 507 556 76 -394 -279 408 392 -177 -517 -255 127 -11 -154 -353 -6 481 224 167 0 19
2430A9J94L58m32k61j36N89k58j73m80K89M57J96l78m77M32N79J36n19k38K5M97
$$ 19 213 571 139 -122 -258 331 73 -100 -580 -291 166 362 -16 -493 -61 518 654 135 -103 -78 419
2451D19K17o82l96R8M12R4k69l41K54K90J71m02n7j94N35L58l55n04J27O89n4
$$ 419 636 -46 -442 -344 68 162 -107 -448 -194 96 267 -135 -192 -386 149 507 152 -352 -225 464 410
2472D10k77o68K09O59M2m21l74J3N22K69m59k23J62L12L31j50n31k4M17P7k00
$$ 410 133 -535 -326 333 375 -46 -420 -407 115 384 -75 -298 -136 176 507 357 -174 -198 219 296 96
2493I6l4n28N01J85j41l39n9L40O96o47m70K70M40M25l32o67j44M13M86o09j44
$$ 96 62 -466 35 220 79 -260 -319 21 717 70 -400 -130 310 735 403 -264 -408 5 491 -118 -262
2514b62l65N35K71l18k86m29N74P84l35j35j58J09N15J65p84pJ04K46L14m96m29
$$ -262 -627 -92 179 -139 -425 -854 -280 504 169 34 -124 -15 500 665 -119 -126 -22 224 538 42 -387
2535c87J21p0K83k02K7j15N44j46j36r6M54L00p4o06j16L34L71k56n95k24L80
$$ -387 -266 -336 -53 -255 -228 -343 201 55 -81 -177 277 577 503 -103 -219 115 486 230 -365 -589 -209
2556b09N22j77m85k67J31O06L12l6o25k8P83K78n74l19l60O42L68o83k56o6K14
$$ -209 313 136 -349 -616 -485 121 433 397 -228 -256 527 805 231 -88 -448 194 562 -121 -377 -443 -229
2577b29K44q6l58J70K79M66l22l0JM52M8m11l31O2L41l88j05n08J57L77J74k42
$$ -229 15 -71 -429 -259 20 486 164 134 135 587 635 224 -107 -45 296 -92 -197 -705 -548 -171 3 -239
2599b39j14l2N18N34k40o45L41J55M18l09l81l71K06M59l06n81j26L86K25K47
$$ -239 -353 -385 133 667 427 -218 123 278 696 387 6 -365 -159 300 -6 -587 -713 -327 -102 145
2619A45k9l23K36L60J96j35m64J47M6L90m85o24J97K80O9l93M0R9K31J70k68J72
$$ 145 116 -207 29 389 585 450 -14 133 179 569 84 -540 -343 -63 6 -387 -347 -248 -17 153 -115 57
2641E7M73K07n7m14j40k69N98k71l32m08r3L52J92l84l75P17K06M93k20k67K0
$$ 57 530 737 680 266 126 -143 455 184 -148 -556 -649 -297 -105 -489 -864 -147 59 552 332 65 85
2662H5P12%r7o54J19p7mQp11P3M11j55j14Q3J13K15J40j60pL35m4K73l4l69j60
$$ 85 797 797 700 46 165 88 84 92 -619 -546 -135 -290 -404 -321 -208 7 147 -13 -20 315 271 544 510 141 -19
2687a9J50N9k06l42k15M85r5lN8k91K43L06N0k54j91M40J03j20j87j8oJ53l1l88
$$ -19 131 190 -16 -358 -573 -88 -183 -186 -128 -419 -176 130 180 -74 -265 175 278 158 -29 -47 -53 100 69 -319
2711c19J3K60J58l4j6k94K70K72J01r4l95p6L28L99n93j62k68L22P2J39l79k23
$$ -319 -306 -46 112 78 62 -232 38 310 411 317 -78 -154 174 573 -20 -182 -450 -128 -56 83 -296 -519
2733e19K95K86k1K28L1J05J13k31P8j87n7k5j43o1j74l28PL21j8j16K71J47N2
$$ -519 -224 62 41 269 300 405 518 287 365 178 121 96 -47 -108 -282 -610 -603 -282 -300 -416 -145 2 54
2756E4o2K01J84K89q5k67k9j01q9j53m29J05N7j08Q5r5qK42J44K39K58m60J27
$$ 54 -8 193 377 666 581 314 285 184 95 -58 -487 -382 -325 -433 -348 -443 -451 -209 -65 174 432 -28 99
2779I9K70J56j14l18J05j56J74p4l06j45mK10K6M5j68L69m0N9p8k1J18j97k51
$$ 99 369 525 411 93 198 42 216 142 -164 -309 -313 -103 -77 -32 -200 169 129 188 110 89 207 10 -241
2802b41j5K05j26J0Jj5r9K64P1PR9j91L42K62j77k47j41n4Q7J64o62P5K94n2j4
$$ -241 -256 -51 -177 -167 -166 -181 -280 -16 55 62 161 -30 312 574 397 150 9 -45 42 206 -456 -381 -87 -139 -153
2827a53q9L4LL45P7K4k21P2O9P4r3k62L99k13p0k30k39q1L45m6OJ72j21K85L2
$$ -153 -242 -208 -205 140 217 241 20 92 161 235 142 -120 279 66 -4 -234 -473 -554 -209 -255 -249 -77 -198 87 119
2852A19J62n3P3k05L25j24k34l3l02K59k8j53n41N96J75K6k93rP5k7N25n5j20
$$ 119 281 228 301 96 421 297 63 30 -272 -13 -41 -194 -735 -139 36 62 -231 -240 -165 -192 333 278 158
2875A58k70L07L40m38n17L39j2l72M6J16K46l81M04L46k80j03J05M24j00k43J13
$$ 158 -112 195 535 97 -420 -81 -93 -465 -419 -303 -57 -438 -34 312 32 -71 34 458 358 115 228
2896B28k96J81k43P5j24OL6l5j43Q1J12L81j66k16K93J67n0j34k31k3P4p5J72
$$ 228 -68 113 -130 -55 -179 -173 -137 -172 -315 -234 -122 259 93 -123 170 337 287 153 -78 -101 -27 -102 70
2919G0k48j05K01K54k44OJ03l2O2J86P8l36J21q0Q0P8j68m59J78O7k4J3j0J14
$$ 70 -178 -283 -82 172 -72 -66 37 5 67 253 331 -5 116 36 116 194 26 -433 -255 -188 -212 -199 -209 -95
2943i5qJ69q0nM56j65j58qJ39m3r1np1j68j56J77m4j1j94J85K64Q5k8j91Q6K67
$$ -95 -103 66 -14 -19 437 272 114 106 245 202 111 106 35 -133 -289 -112 -156 -167 -361 -176 88 173 145 -46 40 307
2969C07j56Qr4k3K95k92j76J2K62l78O8p6K3K86j35K43j00j04K23N6k6j60J86
$$ 307 151 159 65 42 337 45 -131 -119 143 -235 -167 -243 -220 66 -69 174 74 -30 193 249 223 63 249
2992B49l05Mk9K73m78M5L6K70M6k43J40MK16R0k04j49P3J67M1k32j13J87j87K73
$$ 249 -56 -52 -81 192 -286 -241 -205 65 111 -132 8 12 228 318 114 -35 38 205 246 14 -99 88 -99 174
3016A74m29l75L91K89j08r7l2R8L33J41r2k52N5K66m22J54o7l54K21J7k2j97K99
$$ 174 -255 -630 -239 50 -58 -155 -187 -89 244 385 293 41 96 362 -60 94 27 -327 -106 -89 -111 -308 -9
3039iO1n2N8k4j65M87j33o5j47k7j04M58j13j21m69L10K4P0l40M02l2N3j09k89
$$ -9 52 0 58 34 -131 356 223 158 11 -16 -120 338 225 104 -365 -55 -31 39 -301 101 69 122 13 -276
3063b76n1M26K72k60QO0k20K34j92j45J04%N0J96l09j11K45O4Nk26J17J08M0K3
$$ -276 -327 99 371 111 119 179 -41 193 1 -144 -40 -40 10 206 -103 -214 31 95 100 -126 -9 99 139 162
3087A62j94j67O8M42r1l23j75o6M14l24J6L8Q3J17R3kj3J72p7M2J81j99l65R9
$$ 162 -32 -199 -131 311 220 -103 -278 -344 70 -254 -238 -200 -117 0 93 91 78 250 173 215 396 197 -168 -69
3111f9K02j82K4m82L49N0L1l7K3K25K7j12l04N33M0q3l01Q8m0J33O8k18k34J90
$$ -69 133 -49 -25 -507 -158 -108 -77 -114 -91 134 161 49 -255 278 318 235 -66 22 -18 115 183 -35 -269 -79
3135g9P2P3j33P2j84J30K05P6k10l21L21L60j47P0l41QK30O7k32l08N0J97J37
$$ -79 -7 66 -67 5 -179 -49 156 232 22 -299 22 382 235 305 -36 -28 202 269 37 -271 -221 -24 113
3158A13k63O5J2J91l19J72j47J6R4l0k09M32n7M0J8n7j07J27m4Q5m9k3l55R6J44
$$ 113 -150 -85 -73 118 -201 -29 -176 -160 -66 -96 -305 127 70 110 128 71 -36 91 47 132 83 60 -295 -199 -55
3183e5L04m85m2K36J69r4j64l4L28no2j42l40J95J67j02N5j49q5L72J3K54m93
$$ -55 249 -236 -278 -42 127 33 -131 -165 163 158 96 -46 -386 -191 -24 -126 -71 -220 -305 67 80 334 -159
3206a59L59j16K85r5p75N69K6k47o4L2j21m5K34kj75L64K3k8L10k5j72K45o6l15
$$ -159 200 84 369 274 -501 68 94 -153 -217 -185 -306 -351 -117 -119 -294 70 93 65 375 350 178 423 357 42
3230D2p7l10K03lJ0l0j0L7q4M7j18R6J74L67k22J28j63K36l1k5k89rK6j64K64
$$ 42 -35 -345 -142 -145 -135 -165 -175 -138 -222 -175 -293 -197 -23 344 122 250 87 323 292 267 -22 -31 -5 -169 95
3255I5l27J0J49Rn8M6k52L34K31P0k02l20P5K66o5M9j54J0j64M30j65nk55J69
$$ 95 -232 -222 -73 -64 -122 -76 -328 6 237 307 105 -215 -140 126 61 110 -44 -34 -198 232 67 62 -193 -24
3279b4j6J5r5J91l1J67k52j02J68k85M56q6l92M6O0p4L88k83k50K78M84j48j65
$$ -24 -40 -25 -120 71 40 207 -45 -147 21 -264 192 106 -286 -240 -180 -254 134 -149 -399 -121 363 215 50
3302E0j31K39K22m1m03n4p8J02Qo8R5m03O04k33J73k79j6N52k82Qk2r1L70O1k86
$$ 50 -81 158 380 339 -64 -118 -196 -94 -86 -154 -59 -462 142 -91 82 -197 -213 339 57 65 43 -48 322 383 97
3327I7k16j00K96L4j85l35J61k3J95kM9M33k52J89k09j14Q4J15K6j9j02l54j2
$$ 97 -119 -219 77 111 -74 -409 -248 -271 -76 -78 -29 404 152 341 132 18 102 217 243 224 122 -232 -244
3350b44K82k97m5n9J33M44l8j78QJ0J90J38l25j09R3K23j58l00K01q8j0LL0K09
$$ -244 38 -259 -304 -363 -230 214 176 -2 6 16 206 344 19 -90 3 226 68 -232 -31 -119 -129 -126 -96 113
3374A13k78J2O33n48K93n9k67K49J15j77j95N6q4M4K2j78Q3o1P8K42j68K11K57
$$ 113 -165 -153 480 -68 225 166 -101 148 263 86 -109 -53 -137 -93 -71 -249 -166 -227 -149 93 -75 136 393
3397C93k86K1m2k2J57k44k38P5P6mJ32m86L00kP5L22O1M1k70J98R3l54j1K3J04
$$ 393 107 128 86 64 221 -23 -261 -186 -110 -114 18 -468 -168 -170 -95 227 288 329 59 257 350 -4 -15 8 112
3422A12k07O9k44q8K76j38P7j31N4J55L5M16k84L0R8O2j34M0l27J22K20k98m2
$$ 112 -95 -26 -270 -358 -82 -220 -143 -274 -220 -65 -30 386 102 132 230 292 158 198 -129 -7 213 -85 -127
3445a27m85M89l3k15j8K98J17K09k08J53O9M4q1l81L82j28L5j56k01orl0K92j18
$$ -127 -612 -123 -156 -371 -389 -91 26 235 27 180 249 293 212 -169 213 85 120 -36 -237 -243 -252 -282 10 -108
3469a08k6L4j58L83p6K41j69j81K2l5Pj14M3L9N2J29n18L07J13N9j41P8n8K74
$$ -108 -134 -100 -258 125 49 290 121 -60 -38 -73 -66 -180 -137 -98 -46 83 -435 -128 -15 44 -97 -19 -77 197
3493A97JR5k23p6K21n2l88r6K5j27M97k59j44L99k95L60n1m5M6P3L77l65j10n7
$$ 197 198 293 70 -6 215 163 -225 -321 -296 -423 74 -185 -329 70 -225 135 84 39 85 158 535 170 60 3
3517Cj03J59q9j72j96K28K00l64L08l01M76J72k72K51o7q7o5R4o0k22n5J54j73
$$ 3 -100 59 -30 -202 -398 -170 30 -334 -26 -327 149 321 49 300 233 146 81 175 115 -107 -162 -8 -181
3540a81j96J38Q5J3J40k78N4j30M52O5N6J35l05K31j23j29J49J3o4k28mq4M6Q9
$$ -181 -377 -239 -154 -141 -1 -279 -225 -355 97 162 218 353 48 279 156 27 176 189 125 -103 -107 -191 -145 -56
3564e6O9J19j56n9M06j81M0p2K4J07j0j41j00k79J46K5j31N5L7K31K2R8J96k54
$$ -56 13 132 -24 -83 323 142 182 110 134 241 231 90 -10 -289 -143 -118 -249 -194 -157 74 96 194 390 136
3588A36n6J06k8L7j71j64P0N9k58JK2K34J03k66QL6K73p7J24j37J42M7M1l05j09
$$ 136 80 186 158 195 24 -140 -70 -11 -269 -268 -246 -12 91 -175 -167 -131 142 65 189 52 194 241 282 -23 -132
3613a32K76l75P3m8J42K7q8O8J91k24m2Q4M01j02k19M8k0J24l12K55j97J84P6
$$ -132 144 -231 -158 -206 -64 -37 -125 -57 134 -90 -132 -48 353 251 32 80 60 184 -128 127 -70 114 190
3636A90k08r2j53M57q0K5Q0k17j79K46O3j1r0K8j87L22nk91J58j06K47o6n52K83
$$ 190 -18 -110 -263 194 114 139 219 2 -177 69 132 121 31 59 -128 194 189 -102 56 -50 197 131 -421 -138
3660a38pJ04j7M2K56j82nj01J8P8J35l65j41K30O7J20j85J34k97J46P3J26J49
$$ -138 -145 -41 -58 -16 240 58 53 -48 -30 48 183 -182 -323 -93 -26 94 -91 43 -254 -108 -35 91 240
3683B40q1p4o9K35j19J09m36K3J70J68k26k25O0J67R2l10J4K91J61K6J38l91K43
$$ 240 159 85 16 251 132 241 -195 -172 -2 166 -60 -285 -225 -58 34 -276 -262 29 190 216 354 -37 206
3706B06j86J72p0l25mJ94Nm1k29K52P0n4p5O0J55ML38k36n23N82j9k00k62k09
$$ 206 20 192 122 -203 -207 -13 -8 -49 -278 -26 44 -10 -85 -25 130 134 472 236 -287 295 276 76 -186 -395
3730c95K07M19l21LJ00l11J76J55l8l1q8O5L73j89k86J53n3O0j2J33n12L12J02
$$ -395 -188 231 -90 -87 13 -298 -122 33 -5 -36 -124 -59 314 125 -161 -8 -61 -1 -13 120 -392 -80 22
3753B2j9j96J29J59K17L4j52p9L1Q7k73j66j98N73o2k37J77o4J60o5K9J2j45l5
$$ 22 3 -193 -64 95 312 346 194 115 146 233 -40 -206 -404 169 107 -130 47 -17 143 78 107 119 -26 -61
3777f1L56o5k63J77k2k61K95j24j38qq9J02J14m5RM14k05j39l7J19J00n8k24k01
$$ -61 295 230 -33 144 122 -139 156 32 -106 -114 -203 -101 13 -32 -23 391 186 47 10 129 229 171 -53 -254
3801b54N2J8j12K57j84L19j48k4L00k86Q3O3n0q9j66K99k09J01J23p3p8P9K00
$$ -254 -202 -184 -296 -39 -223 96 -52 -76 224 -62 21 84 34 -55 -221 78 -131 -30 93 20 -58 21 221
3824B21n17K99p5P9J1m2K2r6J79J29k12j5K06j78j01J31K80m50o7K55k13K0r3
$$ 221 -296 3 -72 7 18 -24 -2 -98 81 210 -2 -17 189 11 -90 41 321 -129 -196 59 -154 -134 -227
3847b27K33j40l6J86P5N9l6k21J06J1r1J83p0q6r3R9k1P3J29j06o0M9P9n5K75
$$ -227 6 -134 -170 16 91 150 114 -107 -1 10 -81 102 32 -54 -147 -48 -69 4 133 27 -33 16 95 40 315
3872C15k99j35K85j74M2k66J97m0mj64J19J30j19J99j74R1j1O8o3O4j31Q8O4j55
$$ 315 16 -119 166 -8 34 -232 -35 -75 -79 -243 -124 6 -113 86 -88 3 -8 60 -3 61 -70 18 82 -73
3896g3J33j12K7J8o7O2o2n4l1M71k32QK9J06k44k0J69m09K45j22J40j69K16k87
$$ -73 60 -52 -25 -7 -74 -12 -74 -128 -159 312 80 88 117 223 -21 -41 128 -281 -36 -158 -18 -187 29 -258
3920b58J63OJ1R5Nq6M8N9K55p1J48k57j42o0j03j9K27k32K80j54N08m07k55L79
$$ -258 -95 -89 -78 17 22 -64 -16 43 298 227 375 118 -24 -84 -187 -206 21 -211 69 -85 423 16 -239 140
3944A40l01L61l09P8J45k19j37K32o3q1j3J94p8J81Nk23J38k1j39J68l8l6LJ60
$$ 140 -161 200 -109 -31 114 -105 -242 -10 -73 -154 -167 27 -51 130 135 -88 50 29 -110 58 20 -16 -13 147
3968A47o2j82L4K15k54q7J80j04R8p1J38j7j91J73L16n38J34j30J16j62K21J27
$$ 147 85 -97 -63 152 -102 -189 -9 -113 -15 -86 52 35 -156 17 333 -205 -71 -201 -85 -247 -26 101
3990A01l08J03M95m13j25j29L20K20j90k2j01j28L06J74k88Jo4m8M32k85k71K32
$$ 101 -207 -104 391 -22 -147 -276 44 264 74 52 -49 -177 129 303 15 16 -48 -96 336 51 -220 12
4012A2M9K3k23K6J6k08M94mj96m3K24K4j33q3j36M9j39K40j23l5RK68j76qj09
$$ 12 61 84 -139 -113 -97 -305 189 185 -11 -54 170 194 61 -22 -158 -109 -248 -8 -131 -166 -157 111 -65 -73 -182
4037a82L52j59K51k59j52L05j51P9m57P2J35J0J49l33J44Q3M30k08j24M4K01n6
$$ -182 170 11 262 3 -149 156 5 84 -373 -301 -166 -156 -7 -340 -196 -113 317 109 -15 29 230 174
4059A74N5k93p0J50OK12j99j55j90L70K7l29j01N30k83J99K8j66N8N7j85L23m24
$$ 174 229 -64 -134 16 22 234 35 -120 -310 60 87 -242 -343 187 -96 103 131 -35 23 80 -105 218 -206
4082b06J40K66j87j64N7j20L31n5j0n7K55j01l0J5j98O7Q9P9p8k19J87j35j6M3
$$ -206 -66 200 13 -151 -94 -214 117 62 52 -5 250 149 119 134 -64 3 92 171 93 -126 61 -74 -90 -47
4106d7r9l24M89J93k15p3k00L33J89j93j32k0K99J80k81j10k99L4M54k41j19J18
$$ -47 -146 -470 19 212 -3 -76 -276 57 246 53 -79 -99 200 380 99 -11 -310 -276 178 -63 -182 -64
4128f4l0K37j24J18l60J02L24j89L5l12K22J40J33q1n18K62J67K39m05j43J08
$$ -64 -94 143 19 137 -223 -121 203 14 49 -263 -41 99 232 151 -367 -105 62 301 -104 -247 -139
4149a39R1J06n0m9J71J84j84k34J62k27L03pr5p2j02Q8N1n1k6k4L31j5j05p3O2
$$ -139 -48 58 8 -41 130 314 130 -104 58 -169 134 127 32 -40 -142 -54 -3 -54 -80 -104 227 212 107 34 96
4174I6Q0J15r1m70Q3K78J07l74j2j10PM70j35k9J81M6K23n8m36m1J21M0Mn1j60
$$ 96 176 291 200 -270 -187 91 198 -176 -188 -298 -291 179 44 15 196 242 465 407 -29 -70 51 91 95 44 -116
4199a16J91J28j12k65n1J58JJ31j32q9R6J82Q1m64K10J13l1J04m27Q0J28o6K60
$$ -116 75 203 91 -174 -225 -67 -66 65 -67 -156 -60 122 203 -261 -51 62 31 135 -292 -212 -84 -150 110
4222A10l15J17J4O9K70l70M4J12J92o4qk80J6J84j64N9k62L1L96J01l13j2J73
$$ 110 -205 -88 -74 -5 265 -105 -61 51 243 179 171 -109 -93 91 -73 -14 -276 -245 151 252 -61 -73 100
4245A00j29J35j2K33j10k12P5lq3k10K51P5j06l10Q6M19j75j8j02m0J10K34l0
$$ 100 -29 106 94 327 217 5 80 77 -6 -216 35 110 4 -306 -220 199 24 6 -96 -136 -26 208 178
4268A78j41j29Q4J36m3k14q6K30K8q7M9l32L01p2J81k00K9K19j47L28k40M3j49
$$ 178 37 -92 -8 128 85 -129 -215 15 43 -44 5 -327 -26 -98 83 -117 -88 131 -16 312 72 115 -34
4291c4J81j49j39m4N4O4O3j6o4O9K85j97j59J2P1J05j08O8j08P9K06j33J07n38
$$ -34 147 -2 -141 -185 -131 -67 -4 -20 -84 -15 270 73 -86 -74 -3 102 -6 62 -46 33 239 106 213 -325
4315c25J81Q4n6K2k5R3NL19j33j55q7R2L9Ml40J44M19l30O8j33O3J2K86o8q3k3
$$ -325 -144 -60 -116 -94 -119 -26 -21 298 165 10 -77 15 54 58 -282 -138 281 -49 19 -114 -51 -39 247 179 96 73
4341G3k38K41l3MQ8j58j42R5rJ93j0n4k57J41l3L27j15l4q1k76N12q1j57J8j65
$$ 73 -165 76 43 47 135 -23 -165 -70 -79 114 104 50 -207 -66 -99 228 113 79 -2 -278 234 153 -4 14 -151
4366a51j37J43Q7OQ9N6j81M2K4L9k2L84l93r0J10P3Q7j45M0l20M62j70k44K11
$$ -151 -288 -145 -58 -52 37 93 -88 -46 -22 17 -5 379 -14 -104 6 79 166 21 61 -259 203 33 -211 0
4390@O2j74p7R1K35K4m5J12k56J22n4j95K00J20j61mJ15Mj14j21J63K05k41Rl3
$$ 0 62 -112 -189 -98 137 161 116 228 -28 94 40 -155 45 165 4 0 115 119 5 -116 47 252 11 20 -13
4415a3oK24J86j46k69N0r1J73k29J86j17L8M5k40M0M9O8J17kj09O3QJ22m4j32
$$ -13 -19 205 391 245 -24 26 -65 108 -121 65 -52 -14 31 -209 -169 -120 -52 65 63 -46 17 25 147 103 -29
4440b9K0L69k05j76K8j53J86q9lJ4J78j7j89N1J32j90J36QQ9l01J2nK92j9m28
$$ -29 -9 360 155 -21 7 -146 40 -49 -52 -38 140 123 -66 -15 117 -73 63 71 160 -141 -129 -134 158 139 -289
4465b89K12R0j47l4J5L05n3N7r4q6R9L8K05j98l81o5K29J26jj59Q1j66J56J03
$$ -289 -77 13 -134 -168 -153 152 99 156 62 -24 75 113 318 120 -261 -326 -97 29 28 -131 -50 -216 -60 43
4489D3j60J88J53o3k4J21o15L97J92k54j55J49LR5Nj21j28L48j07rk44L20o2j25
$$ 43 -117 71 224 161 137 258 -357 40 232 -22 -177 -28 -25 70 75 -46 -174 174 67 58 -186 134 72 -53
4513e3J66m43L21j36M7J76o6j14K29J7K00l67O4Pj41K49J7l00K20mj93P7k55M88
$$ -53 113 -330 -9 -145 -98 78 12 -102 127 144 344 -23 41 48 -93 156 173 -127 93 89 -104 -27 -282 206
4537B06K0p4j09n3k01J98lQ4j91M9K54p8rk87L49J09j78k5j54m3L46l20N4L1n7
$$ 206 226 152 43 -10 -211 -13 -16 68 -123 -74 180 102 93 -194 155 264 86 61 -93 -136 210 -110 -56 -25 -82
4562h2R5M8j51Q7o4J86k73J66Lo8N2Q4r2O0p7O8Q2p1n7k16J05J22l7Pn5P3j00
$$ -82 13 61 -90 -3 -67 119 -154 12 15 -53 -1 83 -9 51 -26 42 124 53 -4 -220 -115 7 -30 -23 -78 -5 -105
4589a05J83k07R2M0r5K38m34J67OQ3j11Q1p7k9M29m43K02krK48j55J00m16Q3K34
$$ -105 78 -129 -37 3 -92 146 -288 -121 -115 -32 -143 -62 -139 -168 261 -182 20 18 9 257 102 202 -214 -131 103
4614A03j13J67j72L3R1J73k14m4jq7K00j54m5K31J9K2k85Q3J12N9J1j23k45P8
$$ 103 -10 157 -15 18 109 282 68 24 23 -64 136 -18 -63 168 187 209 -76 7 119 178 189 66 -179 -101
4638a01J10K7k36J33J32N4kj00J8N5j00q5K00j73j8M1m6n8Q0R6m8M5k2j34OK85
$$ -101 9 36 -200 -67 65 119 117 17 35 90 -10 -95 105 -68 -86 -45 -91 -149 -69 27 -21 24 2 -132 -126 159
4664A59j82n8Qj02K80j53J46l2M1l22L50J20l13j78M09kj23J32j17j79J83J53
$$ 159 -23 -81 -73 -175 105 -48 98 66 107 -215 135 255 -58 -236 173 171 48 180 63 -116 67 220
4686B20k92J4J08J30k30J87k46K65lj64k0M5J5M5m5k05J73Nn2J15L3j35P4J10
$$ 220 -72 -58 50 180 -50 137 -109 156 153 -11 -31 14 29 74 29 -176 -3 2 -50 65 98 -37 37 147
4710A47J54m06j62J24J61Q0r4q1Q7k30N74l16k79P9L95j47l17J37J76l9k44L56
$$ 147 301 -105 -267 -143 18 98 4 -77 10 -220 354 38 -241 -162 233 86 -231 -94 82 43 -201 155
4732A55l36K08P5K3l2j51r4Q1K86r8l82L00Q7j50L9l71M95L9k17K85l26J09j03
$$ 155 -181 27 102 125 93 -58 -152 -71 215 117 -265 35 122 -28 11 -360 135 174 -43 242 -84 25 -78
4755g8JJ59m3p9k8j84J83k03K68n0L02l28M2Mk1k03M05k58K04k00L24m01J90j25
$$ -78 -77 82 39 -40 -68 -252 -69 -272 -4 -54 248 -80 -38 -34 -55 -258 147 -111 93 -107 217 -184 6 -119
4779a19N5J39J12j54p3o3P7K00j67j24J42o7Q0K04r7J41j03K7k56P3J2j30N2J77
$$ -119 -64 75 187 33 -40 -103 -26 174 7 -117 25 -42 38 242 145 286 183 210 -46 27 39 -91 -39 138
4803A38%k66J34om1p7J27Q6N0ql31kJ17l1k6j29K87J89l69L40k34J31r9j97P3
$$ 138 138 -128 6 0 -41 -118 9 95 145 137 -194 -196 -79 -110 -136 -265 22 211 -158 182 -52 79 -20 -217 -144
4828a44J58J10k01K45k25J61j16J62O9j22k93Q6RK72l83Q5N9K94p6j07k7J13l11
$$ -144 14 124 -77 168 -57 104 -12 150 219 97 -196 -110 -101 171 -212 -127 -68 226 150 43 16 129 -182
4851a82L03j03nk0q3O7N1l7qj12o7K2K20J45k32Q9k17M6K5P2J14j38J82j03q7
$$ -182 121 18 13 -7 -90 -23 28 -9 -17 -129 -196 -174 46 191 -41 48 -169 -123 -98 -26 88 -50 132 29 -58
4876e8L23l22k1KJ93J90k13p2J7k4J35k36O2J7J11k91K85Pl06R1J10Mp0L64l31
$$ -58 265 -57 -78 -76 117 307 94 22 39 15 150 -86 -24 -7 104 -187 98 105 -201 -110 0 4 -66 298 -33
4901c3j13J82j39J12J11k32J51J50j49k35K46m6m0m5J80k13j90J2M95j91j08K27
$$ -33 -146 36 -103 9 120 -112 39 189 40 -195 51 5 -35 -80 100 -113 -303 -291 204 13 -95 132
4923A32J17l15K71j17n8K36m33J69J68j81k21K56k62J6J0K16J25j23O5l9J67l67
$$ 132 249 -66 205 88 30 266 -167 2 170 -11 -232 24 -238 -222 -212 4 129 6 71 32 199 -168
4945a68N1J16j27N1p8Q1j62M50j25K83m76J10P1K09j75j34m2J15p7q8R8j0M0n0
$$ -168 -117 -1 -128 -77 -155 -74 -236 214 89 372 -104 6 77 286 111 -23 -65 50 -27 -115 -17 -27 13 -37
4969c7l8J5o6R4J0q8L14k53J0O1L3r7J23j77J39k09J56pj87J86q3k4J95j66L28
$$ -37 -75 -60 -126 -32 -22 -110 204 -49 -39 22 55 -42 81 -96 43 -166 -10 -17 -204 -18 -101 -125 70 -96 232
4994B32j44k43Q8N8q8J01r8M8j37qK75p3O3j26j97J12J57O7p4j5K0oQ4k01m1K85
$$ 232 88 -155 -67 -9 -97 4 -94 -46 -183 -191 84 11 74 -52 -249 -137 20 87 13 -2 18 12 96 -105 -146 139
5020A39k27J48J11k43K13j36l1j56L03j68K8J20L0j16p0J27r0P7R7j71J08Q4k30
$$ 139 -88 60 171 -72 141 5 -26 -182 121 -47 -19 101 131 15 -55 72 -18 59 156 -15 93 177 -53
5043e3N9k04K53J65l37j22N3L37l40J07L5qN8J00j74N8K18j61R8k02K50k49J60
$$ -53 6 -198 55 220 -117 -239 -186 151 -189 -82 -47 -55 3 103 -71 -13 205 44 142 -60 190 -59 101
5066A01k22K06j06J13k59O8J97l18P01m46m6J43k82L0K46k62J20J04j89J05J09
$$ 101 -121 85 -21 92 -167 -99 98 -220 481 35 -11 132 -150 -120 126 -136 -16 88 -101 4 113
5087A13k34p6K28J54j41l9J16j16K78m22K05j65k02N7J86k9p0j07J12K14K36k58
$$ 113 -121 -197 31 185 44 5 121 5 283 -139 66 -99 -301 -244 -58 -87 -157 -264 -152 62 298 40
5109D0j93P5J81R4m8Jm5Q7j70j81J13pj19J78k16K34J18m06J22N1M0k8L81k89
$$ 40 -153 -78 103 197 149 150 105 192 22 -159 -46 -53 -172 6 -210 24 142 -264 -142 -91 -51 -79 302 13
5133A3L7l38J53J18J36j35o2n8j03M35m57J09l8K19pJ8j69J29L6j7k0Q9j54N8
$$ 13 50 -288 -135 -17 119 -16 -78 -136 -239 196 -261 -152 -190 29 22 40 -129 0 36 19 -1 88 -66 -8
5157hJ81P7l64K20m3L6J28k96O1r0J09R0M9j88M4J16l0j35m0O7k5K16l35K8L5
$$ -8 173 250 -114 106 63 99 227 -69 -8 -98 11 101 150 -38 6 122 92 -43 -83 -16 -41 175 -160 -132 -97
5182i7j84K37o4M5j16m5O4L28r3l01L80r2L1j21M6o3J64l04J68Lj26K14m8R4k89
$$ -97 -281 -44 -108 -63 -179 -224 -160 168 75 -226 154 62 93 -28 18 -45 119 -185 -17 -14 -140 74 26 120 -169
5207a69J75m4L2R6j39Q2k4J02j89J86l6O0j24m1mj02K23l19M40Ql24J49m6nm6
$$ -169 6 -38 -6 90 -49 33 9 111 -78 108 72 132 8 -33 -37 -139 84 -235 205 213 -111 38 -8 -13 -59
5232e9J71N5l35K15K3l26K14R3j05M3q8K5j55R6K51j39M9j36L46j34k88K84k9
$$ -59 112 167 -168 47 70 -256 -42 51 -54 -11 -99 -74 -229 -133 118 -21 28 -108 238 104 -184 100 71
5255G1J7K31m30J47n0J05j27r0n6K74O1q9q8j41K2L92j23j22J00l13J74l00K05
$$ 71 88 319 -111 36 -14 91 -36 -126 -182 92 153 64 -24 -165 -143 249 126 4 104 -209 -35 -335 -130
5278a30L33m60M55l23Q5J00o8J48k2k85K67k79K42K48l73j93K43J56l02O4l7N7
$$ -130 203 -257 198 -125 -40 60 -8 140 118 -167 100 -179 63 311 -62 -255 -12 144 -158 -94 -131 -74
5300g4L33m63K84m7j6pj92L95m37J25J27J07j13O9j51%J24q1Q7j58M09l70j5n7
$$ -74 259 -204 80 33 17 10 -182 213 -224 -99 28 135 22 91 -60 -60 64 -17 70 -88 321 -49 -64 -121
5324a21J18P0q7N1J23j2q2j7P3j9j09J89j51O5j96Q4Q1m3j68M4K72n8MO9k40J15
$$ -121 -3 67 -20 31 154 142 60 43 116 97 -12 177 26 91 -105 -21 60 17 -151 -107 165 107 111 180 -60 55
5350E5r0Q9j84O8m6j00L61q0L8j36K0K01m03K8K83j08R3q8Q2r4o4m0P4r6O0o5
$$ 55 -35 54 -130 -62 -108 -208 153 73 111 -25 -5 196 -207 -179 104 -4 89 1 83 -11 -75 -115 -41 -137 -77 -142
5376a42J88k01Q2J7n4L01n3R7m85l3K88J34qk01q0Q9jJ78p5k08m6O3j52L15j46
$$ -142 46 -155 -73 -56 -110 191 138 235 -250 -283 5 139 131 -70 -150 -61 -62 116 41 -167 -213 -150 -302 13 -133
5401a33J41J44k39o8j6J86j1j23j04P4O3K36q7k05l7L41q8k07J32r7J97P1m3j92
$$ -133 8 152 -87 -155 -171 15 4 -119 -223 -149 -86 150 63 -142 -179 162 74 -133 -1 -98 99 170 127 -65
5425f5M5K8j12k0p2K03P6N0n6j28m2R8L97l57j32R4p1J3o0J71j69j03n1L04k1
$$ -65 -20 8 -104 -124 -196 7 83 133 77 -51 -93 5 402 45 -87 7 -64 -51 -111 60 -109 -212 -263 41 20
5450B0lr9j44K05k13K40o9K06j14J3k79M17k86J31j70Q2j90L41j45L5Q3j38Q7
$$ 20 17 -82 -226 -21 -234 6 -63 143 29 42 -237 180 -106 25 -145 -63 -253 88 -57 -22 61 -77 10
5473A0J71k10J36J11j55K3Q3n02K37N5N1j29O5O8r5J25o5J80l92K81R2OK1j84
$$ 10 181 -29 107 218 63 86 169 -333 -96 -41 10 -119 -54 14 -81 44 -21 159 -233 48 140 146 167 -17
5497a7j70O7K72l53J49K4k03J91J00l25P0K14J37l63M2K27r0j3J11lk88J47K0
$$ -17 -187 -120 152 -201 -52 -28 -231 -40 60 -265 -195 19 156 -207 -165 62 -28 -41 70 67 -221 -74 -54
5520e4Q0l8k20L59J78l53L3J96p6m4l36Q9M6L40o3k39L5k1O7j63J04K78l92K42
$$ -54 26 -12 -232 127 305 -48 -15 181 105 61 -275 -186 -140 200 137 -102 -67 -88 -21 -184 -80 198 -194 48
5544D8K6Q0k85K0K56k04m1M2j57J04K5K99j15k72P2L13j8j53O1k31P1n4J89K9
$$ 48 74 154 -131 -111 145 -59 -100 -58 -215 -111 -86 213 98 -174 -102 211 193 40 101 -130 -59 -113 76 105
5568A05L4k98K7K21J21k57K18j5j04j17J39k6oJ1O3j46M0j94K69n2n9j37L50j20
$$ 105 139 -159 -132 89 210 -47 171 156 52 -65 74 48 42 53 116 -30 10 -184 85 33 -26 -163 187 67
5592F7q1k2J9R8r9r6J77o1K15j66k50J3J11J77j14O1J8m6m7J8Q6j09K88j03k29
$$ 67 -14 -36 -17 81 -18 -114 63 2 217 51 -199 -186 -75 102 -12 49 67 21 -26 -8 78 -31 257 154 -75
5617g5L3k75J70L6J94n4J32j17M2j24m4J32j1l9j45L26k55Q7j27J48Nm3j87m0
$$ -75 -42 -317 -147 -111 83 29 161 44 86 -38 -82 50 39 0 -145 181 -74 13 -114 34 39 -4 -191 -231
5641b31L02j05Q5j22L37l16J22L6k48J69p4o1PK3J35J3J10k03p7J82j77N3j12
$$ -231 71 -34 51 -71 266 -50 72 108 -140 29 -45 -106 -99 -76 59 72 182 -21 -98 84 -93 -40 -152
5664a52Q5J68j97j84K33R4j99J31p9J71Jj49K26J10k64j30P5O0J96j0m14K98r2
$$ -152 -67 101 -96 -280 -47 47 -152 -21 -100 71 72 -77 149 259 -5 -135 -60 0 196 186 -228 70 -22
5687b2j7J77m20J68J17O6j70K84k84M3P9n5r7M9J93j91J42K8j63J92p9j37J80
$$ -22 -39 138 -282 -114 3 69 -101 183 -101 -58 21 -34 -131 -82 111 -80 62 90 -73 119 40 -97 83
5710H3k14K17m4J50j09k24J3L04j35j69J65n8N8J17j75q8J14MK06l8r6n9q1J51
$$ 83 -131 86 42 192 83 -141 -128 176 41 -128 37 -21 37 154 -21 -109 5 9 215 177 81 22 -59 92
5734I2j76J15o8K63l50J4K44n7j51J46r4j34L07k77K62k86M07n10J85J7P8n1k34
$$ 92 -84 31 -37 226 -124 -110 134 77 -74 72 -22 -156 151 -126 136 -150 257 -253 -68 -51 27 -24 -258
5757b58K67R7j44K0Jo9J01l01J99J30J9J44m39K65j31N0J18q3M9j60N5q6M62m24
$$ -258 9 106 -38 -18 -17 -86 15 -286 -87 43 62 206 -233 32 -99 -49 69 -14 35 -125 -70 -156 306 -118
5781a18p1J35j4j9K4L05m43K06K14m3k04l7QJ67l0j48K43j65m2J54l19K66oJ39
$$ -118 -189 -54 -68 -87 -63 242 -201 5 219 176 -28 -65 -57 110 80 -68 175 10 -32 122 -197 69 63 202
5805B02k28N0J45j94L37l94N3n1o6r5J21j17M08j62j01J33k2J8j34J04j63L47
$$ 202 -26 24 169 -25 312 -82 -29 -80 -146 -241 -120 -237 171 9 -92 41 19 37 -97 7 -156 191
5827A91l02k29K43J57k56J88m7K57r7j58n6J90o8j52l1K1K29j34oJ7j51J53j27
$$ 191 -111 -340 -97 60 -196 -8 -55 202 105 -53 -109 81 13 -139 -170 -149 80 -54 -60 -43 -194 -41 -168
5850a68L29rj19m3k41K78M7P4j87j62J57J99J7j08N2j16L1j15K50j78J6k7pJ81
$$ -168 161 152 33 -10 -251 27 74 148 -39 -201 -44 155 172 64 116 0 31 -84 166 -12 4 -23 -30 151
5874A51n7L6j08o3J09j63J30j92k9nK30k25L0J57k0j18J04J47j05k33K65J19l01
$$ 151 94 130 22 -41 68 -95 35 -157 -186 -191 39 -186 -156 1 -19 -137 -33 114 9 -224 41 160 -141
5897a41K37l21L05J20k72N4j28M3N6J96j51O6k33L7K73j60N2k00K97k87L12j37
$$ -141 96 -225 80 200 -72 -18 -146 -103 -47 149 -2 64 -169 -132 141 -19 33 -167 130 -157 155 18
$$ [...]
8191A07
##END NTUPLES=NMR FID
##END=
