##TITLE=1H_PR167_rmk
 D2O, 8 sc, 
 7.2.2019
##JCAMPDX= 6.0         $$ Bruker NMR JCAMP-DX V2.0
##DATA TYPE= NMR FID
##DATA CLASS= NTUPLES
##ORIGIN= UXNMR, Bruker Analytische Messtechnik GmbH
##OWNER= root
$$ XWIN-NMR		Version 3.5
$$ Thu Feb  7 14:43:17 2019 Russian Standard Time (UT+4h)  she@DPX200
##.OBSERVE FREQUENCY= 200.1313
##.OBSERVE NUCLEUS= ^1H
##.DELAY= (6, 6)
##.ACQUISITION MODE= SIMULTANEOUS
##.ACQUISITION SCHEME= undefined
##.AVERAGES= 8
##.DIGITISER RES= 18
##SPECTROMETER/DATA SYSTEM= spect
##.PULSE SEQUENCE= zg30
##.SOLVENT NAME= D2O
##.SHIFT REFERENCE= (INTERNAL, D2O, 0, 15.7039)
##AUDIT TRAIL= $$ (NUMBER, WHEN, WHO, WHERE, WHAT)
$$ ##TITLE= Audit trail, XWIN-NMR		Version 3.5
$$ ##JCAMPDX= 5.01
$$ ##ORIGIN= Bruker BioSpin GmbH
$$ ##OWNER= she
$$ F:/spectra/data/she/nmr/H-F/1/audita.txt
$$ ##AUDIT TRAIL=  $$ (NUMBER, WHEN, WHO, WHERE, WHAT)
(   1,<2019-02-07 14:41:56.10 +0400>,<she>,<DPX200>,
      <created by zg, POWCHK disabled, PULCHK disabled
       configuration hash MD5:
       00 E9 B6 7A A2 85 ED C7 34 08 36 98 17 FE 4E 26
       data hash MD5: 16K
       56 50 AC 79 55 CF 1E 16 35 86 ED D3 A3 65 1D A2>)
$$ ##END=
$$ 
$$ hash MD5
$$ 8F A0 0F E2 39 D7 14 22 DD 40 01 22 79 7C 72 59
##$RELAX= 
##$RELAX= 
##$RELAX= 
##$RELAX= 
##$RELAX= 
##$RELAX= 
$$ Bruker specific parameters
$$ --------------------------
##$DU= <F:/spectra>
##$EXPNO= 1
##$NAME= <H-F>
##$PROCNO= 1
##$TYPE= <nmr>
##$USER= <she>
##$AMP= (0..31)
100 100 100 100 100 100 100 100 100 100 100 100 100 100 100 100 100 100 
100 100 100 100 100 100 100 100 100 100 100 100 100 100 
##$AQSEQ= 0
##$AQ_mod= 1
##$AUNM= <au_zg>
##$AUTOPOS= <>
##$BF1= 200.13
##$BF2= 200.13
##$BF3= 200.13
##$BF4= 200.13
##$BF5= 200.13
##$BF6= 200.13
##$BF7= 200.13
##$BF8= 200.13
##$BYTORDA= 1
##$CFDGTYP= 0
##$CFRGTYP= 5
##$CHEMSTR= <none>
##$CNST= (0..31)
1 1 145 1 1 1 1 1 1 1 1 1 1 1 1 1 1 1 1 1 1 1 1 1 1 1 1 1 1 1 1 1 
##$CPDPRG= <>
##$CPDPRG1= <>
##$CPDPRG2= <>
##$CPDPRG3= <>
##$CPDPRG4= <mlev>
##$CPDPRG5= <mlev>
##$CPDPRG6= <mlev>
##$CPDPRG7= <mlev>
##$CPDPRG8= <mlev>
##$CPDPRGB= <>
##$CPDPRGT= <>
##$D= (0..31)
0 1.2 0 0 0 0 0 0 0 0 0 0.03 0 0 0 0 0 0 0 0 0 0 0 0 0 0 0 0 0 0 0 0 
##$DATE= 1549536115
##$DBL= (0..7)
120 120 120 120 120 120 120 120 
##$DBP= (0..7)
150 150 150 150 150 150 150 150 
##$DBP07= 0
##$DBPNAM0= <>
##$DBPNAM1= <>
##$DBPNAM2= <>
##$DBPNAM3= <>
##$DBPNAM4= <>
##$DBPNAM5= <>
##$DBPNAM6= <>
##$DBPNAM7= <>
##$DBPOAL= (0..7)
0.5 0.5 0.5 0.5 0.5 0.5 0.5 0.5 
##$DBPOFFS= (0..7)
0 0 0 0 0 0 0 0 
##$DE= 6
##$DECBNUC= <off>
##$DECIM= 32
##$DECNUC= <off>
##$DECSTAT= 4
##$DIGMOD= 1
##$DIGTYP= 9
##$DL= (0..7)
0 120 120 120 120 120 120 120 
##$DP= (0..7)
150 150 150 150 150 150 150 150 
##$DP07= 0
##$DPNAME0= <>
##$DPNAME1= <>
##$DPNAME2= <>
##$DPNAME3= <>
##$DPNAME4= <>
##$DPNAME5= <>
##$DPNAME6= <>
##$DPNAME7= <>
##$DPOAL= (0..7)
0.5 0.5 0.5 0.5 0.5 0.5 0.5 0.5 
##$DPOFFS= (0..7)
0 0 0 0 0 0 0 0 
##$DQDMODE= 0
##$DR= 18
##$DS= 0
##$DSLIST= <SSSSSSSSSSSSSSS>
##$DSPFIRM= 0
$$ [...]
##$SUBNAM2= <"">
##$SUBNAM3= <"">
##$SUBNAM4= <"">
##$SUBNAM5= <"">
##$SUBNAM6= <"">
##$SUBNAM7= <"">
##$SUBNAM8= <"">
##$SUBNAM9= <"">
##$SW= 20.0189088683792
##$SWIBOX= (0..15)
0 0 2 0 0 0 0 0 0 0 0 0 0 0 0 0 
##$SW_h= 4006.41025641026
##$TD= 16384
##$TD0= 1
##$TE= 0
##$TE2= 300
##$TE3= 300
##$TEG= 300
##$TL= (0..7)
0 120 120 120 120 120 120 120 
##$TP= (0..7)
150 150 150 150 150 150 150 150 
##$TP07= 0
##$TPNAME0= <>
##$TPNAME1= <>
##$TPNAME2= <>
##$TPNAME3= <>
##$TPNAME4= <>
##$TPNAME5= <>
##$TPNAME6= <>
##$TPNAME7= <>
##$TPOAL= (0..7)
0.5 0.5 0.5 0.5 0.5 0.5 0.5 0.5 
##$TPOFFS= (0..7)
0 0 0 0 0 0 0 0 
##$TUNHIN= 0
##$TUNHOUT= 0
##$TUNXOUT= 0
##$USERA1= <user>
##$USERA2= <user>
##$USERA3= <user>
##$USERA4= <user>
##$USERA5= <user>
##$V9= 5
##$VALIST= <valist>
##$VCLIST= <CCCCCCCCCCCCCCC>
##$VD= 0
##$VDLIST= <DDDDDDDDDDDDDDD>
##$VPLIST= <PPPPPPPPPPPPPPP>
##$VTLIST= <TTTTTTTTTTTTTTT>
##$WBST= 1024
##$WBSW= 4
##$XGAIN= (0..3)
0 0 0 0 
##$XL= 0
##$YL= 0
##$YMAX_a= 192994
##$YMIN_a= -251312
##$ZGOPTNS= <>
##$ZL1= 120
##$ZL2= 120
##$ZL3= 120
##$ZL4= 120
##$ABSF1= 10
##$ABSF2= 0
##$ABSG= 5
##$ABSL= 3
##$ALPHA= 0
##$AQORDER= 0
##$ASSFAC= 0
##$ASSFACI= 0
##$ASSFACX= 0
##$ASSWID= 0
##$AUNMP= <proc_1d>
##$AZFE= 0.1
##$AZFW= 0.1
##$BCFW= 1
##$BC_mod= 2
##$BYTORDP= 1
##$COROFFS= 0
##$CY= 11.3945322036743
##$DATMOD= 1
##$DC= 2
##$DFILT= <>
##$DTYPP= 0
##$F1P= 18.9103706918063
##$F2P= -1.10871071338519
##$FCOR= 0.5
##$FTSIZE= 0
##$FT_mod= 4
##$GAMMA= 1
##$GB= 0.15
##$INTBC= 1
##$INTSCL= 1
##$ISEN= 128
##$LB= 0.24
##$LEV0= 0
##$LPBIN= 0
##$MAXI= 10000
##$MC2= 0
##$MEAN= 0
##$ME_mod= 0
##$MI= 1.114404
##$NCOEF= 0
##$NC_proc= 0
##$NLEV= 6
##$NOISF1= 3.799351
##$NOISF2= 2.8
##$NSP= 1
##$NTH_PI= 0
##$NZP= 0
##$OFFSET= 15.70392
##$PC= 1
##$PHC0= -8671.341
##$PHC1= -1.999817
##$PH_mod= 1
##$PKNL= yes
##$PPARMOD= 0
##$PSCAL= 0
##$PSIGN= 0
##$REVERSE= no
##$SF= 200.130013532006
##$SI= 16384
##$SIGF1= 3
##$SIGF2= 2
##$SINO= 400
##$SIOLD= 16384
##$SREGLST= <1H.CDCl3>
##$SSB= 0
##$STSI= 0
##$STSR= 0
##$SW_p= 3612.71676300578
##$SYMM= 0
##$S_DEV= 0
##$TDeff= 0
##$TDoff= 0
##$TI= <>
##$TILT= no
##$TM1= 0
##$TM2= 0
##$TOPLEV= 0
##$USERP1= <user>
##$USERP2= <user>
##$USERP3= <user>
##$USERP4= <user>
##$USERP5= <user>
##$WDW= 1
##$XDIM= 8192
##$YMAX_p= 0
##$YMIN_p= 0
$$ End of Bruker specific parameters
$$ ---------------------------------
##NTUPLES= NMR FID
##VAR_NAME=  TIME,          FID/REAL,        FID/IMAG
##SYMBOL=    X,             R,               I
##VAR_TYPE=  INDEPENDENT,   DEPENDENT,       DEPENDENT
##VAR_FORM=  AFFN,          ASDF,            ASDF
##VAR_DIM=   8192,          8192,            8192
##UNITS=     SECONDS,       ARBITRARY UNITS, ARBITRARY UNITS
##FACTOR=    0.0002496,     1,               1
##FIRST=     0,             0,               0
##LAST=      2.0444736,     0,               0
##MIN=       0,             -251312,         0
##MAX=       2.0444736,     192994,          0
$$ Real data points
##PAGE= N=1
##DATA TABLE= (X++(R..R)), XYDATA
$$ plain form
0 0 0 0 0 0 0 0 0 0 0 0 0 0 -3 8 -8 8 -8 16 -16 22 -24 31 -32 40 -48 56 -64 73 -87 97 -113 129 -145 167
34 167 -188 210 -239 266 -298 332 -369 409 -456 505 -561 617 -682 752 -829 912 -1006 1108
52 1108 -1220 1347 -1487 1646 -1827 2036 -2274 2557 -2895 3308 -3826 4498 -5410 6721 -8781
67 -8781 12504 -21361 90571 -26469 -216476 8269 135312 -29581 -205567 -48418 142045
78 142045 84343 -61716 7731 118522 33498 -112757 -55106 53343 -21634 -140739 -26771
89 -26771 159269 103592 -89765 -59817 129982 112140 -123115 -186346 9621 119673 -17195
100 -17195 -110954 22675 152078 64820 -64676 -36293 34400 -20470 -91994 -35334 45562
111 45562 10213 -34325 43818 119327 31922 -93087 -53753 57692 18633 -112727 -93746
$$ packed form
0@%%%%%%%%%%%%lJ1j6J6j6K4l2L8m6N5o3P2q8J04j20J37j60J84k10K42k74L12
34A67l55L98m49N05n64O30p01P78q65R61j066J178j299J434j581J741j918K114
52A108k328K567k834L133l473L863m310M831n452O203p134Q324r908J2131j5502
67h781K1285l3865J11932j17040j90007K24745J27043j64893j75986J57149J90463
78A42045n7702j46059O9447J10791q5024j46255N7651J08449p4977j19105J13968
89b6771J86040n5677j93357K9948J89799j7842k35255o3231J95967J10052j36868
100a7195r3759J33629J29403q7258j29496K8383P0693n4870p1524N6660Q0896
111D5562l5349m4538P8143P5509q7405j25009L9334J11445l9059j31360J8981
$$ plain form
122 -93746 65375 118342 9017 -52683 27411 81922 1345 -86867 -60551 1366 -1065 -17832
134 -17832 17073 50406 27427 5812 28543 25666 -43457 -85682 -27654 37842 8182 -43665
146 -43665 -284 85983 76064 -17818 -57329 -9579 16732 -28796 -61985 -22973 32516 41967
158 41967 26607 22604 17197 -3628 -15630 -13810 -26572 -49104 -31245 27615 54888 19111 -9815
171 -9815 19594 46708 4452 -60913 -60369 -5971 17318 -6198 -11435 24963 51225 32875 141
184 141 -16120 -23434 -29670 -23220 -8755 -6005 -4792 20829 53120 41653 -8238 -30481 -6311
197 -6311 4881 -29668 -54140 -16678 37724 41431 10547 4861 23957 19188 -16132 -38306 -30794
210 -30794 -17741 -9316 6870 25036 24448 14111 17937 22368 -4160 -43213 -42879 -6227 9708
$$ packed form
122i3746J59121N2967j09325o1700Q0094N4511q0577q8212K6316O1917k431j6767
134a7832L4905L3333k2979k1615K2731k877o9123m2225N8028O5496k9660n1847
146d3665M3381Q6267r919r3882l9511M7750K6311m5528l3189L9012N5489R451
158D1967j5360m003n407k0825j2002J820j2762k2532J7859N8860K7273l5777k8926
171i815K9409K7114m2256o5365N44N4398K3289k3516n237L6398K6262j8350l2734
184A41j6261p314o236O450J4465K750J213K5621L2291j1467m9891k2243K4170
197f311J1192l4549k4472L7462N4402L707l0884n686J9096m769l5320k2174P512
210c0794J3053Q425J6186J8166n88j0337L826M431k6528l9053L34L6652J5935
$$ plain form
223 9708 -8773 -10498 26743 53172 26599 -14775 -19687 -4828 -12297 -32809 -27555 1200 19683
236 19683 21611 24152 24562 9425 -11001 -14871 -12404 -23822 -33461 -11613 25185 32856 11737 5533
250 5533 21642 19508 -15229 -41502 -28758 -4096 -1277 -5240 9339 30113 29828 12971 274
263 274 -7399 -20169 -28533 -18927 -4146 390 3846 21603 35611 22806 -5159 -15383 -8023 -11550
277 -11550 -27964 -26841 58 22909 21421 13494 16127 16110 135 -18714 -24167 -19669 -15745 -7811
291 -7811 9129 22205 20517 13946 13184 7972 -11209 -28834 -25694 -9114 -1655 -2039 7812 25609
305 25609 29085 12329 -4208 -9103 -12184 -20679 -23006 -10935 4791 12963 17220 21716 18740 4610
319 4610 -10320 -14813 -15695 -19691 -18090 -2942 15633 21226 15870 12967 11925 1940 -15333 -24315
$$ packed form
223I708j8481j725L7241K6429k6573m1374m912J4859p469k0512N254K8755J8483
236A9683J928K541M10j5137k0426l870K467j1418r639K1848L6798P671k1119o204
250E533J6109k134l4737k6273J2744K4662K819l963J4579K0774k85j6857j2697
263B74p673j2770q364R606J4781M536L456J7757J4008j2805k7965j0224P360l527
277a1550j6414J123K6899K2851j488p927K633j7j5975j8849n453M498L924P934
291g811J6940J3076j688o571p62n212j9181j7625L140J6580P459l84R851J7797
305B5609L476j6756j6537m895l081q495k327J2071J5726Q172M257M496k976j4130
319D610j4930m493q82l996J601J5148J8575N593n356k903j042r985j7273q982
$$ plain form
333 -24315 -19160 -9725 -4119 3683 15652 22690 18232 8831 358 -8459 -18393 -22367 -15397 -3598
347 -3598 4353 10137 17742 22025 14819 -478 -10939 -14119 -16076 -17830 -12134 1205 13980 18433
361 18433 17297 13415 6446 -4501 -14465 -18776 -16818 -11457 -2574 9010 17840 18591 13532 7067 -333
376 -333 -10353 -19028 -19788 -11769 -1871 5998 11879 17374 18063 10762 -735 -10559 -15885 -16759 -13485 -6835
392 -6835 2955 11684 17399 17289 11675 2251 -7866 -13734 -15929 -14897 -9798 352 11134 17040 15933
407 15933 11406 4923 -2748 -11461 -17678 -16933 -9624 -107 8222 13429 15349 14061 8306 -1158 -11297
422 -11297 -16993 -15473 -10054 -2859 4078 11223 16917 16489 9004 -1368 -9797 -13475 -14308 -13082 -6977
437 -6977 2359 12122 16711 14740 8369 1674 -4753 -11085 -16033 -15607 -7709 2392 10272 13618 13488
$$ packed form
333b4315N155R435N606P802J1969P038m458r401q473q817r934l974O970J1799
347c598P951N784P605M283p206j5297j0461l180j957j754N696J3339J2775M453
361A8433j136l882o969j0947r964m311J958N361Q883J1584Q830P51n059o465p400
376c33j0020q675p60Q019R898P869N881N495O89p301j1497r824n326q74L274O650
392f835R790Q729N715j10n614r424j0117n868k195J032N099J0150J0782N906j107
407A5933m527o483p671q713o217P45P309R517Q329N207J920j288n755r464j0139
422a1297n696J520N419P195O937P145N694m28p485j0372q429l678q33J226O105
437f977R336R763M589j971o371o695o427o332m948M26P898J0101P880L346j30
$$ plain form
452 13488 11255 6150 -2684 -11862 -17067 -14766 -7072 522 5827 10426 14883 15039 7930 -3652 -12437
467 -12437 -13583 -11163 -9899 -6157 2561 13118 17008 13182 5606 -426 -5827 -11019 -14746 -13251 -6167
482 -6167 3184 11321 14876 12205 7158 2857 -1908 -10128 -17397 -15660 -4590 4899 7224 7517 12380
497 12380 15406 7740 -6185 -14152 -12141 -8963 -8139 -4319 3919 12922 15385 11854 5607 -2541 -9294
512 -9294 -11436 -10263 -9657 -7140 1986 13692 17414 10135 1593 954 -342 -9295 -18486 -15174 -1664
527 -1664 7495 7879 7220 11374 12633 4969 -5652 -12808 -13462 -10046 -4649 492 4981 8782 13145 14115
543 14115 5998 -6727 -12827 -9616 -6108 -7846 -7765 2683 14979 17177 8553 -4 -1623 -2319 -8568
558 -8568 -14724 -13245 -3242 7386 11473 9712 7527 6695 4238 -3125 -12443 -16362 -10497 -526 4722
$$ packed form
452A3488k233n105q834r178n205K301P694P594N305M599M457J56p109j1582q785
467a2437j146K420J264L742Q718J0557L890l826p576o032n401n192l727J495P084
482f167R351Q137L555k671n047m301m765q220p269J737J1070R489K325K93M863
497A2380L026p666j3925p967K011L178Q24L820Q238R003K463l531o247q148o753
512i294k142J173O06K517R126J1706L722p279q542o39j296q953r191L312J3510
527a664R159L84o59M154J259p664j0621p156o54L416N397N141M489L801M363R70
543A4115q117j2725o100L211L508j738Q1J0448J2296K198q624q557j619o96o249
558h568o156J479J0003J0628M087j761k185q32k457p363r318l919N865R971N248
$$ plain form
573 4722 4995 6525 11168 13226 5429 -7161 -14007 -11023 -5354 -4022 -4274 1522 11919 16728 10706
588 10706 -545 -6155 -5553 -5790 -10264 -12241 -5325 7429 14396 11226 5002 2859 2185 -1982 -10378
603 -10378 -15635 -10868 -206 7348 7791 6011 7844 9939 5404 -5719 -14328 -13107 -5454 -67 -36
618 -36 1356 8133 15149 12079 378 -8948 -9231 -5100 -6077 -9065 -5690 5751 14799 13105 4659 -439
634 -439 -794 -2650 -8323 -13254 -10358 -977 7825 10441 7593 4903 4826 4030 -2623 -12678 -15520 -6979
650 -6979 3313 4815 1672 4723 12697 12804 604 -10971 -10972 -5140 -3896 -6161 -3440 5450 12154
665 12154 12092 6501 -28 -4691 -6321 -5855 -7407 -9250 -4714 6749 14476 9995 1193 115 3887
680 3887 -315 -11973 -16261 -6262 4763 6146 2885 4982 10334 9039 288 -7388 -10296 -8802 -5155
$$ packed form
573D722K73J530M643K058p797j2590o846K984N669J332k52N796J0397M809o022
588A0706j1251n610O02k37m474j977O916J2754O967l170o224k143o74m167q396
603a0378n257M767J0662P554M43j780J833K095m535j1123q609J221P653N387L1
618c6J392O777P016l070j1701r326k83M131r77k988L375J1441R048j694q446n098
634d39l55j856n673m931K896R381Q802K616k848k690p7p96o653j0055k842Q541
650f979J0292J502l143L051P974J07j2200j1575jN832J244k265K721Q890O704
665A2154o2n591o529m663j630M66j552j843M536J1463P727m481q802j078L772
680C887m202j1658m288R999J1025J383l261K097N352j295q751p676k908J494L647
$$ plain form
695 -5155 -759 1717 3622 6997 11867 10202 -435 -9679 -8541 -3104 -3997 -8767 -4977 7720 14688
710 14688 9003 849 -222 1105 -2752 -10017 -11410 -5715 1248 6096 7851 7135 4591 3552 2319
725 2319 -3515 -11470 -12595 -4119 4144 3821 1188 5320 12052 9324 -2294 -9990 -7628 -3855 -4653
740 -4653 -5709 -843 6458 10220 8710 4660 -733 -5005 -5587 -5396 -6822 -7618 -2020 8261 11877 6153
756 6153 904 1952 2829 -3657 -11900 -11467 -2548 3424 3786 3874 6820 8547 5477 -1365 -6310 -8815
772 -8815 -7874 -3842 240 1704 3471 7542 10415 6354 -3087 -7825 -5323 -3473 -5791 -6689 -600 8068
788 8068 10527 6023 1920 491 -614 -4765 -8643 -8223 -4142 1787 5911 7222 5857 4157 3441 862
804 862 -5166 -10124 -8617 -2614 2019 2311 3283 6407 8799 4855 -2452 -7011 -6681 -4867 -4274 -3294 685
$$ packed form
695e155M396K476J905L375M870j665j0637r244J138N437q93m770L790J2697O968
710A4688n685q154j071J327l857p265j393N695O963M848J755p16k544j039j233
725B319n834p955j125Q476Q263l23k633M132O732k728j1618p696K362L773p98
740d653j056M866P301L762j510m050n393m272n82J91j426p96N598J0281L616n724
756F153n249J048Q77o486q243M33Q919N972L62Q8K946J727l070o842m945k505
772h815R41M032M082J464J767M071K873m061r441m738K502J850k318q98O089Q668
788H068K459m504m103j429j105m151l878M20M081N929M124J311j365j700p16k579
804H62o028m958J507O003M633K92R72L124K392l944p307m559L30J814N93R80L979
$$ plain form
821 685 6035 8947 7187 2645 -1474 -3422 -5038 -6406 -6712 -4077 1403 6458 7746 5834 3213 1428
837 1428 -1130 -4821 -8192 -7767 -2980 2047 4549 4564 5209 6281 4122 -1513 -6701 -7719 -5309 -2687
853 -2687 -1156 1511 5512 7795 6587 2489 -1765 -4491 -5828 -5727 -4677 -2243 1369 5663 7855
868 7855 6400 2605 -598 -2526 -4579 -6957 -6764 -2841 2684 5406 5779 4864 4586 2715 -2298 -6155
884 -6155 -7353 -5538 -2375 142 3139 5569 6523 5371 2430 -1828 -4975 -6514 -5512 -3258 -753
899 -753 2092 5022 6995 5905 2087 -1808 -3825 -4470 -5846 -5990 -2521 2947 5604 5731 4888 3415
915 3415 1267 -2951 -6020 -6419 -4559 -2217 757 3979 6045 5769 3656 1441 -1485 -5232 -7067 -5340
931 -5340 -2062 430 1853 4897 6929 5558 971 -2504 -3862 -5058 -5780 -4705 -563 3463 5064
$$ packed form
821F85N350K912j760m542m119j948j616j368l06K635N480N055J288j912k621j785
837A428k558l691l371M25M787N027K502J5O45J072k159n635n188j018K410K622
853b687J531K667M001K283j208m098m254k726j337J01J050K434L612M294K192
868G855j455l795l203j928k053k378J93L923N525K722L73r15k78j871n013l857
884f155j198J815L163K517K997K430R54j152k941m258l147j539J002K254K505
899g53K845K930J973j090l818l895k017o45j376j44L469N468K657J27q43j473
915C415k148m218l069l99J860K342K974L222K066k76k113k215k926l747j835J727
931e340L278K492J423L044K032j371m587l475j358j196p22J075M142M026J601
$$ plain form
946 5064 5315 4826 2884 -646 -4293 -5216 -5071 -4464 -2476 1706 5535 5965 4035 3053 1236 -1956 -6033
963 -6033 -6461 -3956 -1133 604 3369 5697 6052 3913 328 -1975 -3917 -5986 -5593 -2261 686 2700
979 2700 4271 6195 4844 1605 -2429 -4221 -4465 -5181 -4352 -1173 2965 5203 4980 3958 2945 194
995 194 -3477 -5688 -4950 -3732 -1705 1516 4648 5870 4468 2382 697 -1966 -5103 -6117 -4165 -1190
1011 -1190 877 2543 4840 5680 4025 719 -2374 -3930 -4882 -4657 -2988 113 3100 4592 5253 4518
1027 4518 1566 -1212 -4039 -4546 -4590 -3964 -1474 2543 5071 5095 3538 2165 569 -2882 -5401 -6039 -3343
1044 -3343 -614 1396 3272 4585 4981 3028 189 -2342 -4473 -5268 -3954 -1397 866 2788 4701
1059 4701 5512 4007 400 -2791 -3870 -3954 -4309 -3422 -311 3232 5217 4920 3238 1334 -804 -2952
$$ packed form
946E064K51m89j942l530l647r23J45O07J988M182L829M30j930r82j817l192m077
963f033m28K505K823J737K765K328L55k139l585k303j942k069L93L332K947K014
979B700J571J924j351l239m034j792k44p16Q29L179M138K238k23j022j013k751
995A94l671k211P38J218K027L221L132J222j402k086j685k663l137j014J952K975
1011a190K067J666K297Q40j655l306l093j556r52K25J669L101K987J492O61p35
1027D518k952k778k827n07m4O26K490M017K528K4j557j373j596l451k519o38K696
1044c343K729K010J876J313L96j953k839k531k131p95J314K557K263J922J913
1059D701Q11j505l607l191j079q4l55Q87L111L543J985k97j682j904k138k148
$$ plain form
1075 -2952 -4778 -5340 -3266 -625 2678 4004 4325 3847 2960 378 -2901 -5193 -4903 -2860 -691 1185
1091 1185 2825 4406 5021 3270 62 -2882 -4197 -4235 -3414 -1874 -143 2687 5174 5408 2857 -277
1107 -277 -1504 -2570 -3973 -4779 -3219 692 3667 4223 3744 3339 2048 -339 -3135 -4816 -4577 -2915
1123 -2915 -244 2212 3453 3515 3619 3110 199 -3640 -5343 -3751 -1384 -1154 57 2466 5283 4961
1139 4961 1842 -1070 -2214 -2894 -3743 -3896 -2405 302 3457 4489 4070 2361 475 -1279 -2625 -4100
1155 -4100 -5120 -3012 1095 3532 3578 2575 3201 2786 -87 -4212 -5530 -3582 -1114 -191 729 3127
1171 3127 4343 4467 2015 -908 -3211 -3945 -3477 -2551 -1530 -13 3137 5305 4675 1443 -1122 -1485
1187 -1485 -2059 -3647 -4738 -2707 1753 3806 3585 2530 2230 1639 -518 -3443 -4918 -3932 -1355 1081
$$ packed form
1075b952j826n62K074K641L303J326L21m78q87k582l279k292K90K043K169J876
1091A185J640J581O15j751l208k944j315l8Q21J540J731K830K487K34k551l134
1107b77j227j066j403q06J560L911K975N56m79m05j291k387k796j681K39J662
1123b915K671K456J241O2J04n09k911l839j703J592K367K30J211K409K817l22
1139D961l119k912j144o80q49j53J491K707L155J032m19j709j886j754j346j475
1155d100j020K108M107K437M6j003O26m15k873m125j318J948K468R23R20K398
1171C127J216J24k452k923k303p34M68R26J021J517L150K168o30l232k565l63
1187a485n74j588j091K031M460K053k21j055l00n91k157k925j475R86K577K436
$$ plain form
1203 1081 2092 2619 3331 3469 2601 -827 -3879 -4709 -2724 -1322 -617 69 2853 5235 4284 1260 -1843
1220 -1843 -2206 -2274 -3087 -3779 -2085 1087 4147 4406 2837 880 127 -465 -2646 -4355 -4342 -1408 2020
1237 2020 2970 2814 2319 2870 2040 -798 -4005 -4693 -2768 -649 332 1025 2355 3923 4084 1613 -2117
1254 -2117 -3522 -2829 -1935 -2219 -1715 902 3863 4578 3173 440 -880 -1237 -2491 -3680 -3806 -1664 1592
1271 1592 3674 3610 2292 1426 1071 -819 -3461 -4887 -3237 -9 1893 1575 2010 3353 3601 1182 -2067
1288 -2067 -4118 -3237 -1784 -1369 -816 1250 3404 4461 3125 268 -1656 -2572 -2358 -2615 -2853 -1404 1553
1305 1553 4090 4020 2032 535 76 -706 -2870 -4474 -3279 120 2125 2377 2162 2555 2620 976 -1655
1322 -1655 -4009 -3493 -2306 -630 480 1440 2514 3565 3377 876 -2128 -3109 -2461 -1851 -1967 -1219 1552
$$ packed form
1203A081J011N27P12J38q68l428l052q30J985J402P05O86K784K382r51l024l103
1220a843l63o8q13o92J694L172L060K59j569j957p53n92k181j709J3K934L428
1237B020R50j56m95N51q30k838l207o88J925K119R81O93J330J568J61k471l730
1254b117j405O93Q94k84N04K617K961P15j405k733j320l57j254j189j26K142L256
1271A592K082o4j318q66l55j890k642j426J650L228J902l18M35J343K48k419l249
1288b067k051Q81J453M15N53K066K154J057j336k857j924r16K14k57k38J449K957
1305A553K537p0j988j497m59p82k164j604J195L399K005K52k15L93O5j644k631
1322a655k354N16J187J676J110R60J074J051j88k501l004r81O48O10j16P48K771
$$ plain form
1339 1552 4346 3645 1853 222 -717 -1077 -2695 -3618 -2616 -397 1919 2892 2955 2193 1120 249 -1067
1356 -1067 -3015 -4175 -2564 198 1528 1638 1989 2883 2838 382 -2474 -3444 -2612 -1462 -1251 -212 1634
1373 1634 3347 3385 1855 147 -1523 -2434 -2475 -2315 -1899 -450 1565 3688 3268 1603 373 -321 -1237
1390 -1237 -3098 -3686 -1860 466 2012 1921 2278 2481 1938 17 -1986 -2881 -3096 -1565 -541 599 1812
1407 1812 2315 3108 2248 200 -2136 -2812 -2317 -1961 -1602 -518 2057 3065 2973 1114 36 -823 -1591 -2554
1425 -2554 -2908 -1848 282 1961 2496 2632 1813 755 -69 -1664 -2601 -3127 -1749 215 984 1744 2294
1442 2294 2557 1586 -165 -1966 -2320 -2539 -1741 -747 353 1672 2882 2696 1525 49 -1489 -2011 -2142
1459 -2142 -1937 -1291 158 1939 2911 2212 1481 490 -592 -1821 -2835 -2598 -1131 109 1593 2193 2316
$$ packed form
1339A552K794p01j792j631r39l60j618r23J002K219K316R73O3p62j073q71j316
1356a067j948j160J611K762J330J10L51Q94m5k456k856r70Q32J150K11J039J846
1373A634J713L8j530j708j670r11m1J60M16J449K015K123m20j665j230o94r16
1390a237j861n88J826K326J546r1L57K03n43j921k003q95k15J531J024J140J213
1407A812N03P93q60k048k336o76M95L56L59J084K575J008r2j859j078q59p68r63
1425b554l54J060K130J679N35J36q19j058q24j595r37n26J378J964P69P60N50
1442B294K63r71j751j801l54k19P98R94J100J319J210j86j171j476j538n22j31
1459b142K05O46J449J781R72o99p31r91j082j229j014K37J467J240J484O00J23
$$ plain form
1476 2316 1851 1194 -483 -2016 -2626 -2763 -1529 -258 818 1690 2560 2527 1334 -493 -1730 -2127 -2090 -1794
1494 -1794 -612 760 1996 2663 2193 1122 208 -1038 -1958 -2323 -1898 -1142 522 1941 2277 2342 1608 667
1512 667 -547 -1892 -2774 -2162 -928 258 1098 1858 2413 1907 747 -677 -1973 -2014 -2074 -1489 -184 887
1530 887 1849 2280 2183 1385 -239 -1625 -1882 -2090 -1717 -549 563 1796 2190 1765 884 82 -863 -1733 -2408
1549 -2408 -1849 -818 149 1640 1939 1866 1560 418 -529 -1766 -2143 -1891 -1068 186 1203 1721 1731 1735 814
1568 814 -427 -1341 -2105 -1741 -1240 -744 569 1433 2142 1782 804 3 -993 -1429 -2165 -1490 -602 436 1637
1587 1637 1937 1770 969 -139 -865 -1394 -1962 -1704 -822 290 1343 1815 1712 1339 731 -975 -1736 -2062
1605 -2062 -2001 -577 -61 697 1526 1973 1689 812 -558 -1376 -1638 -1509 -1089 -520 712 1726 1913 1657 690
$$ packed form
1476B316m65o57j677j533o10j37J234J271J076Q72Q70l3j193j827j237l97L7K96
1494a794J182J372J236O67m70j071r14j246r20l65M25P56J664J419L36O5p34r41
1512F67j214j345q82O12J234J186Q40P60N55n06j160j424j296m1o0N85J305J071
1530H87R62M31r7p98j624j386k57k08L73J168J112J233L94m25q81q02r45q70o75
1549b408N59J031R67J491K99p3l06j142r47j237l77K52Q23J254J017N18J0Mr21
1568H14j241r14p64L64N01M96J313Q64P09l60r78q01r96m36p36O75Q88J038J201
1587A637L00j67q01j108p26n29n68K58Q82J112J053M72j03l73o08j706p61l26
1605b062O1J424N16P58Q29M47k84q77j370q18k62J29M20N69J232J014J87k56r67
$$ plain form
1624 690 -49 -997 -1427 -1926 -1530 -775 573 1297 1739 1389 866 154 -687 -1491 -1878 -1510 -377 406 836
1643 836 1320 1768 1147 557 -831 -1685 -1237 -1327 -937 -460 901 1530 1602 1061 253 -285 -791 -1636 -1347 -1290
1663 -1290 -244 687 1400 1700 1179 517 -238 -636 -1317 -1818 -1447 -269 622 1263 1187 1201 1157 422 -933 -1455
1683 -1455 -1596 -1279 -336 393 639 1101 1679 906 159 -841 -1249 -1358 -1108 -841 -58 702 1660 1464 1220
1702 1220 1 -442 -890 -1453 -1583 -1149 -211 931 1502 1224 972 1019 -184 -861 -1505 -1428 -991 13 296
1721 296 960 1211 1204 904 276 -999 -1489 -1195 -751 -283 -125 831 1332 1847 840 -348 -571 -733 -918 -1397
1741 -1397 -944 86 963 1446 995 904 268 -184 -678 -1313 -1441 -1024 42 727 1457 1184 896 562 38
1760 38 -1021 -1597 -1200 -702 197 -12 590 1370 1685 579 -333 -755 -835 -811 -841 -586 -55 996 1381 1360 762
$$ packed form
1624F90p39r48m30m99L96P55J348P24M42l50n23p12q41q04l87L68J133P83M30
1643H36M84M48o21n90j388q54M48r0L90M77J361O29P2n41q08n38n06q45K89N7
1663a290J046R31P13L00n21o62p55l98o81n01L71J178Q91O41p6J4m4p35j355n22
1683a455j41L17R43P29K46M62N78p73p47j000m08j09K50K67P83P60R58j96k44
1702A220j219m43m48n63j30M34R38J142N71k78k52M7j203o77o44P7M37J004K83
1721B96O64K51pl00o28j275m90K94M44M68J58R56N01N15j007j188k23j62j85m79
1741a397M53J030Q77M83m51r1o36m52m94o35j28M17J066O85P30k73k88l34n24
1760C8j059n76L97M98Q99k09O02P80L15j106r12m22q0K4l0K55N31J051L85k1n98
$$ plain form
1781 762 -67 -560 -1031 -900 -1141 -776 95 1031 954 763 201 571 -228 -1078 -1318 -1145 -557 -35 561 481 1236
1802 1236 1033 769 -22 -690 -1165 -1023 -547 -260 59 788 1090 1356 361 35 -581 -723 -698 -830 -820 347
1822 347 1051 1272 689 448 273 -148 -910 -1152 -851 -427 429 902 777 720 781 332 38 -899 -1385 -895 -258
1843 -258 -256 233 688 983 1102 349 -348 -672 -932 -580 -790 -671 354 836 1212 802 335 -222 -333 -625
1863 -625 -1114 -1090 -431 699 1127 975 655 756 335 -104 -824 -1180 -650 -223 264 455 636 995 733 296
1883 296 -528 -1038 -614 -631 -336 33 506 933 1004 671 28 -450 -687 -723 -612 -954 -119 310 941 747 543
1904 543 381 25 -247 -664 -1282 -1111 7 320 509 736 925 669 167 -561 -776 -706 -499 -353 55 181
1924 181 833 1004 859 106 -393 -710 -674 -441 -652 -380 191 879 930 655 118 -66 -179 -636 -984 -759 7
$$ packed form
1781G62q29m93m71J31k41L65Q71R36p7j91n62L70p99q50k40J73N88N22N96q0P55
1802A236k03k64p91o68m75J42M76K87L19P29L02K66r95l26o16j42K5j32J0J167
1822C47P04K21n83k41j75m21p62k42L01M24Q56M73j25n7O1m49k94r37m86M90O37
1843b58KM89M55K95J19p53o97l24k60L52k10J19J025M82L76m10m67n57j11k92
1863f25m89K4O59J130M28j52l20J01m21m39p20l56N30M27M87J91J81L59k62m37
1883B96q24n10M24j7K95L69M73M27P1l33o43m78k37l6J11l42Q35M29O31j94k04
1904E43j62l56k72m17o18J71J118L13J89K27J89k56n02p28k15P0K07J46M08J26
1924A81O52J71j45p53m99l17L6K33k11K72N71O88N1k75n37j84j13m57l48K25P66
$$ plain form
1945 7 440 827 470 413 328 240 -583 -775 -1047 -639 -35 214 568 369 686 595 67 -322 -670 -945 -285 -465
1967 -465 238 227 1042 908 445 367 -160 -530 -582 -729 -71 -131 514 676 732 428 9 55 -472 -716 -590 -607
1989 -607 -105 576 556 620 625 273 114 -496 -514 -683 -394 146 129 346 677 623 357 115 -491 -662 -729 -336 -436
2012 -436 -8 265 486 499 545 108 -195 -404 -313 -441 -142 -109 307 376 522 263 64 -46 -419 -683 -403 -245
2034 -245 -257 325 374 598 373 315 -310 -577 -512 -284 -301 18 94 422 670 312 284 -356 -119 -624 -347 -465
2056 -465 -156 28 319 706 467 472 216 -198 -437 -532 -327 -86 145 291 382 446 554 192 -183 -361 -213 -505
2078 -505 -345 10 374 559 518 115 -2 140 -385 -550 -274 -97 -231 -34 387 549 544 241 -362 -268 -366 -429
2100 -429 -420 -184 140 297 380 403 89 169 -69 -466 -380 -389 -121 71 311 503 534 142 -163 -385 -271 -125 -201
$$ packed form
1945GM33L87l57n7q5q8q23j92k72M08O04K49L54j99L17r1n28l89l48k75O60j80
1967d65P03j1Q15j34m63p8n27l70n2j47O58o0O45J62N6l04m19M6n27k44J26j7
1989f07N02O81k0O4Nl52j59o10j8j69K89N40j7K17L31n4k66k42o06j71o7L93j00
2012d36M28K73K21J3M6m37l03k09R1j28K99L3M16O9J46k59j99j10l73k64K80J58
2034b45j2N82M9K24k25n8o25k67O5K28j7L19P6L28K48l58k8o40K37n05K77j18
2056d65L09J84K91L87k39Nk56m14k39r5K05K41K31J46R1O4J08l62l75j78J48k92
2078e05J60L55L64J85m1m03j17J42n25j65K76J77j34J97M21J62nl03o03R4r8o3
2100d29RK36L24J57Q3K3l14Q0k38l97Q6rK68J92K40J92L1l92l05k22J14J46p6
$$ plain form
2123 -201 -68 -33 238 371 655 459 178 -177 -228 -168 -292 -161 99 151 366 248 125 -90 200 -251 -477
2144 -477 -424 -248 133 -46 422 378 339 345 14 -315 -538 -575 -72 -158 16 344 210 486 126 -286 -417 -262
2166 -262 -288 -470 -92 111 363 481 329 218 80 -137 -516 -474 -366 -160 -93 209 509 331 192 169 18
2187 18 -100 -472 -543 -38 -40 125 412 -70 264 144 -215 -559 -416 -256 -260 -62 150 305 261 208 -177 -348 -77
2210 -77 -484 -393 -182 42 269 221 628 372 -72 71 -192 -277 -379 12 -219 -87 464 497 436 106 -25 -257
2232 -257 -148 -452 -150 -117 82 -16 194 237 261 -103 -273 -133 -156 1 -80 -230 355 447 481 201 111 -126 -190
2255 -190 -569 -337 -122 -153 267 274 218 253 -72 191 217 -170 -237 58 -22 58 93 544 320 281 21 -390 -65 -454
2279 -454 -190 -212 76 59 344 351 -63 180 -185 -736 -367 -174 -252 58 286 301 261 71 -125 -220 -195 -349 -323
$$ packed form
2123b01J33L5K71J33K84j96k81l55n1O0j24J31K60N2K15j18j23k15K90m51k26
2144d77N3J76L81j79M68m4l9Ol31l29k23l7N03q6J74L28j34K76l60m12j31J55
2166b62k6j82L78K03K52J18j52j11j38k17l79M2J08K06O7L02L00j78j39k3j51
2187A8j18l72p1N05kJ65K87m82L34j20l59l44J43J60mJ98K12J55m4n3l85j71K71
2210g7m07R1K11K24K27m8M07k56m44J43k63q5j02L91k31J32N51L3o1l30j31k32
2232b57J09l04L02L3J99r8K10M3K4l64j70J40k3J57q1j50N85R2L4k80r0k37o4
2255a90l79K32K15l1M20Pn6L5l25K63K6l87o7K95q0Q0L5M51k24l9k60m11L25l89
2279d54K64k2K88j7K85Pm14K43l65n51L69J93p8L10K28J5m0j90j96r5K5j54K6
$$ plain form
2302 -323 -353 -48 229 338 196 26 -116 -162 -151 -458 -459 -147 -129 72 124 273 155 236 77 -155 -326 -40 -344
2325 -344 -164 207 -25 381 330 247 223 -374 -256 -299 -120 -158 -177 180 433 336 161 74 -246 -334 -93 -278 -197
2348 -197 7 265 469 309 151 64 -107 -424 -346 -351 72 -127 318 336 102 372 -28 141 -217 -36 -187 -86
2370 -86 -258 319 113 237 227 24 -81 -201 -351 -260 -72 -99 -27 63 275 -93 -107 20 -273 -274 -334 -282 43 28
2394 28 409 121 157 -94 171 -31 -270 -391 -420 -115 -65 337 289 408 24 9 -230 -354 -263 -111 -486 -70
2416 -70 132 228 -19 418 -203 -92 -346 -153 -480 -234 44 82 435 326 312 90 34 -81 -200 -222 -46 107
2438 107 -113 26 350 396 386 91 -172 -451 -295 -230 -145 244 269 275 345 367 42 -7 -161 -93 -221 -318 -21 228
2462 228 231 164 -134 54 -37 -258 -212 -185 -244 -153 500 497 376 355 -39 -299 -214 -361 -290 -126 -178 -163 238 189 387
$$ packed form
2302c23l0L05K77J09j42j70j42m6J1l07jL12J8K01N2J49j18Q1j59k32j71K86l04
2325c44J80L71k32M06n1q3k4n97J18m3J79l8j9L57K53r7j75q7l20q8K41j85Q1
2348a97K04K58K04j60j58q7j71l17P8nM23j99M45J8k34K70m00J69l58J81j51J01
2370h6j72N77k06J24j0k03j05j20j50R1J88k7P2R0K12l68j4J27k93jo0N2L25j5
2394B8L81k88L6k51K65k02k39j21k9L05N0M02m8J19l84j5k39j24R1J52l75M16
2416g0K02R6k47M37o21J11k54J93l27K46K78L8L53j09j4k22n6j15j19k2J76J53
2438A07k20J39L24M6j0k95k63k79J56O5Q5L89K5OP0K2l25m9j54O8j28r7K97K49
2462B28Lo7k98J88r1k21M6K7n9R1O53lj21k1l94k60Q5j47P1J64n2J5M01m9J98
$$ plain form
2487 387 -3 -5 -311 -436 -184 -177 -36 118 316 290 243 81 -69 -52 -217 -207 -335 -181 -15 70 426 -164 379
2510 379 6 3 -379 -265 -402 -73 85 256 80 154 20 214 -292 -290 -194 -238 -175 68 -126 271 343 87 -7
2533 -7 -92 -182 -272 -82 -314 33 0 279 322 271 -62 115 66 -326 -262 -147 145 51 398 273 280 212 225 21 -240
2558 -240 -354 -284 -38 12 276 124 474 278 189 -146 -30 -115 -112 -114 -182 189 135 325 208 -207 -201 -125 -340 8
2582 8 -190 -224 96 501 470 263 163 -40 -40 -610 -520 151 -308 65 143 333 262 109 -29 -300 -241 -391 -105
2605 -105 18 25 316 484 241 370 -221 125 -230 -491 -204 -52 -238 -58 134 279 680 424 76 -103 -273
2626 -273 -468 -203 -224 322 194 319 349 101 59 -313 -351 -456 -336 -4 267 69 367 184 -13 328 -107
2647 -107 -139 10 -255 -145 160 106 541 346 128 116 -206 -111 -187 -351 184 252 135 354 313 141 12 -14 -591
$$ packed form
2487C87l90kl06j25K52PJ41J54J98k6m7j62j50J7j65J0j28J54J66Q5L56n90N43
2510C79l73ll82J14j37L29J58J71j76P4j34J94n06KR6m4O3K43j94L97P2k56r4
2533gq5r0r0J90k32L47l3K79M3n1l33J77m9l92O4J15K92r4L47j25Po8J3k04k61
2558b40j14P0K46N0K64j52L50j96q9l35J16q5Lko8L71n4J90j17m15OP6k15L48
2582Hj98l4L20M05l1k07j00k03%n70R0O71m59L73P8J90p1j53j38k71N9j50K86
2605a05J23PK91J68k43J29n91L46l55k61K87J52j86J80J92J45M01k56l48j79j70
2626b73j95K65k1N46j28J25L0k48m2l72l8j05J20L32K71j98K98j83j97L41m35
2647a07l2J49k65J10L05n4M35j95k18j2l22R5p6j64N35O8j17K19m1j72j29k6n77
$$ plain form
2670 -591 -456 -608 12 -12 86 72 339 245 91 -24 -411 -305 -295 -266 -15 -20 293 263 168 -197 152 -34 -260
2693 -260 -349 -280 -109 -14 151 332 444 203 172 162 -272 -553 -278 -252 39 268 392 508 177 47 -122 -286
2715 -286 -500 -550 -242 -131 284 246 561 362 100 19 -341 -445 -414 -329 57 161 341 538 544 -34 -50 -133 -296
2738 -296 -452 -324 -51 44 35 318 292 131 26 127 -502 -417 -190 -206 -218 421 373 271 261 303 66 -438 -154
2761 -154 -345 -387 -23 65 577 255 187 -83 -65 -310 -272 -244 -252 220 140 153 586 210 22 108 -406 -314 -348 -330 -324
2786 -324 16 290 327 31 53 -73 -217 -407 -219 -217 -35 174 287 26 341 270 -132 -214 -340 -467 -136 -26
2808 -26 147 90 260 416 261 -141 -260 -127 -319 -61 -279 -16 197 352 256 226 -32 -106 -341 -292 -127 -469
2830 -469 43 128 304 347 315 283 1 -389 -345 -261 -480 -153 -104 327 547 84 86 -264 -241 -253 -375 -235 -219 -18
$$ packed form
2670e91J35j52O20k4R8j4K67r4j54j15l87J06J0K9K51nL13l0r5l65L49j86k26
2693b60q9O9J71R5J65J81J12k41l1j0m34k81K75K6K91K29J24J16l31j30j69j64
2715b86k14n0L08J11M15l8L15j99k62q1l60j04L1Q5L86J04J80J97On78j6q3j63
2738b96j56J28K73R5rK83k6j61j05J01o29Q5K27j6j2O39m8j02j0M2k37n04K84
2761a54j91m2L64Q8N12l22o8k70J8k45L8K8qM72q0J3M33l76j88Q6n14R2l4J8O
2786c24L40K74L7k96K2j26j44j90J88KJ82K09J13k61L15p1m02q2j26j27L31J10
2808b6J73n7J70J56j55m02j19J33j92K58k18K63K13J55r6l0k58p4k35M9J65l42
2830d69N12Q5J76M3l2l2k82l90M4Q4k19L27M9M31K20m63Kl50K3j2j22J40J6K01
$$ plain form
2854 -18 288 26 350 215 25 -239 -361 -302 -341 -75 203 289 36 507 -7 90 -134 -188 -465 -481 -408 55 343
2877 343 267 366 200 103 40 -194 -249 -291 -271 -227 53 352 311 251 59 -48 -196 -72 -494 -295 -253 212 17 291
2901 291 540 206 133 -154 -224 -418 -89 -198 -187 148 296 338 150 51 -13 -293 -635 -247 -94 23 166 305
2923 305 370 302 95 -132 -407 -283 -138 -240 -168 -228 236 610 335 3 106 -10 -302 -219 -296 -262 -2 149
2945 149 326 6 208 344 -189 -392 -369 -324 -132 194 225 438 289 165 84 -115 -184 -105 -378 -337 -221 315
2967 315 256 252 386 109 -246 -219 -403 -178 -280 -219 -77 256 569 285 48 243 -68 -379 -258 -203 54 164
2989 164 331 386 152 544 -20 -389 -449 -373 -342 -164 200 298 384 222 285 14 -22 -253 -108 -223 -138 141 139 336
3013 336 312 -22 -154 -271 -85 -461 -592 -306 -219 103 308 248 288 12 -15 -178 -433 -339 -465 -27 -154 191
$$ packed form
2854a8L06k62L24j35j90k64j22N9l9K66K78Q6k53M71n14R7k24n4k77j6P3M63K88
2877C43p6R9j66r7o3k34n5m2K0M4K80K99m1o0j92j07j48J24m22J99M2M65j95K74
2901B91K49l34p3k87p0j94L29j09J1L35J48M2j88r9o4k80l42L88J53J17J43J39
2923C05O5o8k07k27k75J24J45j02P2o0M64L74k75l32J03j16k92Q3p7L4K60J51
2945A49J77l20K02J36n33k03K3M5J92L26L1K13j49j24q1j99o9P9k73M1J16N36
2967C15n9mJ34k77l55K7j84K25j02O1J42L33L13k84k37J95l11l11J21N5K57J10
2989A64J67N5k34L92n64l69o0P6L1J78L64R8Q6j62O3k71l6k31J45j15Q5K79kJ97
3013C36k4l34j32j17J86l76j31K86Q7L22K05o0M0k76k7j63k55R4j26M38j27L45
$$ plain form
3035 191 283 234 46 -141 -302 -358 -346 -8 94 -38 354 522 317 53 -3 -202 -191 -340 -83 -281 92 256
3057 256 284 201 92 -13 -339 -204 -447 -360 -356 -14 -35 438 222 95 153 -195 68 -365 -583 -112 -38 118 53
3080 53 163 192 -8 -196 -130 -217 -588 -87 -107 166 108 419 289 316 -360 -332 -529 -387 -369 -37 229 406 424
3103 424 480 -26 65 132 -264 -136 -512 -112 156 288 367 266 242 120 -228 -714 -359 -267 -130 -176 122 279
3125 279 525 431 62 -112 -151 -167 -300 -290 -287 197 108 240 530 151 -70 -35 -653 -249 -567 26 180 354 391
3148 391 316 380 -162 46 -206 -278 -366 12 -45 483 153 155 151 -163 6 -421 -285 -433 -225 -88 164 355 345
3171 345 43 180 287 -42 -359 -456 -312 -155 405 249 299 -24 247 -166 -28 -490 -251 -71 -118 -83 360
3192 360 377 185 449 217 -153 -600 -662 -128 -15 97 89 59 192 409 102 -100 -200 -250 -426 -345 -62 80
$$ packed form
3035A91R2m9j88j87j61n6J2L38J02j32L92J68k05k64n6j99J1j49K57j98L73J64
3057B56K8q3j09j05l26J35k43Q7ML42k1M73k16j27N8l48K63m33k18M71P4J56o5
3080E3J10K9k00j88O6q7l71N01k0K73n8L11j30K7o76K8j97J42J8L32K66J77J8
3103D24N6n06R1O7l96J28l76M00K68J32P9j01k4j22l48m86L55R2J37m6K98J57
3125B79K46r4l69j74l9j6j33J0LM84q9J32K90l79k21L5o18M04l18N93J54J74L7
3148C91p5O4n42K08k52p2q8L78n7N28l30Kml14J69m27J36j48K08J37K52J91j0
3171C45l02J37J07l29l17r7J44J57N60j56N0l23K71m13J38m62K39J80m7L5M43
3192C60J7j92K64k32l70m47o2N34J13J12ql0J33K17l07k02j00n0j76Q1K83J42
$$ plain form
3214 80 495 349 219 89 107 -216 -259 -338 -99 -107 233 262 -66 302 87 -139 -59 -254 -137 -154 -26 347 285
3237 285 306 131 159 -119 -185 -399 -132 -258 61 59 264 297 82 78 90 -53 -193 -480 -422 -278 133 -158 243
3260 243 256 268 68 -173 15 -496 -146 -106 -130 38 98 148 117 217 -107 -89 -396 -304 -486 -55 172 195 111 173
3284 173 30 178 -116 -461 -314 -245 -360 127 442 314 316 219 160 -181 -10 -264 -230 -108 100 2 247 245 476
3307 476 -144 -85 -305 -238 -223 -239 -61 126 94 106 123 10 -15 -70 -275 -5 -216 -35 253 52 356 330 200
3330 200 164 -109 -354 -207 -269 -77 137 345 417 -255 42 222 -453 -299 -164 -274 -220 -158 50 109 295 -37
3352 -37 -85 37 -138 165 -150 91 53 31 150 35 458 114 -268 -156 -392 -95 -193 224 6 298 459 -146
3374 -146 61 -67 -48 -331 -298 -528 -245 -132 260 72 248 231 -110 -240 -275 -499 -253 9 7 415 297 62
$$ packed form
3214H0M15j46j30j30J8l23m3p9K39qL40K9l28L68k15k26Q0j95J17j7J28L73o2
3237B85K1j75K8k78o6k14K67j26L19kK05L3k15mJ2j43j40k87N8J44M11k91M01
3260B43J3J2k00k41J88n11L50M0k4J68O0N0l1J00l24J8l07R2j82M31K27K3q4O2
3284A73j43J48k94l45J47O9j15M87L15j28Kr7n9l41J71k54L4J22K08r8K45kK31
3307D76o20N9k20O7J5j6J78J87l2J2J7j13k5n5k05K70k11J81K88k01L04k6j30
3330B00l6k73k45J47o2J92K14K08P2o72K97J80o75J54J35j10N4O2K08N9J86l32
3352c7m8J22j75L03l15K41l8k2J19j15M23l44l82J12k36K97r8M17k18K92J61o05
3374a46K07j28J9k83L3k30K83J13L92j88J76j7l41j30l5k24K46K62kM08j18k35
$$ plain form
3396 62 256 -123 -118 -207 -249 1 -32 44 313 340 399 254 -218 -82 -145 -229 -163 -290 210 216 -34 308 185 221 -60
3421 -60 -452 -188 -120 -237 -11 124 75 312 121 219 -61 -65 -345 -248 -257 -288 293 74 118 292 79 -258 28 -82
3445 -82 -211 -217 -339 -65 256 293 410 137 23 -185 -191 -375 -441 42 10 142 215 427 604 -134 -18 105 -271
3468 -271 -47 -132 54 -27 159 144 461 169 32 -360 -295 -217 -33 -147 222 309 217 370 128 -76 2 -131 -291
3491 -291 -347 -73 268 0 283 299 171 124 -155 -234 -261 -90 -266 -141 88 72 334 146 -204 -201 -248 -370 -264
3514 -264 34 -19 145 161 330 184 -30 -19 -453 -344 -76 -294 -183 -46 124 253 154 108 -40 -242 -327 -330 -47
3537 -47 -46 218 198 429 251 88 59 87 -190 -310 -184 -12 102 9 219 24 124 201 74 -239 -548 -390 -323
3560 -323 208 24 307 291 162 117 -204 -328 -336 -5 -315 -101 241 467 340 334 54 -146 -183 -206 -323 -241 -74
$$ packed form
3396F2J94l79Nq9m2K50l3P6K69K7N9j45m72J36o3q4O6j27N00Ok50L42j23L6k81
3421f0l92K64O8j17K26J35m9K37j91R8k80mk80R7rl1N81k19M4J74k13l37K86j10
3445h2j29oj22K74L21L7J17k73j14k08oj84o6M83l2J32P3K12J77p38J16J23l76
3468b71K24q5J86q1J86j5L17k92j37l92O5P8J84j14L69Q7r2J53k42k04P8j33j60
3491b91n6K74L41k68K83J6j28m7k79p9k7J71j76J25K29j6K62j88l50Lm7j22J06
3514b64K98n3J64J6J69j46k14J1m34J09K68k18J11J37J70J29r9m6j48k02q5lK83
3537d7JK64k0K31j78j63k9K8k77j20J26J72J14r3K10j95J00P7j27l13l09J58O7
3560c23N31j84K83j6j29m5l21j24qL31l10K14L42K26j27ok80k00l7k3j17Q2J67
$$ plain form
3583 -74 -61 310 400 164 7 -280 -149 -279 67 -311 200 -174 10 130 308 -96 209 -310 -278 -266 -193 -98
3605 -98 -101 -1 173 237 46 72 -70 -159 -230 -462 -126 -91 -79 57 213 350 67 74 -273 -423 -246 95 -152 363
3629 363 174 137 209 8 -31 97 -231 -257 -269 -27 -125 346 242 100 139 180 -164 -198 -291 -483 -58 -156 151 452
3653 452 273 173 329 60 -140 21 -523 -429 72 -219 270 320 148 362 88 -291 -210 -237 -313 -130 151 145
3675 145 308 159 584 202 -210 -71 -319 129 -72 273 356 287 358 -115 -2 -287 -79 -400 -305 -263 65 172
3697 172 260 305 383 29 -54 -6 -165 -368 44 -99 170 390 -63 104 162 -31 -218 -275 -216 -4 -33 -212 -2
3720 -2 151 216 154 10 -77 -130 -214 -112 -297 110 100 -35 7 225 -103 -198 -170 -540 5 -48 -51 -44 145 357 140
3745 140 251 -217 -270 -337 -153 48 -27 304 74 287 182 177 -27 -291 -215 -215 -185 -117 -156 -88 276 205 133 -8 28
$$ packed form
3583g4J3L71R0k36j57k87J31j30L46l78N11l74J84J20J78m04L05n19L2J2P3R5
3605i8lJ00J74O4j91K6j42q9p1k32L36L5J2J36J56J37k83Pl47j50J77L41k47N15
3629C63j89l7P2k01l9J28l28k6j2K42r8M71j04j42L9M1l44l4r3j92M25r8L07L01
3653D52j79j00J56k69k00J61n44R4N01k91M89N0j72K14k74l79Q1k7p6J83K81o
3675A45J63j49M25l82m12J39k48M48k01L45Q3o9P1m73J13k85K08l21R5M2L28J07
3697A72Q8M5P8l54q3M8j59k03M12j43K69K20m53J67N8j93j87n7N9K12k9j79K10
3720bJ53O5o2j44q7n3q4J02j85M07j0j35M2K18l28r5K8l70N45n3lPJ89K12k17
3745A40J11m68n3o7J84K01p5L31k30K13j05nk04k64P6%L0O8l9O8L64p1p2j41L6
$$ plain form
3770 28 7 -518 -135 18 144 129 90 146 -22 159 109 -48 -340 -270 -292 130 -57 95 107 233 67 -64 -192
3793 -192 -312 -123 -174 -134 223 242 263 249 -24 104 -187 -332 -135 -335 63 -267 50 0 98 63 -126 -145 -176
3816 -176 -174 -57 -151 -23 141 160 55 149 -104 -198 -202 -192 -148 -249 -49 46 225 -61 567 147 75 -266 -126 -194
3840 -194 -193 34 -89 300 -7 191 -46 -326 74 -269 -135 -6 -62 -16 60 -26 368 111 272 79 -235 -149
3862 -149 -140 -176 -261 161 352 260 24 12 -45 -47 -342 -180 69 -49 172 286 265 342 159 293 -39 -395 -295 -46
3886 -46 -179 -18 118 185 283 66 212 81 -261 -250 -265 -59 -164 188 132 34 14 23 -52 -2 -143 -236 -201 -103 141
3911 141 -48 308 129 190 -236 -31 -202 -147 42 -5 374 -12 256 102 211 50 -185 -98 31 -79 203
3932 203 159 264 82 213 246 -116 -171 -199 -98 -93 -225 92 163 -113 369 11 94 -107 -295 -72 31 -16 141
$$ packed form
3770B8k1n25L83J53J26j5l9N6j68J81n0j57k92P0k2M22j87J52J2J26j66j31j28
3793a92j20J89n1M0L57J9K1j4k73J28k91j45J97k00L98l30L17n0R8l5j89j9l1
3816a76KJ17r4J28J64J9j05R4k53r4mJ0M4j01K00R5J79k86O28m20p2l41J40o8
3840a94JK27j23L89l07J98k37k80M00l43J34J29n6M6P6q6L94k57J61j93l14Q6
3862a49Rl6q5M22J91r2k36j2n7kk95J62K49j18K21J14k1P7j83J34l32l56J00K49
3886d6j33J61J36O7R8k17J46j31l42J1j5K06j05L52n6r8k0Rp5N0j41r3L5R8K44
3911A41j89L56j79O1m26K05j71N5J89m7L79l86K68j54J09j61k35Q7J29j10K82
3932B03m4J05j82J31L3l62n5k8J01Nj32L17P1k76M82l58Q3k01j88K23J03m7J57
$$ plain form
3955 141 127 355 177 -1 218 15 -40 -112 -233 -201 144 134 75 -80 60 7 -94 -236 -179 -370 -223 -95 -330
3978 -330 165 266 119 201 -50 15 -329 -437 -69 -30 -167 92 129 150 285 190 -184 -349 -53 -63 -286 3
4000 3 291 303 43 3 81 -241 -229 -230 -229 -109 -38 84 124 191 259 62 100 -209 -49 -107 -87 116 80 214 349 79
4026 79 350 131 20 -178 -241 -199 -177 -17 244 180 239 314 -23 6 -99 -219 -45 194 46 157 82 277 456
4049 456 25 80 54 -120 -43 -21 7 157 152 332 226 -155 98 -36 -221 -51 -237 193 197 469 231 221 -41
4072 -41 116 18 50 -59 -331 230 72 200 245 308 230 115 -7 -244 -444 -192 -223 -53 285 107 319 116
4094 116 126 -257 -195 -202 -8 -116 -45 108 38 132 168 38 -174 -115 -429 -362 63 -185 133 192 62 173 79 117
4118 117 -455 -200 153 -219 -219 -151 287 -25 -33 128 -156 -377 31 -388 -111 -26 -74 35 231 291 72 10 112
$$ packed form
3955A41j4K28j78j78K19k03n5p2j21L2L45j0n9j55J40n3j01j42N7j91J47J28k35
3978c30M95J01j47Q2k51O5l44j08L68L9j37K59L7K1J35r5l74j65K96j0k23K89
4000CK88J2k60m0P8l22J2jJJ20P1J22M0O7O8j97L8l09J60n8K0K03l6J34J35k70
4026G9K71k19j11j98o3M2K2J60K61o4N9P5l37K9j05j20J74K39j48J11p5J95J79
4049D56m31N5k6j74P7K2K8J50nJ80j06l81K53j34j85J70j86M30MK72k38j0k62
4072d1J57r8L2j09k72N61j58J28M5O3p8j15j22k37k00K52l1J70L38j78K12k03
4094A16J0l83O2pJ94j08P1J53p0R4L6j30k12N9l14O7M25k48L18N9j30J11r4L8
4118A17n72K55L53l72%O8M38l12qJ61k84k21M08m19K77Q5m8J09J96O0k19o2J02
$$ plain form
4141 112 -365 -178 -84 -166 124 -36 95 333 128 161 12 -102 -273 -244 -102 -226 -192 174 2 73 -2 -119
4163 -119 -196 -50 -175 -238 -15 -85 178 255 313 320 6 -129 -256 -310 -78 49 -145 -175 114 353 -15 209 -181
4186 -181 -66 -376 -480 -345 158 308 239 390 75 -206 14 -86 -129 -84 -337 47 50 265 135 317 260 -184
4208 -184 94 28 -247 -152 -10 -95 -69 49 150 175 -106 -67 126 -200 107 -161 57 -24 34 390 394 208 -79
4231 -79 -347 -388 -118 -79 232 -81 21 421 -53 514 39 153 -15 -154 31 -8 -109 44 377 49 108 -71
4253 -71 -256 -84 -200 -38 -95 -92 209 -98 251 179 -71 175 -201 -314 -56 -107 353 173 189 184 200 206 -53 -69
4277 -69 115 -402 -197 -51 -16 191 400 -38 26 194 -289 -200 -140 -31 -15 73 284 190 -4 37 96 -46 -160
4300 -160 -472 -214 -162 141 483 47 193 271 264 -157 105 -293 -166 -73 -109 -33 323 286 161 57 14 109 -163
$$ packed form
4141A12m77J87R4q2K90j60J31K38k05L3j49j14j71K9J42j24L4L66j72P1p5j17
4163a19p7J46j25o3K23p0K63P7N8Pl14j35j27n4K32J27j94l0K89K39l68K24l90
4186a81J15l10j04J35N03J50o9J51l15k81K20j00m3M5k53L84LK15j30J82n7m44
4208a84K78o6k75R5J42q5K6J18J01K5k81L9J93l26L07k68K18q1N8L56Mj86k87
4231g9k68m1K70L9L11l13J02M00m74N67m75J14j68j39J85l9j01J53L33l28N9j79
4253g1j85J72j16J62n7LL01l07L49p2k50K46l76j13K58n1M60j80J6nJ6Ok59j6
4277f9J84n17K05J46L5K07K09m38O4J68m83Q9O0J09J6Q8K11r4j94M1N9j42j14
4300a60l12K58N2L03L42m36J46P8pm21K62l98J27R3l6P6L56l7j25j04m3R5k72
$$ plain form
4323 -163 -133 -133 -41 241 256 188 18 -50 -30 -48 -32 -461 220 -5 64 70 -83 411 -63 -104 -150 56 -183 -307 92
4348 92 208 272 314 339 364 121 -99 -314 -136 -42 -156 195 -2 102 303 170 130 80 -43 -121 -305 -111 54
4371 54 169 147 178 158 228 238 40 -359 -158 -12 -120 16 86 116 210 210 300 240 -7 -122 3 -115 19 103 220
4396 220 257 -215 -207 19 -143 -139 89 -1 -24 187 212 190 -6 209 -108 -418 -272 -197 -306 19 55 172 209 95
4420 95 152 -210 -362 -242 -316 -2 -34 106 167 227 71 -224 271 -116 -57 -445 202 86 130 269 -10 169 202
4443 202 -87 62 -30 16 -315 -106 -68 56 238 318 115 -80 106 -150 -251 -37 184 58 80 66 54 -53
4465 -53 185 171 -295 -48 -445 -245 -49 -12 -61 151 229 -70 -43 -69 -234 -117 -233 89 56 87 154 181 68 -127
4489 -127 96 19 -214 86 -2 -44 382 84 -52 131 0 -89 -176 8 -334 198 -13 194 273 94 -40 177
$$ packed form
4323a63L0%R2K82J5o8j70o8K0j8J6m29O81k25O9Oj53M94m74m1m6K06k39j24L99
4348I2J16O4M2K5K5k43k20k15J78R4j14L51j97J04K01j33m0n0j23p8j84J94J65
4371E4J15k2L1k0P0J0j98l99K01J46j08J36P0L0R4%R0o0k47j15J25j18J34Q4J17
4396B20L7m72QK26j62MK28r0k3K11K5k2j96K15l17l10J46P5j09L25L6J17L7j14
4420I5N7l62j52J20p4L14l2J40O1O0j56k95M95l87N9l88O47j16M4J39k79J79L3
4443B02k89J49r2M6l31K09L8J24J82Q0k03j95J86k56j01K14K21j26K2j4j2j07
4465e3K38j4m66K47l97K00J96L7m9K12P8k99K7k6j65J17j16L22l3L1O7K7j13j95
4489a27K23p7k33L00q8m2M26k98j36J83j31q9q7J84l42N32k11K07P9j79j34K17
$$ plain form
4511 177 72 -244 -7 11 -113 -46 -170 177 -46 17 75 -17 -258 -125 -342 -275 -300 52 178 80 38 314 -104
4534 -104 139 -253 -188 -475 311 380 111 285 -74 52 85 19 -121 -133 -288 -18 52 267 59 250 250 56 -263
4557 -263 -56 -157 -287 7 284 111 285 65 146 -83 -199 -20 -205 -247 -179 -122 -164 275 108 284 -43 -3
4579 -3 -65 -201 -418 70 -173 58 -25 292 279 297 155 76 -236 -83 -81 -230 -19 21 34 385 32 -6 -158 -182
4603 -182 -120 -275 -160 -422 208 177 236 56 203 -101 -196 -344 -77 -166 -146 84 49 415 31 -126 -44 131 -189
4626 -189 -66 -222 -129 -95 57 198 -75 411 57 -222 -258 -28 -139 -88 -59 54 261 80 74 -104 -163 -211 -334
4649 -334 -88 -1 -67 5 76 366 -211 -214 -85 -83 64 -78 -93 56 303 -20 179 486 -67 -194 -25 65 -85
4672 -85 4 -167 266 253 183 367 146 99 87 -302 -150 -168 13 -159 111 231 163 -11 -71 276 -209 -228 188
$$ packed form
4511A77j05l16K37J8j24O7j24L47k23O3N8r2k41J33k17O7k5L52J26r8m2K76m18
4534a04K43l92O5k87P86O9k69J74l59J26L3o6j40j2j55K70P0K15k08J91%j94l19
4557b63K07j01j30K94K77j73J74k20Q1k29j16J79j85m2O8N7m2M39j67J76l27M0
4579co2j36k17M88k43K31q3L17j3J8j42p9l12J53Kj49K11M0J3L51l53l8j52k4
4603a82O2j55J15k62O30l1N9j80J47l04r5j48K67q9K0K30l5L66l84j57Q2J75l20
4626a89J23j56R3L4J52J41k73M86l54k79l6K30j11N1K9J13K07j81oj78n9m8j23
4649c34K46Q7o6P2P1K90n77lJ29KJ47j42j5J49K47l23J99L07n53j27J69R0j50
4672h5Q9j71M33j3p0J84k21m7j2l89J52j8J81j72K70J20o8j74o0L47m85j9M16
$$ plain form
4695 188 -144 -103 115 -83 68 116 -146 105 -136 -86 -200 -201 -124 63 217 -22 21 46 -193 -19 -342 -157 -237
4718 -237 -55 55 -12 171 -4 29 133 -105 -296 -268 77 -45 -176 224 172 182 75 -5 -232 -258 63 -84
4740 -84 -154 85 35 182 284 427 -42 156 -237 -124 -134 -17 -154 86 -139 62 214 114 119 -144 -325 -176
4762 -176 130 -115 191 215 114 332 92 226 -116 -197 -152 -72 -121 -28 -127 231 182 285 -55 42 -50 -318 -10
4785 -10 -116 234 -45 379 166 16 107 108 -278 -66 -124 -302 98 255 121 315 31 59 101 33 -21 -313 -36
4808 -36 -32 -110 167 323 242 -82 -75 -117 -103 -241 -32 -196 -50 192 107 56 -11 -142 -171 -367 -206 -2 -116 -45 -205
4833 -205 242 79 83 -177 -129 -25 8 -175 138 -152 243 -7 326 35 205 266 5 -274 -104 -182 36 72
4855 72 60 242 118 -68 -60 -43 -111 -255 13 -193 24 187 295 312 -95 152 -190 -260 -413 99 -87 191 42
$$ packed form
4695A88l32M1K18j98J51M8k62K51k41N0j14jP7J87J54k39M3K5k39J74l23J85q0
4718b37J82J10o7J83j75L3J04k38j91K8L45j22j31M00n2J0j07q0k27k6L21j47
4740h4p0K39n0J47J02J43m69J98l93J13j0J17j37K40k25K01J52j00Nk63j81J49
4762a76L06k45L06K4j01K18k40J34l42q1M5Q0m9R3r9L58m9J03l40R7r2k68L08
4785a0j06L50k79M24k13j50R1Jl86K12n8j78M00J57j34J94k84K8M2o8n4k92K77
4808c6Mp8K77J56q1l24Pm2J4j38K09j64J46K42q5n1o7j31k9j96J61K04j14P1j60
4833b05M47j63Mk60M8J04L3j83L13k90L95k50L33k91J70O1k61k79J70p8K18L6
4855G2j2J82j24j86QJ7o8j44K68k06K17J63J08J7m07K47l42p0j53N12j86K78j49
$$ plain form
4878 42 325 184 -63 -51 -113 -318 -340 -298 -133 -190 93 187 238 30 -6 192 73 -376 -367 -165 105 76 226 9
4902 9 135 32 125 -233 -152 -280 -51 -208 127 -22 137 107 70 121 24 18 -70 -131 32 21 67 -121 -6 162 61
4927 61 129 -267 111 -301 58 114 274 245 72 227 125 -62 -160 -125 -11 -161 -165 -65 -16 167 165 -66 -56 -81
4951 -81 -238 17 -223 -24 -64 61 208 391 360 -34 -172 -58 -110 -120 -139 -58 -2 266 126 17 176 -56 -22
4974 -22 -213 -133 -158 -44 -83 -80 188 1 294 -38 -51 -3 -102 -51 -139 -69 -297 111 -232 83 90 -75 -160 -145 144
4999 144 -47 162 222 240 2 110 -36 293 80 -16 -362 -156 -66 98 122 243 318 177 23 -333 -385 -23
5021 -23 138 -131 78 289 158 182 87 133 10 -203 57 17 154 -169 58 336 -55 239 -97 -321 3 -116
5043 -116 -126 -37 141 -76 -265 50 -19 77 -209 -390 -20 6 -145 104 282 247 177 -4 279 -104 37 2 -87
$$ packed form
4878D2K83j41k47J2o2k05k2M2J65n7K83R4N1k08l6J98j19m49RK02K70k9J50k17
4902IJ26j03R3l58Q1j28K29j57L35j49J59l0l7N1r7oq8o1J63j1M6j88J15J68j01
4927F1O8l96L78m12L59N6J60k9j73J55j02j87r8L5J14j50mJ00M9J83kk31J0k5
4951h1j57K55k40J99m0J25J47J83l1l94j38J14n2j0j9Q1N6K68j40j09J59k32L4
4974b2j91Q0k5J14l9LK68j87K93l32j3M8r9N1q8P0k28M08l43L15Pj65q5J5K89
4999A44j91K09O0J8k38J08j46L29k13r6l46K06R0J64K4J21P5j41j54l56n2L62
5021b3J61k69K09K11j31K4r5M6j23k13K60m0J37l23K27K78l91K94l36k24L24j19
5043a16j0Q9J78k17j89L15o9R6k86j81L70K6j51K49J78l5p0j81K83l83J41l5q9
$$ plain form
5066 -87 -15 82 41 -80 -19 -172 116 86 -128 251 -148 40 10 5 313 89 275 57 -333 -32 98 -145 -210
5089 -210 -15 226 39 386 199 132 -123 -213 -145 158 11 -403 215 60 62 272 -99 262 11 -411 -45 -289
5111 -289 -3 -43 42 -14 227 84 164 -63 27 -205 -241 -241 -123 8 132 21 89 -243 -40 -121 -85 -173 -144 228
5135 228 -170 152 -81 169 242 102 -41 130 -285 -155 -100 -104 191 63 202 73 -173 -4 -94 -29 -101 -250
5157 -250 -127 -304 319 287 90 332 50 -101 -75 -127 -318 -159 -179 191 147 173 27 231 38 -225 -98 -240
5179 -240 -275 -119 31 164 364 84 -104 -144 -16 33 -17 24 143 61 259 317 26 -140 179 -26 -233 -85
5201 -85 269 82 -27 182 133 190 95 -72 -96 26 -246 -175 -82 -318 -8 252 20 -14 82 -6 -335 -187 -165 -76
5225 -76 150 -179 199 -28 240 86 87 -29 -91 -281 -245 61 254 167 40 432 -45 -98 -39 -192 -119 -205 -41
$$ packed form
5066h7P2R7m1j21O1j53K88l0k14L79l99J88l0nL08k24J86k18l90L01J30k43o5
5089b10J95K41j87L47j87o7k55r0O8L03j47m14O18j55KK10l71L61k51m22L66k44
5111b89K86m0Q5n6K41j43Q0k27R0k32l6%J18J31J24j11O8l32K03q1L6q8K9L72
5135B28l98L22k33K50P3j40j43J71m15J30N5mK95j28J39j29k46J69r0O5p2j49
5157b50J23j77O23l2j97K42k82j51K6n2j91J59k0L70m4K6j46K04j93k63J27j42
5179b40l5J56J50J33K00k80j88m0J28M9n0M1J19q2J98N8k91j66L19k05k07J48
5201h5L54j87j09K09m9N7r5j67k4J22k72P1R3k36L10K60k32l4R6q8l29J48K2Q9
5225g6K26l29L78k27K68j54Jj16o2j90L6L06J93q7j27L92m77n3N9j53P3q6J64
$$ plain form
5248 -41 61 96 185 163 186 -60 -24 -255 -201 -42 47 -13 90 180 61 30 45 60 -100 -141 -14 -24 -65 60 215
5273 215 188 80 99 49 -176 -5 -92 -86 71 158 51 96 -47 -58 -132 -63 57 -158 -120 -290 -69 -48 -105 241 54
5298 54 -109 -39 -217 -384 105 -60 228 130 199 -16 155 -3 -217 -196 20 8 -83 -152 60 142 144 231 367 38
5322 38 -25 182 -287 -25 -73 -42 392 109 139 113 -294 1 -8 -62 -219 35 -182 18 62 105 -61 -95 -137 -24
5346 -24 -346 -295 -164 -261 177 85 6 362 233 115 8 53 -186 -68 -117 41 7 40 -123 171 102 69 136 -261
5370 -261 -103 -212 -76 -32 182 163 -125 -1 133 -8 -271 -433 187 169 -42 106 120 188 -45 232 156 -196
5392 -196 -39 10 -144 232 -14 330 428 -173 -115 -261 -70 49 -189 -276 -128 38 13 207 -63 214 208 -120
5414 -120 -203 -98 -40 382 -23 -4 3 145 75 -234 140 -29 -270 1 -214 -116 -24 126 164 -233 -31 279 -50
$$ packed form
5248d1J02L5Q9k2K3k46L6k31N4J59Q9o0J03R0j19l1J5J5j60m1J27j0m1J25J55
5273B15k7j08J9n0k25J71q7OJ57Q7j07M5j43j1p4O9J20k15L8j70K21K1n7L46j87
5298E4j63P0j78j67M89j65K88r8O9k15J71j58k14K1K16j2r1o9K12Q2KQ7J36l29
5322C8o3K07m69K62m8L1M34k83L0k6m07K95rn4j57K54k17K00M4M3j66l4m2J13
5346b4l22N1J31r7M38r2p9L56j29j18j07M5k39J18m9J58l4L3j63K94o9l3O7l97
5370b61J58j09J36M4K14j9k88J24J34j41k63j62O20j8k11J48J4O8k33K77p6l52
5392a96J57M9j54L76k46L44R8o01N8j46J91J19k38q7J48J66k5J94k70K77ol28
5414a20q3J05N8M22m05J9PJ42p0l09L74j69k41K71k15R8R2J50L8l97K02L10l29
$$ plain form
5437 -50 -20 -185 33 400 77 -8 13 38 -37 87 -298 -257 -331 -47 -47 170 57 26 299 87 -48 -30 -46 -282
5461 -282 -195 47 120 59 -157 286 65 62 86 4 -51 -118 -15 -61 -29 -12 295 15 39 -359 -187 -40 -121 -186 171
5486 171 -19 216 43 140 -68 -224 11 -264 -30 -322 32 33 -36 388 131 -241 -136 63 20 -53 -116 -215 -49
5509 -49 148 162 130 25 -151 -188 -156 106 -200 -73 81 -72 185 154 -22 -119 -130 -78 -68 15 -178 7 -41 135
5533 135 357 54 -45 -63 177 -102 -30 -23 -111 -53 -178 163 12 176 294 12 19 -203 39 -126 174 367 -17
5556 -17 -39 134 -8 29 101 -152 -5 -6 -90 30 288 23 179 -19 -205 -27 73 -57 -175 82 -65 -106 -246
5579 -246 266 144 -69 -95 -63 -152 33 263 52 -36 87 87 91 -71 13 -217 -129 -230 -19 -341 233 92 258
5602 258 120 -272 -121 -270 -74 -68 -370 -273 46 -94 42 38 308 -11 -363 -5 52 -198 -56 115 48 437
$$ packed form
5437e0L0j65K18L67l23q5K1K5p5J24l85M1p4K84%K17j13l1K73k12j35J8j6k36
5461b82Q7K42P3o1k16M43k21lK4q2n5o7J03m6L2J7L07k80K4l98J72J47q1o5L57
5486A71j90K35j73R7k08j56K35k75K34k92L54Jo9M24k57l72J05J99m3p3o3r9J66
5509d9J97J4l2j05j76l7L2K62l06J27J54j53K57l1j76r7j1N2J0Q3j93J85m8J76
5533A35K22l03r9j8K40k79P2Pq8N8j25L41j51J64J18k82Pk22K42j65L00J93l84
5556a7k2J73j42L7P2k53J47jq4J20K58k65J56j98j86J78J00j30j18K57j47m1j40
5579b46N12j22k13k6L2q9J85K30k11q8J23%Mj62Q4k30Q8j01K11l22N74j41J66
5602B58j38l92J51j49J96Ol02R7L19j40J36mK70l19l52L58N7k50J42J71o7L89
$$ plain form
5624 437 -193 -8 -55 -136 -217 -275 -138 7 -10 -218 109 -69 110 -135 -101 -54 -272 -10 60 163 248 80 208
5647 208 217 -80 -74 -365 -141 42 -373 -109 -50 156 44 273 35 112 -34 -142 -30 -43 36 56 -151 84 -166
5670 -166 57 46 -18 67 -251 -283 29 182 9 139 239 487 283 -146 58 -50 -188 -72 169 101 -210 116
5692 116 136 -114 -64 -107 138 -118 -171 90 -205 148 32 -126 9 -72 -186 -465 -119 -342 231 150 -134 64
5714 64 74 13 259 -81 -252 6 20 -11 3 52 96 -145 -50 -155 115 -125 203 -292 -198 -284 -33 322 256 128
5738 128 95 262 -138 -63 -108 39 55 159 188 -38 55 110 -247 131 44 170 -238 106 22 -66 87 283 -96
5761 -96 53 72 -204 -263 -35 66 37 5 409 -21 37 -247 -102 -58 -262 -34 -64 -38 -71 283 78 414 320 -22
5785 -22 -119 115 -110 11 57 33 28 138 157 -130 59 -151 -160 -14 88 -91 -27 33 1 -36 234 90 15 -120 -243
$$ packed form
5624D37o30J85m7q1q1n8J37J45j7k08L27j78J79k45L4M7k18K62P0J03Q5j68J28
5647B08Rk97Ok91K24J83m15K64N9K06j12K29k38P7j46j08J12j3P9K0k07K35k50
5670a66K23j1o4Q5l18l2L12J53j73J30J00K48k04m29K04j08j38J16K41o8l11L26
5692A16K0k50N0m3K45k56n3K61k95L53j16j58J35q1j14k79L46k23N73q1k84J98
5714F4J0o1K46l40j71K58J4l1J4M9M4k41R5j05K70k40L28m95R4q6K51L55o6j28
5738A28l3J67m00P5m5J47J6J04K9k26R3N5l57L78q7J26m08L44q4q8J53J96l79
5761i6J49J9k76n9K28J01k9l2M04m30N8k84J45M4k04K28l0K6l3L54k05L36r4l42
5785b2r7K34k25J21M6k4nJ10J9k87J89k10rJ46J02j79O4O0l2l7K70j44p5j35j23
$$ plain form
5810 -243 -35 16 53 51 -2 -74 111 -317 0 124 -73 20 -150 161 -113 533 131 -108 -9 -155 219 -128 -128
5833 -128 -90 -40 -32 100 204 -1 10 -15 -86 -9 -177 -152 -46 95 -134 -158 -3 59 -58 -331 -89 -141 -239 -162 168
5858 168 44 34 162 -198 -195 -29 -172 -92 1 49 280 91 245 36 268 -60 0 97 -107 -79 33 322 -32
5881 -32 -127 105 -100 81 -189 101 27 171 -56 -179 150 4 -262 159 54 -144 -331 -18 -93 -34 143 -89
5903 -89 -8 333 -55 -33 77 31 -112 -60 -59 -270 -270 -66 73 -119 60 81 -98 248 -16 20 -85 -36 -156 189
5927 189 -225 -29 186 85 -59 -171 -87 -11 235 -107 -173 145 42 9 -170 -177 -409 -362 20 156 -65 -46 88
5950 88 -110 114 -1 -224 -149 -114 90 -103 403 -103 11 -138 -56 162 -170 31 -84 34 49 -144 34 57
5972 57 -52 -23 117 -7 311 6 34 -72 0 15 133 108 77 -113 70 -30 -94 -70 -78 -62 -20 123 -158 73
$$ packed form
5810b43K08N1L7kn3p2J85m28L17J24j97R3j70L11k74O46m02k39R9j46L74l47%
5833a28L8N0QJ32J04k05J1k5p1P7j68K5J06J41k29k4J55O2j17k73K42n2r8P7L30
5858A68j24j0J28l60LJ66j43Q0R3M8K31j89J54k09K32l28O0R7k04K8J12K89l54
5881c2r5K32k05J81k70K90p4J44k27j23L29j46k66M21j05j98j87L13p5N9J77k32
5903h9Q1L41l88K2J10m6j43N2Jk11%K04J39j92J79K1j79L46k64L6j05M9j20L45
5927A89m14J96K15j01j44j12Q4P6K46l42o6L18j03l3j79pk32M7L82J36k21J9J34
5950H8j98K24j15k23P5L5K04j93N06n06J14j49Q2K18l32K01j15J18J5j93J78K3
5972E7j09K9J40j24L18l05K8j06P2J5J18k5l1j90J83j00o4K4qJ6M2J43k81K31
$$ plain form
5996 73 206 59 -137 -58 -90 -83 -213 5 -9 88 -291 -117 -46 -169 20 -225 -238 -117 -144 37 -73 97 240
6019 240 -13 155 84 -6 -165 -226 -159 -53 139 -22 -53 -121 82 118 -68 -63 -98 -71 -64 200 -50 49 174 -76 -22
6044 -22 192 -52 -107 32 66 -72 91 50 256 -117 164 -92 -91 -63 -51 184 -80 78 -232 -101 -125 -54 -95 108
6068 108 -408 -37 35 -232 -59 51 43 129 15 59 -151 -209 -75 -175 -348 4 -197 -100 155 -2 -58 -269 213
6091 213 3 167 -21 46 -26 92 202 83 27 -161 -341 63 -11 -108 116 -305 49 159 141 -17 -380 158
6113 158 -158 -97 -4 271 317 131 -71 101 56 -19 211 185 83 -423 37 -73 11 -209 -44 -36 -97 -131 -185 97
6137 97 13 112 83 81 -43 -4 19 -4 234 -60 -285 -66 37 104 -47 89 10 57 225 -105 -16 -114 184 97 79
6162 79 74 -55 155 -215 -183 73 -203 272 -171 21 -235 71 46 -39 -15 -186 -48 -100 -119 115 -120 -122 275 -33
$$ packed form
5996G3J33j47j96P9l2Pj30K18j4R7l79J74P1j23J89k45j3J21k7J81j10J70J43
6019B40k53J68p1r0j59o1O7J06J92j61l1o8K03L6j86Nl5K7PK64k50R9J25k50N4
6044b2K14k44n5J39L4j38J63m1K06l73K81k56JK8J2K35k64J58l10J31k4P1m1K03
6068A08n16L71P2k67J73J10qQ6j14M4k10n8J34j00j73L52k01R7K55j57n6k11M82
6091B13k10J64j88O7p2J18J10j19n6j88j80M04p4r7K24m21L54J10j8j58l63N38
6113A58l16O1R3K75M6j86k02J72m5p5K30k6j02n06M60j10Q4k20J65Qo1l4n4K82
6137I7q4R9k9kj24L9K3k3K38k94k25K19J03O7j51J36p9M7J68l30Q9r8K98q7j8
6162G9nj29K10l70L2K56k76M75m43J92k56L06k5q5K4j71J38n2j9K34k35kL97l08
$$ plain form
6186 -33 -258 -191 -155 -111 83 -205 196 28 77 20 9 -173 -109 -79 -133 7 -100 -42 -135 51 -49 130 -154 38
6210 38 -116 36 136 -68 166 -258 -241 262 202 -80 -121 -138 -161 -87 100 -334 -82 50 -54 51 -70 -114 321
6233 321 32 -121 -201 -32 -32 58 61 -65 -145 -110 6 -160 86 162 -117 -235 106 172 -240 -64 -81 -53 -64 8 56
6258 56 15 -69 100 165 -230 15 179 -6 -27 -19 109 -140 -72 -95 -111 -9 2 28 221 -107 -210 48 -116 28
6282 28 -274 -135 -20 -153 -79 -92 -160 -111 -321 -36 60 -165 -140 -67 -129 -66 245 29 -253 -75 -178 4 -169
6305 -169 76 11 -172 64 -229 266 -256 66 365 266 -129 325 90 -205 -46 -123 112 40 46 -5 -12 -231 21
6328 21 -120 203 19 48 -43 223 -5 126 14 22 -26 -191 -210 55 118 270 98 -40 104 167 135 -242 -75
6351 -75 -226 61 7 182 48 64 1 93 -285 -192 -256 -145 15 82 10 85 28 -10 51 15 -8 162 -105 -56 -224
$$ packed form
6186c3k25O7L6M4J94k88M01j68M9n7j1j82O4L0n4J40j07N8r3J86j00J79k84J92
6210C8j54J52J00k04K34m24J7N03o0k82m1j7k3P4J87m34K52J32j04J05j21m4M35
6233C21k89j53q0J69%R0Lj26q0L5J16j66K46P6k79j18L41O6m12J76j7K8j1P2M8
6258E6m1q4J69O5l95K45J64j85k1QJ28k49O8k3j6J02J1K6J93l28j03K58j64J44
6282B8l02J39J15j33P4j3o8M9k10K85R6k25K5P3o2O3L11k16k82J78j03J82j73
6305a69K45o5j83K36k93M95n22L22K99r9l95M54k35k95J59p7K35p2On1pk19K52
6328B1j41L23j84K9r1K66k28J31j12Qm8j65j9K65O3J52j72j38J44O3l2l77J67
6351g5j51K87n4J75j34J6o3R2l78R3o4J11J60O7p2P5n7l8O1l6k3J70k67M9j68
$$ plain form
6376 -224 -166 178 116 177 117 -142 -215 -179 481 -235 262 83 214 24 48 85 -1 154 -2 -96 -116 130 78 -181
6400 -181 -58 203 -151 159 -101 -63 -146 -251 -176 -224 178 -245 -154 -271 -65 -166 -19 -218 -71 101 -285 -68
6422 -68 93 86 314 184 106 103 269 -19 -152 -202 -136 -60 -255 -126 90 -183 -107 -86 59 51 -132 64 180 26
6446 26 -8 190 92 332 248 -305 189 -123 -106 1 58 85 105 263 227 80 -184 -52 -84 113 210 -60 10 -132
6470 -132 113 62 114 103 118 -83 227 279 35 -261 33 -59 -124 304 -25 125 33 37 -75 62 -16 9 265 -312
6494 -312 -41 -144 83 149 5 -85 120 -142 -7 19 170 -32 -57 -74 101 205 109 -22 -3 -40 3 386 112
6517 112 56 94 -52 54 128 205 -36 52 53 62 289 54 -49 169 -302 -155 1 -69 164 239 104 -159 162 145
6541 145 -201 105 -102 -120 22 -195 56 -66 -123 50 -12 -95 -91 -1 -97 15 191 -150 -59 210 -206 -71 57
$$ packed form
6376b24N8L44o2O1o0k59p3L6O60p16M97j79J31j90K4L7q6J55j56r4k0K46n2k59
6400a81J23K61l54L10k60L8q3j05P5m8M02m23R1j17K06j01J47j99J47J72l86K17
6422f8J61pK28j30p8lJ66k88j33n0O6P6j95J29K16k73P6K1J45qj83J96J16j54
6446B6l4J98r8K40q4n53M94l12J7J07N7K7K0J58l6j47k64J32l2J97R7k70P0j42
6470a32K45n1N2j1J5k01L10N2k44k96K94r2o5M28l29J50r2Mj12J37p8K5K56n77
6494c12K71j03K27O6j44r0K05k62J35K6J51k02k5j7J75J04r6j31J9l7M3L83k74
6517A12n6L8j46J06P4P7k41Q8JRK27k35j03K18m71J47J56p0K33P5j35k63L21j7
6541A45l46L06k07j8J42k17K51j22n7J73o2q3MR0r6J12J76l41R1K69m16J35J28
$$ plain form
6564 57 -173 86 52 59 234 65 158 21 -10 -24 224 99 125 49 0 195 113 123 -28 170 -48 84 -32 235
6588 235 1 318 43 238 261 -39 93 -86 -58 -42 48 -24 115 30 24 -116 50 -45 -249 0 -68 -105 -61 -10
6612 -10 214 -177 45 158 101 -72 22 80 259 90 -141 179 -76 81 107 117 124 19 200 74 -39 32 -10
6635 -10 -98 -99 31 116 -91 173 -239 -58 -324 94 78 -26 -172 -132 -153 56 -21 -188 138 -74 -77 -188 217 -76
6659 -76 246 -303 -6 139 -82 59 23 -32 -244 86 71 168 34 -97 195 64 -177 96 181 -270 -126 110
6681 110 74 230 -47 98 -98 -282 221 91 -110 -94 -258 -123 -60 -81 -48 -22 85 -69 -182 130 -91 -212
6703 -212 -48 205 96 76 -59 -25 -139 173 -108 -82 -140 124 -102 96 -134 6 -90 160 69 -89 -28 344
6725 344 120 43 52 -251 95 286 -76 -148 22 41 13 -4 57 207 27 395 -39 131 67 -227 -70 -141 107
$$ packed form
6564E7k30K59l4PJ75j69R3j37l1j4K48j25K6p6m9J95q2J0j51J98k18J32j16K67
6588B35k34L17k75J95K3l00J32j79K8J6R0p2J39q5oj40J66r5k04K49o8l7M4N1
6612a0K24l91K22J13n7j73R4N8J79j69k31L20k55J57K6J0Pj05J81j26j13P1m2
6635a0q8jJ30Q5k07K64m12J81k66M18j6j04j46M0k1K09p7j67L26k12lj11M05k93
6659g6L22n49K97J45k21J41l6n5k12L30j5R7j34j31K92j31k41K73Q5m51J44K36
6681A10l6J56k77J45j96j84N03j30k01J6j64J35O3k1L3K6J07j54j13L12k21j21
6703b12J64K53j09k0j35L4j14L12k81K6n8K64k26J98k30J40r6K50r1j58O1L72
6725C44k24p7Rl03L46J91l62p2J70J9k8j7O1J50j80L68m34J70o4k94J57p1K48
$$ plain form
6748 107 -16 21 -67 290 9 96 -106 -158 -66 64 -164 -23 -85 -219 -160 -26 -32 35 -181 148 -4 -75 240 -94
6772 -94 -256 37 31 -264 49 -106 -50 135 -32 281 50 125 104 28 -91 169 -1 -158 -437 -99 121 -6
6794 -6 -131 96 -97 -4 111 -106 167 127 -34 -106 132 78 -137 239 -228 -246 63 345 1 -91 329 55 -117
6817 -117 -180 69 55 -171 289 137 148 -105 189 324 -45 -159 -243 56 -117 -115 209 -60 -1 -176 74 -222
6839 -222 -282 130 -118 80 52 -63 136 -152 135 62 84 127 18 -87 136 -15 -344 83 256 -121 -31 52
6861 52 -72 481 85 156 -160 -262 26 16 -96 -49 -195 25 35 181 -119 -403 -231 -182 29 38 -173 23 97
6884 97 134 -66 204 78 55 -322 -335 -23 -282 -178 -204 36 -106 155 9 35 15 -243 6 245 36 91 -100
6907 -100 -172 62 -147 -75 254 108 -110 191 -232 151 285 -107 76 85 32 9 -16 -205 34 16 -65 210 135
$$ packed form
6748A07j23L7q8L57k81Q7k02n2R2J30k28J41o2j34N9J34oO7k16L29j52p1L15l34
6772i4j62K93ok95L13j55N6J85j67L13k31P5k1p6j19K60j70j57k79L38K20j27
6794fj25K27j93R3J15k17K73m0j61p2K38n4k15L76m67j8L09K82l44r2M20k74j72
6817a17o3K49j4k26M60j52J1k53K94J35l69j14q4K99j73KL24k69N9j75K50k96
6839b22o0M12k48J98k8j15J99k88K87p3K2M3j09j05K23j51l29M27J73l77R0Q3
6861E2j24N53l96P1l16j02K88j0j12M7j46K20J0J46l00k84J72M9K11Rk11J96P4
6884I7L7k00K70j26k3l77j3L12k59J04k6K40j42K61j46K6k0k58K49K39k09N5j91
6907a00p2K34k09P2L29j46k18L01m23L83J34l92J83Rn3k3k5j89K39j8q1K75p5
$$ plain form
6930 135 217 123 50 208 -112 -268 52 83 212 83 18 -15 -13 41 155 25 17 -74 -56 23 -9 -229 134 -149 10
6955 10 -118 -19 117 -50 -110 170 -88 -189 184 48 274 175 312 105 -241 183 -18 89 129 -48 232 -21
6977 -21 103 -17 55 -43 -15 -7 5 55 67 -55 -69 143 114 125 66 75 29 8 -26 167 -254 43 31 2 85 2 -35 -123
7005 -123 192 62 238 -171 41 -164 -118 136 -42 75 269 133 85 219 21 -195 -299 -21 50 16 166
7026 166 -10 -192 -44 131 -171 63 -213 -31 33 -200 -100 -66 14 169 175 27 -184 81 62 -10 -131 -119 -66
7049 -66 90 -164 -131 114 118 167 131 -294 -40 72 159 -80 100 13 -69 -22 326 153 -281 -28 123 99 22 -221
7073 -221 211 -156 45 86 -99 -258 -61 97 -129 114 50 9 14 -43 157 -59 193 -227 -8 126 -234 -18
7095 -18 -7 -46 -110 22 36 286 37 44 95 250 -78 -101 -198 -40 0 -67 52 151 -102 -150 68 -21 233 -234 24
$$ packed form
6930A35Q2r4p3J58l20j56L20L1J29j29o5l3KN4J14j30qr1J8P9l2k20L63k83J59
6955A0j28R9J36j67o0K80k58j01L73j36K26r9J37k07l46M24k01J07M0j77K80k53
6977b1J24j20P2r8K8QJ2N0J2j22j4K12k9J1n9Rm6k1l4J93m21K97j2k9Q3q3l7q8
7005a23L15j30J76m09K12k05M6K54j78J17J94j36m8J34j98k16j04K78P1l4J50
7026A66j76j82J48J75l02K34k76J82O4k33J00L4Q0J55Oj48k11K65j9p2j21J2N3
7049f6J56k54L3K45MM9l6m25K54J12Q7k39J80q7q2M7L48j73m34K53J51k4p7k43
7073b21M32l67K01M1j85j59J97J58k26K43o4m1Nn7K00k16K52m20K19J34l60K16
7095a8J1l9o4J32J4K50k49PN1J55l28k3r7J58M0o7J19R9k53m8K18q9K54m67K58
$$ plain form
7120 24 252 265 169 -90 91 -53 234 270 -138 -53 163 181 -45 -268 -108 113 -79 222 155 -62 87 21 -293
7143 -293 34 90 107 202 -42 -45 -95 -76 -78 -107 -27 -30 15 -26 -211 -83 -1 -181 -12 112 -84 25 11 -64 -30 -135
7169 -135 31 -37 45 -20 53 -50 -49 264 55 139 73 5 -248 327 -65 -200 60 -58 -26 -58 49 -32 -35 -42 22 -1
7195 -1 -100 -75 -45 106 -175 -110 -173 63 265 -44 374 167 -49 -34 -23 -52 -185 80 -73 419 -408 66 241
7218 241 -162 -49 30 -86 -176 296 -21 58 240 5 63 -69 -15 -9 -125 -33 -120 255 -195 -260 168 -93 -127 118
7242 118 133 -126 93 -21 157 -283 133 49 -32 -41 5 187 -127 -24 84 -205 -210 198 89 -79 33 121 -89
7265 -89 -65 128 142 58 -267 -136 -206 -154 0 -322 -79 84 59 102 129 -62 -108 -100 155 -231 17 -43 44 -87 -89
7290 -89 207 15 -154 -271 37 333 -47 -33 -83 -50 183 -33 7 -114 146 -350 312 120 32 149 -90 132
$$ packed form
7120B4K28J3r6k59J81j44K87L6m08Q5K16J8k26k23J60K21j92L01o7k17J49o6l14
7143b93L27N6J7R5k44ln0J9kk9Q0lM5m1j85J28Q2j80J69J24j96J09j4p5L4j05
7169a35J66o8Q2o5P3j03JL13k09Q4o6o8k53N75l92j35K60j18L2l2J07q1lpO4k3
7195ar9K5L0J51k81O5o3K36K02l09M18k07k16J5J1k9j33K65j53M92q27M74J75
7218B41m03J13P9j16r0M72l17P9J82k35N8j32N4Oj16R2q7L75m50o5M28k61l4K45
7242A18J5k59K19j14J78m40M16q4q1rM6J82l14J03J08k89nM08j09j68J12Q8k10
7265h9K4J93J4q4l25J31p0N2J54l22K43J63k5M3K7j91m6QK55l86K48o0Q7j31k
7290h9K96j92j69j17L08K96l80J4n0L3K33k16M0j21K60m96O62j92q8J17k39K22
$$ plain form
7312 132 -2 -10 98 180 -115 70 -159 -16 101 16 -27 -32 -120 110 -184 -16 91 -175 100 132 -194 98 92 51
7336 51 -67 -56 176 148 33 -1 56 101 -34 -19 -12 -425 106 69 111 229 22 176 6 -83 -55 251 -165 -20
7360 -20 79 -92 -79 -110 143 -217 -76 92 19 -62 -102 124 3 110 206 111 16 -272 -21 19 -277 247 10 20
7384 20 -114 80 -27 -171 -247 22 -87 46 114 -77 -15 89 219 215 -29 67 204 -95 124 -118 -177 -135 161
7407 161 300 60 -221 50 -38 -27 23 71 38 126 199 96 -133 144 -38 70 -92 154 -81 94 113 163 138
7430 138 88 -157 -345 -93 135 -30 86 56 -50 61 91 -89 91 50 65 329 -17 28 53 29 -74 170 -89
7453 -89 421 98 183 -124 258 98 -207 -12 -39 60 396 259 -37 54 31 -101 78 -257 268 324 -84 -49 157
7476 157 140 84 67 52 -35 50 42 -175 136 -189 -246 -4 143 41 204 80 -142 58 -148 -128 64 27 50 -75
$$ packed form
7312A32j34qJ08Q2k95J85k29J43J17q5m3nq8K30k94J68J07k66K75L2l26K92om1
7336E1j18J1K32k8j15l4N7M5j35J5Pm13N31l7M2J18k07J54j70q9K8L06m16J45
7360b0R9j71J3l1K53l60J41J68p3q1m0K26j21J07R6r5r5k88K51M0k96N24k37J0
7384B0j34J94j07j44p6K69j09J33O8j91O2J04J30mk44R6J37k99K19k42n9M2K96
7407A61J39k40k81K71q8J1N0M8l3Q8P3j03k29K77j82J08j62K46k35J75J9N0k5
7430A38n0k45j88K52K28j65J16l0j06J11L0j80J80m1J5K64l46M5K5k4j03K44k59
7453h9N10l23Q5l07L82j60l05J95k7R9L36j37k96R1k3j32J79l35N25N6m08L5K06
7476A57j7n6j7j5q7Q5qk17L11l25n7K42J47j02J63j24k22K00k06K0J92l7K3j25
$$ plain form
7500 -75 -114 38 -127 -146 -3 -179 -139 79 174 25 361 145 112 -77 62 -71 -166 -77 24 -103 151 26 -110
7523 -110 20 -163 310 -135 151 -74 59 246 71 194 -20 -166 -129 -109 203 -29 264 -57 -125 149 -154
7544 -154 39 2 266 -174 -124 -165 167 36 86 99 269 239 171 -160 -250 218 96 -40 44 142 33 -43 56 116
7568 116 25 179 38 -77 -62 -74 121 174 259 -136 99 230 199 -194 -32 -211 36 144 -118 64 -58 188
7590 188 -173 -87 34 110 -13 35 -320 30 27 -20 -276 243 204 -86 154 9 -83 -171 148 136 294 -42 7 -79
7614 -79 -90 137 -48 -324 139 43 222 125 -85 86 309 134 67 215 53 -316 -89 220 26 -2 10 0 -53
7637 -53 -95 -210 69 -61 233 83 -24 35 -153 43 -222 -35 -79 -24 95 -17 34 49 16 -131 -8 55 110
7660 110 -23 -103 -38 -167 248 -24 -5 229 -4 136 -46 -1 -23 42 315 44 79 -62 -28 -26 176 416 -162
$$ packed form
7500g5l9J52j65j9J43j76M0K18R5j49L36k16l3j89J39j33r5Q9J01j27K54j25j36
7523a10J30j83M73m45K86k25J33J87j75J23k14j46L7K0L12k32K93l21o8K74l03
7544a54J93l7K64m40N0m1L32j31N0J3J70l0o8l31r0M68j22j36Q4R8j09p6R9O0
7568A16r1J54j41j15J5j2J95N3Q5l95K35J31l1l93J62j79K47J08k62J82j22K46
7590A88l61Q6J21P6j23M8l55L50lm7k56N19l9k90K40j45r2q8L19j2J58l36M9q6
7614g9j1K27j85k76M63r6J79r7k10J71K23j75o7J48j62l69K27L09j94k8J2j0n3
7637e3m2j15K79j30K94j50j07N9j88J96k65J87m4N5J19j12N1J5l3j47J23O3N5
7660A10j33q0O5j29M15k72J9K34k33J40j82M5k2O5K73k71L5j41L4KK02K40n78
$$ plain form
7683 -162 -1 -40 -135 202 -90 161 -60 26 -3 1 170 230 106 -55 63 -19 245 -145 -91 14 65 -44 126
7706 126 -129 188 18 -356 -295 -49 -216 102 148 9 296 213 358 -119 -179 -185 252 -9 -202 77 -134 -84
7728 -84 -31 2 133 -53 199 34 -29 200 68 204 -96 -201 34 -66 -242 -80 -346 261 172 -154 -128 -88
7750 -88 -6 -285 -66 -87 -47 166 149 44 7 10 -258 -166 128 -46 115 -6 -130 -16 133 -70 -190 34 -273
7773 -273 -13 -127 173 -113 232 111 206 285 -128 -155 125 141 -17 -76 109 -119 -77 9 -133 -73 -61 -37 79
7796 79 -4 -358 79 -231 -142 61 73 43 -69 99 -256 -252 78 -72 16 49 178 97 112 91 -63 22 243 35
7820 35 -114 62 -19 0 88 109 26 34 -8 78 47 -16 -56 -141 4 93 48 -223 370 -15 -324 -236 -137 180 -246 -106
7846 -106 -140 254 -104 91 200 -83 -119 11 -282 182 224 -48 235 37 -141 -139 61 58 253 -130 0 118
$$ packed form
7683a62J61l9r5L37k92K51k21Q6k9MJ69O0j24j61J18q2K64l90N4J05N1j09J70
7706A26k55L17j70l74O1K46j67L18M6j39K87q3J45m77o0oM37k61j93K79k11N0
7728h4N3L3J31j86K52j65o3K29j32J36l00j05K35j00j76J62k66O07q9l26K6M0
7750h8Q2k79K19k1M0K13j7j05l7Lk68R2K94j74J61j21j24J14J49k03j20K24l07
7773b73K60j14L00k86L45j21R5P9m13k7K80J6j58n9J85k28M2Q6j42O0J2K4J16
7796G9q3l54M37l10Q9K03J2l0j12J68l55ML30j50Q8L3J29q1J5k1j54Q5K21k08
7820C5j49J76q1J9Q8K1q3Qm2Q6l1o3m0q5J45Q9m5k71N93l85l09Q8R9L17m26J40
7846a06l4L94l58J95J09k83l6J30k93M64M2k72K83j98j78KK00lJ95l83J30J18
$$ plain form
7868 118 152 -93 185 -1 -31 -40 -254 -57 121 -181 1 -135 73 311 75 -212 -361 -89 272 43 153
7889 153 168 -66 347 155 -160 -130 -34 27 -320 -252 111 19 226 -4 224 127 -114 114 195 -31 -210 -81 -57
7912 -57 -62 185 6 -195 -15 -116 -42 20 -90 -40 192 140 39 219 -4 13 213 90 98 41 -258 -195 235 145
7936 145 -100 -56 453 217 -102 -134 -129 -38 229 -155 223 175 140 -53 117 195 12 10 -100 163 65 -69 -150 37
7960 37 -156 -14 -174 -100 -282 412 52 128 -159 150 -115 -20 4 198 -120 -114 -66 6 -9 75 -240 -39 -145 -161
7984 -161 -4 61 77 215 -131 35 132 240 -191 -218 -97 168 129 -17 -5 61 -231 65 241 10 102 76 -131
8007 -131 -146 184 -182 80 32 -57 -97 210 45 43 26 64 -165 -222 -13 64 83 -60 174 67 208 338 199 197
8031 197 -179 -33 51 -76 43 -355 -105 211 117 181 110 140 -198 2 -151 -55 99 230 172 -99 -94 -112 96
$$ packed form
7868A18L4k45K78j86l0rk14J97J78l02J82j36K08K38k36k87j49K72L61k29J10
7889A53J5k34M13j92l15L0R6O1l47O8L63r2K07k30K28r7k41K28Q1k26j79J29K4
7912e7nK47j79k01J80j01P4O2j10N0K32n2j01J80k23J7K00j23Qn7k99O3M30r0
7936A45k45M4N09k36l19l2NR1K67l84L78m8l5j93J70P8j83kj10K63r8j34q1J87
7960C7j93J42j60P4j82O94l60P6k87L09k65R5K4J94l18OM8P2j5Q4l15K01j06j6
7984a61J57O5J6J38l46J66R7J08m31k7J21K65l9j46J2O6k92K96J76k31R2k6k07
8007a31j5L30l66K62m8q9m0L07j65kj7L8k29n7K09P7J9j43K34j07J41J30j39k
8031A97l76J46Q4j27J19l98K50L16r4O4p1L0l38K00j53R6J54J31n8k71Nj8K08
$$ plain form
8054 96 6 88 233 146 108 -40 251 116 39 64 128 -186 -2 151 -87 -27 -15 -83 6 -151 -224 -286 -22 65 -106
8079 -106 119 -10 321 -68 248 136 -247 101 -61 -152 -218 -17 -180 80 151 -220 61 108 -77 -17 -19 -120
8101 -120 -260 57 8 34 -238 104 23 -51 -193 -4 145 108 -55 66 116 256 181 52 62 56 -149 95 -111
8124 -111 129 201 74 -65 95 -86 -111 -37 -143 84 -28 22 39 182 -87 35 18 127 -131 13 -2 -104
8146 -104 -62 35 231 -8 12 155 -36 -60 -130 -50 50 34 -31 -32 67 63 -104 182 149 220 109 0 -93 -173 198 3
8172 3 139 211 158 -165 38 116 -335 7 87 -104 32 -2 -33 125 173 251 112 -163 -196
$$ packed form
8054I6r0Q2J45q7l8j48K91j35p7K5O4l14J84J53k38O0J2o8Q9j57p3o2K64Q7j71
8079a06K25j29L31l89L16j12l83L48j62r1o6K01j63K60P1l71K81M7j85O0kj01
8101a20j40L17m9K6k72L42q1p4j42J89J49l7j63J21N0J40p5j29J0ok05K44k06
8124a11K40P2j27j39J60j81k5P4j06K27j12N0J7J43k69J22j7J09k58J44j5j02
8146a04M2R7J96k39K0J43j91k4p0Q0J00j6o5jR9mj67K86l3P1j11j09r3q0L71j95
8172CJ36P2n3l23K03P8m51L42Q0j91J36l4l1J58M8P8j39k75l3
8191a96
$$ Imaginary data points
##PAGE= N=2
##DATA TABLE= (X++(I..I)), XYDATA
$$ plain form
0 0 0 0 0 0 0 0 0 0 0 0 0 0 0 -8 8 -8 8 -8 8 -16 16 -16 24 -24 32 -35 40 -48 56 -64 72 -81 94 -105 119 -133
36 -133 150 -168 185 -208 231 -256 283 -313 346 -383 423 -464 512 -565 621 -685 756 -833 921
55 921 -1021 1137 -1269 1422 -1608 1831 -2109 2462 -2935 3597 -4588 6238 -9490 18291 -94318
70 -94318 -251312 7566 150722 -20707 -171971 7068 192994 93080 -87121 -33150 79036
81 79036 -3489 -137673 -62359 68920 15518 -85898 19535 172121 82310 -118902 -84854
92 -84854 97084 66957 -148803 -164663 62918 162926 3670 -95960 36429 142634 22231
103 22231 -119428 -70865 28632 -6691 -67611 -2636 81608 40727 -20615 30153 79275 -15437
115 -15437 -123287 -60961 60773 27705 -85433 -45657 107679 126075 -14804 -82659 2957
$$ packed form
0@%%%%%%%%%%%%%qJ6j6J6j6J6k4L2l2M0m8N6o7P5q8J04j20J36j53J75j99K24k52
36a33K83l18L53l93M39m87N39n96O59p29Q06q87R76j077J186j306J441j589J754
55I21j942K158k406K691l030L439l940M571n397O532q185J0826j5728K7781j12609
70i4318j56994K58878J43156j71429j51264J79039J85926r9914j80201N3971J12186
81G9036q2525j34184P5314J31279n3402j01416J05433J52586q9811k01212L4048
92h4854J81938l0127k15760j5860K27581J00008j59256r9630J32389J06205j20403
103B2231j41659M8563R9497l5323o0920O4975Q4244m0881o1342N0768M9122r4712
115a5437j07850O2326J21734l3068j13138L9776J53336J8396j40879o7855Q5616
$$ plain form
126 2957 54674 -29223 -101405 -42630 42842 39337 6895 26093 47283 11591 -23752 -9882
138 -9882 -7094 -53992 -67695 5916 68721 30598 -25219 10525 74627 38666 -61426 -83004
150 -83004 -12347 25050 -14230 -36570 13099 63460 48990 7574 -8562 -12320 -26161 -31216
162 -31216 -18447 -13357 -17421 7263 53832 58407 6006 -29193 -3822 17868 -22213 -68812 -41875
175 -41875 26969 46856 13078 -361 27320 37563 2312 -35363 -39562 -26443 -16225 -1908
187 -1908 15253 19443 15804 26555 37146 9814 -39269 -48976 -12417 7650 -16721 -27100 16136
200 16136 59797 42627 -5610 -17442 1070 -3535 -33154 -40619 -14122 11443 19437 25075 29936
213 29936 17703 -2111 -6512 -5409 -24248 -45381 -26736 18188 32932 9698 2155 28836 37481
$$ packed form
126B957N1717q3897p2182N8775Q5472l505l2442J9198K1190l5692l5343J3870
138i882K788m6898j3703P3611O2805l8123n5817L5744O4102l5961j00092k1578
150h3004P0657L7397l9280k2340M9669N0361j4470m1416j6136l758j3841n055
162c1216J2769N090m064K4684M6569M575n2401l5199K5371K1690m0081m6599K6937
175d1875O8844J9887l3778j3439K7681J0243l5251l7675m199J3119J0218J4317
187a908J7161M190l639J0751J0591k7332m9083r707L6559K0067k4371j0379M3236
200A6136M3661j7170m8237j1832J8512m605k9619p465K6497K5565P994N638M861
213B9936j2233j9814m401J103j8839k1133J8645M4924J4744k3234p543K6681Q645
$$ plain form
226 37481 -2014 -43106 -35938 -6877 -3924 -15965 -3334 26894 36460 21568 8151 965 -14658
239 -14658 -29189 -23892 -9882 -8240 -7987 14932 41685 33517 145 -12429 147 -2579 -30258
252 -30258 -41396 -11924 20198 21248 10402 16343 25958 13335 -11838 -23714 -21939 -20984 -16540
265 -16540 196 17710 19417 15316 20117 20634 -1375 -28036 -29745 -11959 -5478 -12023 -3540 23285
279 23285 36201 20397 714 -3424 -4767 -17784 -28346 -20698 -3984 6979 13741 23136 25071
292 25071 12182 -2880 -8073 -11849 -23056 -27764 -11965 11203 18601 13217 14694 21617 13278 -9938
306 -9938 -24613 -21004 -13378 -11181 -5629 9941 22627 21988 14501 8217 -869 -15381 -24181 -19455
320 -19455 -9527 -4177 2452 16503 26914 20802 4889 -4244 -7391 -14409 -23285 -20811 -4720 9217
$$ packed form
226C7481l9495m1092P168K9061K953j2041J2631L0228R566j4892j3417p186j5623
239a4658j4531N297J4010J642K53K2919K6753q168l3372j2574J2576k726k7679
252c0258j1138K9472L2122J050j0846N941R615j2623k5173j1876J775R55M444
265a6540J6736J7514J707m101M801N17k2009k6661j709J7786O481o545Q483K6825
279B3285J2916j5804j9683m138j343j3017j0562P648J6714J0963O762R395J935
292B5071j2889j5062n193l776j1207m708J5799K3168P398n384J477O923q339k3216
306i938j4675L609P626K197N552J5570J2686o39p487o284r086j4512q800M726
320a9455R928N350O629J4051J0411o112j5913r133l147p018q876K474J6091J3937
$$ plain form
334 9217 14329 16226 18803 15474 2116 -11140 -16980 -17927 -17375 -11302 2472 15288 18511 16103 13574
349 13574 8148 -4284 -18094 -21870 -15178 -7842 -2304 6348 17478 21909 15914 4948 -4332 -11225
363 -11225 -17371 -19208 -13096 -2933 7002 14169 19018 17855 9145 -2377 -10407 -14671 -17151 -16345 -7565
378 -7565 5590 15119 17074 15022 10961 4010 -6704 -16819 -19160 -14836 -6679 1586 10070 15940
392 15940 17312 13168 4827 -5103 -14024 -17682 -15061 -8798 -1072 6837 14878 18534 14998 5865 -4100
407 -4100 -11066 -14605 -15951 -12891 -4136 6629 14682 17028 14060 7427 42 -7596 -14689 -17793 -14055
422 -14055 -4663 5216 11912 14373 14268 11371 3563 -7300 -15371 -16975 -12388 -5490 815 7954 14139
437 14139 17153 12967 3410 -6224 -12337 -13994 -13392 -10109 -2511 7432 15177 16471 11502 4183 -2535
$$ packed form
334I217N112J897K577l329j3358j3256n840r47N52O073J3774J2816L223k408k529
349A3574n426j2432j3810l776O692P336N538Q652J1130M431n995j0966r280o893
363a1225o146j837O112J0163R935P167M849j163q710j1522q030m264k480Q06Q780
378g565J3155R529J955k052m061o951j0714j0115k341M324Q157Q265Q484N870
392A5940J372m144q341r930q921l658K621O263P726P909Q041L656l536r133r965
407d100o966l539j346L060Q755J0765Q053K346k968o633p385p638p093l104L738
422a4055R392R879O696K461j05k897p808j0863q071j604M587O898O305P139O185
437A4139L014m186r557r634o113j657O02L283P598R943P745J294m969p319o718
$$ plain form
452 -2535 -8152 -13806 -15920 -12230 -2811 7383 13162 13866 11384 8018 2495 -7261 -15661 -17372 -10599
467 -10599 -1753 3306 7123 12797 16184 11768 721 -8792 -12813 -12182 -11033 -7881 -681 7946 14558
482 14558 15613 10930 2244 -5614 -9562 -11094 -12868 -11888 -3234 9356 16449 12423 6612 5272 3168
497 3168 -6563 -17094 -17319 -7629 1171 4318 7407 12122 14503 9132 -389 -8179 -12920 -14024 -9428
512 -9428 -2749 2058 5819 12043 16838 12296 -1302 -10631 -9380 -7009 -10632 -12648 -2753 12029 17197
527 17197 10823 4506 3526 844 -7538 -15422 -14659 -7449 835 7591 10715 10562 8846 6631 2021 -7339
543 -7339 -16550 -15083 -5400 1938 2677 3915 11119 16583 10628 -3256 -11942 -9924 -7095 -7910 -8207 -1584
559 -1584 9598 15887 13013 4991 -1249 -3643 -6093 -10343 -13473 -9662 1181 10820 12796 8190 4902
$$ packed form
452b535n617n654k114L690R419J0194N779P04k482l366n523r756q400j711O773
467a0599Q846N059L817N674L387m416j1047r513m021O31J149L152P200Q627O612
482A4558J055m683q686p858l948j532j774R80Q654J2590P093m026n811j340k104
497C168r731j0531k25R690Q800L147L089M715K381n371r521p790m741j104M596
512i428O679M807L761O224M795m542j3598r329J251K371l623k016R895J4782N168
527A7197o374o317r80k682q382p884P63P210Q284O756L124j53j716k215m610r360
543g339r211J467R683P338P39J238P204N464n955j3884q686K018K829q15k97O623
559a584J1182O289k874q022o240k394k450m250l130L811J0843R639J976m606l288
$$ plain form
574 4902 4921 2174 -7029 -16044 -14883 -4956 4050 5692 4828 8058 12800 10240 -1143 -12121 -13264
589 -13264 -7512 -3389 -3868 -1860 6460 15279 15055 4845 -4470 -7019 -5995 -7493 -10697 -9223 419
604 419 11498 14283 8879 2572 1331 107 -5206 -12866 -15079 -6549 4863 9233 6827 5182 7972
619 7972 8898 1023 -11100 -15535 -9537 -938 1223 408 3879 12444 14417 6043 -5711 -9968 -7243
634 -7243 -5522 -7266 -6997 76 9726 14020 10243 2726 -2813 -3623 -4077 -8285 -12820 -8715 3773 12698
650 12698 10384 3363 2830 6496 2860 -9424 -16871 -10049 382 3884 2099 4338 10247 11545 4986
665 4986 -4105 -9503 -10010 -7145 -3167 -1372 -21 4932 12716 13424 3326 -7254 -7272 -2563 -4509 -11503
681 -11503 -9438 4088 13779 10626 2948 1814 3881 115 -8532 -12725 -8679 -2521 3350 6649 7097
$$ packed form
574D902J9k747r203r015J161R927R006J642q64L230M742k560j1383j0978j143
589a3264N752M123m79K008Q320Q819k24j0210r315k549J024j498l204J474R642
604D19J1079K785n404o307j241j224n313p660k213Q530J1412M370k406j645K790
619G972R26p875j2123m435N998Q599K161q15L471Q565J973q374j1754m257K725
634g243J721j744K69P073R650M294l777p517n539q10m54m208m535M105J2488Q925
650A2698k314p021n33L666l636j2284p447O822J0431L502j785K239N909J298o559
665D986r091n398n07K865L978J795J351M953P784P08j0098j0580j8M709j946o994
681a1503K065J3526R691l153p678j134K067l766q647m193M046O158N871L299M48
$$ plain form
696 7097 6101 5778 5273 280 -9607 -14459 -7690 1373 2071 -1134 3024 12663 13436 2222 -7997 -7719
712 -7719 -3673 -5274 -8207 -4916 3572 9847 10158 6672 2362 -1970 -3969 -4866 -7761 -9768 -5780 4799
728 4799 11471 8135 2041 3283 6082 245 -10647 -13799 -6097 1509 1900 1779 5423 9643 8508
743 8508 1983 -4226 -8054 -8426 -5708 -2562 -995 748 5928 11818 9874 266 -6449 -4827 -2601
758 -2601 -6540 -9915 -4427 6068 10782 7188 3158 3138 2273 -2747 -8171 -9438 -6595 -1985 3572 6668
774 6668 6276 4915 5230 4131 -2137 -9932 -10546 -4380 778 45 487 5891 11143 8566 -244 -5486
790 -5486 -5517 -4807 -6049 -5978 -1784 4068 7927 8549 5782 1543 -2090 -3424 -5361 -7677 -7797 -2231 5252
807 5252 8297 5997 3318 3597 2508 -2413 -8806 -9856 -4670 57 1938 3309 5460 7790 6423
$$ packed form
696G097r96l23n05m993r887m852O769R063O98l205M158R639P73j1214j0219K78
712g719M046j601k933L291Q488O275L11l486m310m332j999q97k895k007L988J0579
728D799O672l336o094J242K799n837j0892l152P702P606L91j21L644M220j135
743H508o525o209l828l72K718L146J567J743N180N890j944r608o715J622K226
758b601l939l375N488J0495M714l594m030k0q65n020n424j267K843M610N557L096
774F668l92j361L15j099o268p795o14O166N158p33M42N404N252k577q810n242
790e486l1P10j242P1M194N852L859O22k767m239l633j334j937k316j20N566P483
807E252L045k300k679K79j089m921o393j050N186M727J881J371K151K330j367
$$ plain form
822 6423 1072 -4793 -7279 -6589 -4381 -2975 -641 3187 7285 8475 5578 279 -3514 -4583 -5151 -6200
838 -6200 -5454 -1684 4266 7728 6930 3936 2027 348 -2894 -7190 -8687 -4921 326 3634 4515 5038
854 5038 5995 4724 389 -4484 -7127 -6848 -4560 -1589 892 3914 6128 7007 5317 719 -3912 -6074
870 -6074 -5572 -4679 -3523 -902 3991 7567 7210 3792 736 -1069 -3615 -6312 -7401 -4368 430 4021
886 4021 5488 5675 5131 2920 -329 -4330 -6540 -6482 -4500 -928 2222 4956 5328 5643 4369 403 -4127
903 -4127 -6698 -5682 -3904 -2382 91 3607 7130 6782 3382 -58 -2405 -4260 -6121 -5845 -3166 746
919 746 3908 5295 6146 4839 1514 -1944 -4276 -5635 -5776 -4564 -472 3983 5347 4944 4733 3578
935 3578 -68 -4726 -7032 -5334 -3034 -1619 1167 4576 6548 5125 2346 205 -2637 -5470 -6529
$$ packed form
822F423n351n865k486O90K208J406K334L828M098J190k897n299l793j069n68j049
838f200P46L770N950L462p98k994j909j679l242m296j497L766N247L308Q81N23
854E038R57j271m335m873k643K79K288K971K481L022K214Q79j690m598m631k162
870f074N02Q93J156K621M893L576l57l418l056j805k546k697j089L033M798L591
886D021J467J87n44k211l249m001k210N8J982L572L150K734L72L15j274l966m530
903d127k571J016J778J522K473L516L523l48l400l440k347j855j861K76K679L912
919G46L162J387Q51j307l325l458k332j359j41J212M092M455J364m03k11j155
935C578l646m658k306J698K300J415K786L409J972j423k779k141k842k833j059
$$ plain form
950 -6529 -4462 -1139 1084 3190 6097 6576 4043 -304 -2603 -3352 -5282 -6030 -3256 1093 4295 4698
966 4698 4700 4725 2334 -1668 -4867 -5484 -4586 -3648 -912 2856 5528 5198 4029 2694 -45 -3862 -6428
983 -6428 -5515 -2814 -1142 893 3877 6447 5640 2308 -515 -2376 -4603 -5863 -4832 -1888 1275 3850
999 3850 5081 5625 3963 260 -2491 -4120 -4639 -5241 -3332 521 3907 5049 4428 3899 2483 -949
1015 -949 -4313 -5625 -4700 -2674 -624 2043 4517 5696 4399 1980 -543 -3231 -5215 -5021 -3322 -697
1031 -697 1149 3722 5747 5450 2402 -608 -2679 -3489 -4653 -4916 -2596 1598 4231 4676 4420 3408
1047 3408 1245 -2099 -4492 -5044 -4194 -2473 558 3068 4193 4301 3870 2355 -628 -4106 -5462 -4240
1063 -4240 -2202 -497 1336 3768 5631 4933 1858 -1257 -3060 -4053 -4371 -3775 -1468 1427 4270 5194
$$ packed form
950f529K067L323K223K106K907M79k533m347k299p49j930p48K774M349L202M03
966D698KK5k391m002l199o17Q98R38K736L768K672l30j169j335k739l817k566
983f428R13K701J672K035K984K570q07l332k823j861k227j260J031K944L163K575
999C850J231N44j662l703k751j629n19o02J909L853L386J142o21n29j416l432
1015i49l364j312R25K026K050K667K474J179j297k419k523k688j984J94J699K625
1031f97J846K573K025k97l048l010k071q10j164k63K320M194K633M45k56j012
1047C408k163l344k393n52Q50J721L031K510J125J08m31j515k983l478j356J222
1063d240K038J705J833K432J863o98l075l115j803r93l18N96K307K895K843R24
$$ plain form
1079 5194 4528 2097 -186 -2152 -3597 -5118 -4431 -1719 1650 3802 4105 3829 3356 1292 -1527 -4291
1095 -4291 -5195 -4069 -1959 699 2088 3550 4490 4391 2067 -1693 -4456 -4414 -3273 -2422 -1619 1095 4719
1112 4719 5524 3783 945 -818 -2257 -3691 -4793 -3908 -1172 1725 3718 4720 3532 1884 -242
1127 -242 -1508 -3923 -5901 -4533 -811 2435 2643 2866 3936 4358 1686 -2474 -4793 -4001 -2647 -1717
1143 -1717 -598 1813 4097 4633 3678 800 -1936 -3429 -3662 -3485 -3087 -1870 1735 4794 5166 2512
1159 2512 165 -508 -1109 -3466 -5405 -4302 -236 2607 3202 2983 3138 3042 794 -2451 -4235 -4588 -3079
1176 -3079 -689 1106 2065 3353 4352 3844 1109 -2552 -4484 -3296 -2110 -2001 -1434 1618 5103 5281
1192 5281 2670 -358 -1234 -1303 -3200 -4046 -3373 -461 2355 4021 3661 2281 1292 356 -1809 -3800 -5310
$$ packed form
1079E194o66k431k283j966j445j521O87K712L369K152L03k76m73k064k819k764
1095d291r04J126K110K658J389J462R40r9k324l760k763M2J141Q51Q03K714L624
1112D719Q05j741k838j763j439j434j102Q85K736K897J993J002j188j648k126
1127b42j266k415j978J368L722L246K08K23J070M22k672m160k319P92J354R30
1143a717J119K411K284N36r55k878k736j493k33J77L98J217L605L059L72k654
1159B512k347o73o01k357j939J103M066K843N95k19J55r6k248l245j784l53J509
1176c079K390J795R59J288R99n08k735l661j932J188J186J09N67L052L485J78
1192E281k611l028q76o9j897q46O73K912K816J666l60j380r89r36k165j991j510
$$ plain form
1209 -5310 -3198 241 2217 2183 2281 3333 3556 875 -2939 -4660 -3639 -1443 -997 -416 1482 4238 4882
1226 4882 2813 -212 -2252 -2917 -2682 -3252 -2697 -955 2652 4747 4087 1540 -16 -248 -1456 -3574
1242 -3574 -4817 -2769 626 3012 3131 2516 2714 2570 783 -2649 -4928 -3930 -1586 185 1141 1789 3334
1259 3334 4424 2847 -642 -3226 -3646 -2708 -1799 -1568 -128 2650 4508 4284 1663 -542 -1535 -2016 -2717
1276 -2717 -3602 -2908 229 3130 4280 2483 1406 1269 539 -1993 -4669 -4135 -1568 781 1643 1897 2753
1293 2753 3488 2407 -77 -3166 -3986 -3106 -1521 -365 243 1697 3716 4319 2066 -1256 -2850 -2231
1309 -2231 -2073 -2712 -2407 -100 3558 4290 2724 1123 602 -522 -2200 -3702 -3612 -1599 1055 2764 2895
1326 2895 2453 1973 1390 -126 -2513 -4411 -3391 -989 735 1254 1592 3225 4187 1853 -1270 -2824
$$ packed form
1209e310K112L439J976l4R8J052K23k681l814j721J021K196M46N81J898K756O44
1226D882k069l025k040o65K35n70N55J742L607K095o60k547j556k32j208k118
1242c574j243K048L395K386J19o15J98j44j787l432k279R98K344J771R56O48J545
1259C334J090j577l489k584m20R38R09K31J440K778J858k24k621k205r93m81p01
1276b717q85O94L137K901J150j797j077j37p30k532k676N34K567K349Q62K54Q56
1293B753P35j081k484l089q20Q80J585J156O08J454K019O03k253l322j594O19
1309b231J58o39L05K307L658P32j566j601n21j124j678j502R0K013K654J709J31
1326B895m42m80n83j516k387j898J020K402J724N19L38J633R62k334l123j554
$$ plain form
1342 -2824 -2616 -2392 -1950 -1686 663 2954 3997 3222 1299 -277 -1800 -2072 -2604 -3133 -1951 663 3041
1359 3041 3590 2014 948 926 -189 -2335 -4141 -3256 -811 733 1452 1921 2837 2925 1483 -1002 -2830
1376 -2830 -3014 -2665 -1248 -398 825 2220 3347 3372 1186 -1281 -2354 -2035 -2155 -2367 -1394 1089 2813
1393 2813 3325 2192 1083 479 -833 -2313 -3395 -2708 -811 1133 2362 2631 2326 1817 1020 -699 -2773
1410 -2773 -3415 -2560 -689 467 959 2112 2854 2704 1073 -1343 -2130 -2444 -2213 -1841 -667 1328 2566
1427 2566 3003 2179 965 -398 -1617 -2038 -2639 -2377 -1012 912 2622 2561 1992 1414 430 -1029 -2511
1444 -2511 -3218 -2216 -768 629 1670 2143 2529 2034 652 -884 -2464 -2747 -2097 -953 50 1123
1460 1123 2328 2861 2299 458 -1265 -1878 -1935 -2128 -1988 -714 1139 2690 2643 1911 1135 -78 -1223 -2436
$$ packed form
1342b824K08K24M42K64K349K291J043p75j923j576j523k72n32n29J182K614K378
1359C041N49j576j066k2j115k146j806Q85K445J544P19M69R16Q8j442k485j828
1376b830j84L49J417Q50J223J395J127K5k186k467j073L19j20k12R73K483J724
1393B813N12j133j109o04j312j480j082O87J897J944J229K69l05n09p97j719k074
1410b773o42Q55J871J156M92J153P42j50j631k416p87l14K31L72J174J995J238
1427B566M37q24j214j363j219m21o01K62J365J924J710o1n69n78r84j459j482
1444b511p07J002J448J397J041M73L86m95j382j536j580k83O50J144J003J073
1460A123J205N33n62j841j723o13n7j93J40J274J853J551m7p32p76j213j145j213
$$ plain form
1478 -2436 -2632 -1821 -483 1077 2155 2269 1972 1574 466 -1353 -2409 -2648 -1948 -889 338 1405 2349
1495 2349 2533 1803 394 -1018 -2009 -2282 -1989 -1279 284 1481 2136 2615 2049 640 -822 -1477 -2064 -2114
1513 -2114 -1713 -348 1333 2106 1766 1783 843 -98 -1235 -2183 -2331 -1479 -442 853 1617 1972 1914 1238 345
1532 345 -1106 -2085 -2129 -1685 -524 459 1272 2162 2359 1853 307 -794 -1589 -2115 -1818 -1122 -257 1275 2246
1551 2246 2014 1393 578 -230 -1474 -2005 -2035 -1404 -477 1087 1959 1763 1655 905 33 -1225 -2256 -2035 -1621
1570 -1621 -209 356 1486 1732 2117 1275 -1 -1185 -1883 -1879 -1602 -998 66 1262 1898 2054 1355 404
1588 404 -698 -1353 -1820 -1631 -991 -243 1277 1842 1883 1436 697 -298 -1238 -2115 -1698 -1116 -56 775 1859
1607 1859 1558 1420 808 -327 -1119 -1916 -1940 -1073 -274 452 1163 1746 2011 1175 -220 -1082 -1636 -1353 -1458
$$ packed form
1478b436j96Q11J338J560J078J14k97l98j108j819j056k39P00J059J227J067R44
1495B349J84p30j409j412r91k73K93P10J563J197O55M79n66j409j462o55n87n0
1513b114M01J365J681P73l40J7r40r41j137r48j48Q52J037J295P64L55n8o76q93
1532C45j451r79m4M44J161R83Q13Q90J97n06j546j101p95n26K97O96Q65J532R71
1551B246k32o21q15q08j244n31l0O31R27J564Q72j96j08p50q72j258j031K21M14
1570a621J412N65J130K46L85q42j276j184o98MK77O04J064J196O36J56o99r51
1588D04j102o55m67J89O40P48J520N65M1m47p39r95r40q77M17N82J060Q31J084
1607A859l01j38o12j135p92p97k4Q67P99P26P11N83K65q36j395q62n54K83j05
$$ plain form
1626 -1458 -917 421 1410 1924 1771 1116 187 -644 -1212 -1478 -1740 -754 -33 1067 1581 1611 1053 579 143
1645 143 -1120 -1838 -2088 -806 232 886 1344 1586 1411 682 23 -1392 -1670 -1413 -967 -339 466 1042 1478
1664 1478 1649 748 -116 -948 -1113 -1202 -1372 -655 245 1446 1681 1462 915 94 -330 -1232 -1811 -1706 -507
1683 -507 440 729 1372 1241 1160 661 -409 -1162 -1511 -1278 -451 -41 642 1024 1708 1254 812 -645 -1159 -1398
1703 -1398 -1073 -587 -603 255 1333 2132 1564 411 -112 -471 -712 -1373 -1408 -432 362 1091 1388 1056 711 593
1723 593 -292 -978 -1251 -1317 -663 253 999 1025 916 1046 849 -552 -1531 -1315 -872 -626 -413 461 1336 1564
1743 1564 962 182 -201 -868 -927 -1014 -1106 -476 373 1249 1358 1111 584 -107 -360 -792 -1426 -1238 -293 656 870
1764 870 889 640 989 442 -737 -1554 -1340 -1025 -358 -48 534 1153 1221 966 225 -644 -1327 -1020 -612 -487
$$ packed form
1626a458N41J338R89N14j53o55r29q31n68k66k62R86P21J100N14L0n58m74m36
1645A43j263p18k50J282J038O54M58K42j75p29o59j415k78K57M46O28Q05N76M36
1664A478J71r01q64q32j65q9j70P17R00J201K35k19n47q21m24r02n79J05J199
1683e07R47K89O43j31q1m99j070p53l49K33Q27M10O83L82O84m54m42j457n14k39
1703a398L25M86j6Q58J078P99n68j153n23l59k41o61l5R76P94P29K97l32l45j18
1723E93q85o86k73o6O54R16P46K6j09J30j97j401r79K16M43K46K13Q74Q75K28
1743A564o02p80l83o67n9q7r2O30Q49Q76J09k47n27o91k53m32o34J88R45R49K14
1764H70J9k49L49n47j179q17K14L15O67L10N82O19O8k55p41q69o83L07M08J25
$$ plain form
1784 -487 -420 355 1468 1394 1035 109 -117 -459 -865 -1559 -922 -93 582 1380 723 837 629 236 -581 -1178
1804 -1178 -1305 -827 -217 574 569 999 1131 1052 469 -672 -1208 -1079 -690 -176 -131 336 1075 1241 661 -243 -857
1825 -857 -922 -753 -770 -889 -192 575 1090 1208 644 112 8 -464 -1006 -1100 -630 76 532 636 613 739 841
1846 841 308 -819 -771 -740 -914 15 -55 264 972 975 597 41 -480 -1068 -975 -593 -498 -97 494 1259 990 275
1868 275 -11 -199 -545 -737 -1065 -796 182 636 1085 785 314 263 -54 -609 -1097 -1094 -606 -3 499 596 686 1102
1890 1102 918 -50 -822 -883 -937 -628 -72 -243 873 910 1160 412 -234 -328 -759 -560 -799 -433 249 519 933
1911 933 632 319 193 1 -685 -1029 -904 -265 10 496 625 806 610 417 92 -515 -1045 -921 -463 -37
1931 -37 297 459 894 901 341 -292 -515 -609 -753 -440 -521 217 672 844 669 143 172 -366 -678 -579 -679 -556
$$ packed form
1784d87O7P75J113p4l59r26k26l42m06o94O37Q29O75P98o57J14k08l93q17n97
1804a178j27M78O10P91nM30J32p9n83j141n36J29L89N14M5M67P39J66n80r04o14
1825h57o5J69j7j19O97P67N15J18n64n32j04m72n42r4M70P06M56J04k3J26J02
1846H41n33j127M8L1j74R29p0L19P08Ll78n56n21n88R3L82R5M01N91P65k69p15
1868B75k86j88l46j92l28K69R78M54M49l00m71n1l17n55m88LM88O03N02R7R0M16
1890A102j84r68p72o1n4L09N56j71J116L7K50p48o46r4m31J99k39L66O82K70M14
1911I33l01l13j26j92o86l44J25O39K75M86J29J81j96j93l25o07n30J24M58M26
1931c7L34J62M35Pn60o33k23r4j44L13q1P38M55J72j75n26K9n38l12R9j00J23
$$ plain form
1953 -556 406 387 788 707 26 63 -73 -583 -583 -766 -240 217 526 356 593 526 563 -406 -546 -644 -493 -543 -288
1976 -288 439 444 881 604 197 -229 -661 -484 -486 -606 -88 217 788 605 848 320 51 -65 -420 -787 -502
1997 -502 -131 123 368 407 479 358 323 -96 -563 -891 -358 -349 -69 311 184 449 854 122 -206 -824 -489 -501
2019 -501 -461 -102 272 575 764 565 74 -34 21 -601 -623 -403 -167 158 244 603 509 431 -137 -283 -464 -701
2041 -701 -668 -11 201 312 655 549 683 -203 -164 -622 -413 -291 -202 -200 141 503 484 160 115 106 -218 -529 -309
2064 -309 -208 -209 292 520 586 341 -24 -125 -326 -645 -452 -337 135 44 101 438 583 95 -105 -309 -426 -610
2086 -610 -251 -158 143 237 514 536 153 240 -215 -548 -219 -201 -414 239 320 552 373 87 43 47 -279 -407 -272
2109 -272 -362 114 50 432 636 335 13 -70 37 -283 -546 222 107 339 70 427 112 -103 107 -388 -604
$$ packed form
1953e56R62j9M01q1o81L7j36n10%j83N26M57L09j70K37o7L7r69j40r8J51n0K55
1976b88P27NM37k77m07m26m32J77kj20N18L05N71j83K43n28k69j16l55l67K85
1997e02L71K54K45L9P2j21l5m19m67l28N33RK80L80j27K65M05p32l28o18L35j2
2019e01M0L59L74L03J89j99m91j08N5o22k2K20K36L25Q6L59r4p8n68j46j81k37
2041g01L3O57K12J11L43j06J34q86L9m58K09J22Q9KL41L62j9l24m5rl24l11K20
2064c09J01jN01K28O6k45l65j01k01l19J93J15M72r1N7L37J45m88k00k04j17j84
2086f10L59R3L01R4K77K2l83Q7m55l33L29J8k13O53Q1K32j79k86m4Ml26j28J35
2109b72r0M76o4L82K04l01l22q3J07l20k63P68j15K32k69L57l15k15K10m95k16
$$ plain form
2130 -604 -214 -181 118 163 107 716 426 184 -79 -151 -250 -336 -305 123 41 207 359 281 77 143 -269 -331 -539 -487
2154 -487 -185 179 198 463 123 301 190 -292 -330 -265 -336 63 61 169 234 344 184 -24 286 -275 50 -220
2176 -220 -84 -171 110 434 269 417 65 -120 -458 -102 -507 -110 89 244 499 218 127 338 -101 -135 -30
2197 -30 -342 -68 -365 113 420 315 390 170 -56 174 -217 -433 -384 -287 -7 382 402 207 12 -72 -159 -364
2219 -364 -335 -155 -43 -29 108 480 368 384 -57 -174 -201 -432 -18 -356 29 191 479 336 -17 364 -288
2240 -288 -305 -448 -293 -284 216 178 290 221 268 302 59 -328 -548 -301 -243 90 -58 118 436 220 554 -59 -12
2263 -12 -413 -461 -112 -271 30 200 251 144 431 94 -66 -317 -513 -485 -86 10 315 320 192 152 185 53 -298
2286 -298 -632 -283 -287 168 464 410 321 266 -189 -60 -369 -340 -426 -51 -158 60 45 289 184 72 16 -34 -117 -413
$$ packed form
2130f04L90L3K99M5n6O09k90k42k63p2r9q6L1M28q2J66J52p8k04O6m12o2k08N2
2154d87L02L64J9K65l40J78j11m82l8O5p1L99kJ08O5J10j60k08L10n61L25k70
2176b20J36q7K81L24j65J48l52j85l38L56m05L97J99J55K55k81r1K11m39l4J05
2197c0l12K74k97M78L07j05P5k20k26K30l91k16M9R7K80L89K0j95j95q4q7k05
2219c64K9J80J12J4J37L72j12J6m41j17k7k31M14l38L85J62K88j43l53L81o52
2240b88j7j43J55RN00l8J12o9M7L4k43l87k20K47N8L33j48J76L18k16L34o13M7
2263a2m01m8L49j59L01J70N1j07K87l37j60k51j96K8L99R6L05Nj28m0L3j32l51
2286b98l34L49mM55K96n4q9n5m55J29l09K9q6L75j07K18j5K44j05j12n6n0q3k96
$$ plain form
2310 -413 -208 -84 -89 188 426 318 81 -72 -223 -398 -238 -243 -245 67 246 176 15 11 -25 -165 -324 -364 -223 101
2334 101 25 112 236 134 261 268 -347 -337 -248 -86 -64 -5 -12 304 188 171 152 -206 -115 -254 -350 -33 64 47 190
2359 190 213 20 62 -136 43 -135 -385 -35 120 110 131 105 205 23 19 73 -397 -394 -2 -158 -29 204 295 306
2383 306 91 37 -225 -323 70 -117 -154 86 197 331 219 137 -124 -157 -604 -328 -164 -84 30 128 442 251
2405 251 372 301 -198 -170 -322 -297 -105 10 105 93 633 185 -105 -3 -261 -387 -103 -345 -6 148 354 204
2427 204 253 308 79 -19 -81 -265 -172 -90 9 434 338 448 -97 85 68 -128 -427 -176 -94 39 177 373 300 310
2451 310 41 -109 -423 -352 -182 -201 -161 152 182 351 385 84 -78 -161 -368 -468 -474 -253 80 533 456 315 290
2474 290 -115 -193 -341 -333 -127 -245 -66 243 396 197 317 11 -18 -447 -276 -305 -84 -200 172 279 381 230
$$ packed form
2310d13K05J24nK77K38j08k37j53j51j75J60nkL12J79p0j61ml6j40j59m0J41L24
2334A01p6Q7J24j02J27Po15J0Q9J62K2N9pL16j16j7j9l58R1j39r6L17R7j7J43
2359A90K3j93M2j98J79j78k50L50J55j0K1k6J00j82mN4m70LL92j56J29K33R1J1
2383C06k15n4k62r8L93j87l7K40J11J34j12q2k61l3m47K76J64Q0J14R8L14j91
2405B51J21p1m99K8j52K5J92J15R5j2N40m48k90J02k58j26K84k42L39J54K06j50
2427B04M9N5k29r8o2j84R3Q2R9M25r6J10n45J82j7j96k99K51Q2J33J38J96p3J0
2451C10k69j50l14P1J70j9M0L13L0J69L4l01j62q3k07j00oK21L33M53p7j41k5
2474B90m05p8j48QK06j18J79L09J53j99J20l06k9m29J71k9K21j16L72J07J02j51
$$ plain form
2496 230 -78 -73 -521 -191 -459 -238 -140 106 344 149 -79 -49 143 -220 -382 -255 -291 36 432 138 396 267
2518 267 229 61 -98 -380 -229 -160 21 390 10 292 239 91 -216 257 -372 -164 -224 -114 132 229 397 -77
2540 -77 78 -162 -265 -518 -183 -454 -143 88 317 180 296 60 24 -165 -220 -347 -249 -346 137 32 208 -23
2562 -23 315 -32 -80 -23 -569 -140 -77 -69 123 326 261 160 220 -214 -191 -236 -211 -263 -179 279 -128 458 238 91
2586 91 -67 -307 -385 -216 -216 -75 251 247 610 186 248 58 -175 -126 -178 -321 -78 32 48 114 371 202 38 -281
2610 -281 -340 -268 -170 -232 -98 128 429 560 387 171 150 -270 -95 -168 -236 -499 -42 420 9 96 -49 112 -299
2633 -299 -331 -319 -276 -136 75 215 453 349 136 76 -76 -254 -217 -127 -66 213 137 303 353 197 195 -339 -282 -205
2657 -205 -202 -131 -75 496 113 546 208 -193 -306 -216 -344 -663 -34 -21 210 127 479 327 138 -250 -163 -482 -600
$$ packed form
2496B30l08Nm48L30k68K21R8K46K38j95k28L0J92l63j62J27l6L27L96k94K58j29
2518B67l8j68j59k82J51O9J81L69l80K82n3j48l07M73o29K08o0J10K46R7J68m74
2540g7J55k40j03k53L35k71L11K31K29j37J16k36l6j89n5j27R8r7M83j05J76k31
2562b3L38l47m8N7n46M29O3QJ92K03o5j01O0m34K3m5K5n2Q4M58m07N86k20j47
2586I1j58k40p8J69%J41L26mL63m24O2j90k33M9n2j43K43J10J6O6K57j69j64l19
2610b81n9P2R8o2J34K26L01J31j73k16k1m20J75p3o8k63M57M62m11Q7j45J61m11
2633b99l2J2M3J40K11J40K38j04k13o0j52j78L7R0O1K79p6J66N0j56kn34N7P7
2657b05LP1N6N71l83M33l38m01j13R0j28l19O29J3K31q3L52j52j89l88Q7l19j18
$$ plain form
2680 -600 -463 -185 22 238 300 345 184 -153 -185 -462 -504 -84 -124 69 421 296 174 194 212 -94 -481 -338
2702 -338 -396 -131 -38 156 362 391 55 312 33 -148 -222 -307 -76 -55 194 286 80 443 175 -205 -231 -229 -465
2725 -465 -332 79 98 311 357 255 72 14 -238 -484 -259 -124 -337 -29 -105 538 176 163 -125 -375 -236 -290
2747 -290 -330 -303 268 256 242 367 243 5 -6 -293 -333 -250 -131 -140 28 205 129 374 40 -48 7 -99 -171 22
2771 22 -146 -184 411 458 347 240 -6 -113 -353 -347 -535 -86 -48 112 359 97 234 -168 -13 -166 -263 -344 -295
2794 -295 6 48 386 353 325 136 -78 -229 -311 -260 -164 145 67 589 197 208 312 15 -127 -400 -310 -268 201
2817 201 119 510 298 149 261 131 -342 -357 -392 -328 -130 212 223 196 -41 378 -38 -167 -205 -286 -179 -24 -1
2840 -1 376 196 157 498 -66 -166 -418 -357 -181 -413 131 49 286 329 390 -126 -364 -385 -510 -323 -227 -255 -68
$$ packed form
2680f00J37K78K07K16O2M5j61l37l2k77m2M20m0J93L52j25j22K0J8l06l87J43
2702c38n8K65R3J94K06K9l36K57k79j81p4q5K31K1K49R2k06L63k68l80k6Kk36
2725d65J33M11J9K13M6j02j83n8k52k46K25J35k13L08p6O43l62j3k88k50J39n4
2747b90m0K7N71j2j4J25j24k38j1k87m0Q3J19rJ68J77p6K45l34q8N5j06p2J93
2771B2j68l8N95M7j11j07k46j07k40Oj88M49L8J60K47k62J37m02J55j53r7q1M9
2794b95L01M2L38l3k8j89k14j51q2N1R6L09p8N22l92J1J04k97j42k73R0M2M69
2817B01q2L91k12j49J12j30m73j5l5O4J98L42J1k7k37M19m16j29l8q1J07J55K3
2840aL77j80l9L41n64j00k52O1J76k32N44q2K37M3O1n16k38k1j25J87R6k8J87
$$ plain form
2863 -68 156 399 269 195 -194 9 -175 -480 -573 94 325 161 334 367 109 -83 -140 -159 -382 -315 -10 -153
2885 -153 183 291 433 16 51 -209 -423 -353 -88 52 -131 4 363 300 212 3 -142 -32 -198 -355 -297 145
2907 145 120 374 367 240 116 -69 -236 -224 -367 -162 25 40 89 268 406 112 -8 89 -407 -417 3 -195 219
2930 219 101 489 356 351 120 -144 -399 -99 -470 -148 47 253 432 345 192 166 -198 -276 -436 -367 -215 -111
2952 -111 179 177 133 178 481 232 -353 -212 -171 -275 -108 394 360 267 418 652 138 -347 -219 -414 -182 -103 83
2975 83 192 368 259 294 -135 -117 -331 -402 -363 -363 -147 48 526 223 304 -108 -225 -35 -427 -381 -320 84 442
$$ packed form
2863f8K24K43j30p4l89K03j84l05r3O67K31j64J73L3k58j92n7j9k23O7L05j43
2885a53L36J08J42m17L5k60k14P0K65J40j83J35L59o3q8k09j45J10j66j57N8M42
2907A45k5K54pj27j24j85j67J2j43K05J87J5M9J79J38k94j20R7m96j0M20j98M14
2930B19j18L88j33nk31k64k55L00l71L22J95K06J79q7j53k6l64p8j60O9J52J04
2952a11K90km4M5L03k49n85J41M1j04J67N02l4r3J51K34n14m85J28j95K32P9J86
2975H3J09J76j09L5m29J8k14p1L9%K16J95M78l03Q1m12j17J90l92M6O1M04L58
$$ [...]
8191b11
##END NTUPLES=NMR FID
##END=
