##TITLE=1H_PR166_rm
 D2O, 8 sc, 
 7.2.2019
##JCAMPDX= 6.0         $$ Bruker NMR JCAMP-DX V2.0
##DATA TYPE= NMR FID
##DATA CLASS= NTUPLES
##ORIGIN= UXNMR, Bruker Analytische Messtechnik GmbH
##OWNER= root
$$ XWIN-NMR		Version 3.5
$$ Thu Feb  7 15:30:40 2019 Russian Standard Time (UT+4h)  she@DPX200
##.OBSERVE FREQUENCY= 200.1313
##.OBSERVE NUCLEUS= ^1H
##.DELAY= (6, 6)
##.ACQUISITION MODE= SIMULTANEOUS
##.ACQUISITION SCHEME= undefined
##.AVERAGES= 8
##.DIGITISER RES= 18
##SPECTROMETER/DATA SYSTEM= spect
##.PULSE SEQUENCE= zg30
##.SOLVENT NAME= D2O
##.SHIFT REFERENCE= (INTERNAL, D2O, 0, 15.7039)
##AUDIT TRAIL= $$ (NUMBER, WHEN, WHO, WHERE, WHAT)
$$ ##TITLE= Audit trail, XWIN-NMR		Version 3.5
$$ ##JCAMPDX= 5.01
$$ ##ORIGIN= Bruker BioSpin GmbH
$$ ##OWNER= she
$$ F:/spectra/data/she/nmr/H-F/1/audita.txt
$$ ##AUDIT TRAIL=  $$ (NUMBER, WHEN, WHO, WHERE, WHAT)
(   1,<2019-02-07 15:28:12.43 +0400>,<she>,<DPX200>,
      <created by zg, POWCHK disabled, PULCHK disabled
       configuration hash MD5:
       00 E9 B6 7A A2 85 ED C7 34 08 36 98 17 FE 4E 26
       data hash MD5: 16K
       5A B7 D1 0F E3 49 52 67 43 B4 1D 65 A5 0A FA D9>)
$$ ##END=
$$ 
$$ hash MD5
$$ 74 CD 42 BD 8D 77 4E 9B C7 65 E7 8F F2 02 35 B6
##$RELAX= 
##$RELAX= 
##$RELAX= 
##$RELAX= 
##$RELAX= 
##$RELAX= 
$$ Bruker specific parameters
$$ --------------------------
##$DU= <F:/spectra>
##$EXPNO= 1
##$NAME= <H-F>
##$PROCNO= 1
##$TYPE= <nmr>
##$USER= <she>
##$AMP= (0..31)
100 100 100 100 100 100 100 100 100 100 100 100 100 100 100 100 100 100 
100 100 100 100 100 100 100 100 100 100 100 100 100 100 
##$AQSEQ= 0
##$AQ_mod= 1
##$AUNM= <au_zg>
##$AUTOPOS= <>
##$BF1= 200.13
##$BF2= 200.13
##$BF3= 200.13
##$BF4= 200.13
##$BF5= 200.13
##$BF6= 200.13
##$BF7= 200.13
##$BF8= 200.13
##$BYTORDA= 1
##$CFDGTYP= 0
##$CFRGTYP= 5
##$CHEMSTR= <none>
##$CNST= (0..31)
1 1 145 1 1 1 1 1 1 1 1 1 1 1 1 1 1 1 1 1 1 1 1 1 1 1 1 1 1 1 1 1 
##$CPDPRG= <>
##$CPDPRG1= <>
##$CPDPRG2= <>
##$CPDPRG3= <>
##$CPDPRG4= <mlev>
##$CPDPRG5= <mlev>
##$CPDPRG6= <mlev>
##$CPDPRG7= <mlev>
##$CPDPRG8= <mlev>
##$CPDPRGB= <>
##$CPDPRGT= <>
##$D= (0..31)
0 1.2 0 0 0 0 0 0 0 0 0 0.03 0 0 0 0 0 0 0 0 0 0 0 0 0 0 0 0 0 0 0 0 
##$DATE= 1549538891
##$DBL= (0..7)
120 120 120 120 120 120 120 120 
##$DBP= (0..7)
150 150 150 150 150 150 150 150 
##$DBP07= 0
##$DBPNAM0= <>
##$DBPNAM1= <>
##$DBPNAM2= <>
##$DBPNAM3= <>
##$DBPNAM4= <>
##$DBPNAM5= <>
##$DBPNAM6= <>
##$DBPNAM7= <>
##$DBPOAL= (0..7)
0.5 0.5 0.5 0.5 0.5 0.5 0.5 0.5 
##$DBPOFFS= (0..7)
0 0 0 0 0 0 0 0 
##$DE= 6
##$DECBNUC= <off>
##$DECIM= 32
##$DECNUC= <off>
##$DECSTAT= 4
##$DIGMOD= 1
##$DIGTYP= 9
##$DL= (0..7)
0 120 120 120 120 120 120 120 
##$DP= (0..7)
150 150 150 150 150 150 150 150 
##$DP07= 0
##$DPNAME0= <>
##$DPNAME1= <>
##$DPNAME2= <>
##$DPNAME3= <>
##$DPNAME4= <>
##$DPNAME5= <>
##$DPNAME6= <>
##$DPNAME7= <>
##$DPOAL= (0..7)
0.5 0.5 0.5 0.5 0.5 0.5 0.5 0.5 
##$DPOFFS= (0..7)
0 0 0 0 0 0 0 0 
##$DQDMODE= 0
##$DR= 18
##$DS= 0
##$DSLIST= <SSSSSSSSSSSSSSS>
##$DSPFIRM= 0
$$ [...]
##$SUBNAM2= <"">
##$SUBNAM3= <"">
##$SUBNAM4= <"">
##$SUBNAM5= <"">
##$SUBNAM6= <"">
##$SUBNAM7= <"">
##$SUBNAM8= <"">
##$SUBNAM9= <"">
##$SW= 20.0189088683792
##$SWIBOX= (0..15)
0 0 2 0 0 0 0 0 0 0 0 0 0 0 0 0 
##$SW_h= 4006.41025641026
##$TD= 16384
##$TD0= 1
##$TE= 0
##$TE2= 300
##$TE3= 300
##$TEG= 300
##$TL= (0..7)
0 120 120 120 120 120 120 120 
##$TP= (0..7)
150 150 150 150 150 150 150 150 
##$TP07= 0
##$TPNAME0= <>
##$TPNAME1= <>
##$TPNAME2= <>
##$TPNAME3= <>
##$TPNAME4= <>
##$TPNAME5= <>
##$TPNAME6= <>
##$TPNAME7= <>
##$TPOAL= (0..7)
0.5 0.5 0.5 0.5 0.5 0.5 0.5 0.5 
##$TPOFFS= (0..7)
0 0 0 0 0 0 0 0 
##$TUNHIN= 0
##$TUNHOUT= 0
##$TUNXOUT= 0
##$USERA1= <user>
##$USERA2= <user>
##$USERA3= <user>
##$USERA4= <user>
##$USERA5= <user>
##$V9= 5
##$VALIST= <valist>
##$VCLIST= <CCCCCCCCCCCCCCC>
##$VD= 0
##$VDLIST= <DDDDDDDDDDDDDDD>
##$VPLIST= <PPPPPPPPPPPPPPP>
##$VTLIST= <TTTTTTTTTTTTTTT>
##$WBST= 1024
##$WBSW= 4
##$XGAIN= (0..3)
0 0 0 0 
##$XL= 0
##$YL= 0
##$YMAX_a= 757044
##$YMIN_a= -1017478
##$ZGOPTNS= <>
##$ZL1= 120
##$ZL2= 120
##$ZL3= 120
##$ZL4= 120
##$ABSF1= 10
##$ABSF2= 0
##$ABSG= 5
##$ABSL= 3
##$ALPHA= 0
##$AQORDER= 0
##$ASSFAC= 0
##$ASSFACI= 0
##$ASSFACX= 0
##$ASSWID= 0
##$AUNMP= <proc_1d>
##$AZFE= 0.1
##$AZFW= 0.1
##$BCFW= 1
##$BC_mod= 2
##$BYTORDP= 1
##$COROFFS= 0
##$CY= 11.3945322036743
##$DATMOD= 1
##$DC= 2
##$DFILT= <>
##$DTYPP= 0
##$F1P= 18.9103706918063
##$F2P= -1.10871071338519
##$FCOR= 0.5
##$FTSIZE= 0
##$FT_mod= 4
##$GAMMA= 1
##$GB= 0.15
##$INTBC= 1
##$INTSCL= 1
##$ISEN= 128
##$LB= 0.24
##$LEV0= 0
##$LPBIN= 0
##$MAXI= 10000
##$MC2= 0
##$MEAN= 0
##$ME_mod= 0
##$MI= 1.114404
##$NCOEF= 0
##$NC_proc= 0
##$NLEV= 6
##$NOISF1= 3.799351
##$NOISF2= 2.8
##$NSP= 1
##$NTH_PI= 0
##$NZP= 0
##$OFFSET= 15.70392
##$PC= 1
##$PHC0= -8679.587
##$PHC1= 5.600183
##$PH_mod= 1
##$PKNL= yes
##$PPARMOD= 0
##$PSCAL= 0
##$PSIGN= 0
##$REVERSE= no
##$SF= 200.130013532006
##$SI= 16384
##$SIGF1= 3
##$SIGF2= 2
##$SINO= 400
##$SIOLD= 16384
##$SREGLST= <1H.CDCl3>
##$SSB= 0
##$STSI= 0
##$STSR= 0
##$SW_p= 3612.71676300578
##$SYMM= 0
##$S_DEV= 0
##$TDeff= 0
##$TDoff= 0
##$TI= <>
##$TILT= no
##$TM1= 0
##$TM2= 0
##$TOPLEV= 0
##$USERP1= <user>
##$USERP2= <user>
##$USERP3= <user>
##$USERP4= <user>
##$USERP5= <user>
##$WDW= 1
##$XDIM= 8192
##$YMAX_p= 0
##$YMIN_p= 0
$$ End of Bruker specific parameters
$$ ---------------------------------
##NTUPLES= NMR FID
##VAR_NAME=  TIME,          FID/REAL,        FID/IMAG
##SYMBOL=    X,             R,               I
##VAR_TYPE=  INDEPENDENT,   DEPENDENT,       DEPENDENT
##VAR_FORM=  AFFN,          ASDF,            ASDF
##VAR_DIM=   8192,          8192,            8192
##UNITS=     SECONDS,       ARBITRARY UNITS, ARBITRARY UNITS
##FACTOR=    0.0002496,     1,               1
##FIRST=     0,             0,               0
##LAST=      2.0444736,     0,               0
##MIN=       0,             -1017478,        0
##MAX=       2.0444736,     757044,          0
$$ Real data points
##PAGE= N=1
##DATA TABLE= (X++(R..R)), XYDATA
$$ [...]
2097D04p88j060k76o8Q62N90J400N82J70j93p52j455n25p82L84O9J102Q82O29
2116A175L53J84p34q40q30p66l87L06R21J074Q27N41J56q80n42j097o56o09LQ19
2136i82J282O28O46M68l98r56j018r06k87m79P34R70P80Q99M85j69q47p16j008
2155h74p78p2M88P29R32Q23N21k22m61q38q63o96l1k95P29J050Q30P84l24J16
2175A548q06r27r54n10K6N60R73Q55P59K6Q2p41q77r06n46n09P16R40O98P43N38
2196A688j1m97j028q62o87j51R9M84J173P77M29J98l52o75p85j031m40K58L02
2215a111J005P51J020N2j96r71n33o89q93j60L63J003Q83Q33M84k95o15q53q52
2234g74p02nM6P61P93P64N17J12n67m94r62p19o19M08N91O47Q69O15M40l56q99
$$ y = [404, -384, -1444, -1720, -1788, -926, -336, 1064, 1646, 1816, 1623, 871, -584, -1109, -1891, -1507, -1438, -336, 546, 1175, 1528, 1712, 978, 138, -692, -1458, -1845, -1539, -618, 456, 1283, 1824, 1980, 1100, 558, -539, -1195, -1804, -1801, -982, 300, 928, 1574, 2042, 1644, 688, -330, -1236, -1523, -2002, -1268, -298, 482, 1381, 1866, 1697, 850, 134, -874, -1652, -1724, -1236, -507, 425, 1248, 1769, 1547, 1086, 248, -615, -1311, -1342, -1637, -908, 142, 972, 1756, 1432, 1548, 742, -185, -1139, -1649, -1623, -1063, -90, 765, 1524, 1550, 1632, 891, 14, -892, -1438, -1947, -1231, -291, 407, 1150, 1688, 1677, 1180, 152, -710, -1397, -1548, -1449, -965, 208, 985, 1414, 1612, 1260, 585, -200, -1231, -1671, -1413, -1111, -106, 645, 1665, 1717, 1521, 550, 17, -672, -1565, -1725, -1362, -359, 524, 1357, 1841, 1546, 931, 78, -774, -1476, -1481, -1435, -674, 119, 883, 1400, 1512, 945, 451, -511, -1230, -1849, -1441, -850, -203, 666, 1281, 1721, 1365, 466]
2255D66p27p32n20p8M01P75J007O85j7K68n81r11q29n42l24L40K69J399Q05L79
2275A533j77l67o22o60o98m94oN56P87O74J009r6j33n70q15j096Ol29K91P89J061
2296F43L95L51J57p59r56q67l29l03N26N96P33Q33O89j67m32q34o13q98m11K81
2316a365M58J070O76M20K96k01q74r93n48j22l72M06R19P82O93J68j49l86p43
2335A35o51j100K68K73P45P58N49M74M3o05p03o75n06o03L16L93R88O86L81K06
2355A372l83m89p64o84l76J36L43P93O01R65j40Q4n98j004q97p19J95O81N41P79
2375D36O28M37j94n03o43r00n03l69K77M23J354M14K94J25l85n11j034m04l64
2394a422L1M58R40L75Q56M25p13n71p86m96l44j26N37P71K47P16N06Mn18r87p37
$$ y = [466, -261, -993, -1513, -1591, -1190, -415, 592, 1277, 1260, 1528, 947, 36, -793, -1335, -1659, -1319, -1050, 349, 1154, 1533, 1356, 989, 367, -293, -991, -1485, -1491, -935, -148, 526, 1535, 1439, 1306, 736, -79, -1175, -1169, -1498, -1207, -418, 643, 1038, 1389, 1546, 787, -169, -1036, -1365, -1668, -1142, -546, 187, 1020, 1709, 1542, 1110, 276, -337, -1235, -1646, -1365, -907, 163, 839, 1259, 1555, 1354, 480, -513, -1061, -1183, -1555, -1149, -230, 552, 1245, 1413, 1264, 878, 135, -516, -1616, -1348, -1075, -330, 428, 977, 1451, 1494, 889, 186, -489, -995, -1598, -1282, -889, 99, 785, 1166, 1372, 989, 500, -264, -948, -1324, -1188, -845, -52, 549, 1514, 1374, 1458, 860, -144, -1041, -1760, -1565, -884, -343, 436, 1064, 1501, 1307, 804, 161, -739, -1242, -1611, -1334, -911, 443, 857, 1151, 1276, 891, 380, -654, -1058, -1422, -1391, -933, 7, 382, 1238, 1663, 950, 379, -407, -903, -1247, -1373, -836, -65, 182, 898, 1404, 1408, 890, -97, -834]
2415h34l22j87L69M39O06R15K13O5m7j028m56q43l88L00N85N15O01Q56K95l87
2435A267j111l74o41m35j17N44Q41O31N30L81n33j79q29n33n51j53L14O63O92
2454D07O98K93l23r5p07p73r18l3L94L11J027L91P29j9m70o08o75n38m85L47Q0
2475i67O63J137K25K95l3o35q31n46n11k27L27P08O70R02K77l6o84n86o96p26
2495a274m4M59J90O54R34M45L7j46j012o29n72k70q4O31O87Q08K67J63m8o24q48
2516b76q06p2K2L67N40P19L39N57k72j51j313m51l88l17M29N57P59P27K92M8m85
2537H25n90p47n16q3r6M19Q80P50M03L06m74p33p30o31k41O5M58N74O45N44L47
2558A375l01k95n78q57m45j69L74N21Q77K78P08j62l43o68q37l69o82N36M43M42
$$ y = [-834, -1156, -1343, -974, -535, 71, 986, 1199, 1264, 1217, 189, -267, -1110, -1498, -1198, -613, -98, 503, 1359, 1654, 1267, 156, -218, -859, -1294, -1411, -867, -26, 605, 1135, 1516, 983, 804, -25, -558, -1109, -1262, -948, -285, 407, 1105, 1398, 1075, 980, 273, -500, -1418, -1451, -1057, -746, 281, 672, 1401, 1382, 912, 304, -371, -909, -1394, -1047, -967, -304, 833, 1058, 1353, 1320, 685, -146, -692, -1203, -1430, -1103, -395, 275, 1177, 1454, 1418, 734, 148, -548, -1274, -1318, -859, -669, -15, 919, 1364, 1401, 1255, 243, -386, -958, -1228, -1312, -681, 6, 814, 1081, 1244, 1196, 572, -276, -1082, -1154, -1132, -765, -225, 494, 833, 1390, 1118, 967, -346, -797, -1185, -1502, -1073, -516, 243, 970, 1262, 1310, 825, 235, -512, -1028, -1111, -1207, -788, 92, 842, 1245, 1551, 1077, 344, -386, -1017, -1258, -1193, -735, -161, 484, 1028, 1375, 1074, 779, 201, -656, -1101, -1270, -896, -375, 502, 780, 1488, 1326, 983, 315, -522, -891, -1573, -1037, -594, -152]
2578a52Q94M38M5k34p48n01p25n31J76N81O85O36M90J00O9o97n95q13n38kM38
2599i84R62O14M03J72K67q57m22p03n55k15L02P50R5R23M18M8m65n78n52o84j83
2620a244K1O35M91O84M77K46l15o50l90p64k13k78N49N69P50M40L76m41P8r16
2640A05m21p79k31L91O77O59M24N23j48k87q19l95o55k34J48N01O37R36j62L42
2660A212k27m58r08n05l24J35K31N76N38O99M57k92l79o73o94n38j3J49Q27L95
2680B08N55K50J0j58j243J54p26j28L88J89N98L91N36J27l06m64o80m86k91K06
2700h70J17P84M32K64L74j79n04m22q23j40J09K68M50K00P46j20J30k62n44n52
2720e42j81k13n9M02N26J039N7J36o37K8p51p89m1K21L10M67L43O14J42k76k55
$$ y = [-152, 742, 1180, 1225, 991, 243, -258, -983, -1514, -1338, -757, -72, 564, 1054, 1154, 1223, 526, -69, -882, -1420, -1422, -984, -22, 592, 995, 1167, 1434, 577, 155, -548, -1103, -1318, -1016, -266, -171, 752, 1170, 1218, 753, 175, -377, -1061, -1244, -1223, -588, -97, 587, 1064, 1310, 995, 345, -45, -809, -1022, -1300, -751, -182, 568, 1008, 1384, 943, 1021, 105, -316, -1095, -1326, -935, -258, 401, 825, 1348, 1200, 913, 94, -301, -956, -1190, -1042, -541, 96, 1032, 870, 1212, 985, 527, -381, -886, -1210, -1075, -844, -268, 270, 969, 1426, 1134, 755, 82, -612, -1150, -1163, -1014, -187, 208, 763, 1013, 1023, 865, -378, -224, -950, -1078, -690, -501, 97, 488, 1024, 1151, 845, 381, -299, -785, -1076, -870, -753, 31, 463, 727, 1101, 922, 418, -4, -827, -967, -858, -590, -140, 60, 806, 686, 816, 554, 10, -542, -723, -936, -995, -593, -67, 972, 1029, 1165, 528, 556, -195, -984, -1025, -804, -494, -27, 316, 930, 1072, 796, 541]
2741E41p82m71m04L6K52O56M81L75L56m3k82r09j96l48k70J42M48P05L17L64P9
2762A047k64n80m84o10j23j61N15Q65M39K64J59p9q10l97m57r0MJ61N42L54N30
2783H25L19m09l66l21p60j64p2L65L03M15Q48J99j21o32n0o66n85J04r0M12P65
2804C19K78L61P1m43j87q03l99p3Q2M66K36P53K99k39j42k08k91q23L4k59N85
2825c83l2L46M63M12J27j56o06n07j41l66OL52M74O83J80J33m96m40m06k43q5
2846f85q8K56L1P70L60Pn8l57k20l53l67j67K65N89M4P27L1j12n01j48m30j77
2868e83j55j00P15K93N26NR1j80m70m51l33j24L89Q4L25O03J02j6l03L7m43o51
2890f39J7j05K83K37N03J82J02M77o86l34l30k78k00K59J73N28L61J56j01k36
$$ y = [541, -241, -712, -1116, -1080, -828, -172, 309, 684, 1040, 997, 715, -194, -390, -738, -1008, -866, -418, 287, 604, 968, 1047, 783, 203, -281, -891, -1014, -1175, -660, 205, 644, 908, 1067, 988, 178, -219, -676, -766, -762, -601, -59, 295, 825, 1144, 735, 369, 48, -712, -876, -948, -583, -280, 135, 983, 1182, 1061, 429, 379, -287, -872, -768, -858, -446, 319, 597, 958, 1029, 586, 399, -404, -803, -876, -794, -328, -92, 661, 960, 721, 579, 371, 80, -743, -709, -968, -383, -415, -69, 394, 806, 933, 777, 171, -336, -477, -843, -837, -485, -11, 672, 852, 985, 489, 49, -357, -600, -685, -773, -517, -486, 284, 644, 651, 593, 236, 16, -337, -704, -871, -606, -17, 27, 754, 785, 673, 172, 24, -406, -583, -738, -838, -123, 170, 696, 701, 792, 612, 142, -309, -642, -766, -377, -293, 32, 635, 737, 721, 418, 455, 12, -639, -622, -727, -444, -207, 296, 478, 580, 1057, 371, 37, -293, -571, -771, -512, -339, 189, 550, 706, 605, 369]
2910C69k93k62n24l6J54K46O44K65K44j71k36k95k88m1m21K27K11J64Q2M16L32
2931G87j1n81k13n50q9L5K60K01L11J96M92l31R2m24m89m28J01k16L11N56J74
2952A84M69J36l38m11l64L8o09J81J49M03L64L13L8j76j36m08k36j20K16k37K90
2973b54L40L21L19k10J5m18k54m37J38K18J16J89M65K29m36J96k44k68j93l36
2993e04j1J57L06M70J06Q9l64N7l83l10j38J72p9L46J48L92J68k94n7l26m72j0
3015e37J25p9K71K95K39J55K21m11J38n78m00J92O7J57R5M65M4j14oJ12o79j08
3037c36J37k32K6K47K33L78J57k60k62jj94l74L8n8L67J21K90J16K4l83l8n14
3059e18N55k98p4J92L14R2J6J54r7k41q6j43l76J56k15M46L49j56O10k67l03l44
$$ y = [369, 76, -186, -710, -746, -592, -346, 298, 563, 807, 636, 400, 105, -183, -224, -645, -418, -207, -43, 39, 455, 787, 776, 195, -18, -568, -657, -622, -362, -161, 150, 346, 838, 507, 599, 175, -314, -742, -641, -857, -546, 10, 184, 653, 789, 451, 40, -324, -286, -895, -714, -565, -162, 202, 515, 553, 377, 241, -167, -403, -523, -307, -544, -254, 86, 407, 726, 516, 531, 113, -141, -578, -440, -222, -106, 83, 548, 777, 341, 537, 293, 25, -168, -504, -515, -358, -52, 418, 524, 613, 249, 306, -77, -387, -525, -353, -432, -86, 62, 454, 622, 328, 271, -55, -527, -537, -412, -491, -220, 75, 314, 469, 690, 279, 417, -161, -561, -369, -302, -145, -50, 415, 459, 345, 339, 451, -228, -336, -199, -431, -405, -158, 75, 453, 610, 350, 88, 87, -107, -481, -443, -501, -134, -13, 277, 393, 417, 34, -4, -518, 37, -261, -335, -143, 171, 263, 279, 433, 336, 95, 9, -134, -510, -354, -569, -123, 226, 70, 680, 413, 110, -234]
3081b34l3j26k17M58j17J43J27M17J68k01m39k42j04j05P3M84j62K85K38L2l16
3102A29Q1j28n03K31p0j31K27K92L20n5k8p8m60J56n75L37j08K57Q8K38J18l3
3124C05j39L0m34k77L83m0k06M75p9M25n0n8l15rk35j90k6j1M06K50k3J45j6L8
3148C49n80J08j61j02K57J35J00M6J72l8m0k04m8l44o9J19K7J85K76P8L13k21
3170C58l83Q7l64o8R3k40M68N6K70j32K12j5k36l81J9k13K16J39O0K32N6m9N4
3193B39q0r0m25l8J05N1K41L5L90R6Nn96LM7n22K32J07JN66j80k45L62n6j3k79
3218d4n14L27n7J58J65q5M12j08K38o79J57k91J32O3l5k01O08K1J33m40K91m10
3240a59j34M08j22j5j56M48n9K33k96j71j40l9n8J92n7L9K8J40J08J11j51L0k71
$$ y = [-234, -267, -393, -610, -152, -269, -126, 1, 418, 586, 385, -54, -296, -400, -505, -432, 52, -110, 175, 413, 445, 129, 210, 82, -421, -190, -260, -391, -164, 128, 448, 393, 365, 287, -173, -17, -592, -255, -363, -106, -18, 220, 338, 305, 166, 196, -238, -515, -132, -172, -378, 97, 18, 443, 393, 335, 20, 11, -224, -414, -440, -451, -45, 205, 182, 327, 311, 349, -231, -123, -284, -386, -129, 6, 106, 152, 324, 286, 246, 42, -6, -350, -419, -300, -273, -88, 188, 266, 579, 358, -25, 62, -302, -370, -277, -517, -49, 7, 277, 145, 357, 342, 106, -275, -256, -469, -253, -114, -54, 178, 234, 185, 239, 159, 69, -356, -394, -289, -238, 3, 38, 428, 524, 529, -67, -64, -17, -539, -307, -200, -199, 367, 187, -58, 304, 248, 235, -44, -558, -231, -288, -130, 35, -50, 362, 254, 492, -187, -30, -321, -189, -126, -161, -362, 246, 267, 400, -40, 251, -159, -293, 115, -7, -22, -178, 270, 211, 444, 148, -23, -163, -202, -260, -68, -125, -86, -58, 82, 190, 301, 150, 180, -91]
3263i1L9j31J90p4J02M6q8J51L45n21J48j27r4m8K84l65J15L98j19J61k76jk15
3286a71K02k40J3L2K53p9K65k73K42j84k93p9P0K00j20L4L2K51r3N75p30J63k18
3309a48k9K27o4j7J73n5K55l05J47l19J64k36k9j08M11j52R3M4K79j12j48k46
3331a75J25k04N9J06j9J69n5Q2J73Q4l13k20j39J49J04J45j51k2M26k30J34j25
3353A03k31l12K70J34k66K31O4K57J43m19JMl8J02k22k94M84K18k42J80J57j66
3375A58m45L35Lmj10j2J05k1L1J26o8o5p1j71K35l88L81J36J7J37O2l74J40k88
3399a51j70J47J49J32k70L05J77K37k33j77q3l42l9P6j3K11K08m4J03J64m98M6
3421f5M8N0O0k75m9J29J33oL65k37j73O5k09n2Q9M00k63J38K03k70j87L50l48
$$ y = [-91, -52, -183, 7, -67, 35, 81, -7, 144, 489, -32, 116, -11, -105, -153, 131, -234, -119, 279, 160, 321, 45, 44, -171, 31, -209, -196, -164, 89, 10, 275, 2, 244, 60, -233, -312, -242, -42, -162, -128, -96, 155, 62, 637, -93, 70, -148, -177, 50, -14, -31, 142, 87, 342, 37, 184, -135, 29, -207, -236, -344, 67, -85, 8, 52, 331, 219, 71, -175, -50, -254, -195, -89, -108, 61, 6, 88, 261, 345, 32, -188, -327, -178, -74, 71, -80, -102, 324, 94, 228, 103, -128, -440, -170, -36, -302, -71, -7, 250, 393, -26, -25, -21, -59, 43, -179, -473, 11, 229, -13, 167, 324, 158, -287, 48, 51, 47, -63, -75, 30, 9, 40, 166, 98, 33, -38, -209, 26, -362, 19, 155, 172, 309, 371, -3, 137, -151, -321, -174, -25, 107, -163, 142, 319, 556, 323, 146, 63, -279, -318, -242, -255, -44, 164, 120, 223, 387, -111, -65, -17, 33, 93, -182, -231, -102, 31, 25, 390, 153, -20, 45, -164, -216, -127, 273, 10, 148, 351, 81, -106, 244, -104]
3444a04J06k07Q7MK8J33lm7K71l50J57j45j40j72J87J32J40J73m1Kk49L08n02
3467b32M5N1j5m1K53m2l2k3L38m19K15j25j52J44j81K07j82M39jq4j67L11m97
3490a90L47l42j63K72L3r7J63M93l92k13K05j02j13l26K12K02r3K50m3l33J81
3511d9j05N0j5M4j19P7K96k6j3J83j86l07L08j88k95K39k5j17M52ll3Rj77J5k40
3536b25K27q9j05M49j45k2P3K15pj60k98J69l70j49J09M64O7J69k83k9k10L8j00
3559b12J68j47K52j08L10J67m92K43k67J70k90j86J35J47O4J62rK37j2k82L3m06
3581c23j3j44L14n3K75N9O5M5m7O7k83j41j29K06k5J36J43N1Q2q4j44Q7l14Lk7
3606a94m3J25J91L07k55Q6p7k61k13njM16k68L00K4j71M38k83j85p4J33j27k95
$$ y = [-104, 2, -205, -118, -114, -86, 47, 44, -3, 268, -82, 75, -70, -210, -382, -195, -63, 77, 250, 209, 211, -38, 270, -232, -187, -136, -151, -192, 61, 19, -13, -36, 302, -117, 98, -27, -179, -35, -216, -9, -191, 248, 247, 163, -4, 307, -190, 157, -185, -348, -76, -43, -140, 23, 516, 124, -89, 116, 14, -99, -425, -213, -11, -104, 146, 103, -230, -49, -154, -104, -119, -75, -194, -117, 179, 153, 140, 323, 137, -170, 138, -50, -345, -106, -131, -248, 204, 201, 168, 177, 0, 15, -225, 2, -87, -192, 257, 112, 90, 163, 378, 371, 211, -87, 82, -288, -437, -328, 136, 203, 372, 89, 60, -150, -112, -212, -44, -191, 61, -47, 263, 430, -62, 181, -86, 84, -206, -392, -257, -110, -46, 116, 107, 344, 332, 50, 83, -323, -336, -480, -166, -219, 56, 115, 180, 225, 178, 245, -38, -179, -308, -102, -127, 9, 152, 203, 285, 201, 57, 144, -170, -167, -194, -237, -112, 79, 386, 131, 217, 140, -121, -334, -339, -340, 76, -192, 108, 132, -39, 399, 116, -69, -143, -10, -137, -432]
3629d32K65M84k5j57J79M7j64l9n53J20M0Q2J9N13k94L89k27k49L9j48m45J33
3651d23K45j07M72K29j41Q9J01o19pk45J07Q6K03N6K74o2O1p2k24j29Q6j03k44
3674c67O7M22k2J30K9j58Q1k81j27n7n1Q1J65J05J71j5j45K48j77Jo26J92J46
3697a88p8O02m37K09O6J00l98N9j64L8j33p4L48M0R6J73j80J7j42k77J61l73L48
3720a87N5J86K76r2K93l34N5m10Jo3r8K61J47K11J1j4M9k35k20m7p0l1J20N1J94
3745A09J95l5R1k44j27j51k30nK88J49J5m2L41K5j26n31K82m51L51k8j8L54J05
3768C17J06j81J07o8k77l80J31j77L41l9R3L49k24K21j45j10m39k12L91K19k37
3789b14L56K6j43K20j51j30j13Om16M37P2J69J08k1O7j45k7m8j39j98L60p2M0
$$ y = [-432, -167, 317, 292, 135, 314, 361, 197, 158, -395, -275, -235, -153, -134, 379, 85, 474, 247, -2, 37, -111, -556, -423, -178, -285, 187, 416, 275, 364, 465, -154, -161, -406, -299, -213, -10, 46, 320, 258, 319, 247, 23, -106, -20, -123, -367, -300, 122, 100, 230, 259, 101, 182, -99, -226, -283, -334, -253, -88, 17, 188, 173, 28, 276, 99, 100, -526, -334, -188, -266, 336, -101, 108, 174, 274, -124, -65, -229, -191, -324, -398, -50, -10, 86, 259, 79, 96, -46, -323, -162, -535, -187, -132, 54, 330, 238, 531, 197, 252, -158, -157, -220, -318, -57, 90, 301, 312, 298, 347, 112, -108, -155, -225, -256, -136, -85, 109, 304, 269, 360, 116, -11, -162, -392, -397, -109, 40, 55, 13, 354, 379, 253, -278, 4, -447, -96, -124, -142, 212, 317, 423, 242, 349, 281, 4, -376, -245, -422, -81, -120, -27, 322, 98, 319, 174, 64, -375, -587, -196, 23, -214, 142, 168, 25, 245, 94, -36, -149, -143, -559, -122, -50, 119, 227, 206, 273, 128, 101, 53, -86, -284, 76, 4, 44]
3812D4J64l9Q5j63K32l38j17KL8j94J38K89k55M76j4j97k37Q4k37R7m2J15K64
3835A95L7k6q6R5k31k15L29m29J90r9J25L07m3J45%K8l56j24l6K8J08j0K83j86
3859B9J02P9n5L1j33k67jJ00n8J56R9K15j07N7n5R8n30j71M57M8l91L74J5l8M3
3884I7k59L00p7k40j30J43O0K19J61P6r3r4k20k58L31k30j25J14K85J14O2q1k7
3907A28P3l82o6j44J59K49j00K73j21J66J50l77j15p6j24L26k73M05m8K0K1n6
3929H8j41J71l02k69p2M94l3K0N0K52r8K48m46P5j57j08R7r6L25j51pL51k15O6
3953A42J26n90K33j44K77mJ76r2j05J57Rm26K52j11o2j71J44J57J63j12l2j17
3975a30M12k33j82j51K47j62J62L41j94K44j02j76n9j47q6J52K3R7J4k3M00k96
$$ y = [44, 208, 169, 254, 91, 323, -15, -132, -130, -92, -286, -148, 141, -114, 362, 348, 151, -86, -2, -239, -142, -184, -69, 195, 232, 206, 120, 215, -16, -231, 98, -331, -141, -240, -115, 192, 149, 294, 294, 322, -34, -158, -194, -166, -58, -68, 215, 29, 131, 210, 155, 186, 53, -214, -215, -115, -173, -17, 82, 297, 190, 247, 192, 290, -240, -411, 46, 94, -297, 77, 92, 54, 97, -162, 138, 61, -179, -309, -166, -106, 113, 274, 350, 257, 163, -57, -315, 16, -214, -339, -225, 60, 174, 236, 155, 128, 201, -181, -247, -391, -232, 17, -83, 190, 69, 235, 385, 8, -107, -183, -307, 19, -254, 151, 103, 123, 144, 88, -53, 118, -184, -453, -525, -31, -64, -44, 6, 258, 160, 408, -38, 37, -120, -228, -131, -227, 98, -53, -60, 291, 76, 142, 268, -322, -89, -233, 44, 40, 216, 124, 19, 176, 185, -241, 11, -100, -162, -333, -189, -32, 131, 19, -13, -130, 282, 49, -133, -284, -37, -199, -37, 304, 110, 354, 252, 76, 17, -130, -216, -64, -41, 56, 70, 47, 447, 151]
3997A51j62j76J57q0K03k95m6J17Q1K48J45r0l10L3k27l8J28M98l34J20L4J31
4019B88j78J34q2m48k5QL22J44k53J93j8O6q0j21J56l41L11j26k20M73K11k6L6
4042D24l93j12k70l5K13j26O01k63N8k7J15l21J68J35j07j67K37j28k14M75k46
4063A7K49k45r3K13l20J30k87J11K41r4K83j4lq8j63K5k01L08l41L51k7K68n7
4086B63q6N0l19J46m8j76n2K50k42L00J36J33m47l1j78K37k14J96j29L5L63M4
4108B31K5M8n18L58l7n01J46R7O6P0K81k54j51P4Q5k1J46l68oK29m5j53M07j43
4132F6K5M6j39n0j65J52orj25L60J63j84P%k33k1j93L74j88L8L74k57J35j68n
4157cP8j73o2J5J24J98p7p0NQ7N4j07j91N8l05M33l0J77J0l14L05k83J06k18J91
$$ y = [151, -11, -187, -30, -110, 93, -202, -248, -131, -50, 198, 343, 253, -57, -24, -251, -289, -161, 337, 3, 123, 157, 288, 110, 244, 162, -286, -311, -303, 19, 163, -90, 103, 85, 151, 71, -50, 106, -235, 76, -50, -270, 203, 414, 388, 424, 31, -81, -351, -386, -173, -299, 302, 39, 97, 70, 185, -136, 32, 167, 60, -107, 130, 2, -212, 263, 17, 266, 21, -72, 141, -179, -49, -336, -225, 16, -78, 205, 191, 188, 100, -63, -38, -239, 69, -272, 79, 52, 320, 263, 177, 227, -92, 54, 6, -170, -222, 28, -214, 86, 222, 355, -92, -123, -301, -64, -278, -82, -211, -176, 187, 231, 256, 304, -214, 144, 107, -394, -248, -151, -85, -15, 266, 12, -139, -65, 20, -1, 145, -223, -229, 0, -45, -198, 209, 66, 91, 137, -2, -52, -217, -65, -71, -80, -205, 155, 318, 134, 141, 141, -92, -113, -306, 68, -120, -82, 292, 35, 170, 2, -3, 75, -98, -160, -145, -21, 177, 100, 30, 35, 122, 176, 69, -122, -64, -369, 64, 34, 211, 221, -93, 212, -71, 35, -183, 8]
4182Hl04j16K65K86J5j13K00j84j35QL10j46j66M1L2J05j69O6J68l26P8j1k18
4205c06KK48K7m8K25K72l40m9R5j95O2j67O1O7L72k72k1J17K11l00J63n87Q9N1
4229b23J62J27k34M16k28rJ09l10K6J21J03j57K88J19n5m4P0j02k19J21k69j59
4251c47J78K4K07m6qK61l10M1j56k3J87k79L02L04k10j62J12J81p8k39m7J47M5
4274H4j38P3J2K50rj49J08l06J10k68J69J79j30K41j29J80m8j30j28j18K3k7J52
4297Aj10K65j7n9Q4l0j22%j42L18l39M6M25k83J30k50K38J65l79k17K01O8j46
4320a53K11j63m4L20j59P3J96l92R3j70L59o7k15Om6K21N5k25K5j64N2K10P3L4
4344A30m62L85K40j28j12R7k98K81k52O7K15j04M4j90M03m32r5L43k64N3k6m1
$$ y = [8, -296, -412, -147, 139, 154, 41, 241, 57, -78, -70, 240, 94, -72, -31, 1, 106, -63, 3, 171, -155, -77, -88, -306, -304, -56, -29, -77, 148, 420, 80, 31, 126, -69, -7, -174, -113, -46, 326, 54, 33, 150, 361, 61, 224, -363, -274, -223, -61, 66, -168, 248, 20, 11, 120, -190, -164, -43, 60, -97, 191, 310, 255, 211, 281, 179, -40, 81, -188, -347, -169, -145, 62, 16, 8, 269, -41, 0, -156, -179, 8, -271, 31, 335, 125, -37, 75, 256, 178, -61, -108, 39, 84, -54, 19, 31, 281, 272, 123, 231, -75, 35, -233, -64, 115, -15, 226, 97, 277, 229, 99, -29, -147, -124, -151, 1, -109, 156, 139, 80, 164, 134, 12, 12, -130, 188, -151, -105, 320, 37, 167, -83, 155, 320, -59, -276, -75, -7, -153, 58, -105, -149, 171, 12, 85, 281, -111, -18, -188, 171, 104, -111, -105, -151, 70, 125, -100, -75, -239, -187, 23, 96, 130, -332, 53, 293, 165, 53, 150, -148, 133, -119, -52, 163, 59, 103, -87, 316, -116, -211, 132, -132, -79, -105, -146]
4366a46K04Ol3K30pl36j24Q4k82L18L64l28J32j19J05r4m7j39j38N42k10q9o1
4389a68L79K0N4p0k28k29p8M19O7k73L0P7J02L9M0k18J89j74J29k3k24M1K5J20
4413D6m7o2K38K0k56J32m03M18k25K45j14O4j66J72j50O7o2k0j1L33l08K68j00
4436G9N7k8j76O2J03j9j42j32L76l27L82k29J11J61n04N6p3N20k22j02J68M4l14
4459a49K61J59m53M8K86r2kl00J21L03J01l15P9r2O2M8R5l95J92J63J2Rj06K38
4483B73l13J51q9j55J8o7J43j17J99k76mM38j94O4j20Q6O6j97J24j65L67k95K6
4506c7J43j22j85K99j1J2m7N3j97O3J16K2K7q6n6j70J07J36m4j18m8K01j55j3
4530a10L0J65K32m83L70j93k94J91O2l6Q0K2ll78L51j2o5J88l36j63L87J44j83
$$ y = [-146, 58, 64, 31, 261, 254, -82, -206, -122, -404, -86, 278, -50, 82, -37, 68, -26, -73, -212, -350, 192, -18, -107, -168, 211, 231, 285, 215, -13, -242, -320, 99, 166, -107, -77, 0, 102, 141, 181, -37, 152, -22, 107, 84, -140, -99, -74, 46, -1, -63, 175, 195, -61, 71, -332, 86, -139, 106, -8, 56, -110, 62, -88, -21, -83, -103, -114, 219, -89, 179, 79, 136, 108, -68, -6, 97, 78, -64, -196, 180, -147, 235, 6, 117, 278, -226, -170, -243, 277, 55, -47, 121, 165, -149, 112, 271, -182, -134, 152, 60, 58, -242, -121, 182, 283, -32, 47, -45, 17, 65, 160, -235, -43, 120, 132, 141, 35, 273, -40, 111, 22, -133, -115, -182, -39, -156, 43, -233, -237, 201, 7, 71, -49, 37, 103, -94, 30, -135, 232, -63, -37, 106, -16, -201, 98, 87, 99, 52, 105, -92, -29, 87, 109, 136, 50, -6, -176, -69, 67, 23, -95, -143, 58, -97, -110, -80, 85, 317, -166, 204, 11, -283, -92, -30, -66, 14, 36, 33, -345, 6, -6, -71, 117, -219, -382, 5, 149, -34]
4553c4J0J97J4l86J88j6p5J5J46k62qL45KL6j71N3K5j96n7J54Kj53L16m3l6k20
4579a54M7J3J7j06K55k46K09J5j5j29p0J96N8q0j56J15l8J02Q8j76J07l6lk03
4603a90J42J19k32R6J97q8J4J39r3j39%j00K69k07J07n7K28j8j95l1J14k26n0
4626b01L89l41K36q2K51m23L03j36K18m07J38k7J5j66J11K41L7j85J81l11P2m7
4648a34J89J47l31J91k70J17L45Lj35L1n8j34k07K47M3M5j33L43k0k61J58j21
4670E5j61K20j63l5r7K40m9J66MM6l56K38J23n54L62m6k06L91j15J40j40P2l64
4693b29K67j98j63J59j81K92R7L66l65p2O7n5k96J68k4J29j73L02J02o1j97r4
4715a59J23n0J86k63K56L97l57J31Lj9j59M9n11L40J67k92K07j33K76r0J10l3
$$ y = [-34, -24, 173, 187, -199, -11, -27, -102, -87, 59, -203, -211, 134, 136, 172, 1, 54, 79, -117, -174, -20, -18, -171, 145, 102, 66, -154, -107, -94, -77, -183, 72, -174, 35, 50, 35, -94, -164, 32, 90, 10, -146, -31, -69, 33, 121, -55, 52, 16, 13, -190, -48, 71, -161, -65, 132, 44, 58, 197, 104, -35, -35, -135, 134, -73, 34, -23, 205, 187, -8, -39, 75, -151, -201, 188, -153, 83, 1, 252, -171, 132, -4, 214, -193, -55, -82, -67, -233, -122, 119, 156, -29, 152, -159, -87, -134, 55, 202, -129, 62, -208, -91, 254, 257, 122, 153, 95, -39, -246, 1, 44, 89, -44, 299, 279, 18, 176, 55, -106, 114, -49, -84, -181, 59, 10, 176, 180, 226, -130, 108, 231, -323, 39, -7, -213, 178, 63, 203, 63, 135, -229, 38, -160, -323, -164, -345, -53, 44, 410, 45, -27, 40, -15, -311, -143, -167, -38, -211, 91, 193, 132, -65, -159, -36, -86, 100, -163, 93, 490, 133, 264, 267, 248, 89, 138, -373, -33, 134, -158, 49, -84, 192, 102, 212, 179]
4737A79m75J65J44J40k24n1L72j57p6O4K29j71N7k63K05q1k05J18j92N95m13K98
4759B58q5l85J61l3Kj82K99j52J58N1j13k5j95K10J71m68L52k0j13J87m9K7J75
4782B31k13q8j36L9m9J01N4K24m9M7j82O4n4j21k8LJ07K51k44J34N9Jr6j30O9
4807fj76j05J50K8K1J74J66l95J01l4r2j8P9K6j1k32M45J01J3l07K55k39N7k44
4831b43Q4J25J13q4K21Q7m34L77j56r4j59Lk30M22q9K11j69L34K8l26j95O0R4
4854b0R1k92J85o0K95K5j19j91NL4j15J04j59J03P8J47M2k73L41K3o24J60L33
4877A13j58k6l2L63k93L68o9k26p0k45K07o2O3J95jp3Mk33P7O2k33K09%r5L37
4902A82l11O0K61m1j91j41K15j50l45K91K04m2J43k13N6K08j84J70l32q4R5J81
$$ y = [179, -296, -131, 13, 153, -71, -122, 250, 93, 17, 81, 310, 139, 196, -67, 138, 57, -148, -30, -222, 373, -40, 258, 173, -212, -51, -84, -82, -264, 35, -117, 41, 92, -21, -46, -241, -31, 140, -328, 24, 4, -109, 78, 29, 56, 231, 18, -70, -206, -167, -216, -115, -61, 163, 114, 161, -21, 43, -11, -132, -160, -157, -50, 201, -43, 91, 150, 151, 55, -75, -6, -182, -287, -137, -109, -88, 86, 252, -143, -42, -76, -168, -186, -107, -81, -92, -324, 121, 222, 235, -72, 183, -56, 1, -243, -159, -34, 79, -5, 216, 303, -131, 246, 90, -4, -163, -160, -390, 32, -57, 154, -15, 319, 347, 21, -174, -114, -20, 71, -221, -36, -96, 199, 224, 105, -86, -81, -47, -162, -58, -217, -114, -36, 111, 153, -120, 221, 244, -380, -220, 113, -45, -71, -103, 260, -33, 335, 266, 40, -30, -275, -68, -130, -67, 128, 127, 54, 58, -175, -98, -36, -269, -60, -60, -155, 182, -129, -69, 192, 151, -40, -181, 34, -116, -461, -170, 34, -8, 135, -78, -22, 186, 2, 172, -160, -244, -149, 32]
4924C2J01m2J8N4j51J0l15L74k98Q0r7K51M8j6J48k22J48l39O9Q8l0K63j60o7
4948e3jJ56j18M4j0r8k82P5J73p8K56J67l46K51n2r9r3K69k52p3J97J27j53k8
4972b1M1m9N0k59O6J8R1l33M64J01M1k10K5J19k67L96n20L88m11K02L5L59k1j1
4996B94J46n75k26J2L76K63l59P9P6L39K8n52j02Q3j18J90l79K44J66O2n0L77
5018C74l23p0l7oO7k25J50K7K33j13P8Q7q7k12p7R6j45R8j10K53L7K4lJ56k28
5043D4rm8J26k72L9J63j7K68k36J06j13M6m9r5k94k5N12o8k0J43k6j6p5k10j09
5068b35L7R8K63k6k2P2n8K59j80j90r5o7K35k24J49k3K30K6j07j78K44j10m77
5091c79J85o4k80N82K85j18k17K27l84J21K19l94O2q9L43J93r5j47L18n64J78
$$ y = [32, 133, 91, 109, 163, 12, 22, -293, 81, -217, -137, -234, 17, 65, 49, 197, -25, 123, -216, -147, -59, -89, 174, 14, -53, -54, 102, -16, 28, 18, -80, -362, -287, -114, -192, 64, 231, -115, 136, 84, -15, -108, 161, -91, -164, 33, 160, 7, -21, 20, -29, 21, -238, -172, -154, -63, -396, 68, 169, 210, 0, 25, 144, -123, 273, -247, 141, -270, -68, -33, 326, 305, 294, 440, -135, -361, -349, 27, 290, -69, 10, 86, 425, 453, -99, -201, -118, -236, -46, -425, -181, -15, 47, -3, 374, 51, -19, -56, -62, 5, -220, -70, -43, 190, 77, 155, 242, 155, -57, -134, -38, -183, -85, -195, 58, 95, 119, 116, 272, 44, 35, -13, 113, -159, -120, 43, 26, 294, 58, 164, 51, 97, 48, -47, -341, -366, 146, 78, 58, 201, 175, 159, 84, -126, -235, -198, -100, 163, 137, 115, 187, 129, 388, 208, 18, -77, -144, 91, -133, 16, -7, 223, 249, 142, -36, 208, 98, -379, -194, -258, -538, 44, 329, 211, -6, 221, -163, -42, 177, -217, -155, -244, 99, 292, 197, 50, 368, -196, -18]
5112a8k28J69j19j68J32K40J15J50j66Oj49k49N2j18K0K59K36L1p0j6K5l44K27
5135A7r9K6j53L0K78Q7L2l32J50K48n87J94k87L17j9J25J3k7J35R5j48j34O3j85
5159a61J56r9o1K98R5K46l21j09l8j00o9j22L4K96l4K34K6J3j86Kl02J61k07k10
5183d58M70j25J88j68j3K81j29j69J0r2J39J24J80n4j15Q8p5r9q5O6k39J55j11
5206b31Q7ln3L75j70J99k42J20j51j49J83j06K03l0J00k8L03m38j20j08p2R8K9
5229b04o0N45k70Q2J78k85j26K29L3j71n2K2K34m6j60N98k13k76p4k61M52n24
5251c49K17K80J11p0l0k7M2m95L53k45M73n08L31M0K63k49n5k8j24K5M7k14K42
5274C0k25j41L32K37R3l74K53l81J15j64l2J34P3n5K34J00J52n26L30k37l57K61
$$ y = [-18, -246, -77, -196, -364, -232, 8, 123, 273, 107, 113, -36, -285, -233, -351, -331, -72, 164, 195, 125, 109, 134, -210, 17, -82, -56, -209, -179, 99, 186, 218, -114, 36, 284, -303, -109, -396, -79, -98, 27, 40, 13, 148, 243, 95, -39, 24, -161, -5, -104, -165, 133, 228, 474, 153, 44, 6, -94, -163, -285, -251, 45, 11, 245, 271, 284, 98, 100, -202, -41, -248, -458, 12, -113, 75, -93, -106, 175, 46, -123, -113, -205, -66, 58, 238, 184, 69, 157, 82, -17, -102, -36, -275, -120, -231, -144, -147, -200, 175, 5, 204, -38, 82, -69, -218, -35, -141, 62, 32, 132, 104, 407, -31, -151, -259, -331, -233, -204, -264, 281, 11, 93, 271, -14, -140, 89, 122, -49, -101, -79, 155, 109, -51, 547, 334, 58, -16, -277, 175, -349, -132, 148, 259, 189, 159, 132, 174, -321, 32, -213, 260, -248, 83, 123, 386, 137, 82, 54, -70, -45, 2, -212, 30, -195, -336, -4, 233, 326, -48, 205, -176, -61, -225, -257, -123, -50, -105, 129, 229, 381, -145, 185, -52, -409, -148]
5296a48O6j41K90j37L80j30o0j93J14l44L15p2L8R7j35J51j1k09L63l95J16j13
5318a58j4N3J7m0Q6J76k89O5K7K2j73o9J05J34L08j54K62j43j72k4j68p1J10K38
5342A28k3l70J87K25P0n7l56J21p2j14k90L21J82J54p7q3m9Q2K82j99O5m38K58
5365e3l5j17N37n2j19l51k2K16k67J54J55j00K1L14O5m73J24K10k49P6j37Q6j34
5388a51M55l54J95j36J16j17o9O0j89Q4J6j73N8J12M09l70j39j82J96J93j95K21
5410D0k17O9L13J11j49O7j45l08j69K30n5J9J05M4K61j29j95J60k1j16j54J03
5432a36lJ08L25R4k13j67K4k4j20j88J83k10L02j9K01Kj53p6l39L19l7q0J07k07
5456c07L87p7J36j67J58l00P4J1Q9j6j07K3J90K05k96J40k52L02n83L23J6j25
$$ y = [-148, -82, -223, 67, -70, 310, 180, 120, -73, 41, -303, 12, -60, -22, 75, -60, 91, 80, -129, 234, -161, -45, -158, -172, -119, -102, -142, -56, 120, -169, -104, -77, -55, -228, -297, -192, -58, 250, 96, 358, 215, 43, 19, -149, -220, -110, 128, 105, -265, -78, 147, 217, 160, -196, -75, -147, -261, -551, -230, -48, 106, 29, -54, -103, -21, 261, 62, 127, -311, -53, -88, -205, 332, 280, 161, -190, -212, 4, -263, -109, 46, -54, -33, 281, 346, -127, -3, 207, -42, 34, -103, -17, -151, 304, -50, 145, 9, 125, 8, -61, -1, -190, -106, -90, -263, -205, -93, 316, -54, -193, -375, -179, 14, -181, 40, -177, -108, 205, 316, 167, 234, 89, -219, -388, -158, -213, -194, -89, -45, 216, 87, -108, 52, 31, -85, -239, -136, -139, -31, 294, 388, 175, 8, 32, 8, -112, -300, -117, -327, -25, -44, 157, 159, 6, -70, -409, -90, -127, -207, -100, -307, 80, 3, 139, -28, 130, -170, -96, -85, 4, -12, -119, -96, 94, 299, 3, 143, -109, 193, -390, -67, -51, -176]
5478a76R5K28J16j73q6J81k66j68m0K17j28k1L60j55J20j0m2j54K1j82J34J58
5500B9j12J02J1J60j70J29p3k80r1J59j66K21K40M9Ok92k2j7J55J8k51K00m7J60
5524A18n0J77K51l12J64r4j00l20N1J18j69K83j99L99l56R8k83J22r8J02J33k63
5546b28J95J82l42N93n71K67j96p9K58j26R1kl42L22J67k51K19m8j57o1J67k14
5568a56J97l9J09q5N9p8j78K52l64L40j92P7n9L76j42k5j37j0K19k42o0k5J6J60
5592A3N4J03j45m3k3k2j61L80k69J81nQ4M9l58N08o5k03j49r9K05o0j53L30m1
5616A11j25J86m74M60k66J4J81r3K1P6o5J84m21J48J86k66L9L6k89L04kL4M3K12
5640B34k4j92J62k25r4j30K11N2J32M7m8N7k64m2O4J45l74J38L35l39j17J90j09
$$ y = [-176, -81, 147, 263, 90, 4, 185, -81, -249, -289, -72, -200, -221, 139, -16, 104, 94, 52, -102, -81, -263, -129, 29, -83, 19, 30, 190, 20, 149, 76, -204, -295, -136, -302, -81, 159, 208, 214, -78, -100, -117, 38, 56, -195, 5, -42, 118, 68, 245, 496, 184, 348, 254, 154, -166, -115, 3, -166, 117, -82, 317, -39, 59, -224, -102, -200, -98, 35, -228, -33, 149, -193, 400, -171, 96, -100, -179, 79, -47, 44, 42, -300, 22, 189, -62, 157, 109, -48, -109, 58, -156, 41, 2, 111, 26, 85, 7, -171, 81, -283, 57, -135, -58, -117, 259, 117, 92, -45, -55, 164, -78, -138, -163, -147, 13, 67, 170, 25, -18, -41, -63, -224, 156, -113, 68, 63, 147, 196, -162, 346, 281, 78, -71, -170, 35, -25, -178, 152, 111, -14, 172, -302, 158, -108, -94, 87, -6, 15, 91, 26, 210, -211, -63, 123, -143, -104, -68, -357, -53, -55, -21, 22, 234, 210, 18, 180, -45, -139, -269, -58, -6, 126, 173, 125, 182, -82, -124, -60, 85, -289, -151, 184, -155, -272, -82, -191]
5663a91K19j15K17j50lj19O6N0k1J59K39j52l5k08N1q6l1L14k15J58j40M1l0K37
5687B55j91o2j93M8L9L57m18J52j2J63J37l63O5K1j15M0L4j69L7n0L64l62J71
5710e2K40m98K76J90j31P2l90M25Rp0J46j62k68R6K75l05J56NK44m5n6k04QR4
5734E5L8k43p0J65rJ42j60J89j87L4j31L14p2j65J11R0l05K39j37J46q5K2j07
5757a26k20J97R1J30J44q3j38j3%KK03k74o0K35J4P4j47N3n0J15l33K52k91M36
5781B11n12R3K86lj58p0K09k12L98k89JJ09o1J69m33K22k6k1j98L22j74K27j27
5804c7N1m1j76J20J73j74kL37%p5j33k34mK92o8j69J04j06M3L65K2j88j67K33
5828A66j49o0J2K18J2k57N7K05j83l1p8K17k71J4j85N27P9J00j70m30j4K29L8
$$ y = [-191, 28, -87, 130, -20, -23, -142, -76, -26, -47, 112, 351, 199, 164, -44, 7, -79, -110, 204, -11, 147, 7, 48, 18, 255, 64, 2, -191, -143, -104, 253, -165, -13, -25, 138, 275, -88, -23, -2, -117, -77, -43, -212, -175, -225, 139, -223, -52, 188, -310, -34, 156, 25, 97, -293, 132, 141, 71, 217, 55, -213, -117, 158, -147, 9, 14, 258, 213, 157, -47, -39, 55, 93, -150, -220, -55, -64, 78, -82, 107, -80, -46, -177, 137, 65, -100, 11, 101, -204, 35, -102, 44, -41, -19, -126, -346, -149, -58, 72, 216, 133, -5, -18, -18, -16, 187, -87, -147, 88, 102, 176, 29, 82, 32, 147, -186, 66, -225, 211, -301, -208, 78, 75, -83, -153, 56, -156, 242, -47, -46, 63, 2, 171, -262, -40, -66, -87, -285, 37, -137, 90, -37, 14, -27, -203, -83, 90, -84, -86, 251, 251, 176, 43, -191, -195, 97, 29, -140, -36, -142, -99, 266, 288, 100, -67, 166, 17, -43, -31, 187, 199, -58, -1, 204, 21, -10, -88, 129, -142, -128, -313, 214, 293, 393, 223, -207, -221, 8, 46]
5851D6J01k84o8J77O6j78Q3J7L4Q1n2J17k67m3K73j76J75j11j16M0MK42m24L36
5875G3P5N5l50j63L98J18l15J04K7M2m7j07J72j40j10L33j31q2O9k03J73j20K8
5898a01pR8J96k09j29J82J47l23K0J73K11l44K90k22j63J28p0J35J5p8k2J31r9
5921d1J15O9j77J13M9o0Lr0J43j22j38J40rl17M78J1j2Q6k3m9l8l06j7M19l26
5946i9K3J05J86j45j70k7J33j7j85K45M2j38J61Q5p1k6k9Jl07K26J00l23J93O7
5970C0Q0j17j6J04r3n5k24L21m6K9J8J42k27k1M7nJ04j91Lp3K91j99K08k18K21
5995A13j64k22K39M7O8k15J84l53L23m9J23P9j46J18l65j22K83J32j13K3L7P7
6017I7q0J18k12L8%J36q5J4R5j99L1n3K76ok90J79j31K1L3j9K35k13K41l74j9
$$ y = [46, 147, -137, -205, -28, 38, -140, -57, -40, -6, 75, 23, 140, -127, -170, 103, -73, 102, -9, -125, -85, -81, 161, -263, 73, 148, 203, -147, -310, 88, 206, -109, -5, 22, 64, 17, -90, 82, -58, -168, 165, 34, -48, 21, -182, -9, -129, -101, -108, -10, 186, -23, -152, 30, 177, -146, -126, 47, 258, -86, 204, -18, -181, -53, -123, 12, 27, -51, -73, 58, -41, 74, 143, -34, 79, 128, 68, 71, -19, 124, 2, -136, 4, -5, -322, 156, 167, 155, 241, 218, 169, 131, -175, -192, 227, -99, -76, 29, 215, 70, -100, -127, 6, -11, -196, 49, 91, -47, 114, 199, 128, 102, 73, 74, -233, -7, 93, -230, -37, 30, 110, -7, -23, 81, -12, -67, -291, 30, -16, 13, 31, 173, -54, -75, -28, -33, 71, -120, -117, -190, 101, -98, 110, -108, 113, -51, -273, -34, 13, 81, -134, 50, -303, 20, -29, 94, 173, 27, 145, -220, -342, -59, 73, -40, -17, 20, 97, 17, 135, -77, -39, -39, 97, 12, 26, 121, -78, -47, -100, 176, 170, -120, 59, -72, -51, -18, -37, 198, -15, 226, -148, -167]
6042a67L93k03J64k82P5kL2kJ1Q2n1K96j35k16o7K96m13K96p9mK66l90k6K66k95
6067a55PN3j10J66Q3K05k00R6l5k60n3J68K69j99j21J75k%J24k29j89K04j03K31
6091A25l05L02k06l4K52K0L6j94O6m6%k37K42k0K13l93J37J67o8n9J13l63K36
6114a6J76j13j26k47M77J2j08j42R5J04j27M6j84J81Q9J00q3K0l77K93P3k33K8
6137f2J35q9J15k15m2k1L42k92L1L77k71J06o8m4k01M06k65J60k5m06L50L3l53
6160b99K62K02j2P4k20JM0K48j53l6l21J32L10k84M7j11J9Q1M8J77q2p6J09k57
6184a01J03J52m9R1q2j95qj34K92k00o6M02j85K31q3k49j9L14l42j88J40K27q6
6207c5o7J71m8n4k58L01K7n1j91J65P2J57n0J29j87k6p1J98k62J2J80j06J03r7
$$ y = [-167, 226, 23, 187, -95, -20, -22, 10, 8, 19, 101, 50, 346, 211, -5, -72, 224, -189, 107, 28, 24, 290, -100, -126, 140, -155, -148, -95, -205, -39, 44, 249, 49, 145, 110, -150, -203, -35, 234, 35, -86, 89, 87, 87, 211, -18, -207, -3, -106, 125, -180, 122, -84, -118, 134, 154, 190, -4, 62, 16, 16, -221, 21, 1, 214, -179, -42, 125, 57, -2, 111, -252, -16, 160, 47, -79, -326, 151, 163, 55, -87, 8, 112, -15, 31, -153, 28, 117, 217, 134, 154, -223, 70, 143, -90, -62, 73, -16, 99, -116, -158, -179, 163, -129, -98, 279, 8, 114, 46, 2, -199, 207, -58, 102, 77, -329, 21, 54, -299, -37, 165, 153, 227, 7, 8, 48, 296, 143, 107, -214, -82, 228, -56, -9, -120, -101, -20, 28, 205, 123, 47, 156, -101, 2, 154, 105, 196, 114, -81, -89, -223, 69, -131, -197, 205, 20, 251, 168, -81, -100, 214, -128, -316, -176, 51, -35, -102, 69, 21, -33, -291, 10, 37, -14, -205, -40, 32, 189, 139, 268, 81, 55, -16, 182, -80, -68, 112, 6, 109, 12]
6231A2l7L39l48%O0J1J61J29l48M5j65M04l15q5j15K03j2m9M3J45l3K8J12j4n7
6256A14l09J24J31k27m6J45j81L29j52J24J04l22J44k41J18L98j44jr6K1L42k02
6278A73j66o8J07l50R9J32j02K7O7k1J29J68j84r3K6l53K80pM4k7L24k64n1J59
6302D9k68L70k62K31j93j06M83m92J10J21J8j23j8l6q9L02j63M1J25L6M1r1j43
6325e7j8r4K47j71q5L31l31K23qJ04k56K72l55K57j71j74L84l68L53k41K7M5L70
6348B84k47j47J28o9k5M2N5J16l45R8J8J32p5R0j35j01o7M36J04l48Q1K7j63L65
6372B54l68k1p3J34K64k73J41l7J5L2j85K38N1l07L94k18m3j57J85K7k12Q8o5
6395a36K04J03P6k59J69k64J36j05J43k57l3J71J40J66n38K37O8n6J29j21k40
$$ y = [12, -25, 314, -34, -34, 26, 37, 198, 327, -21, 24, -141, 263, -52, -137, -252, -49, -61, -110, -67, 78, 45, 73, 185, 171, 114, -195, -71, 60, -167, -213, -68, -249, 80, -72, 52, 156, -166, -22, -263, -145, 253, 109, 108, 12, 33, 375, 173, 7, -61, 46, -304, -205, -73, -175, -148, -81, -102, 27, 195, 11, -82, -56, -409, -129, -136, -92, -119, 205, -59, -110, 49, -219, 151, -111, 120, -73, -179, 304, -188, -78, 43, 61, -62, -80, -116, -205, 97, -66, -25, 100, 136, 177, 86, -57, -75, -169, 78, -93, -178, 153, -178, 45, 37, 141, -115, 157, -198, 59, -112, -286, 98, -270, 83, -158, -131, -86, 284, 37, -110, 18, -51, -76, -34, 21, 137, -208, -110, -92, 40, -35, 55, -80, -181, -248, 188, 292, -56, 25, 52, -111, 254, -114, -135, -208, -74, 190, -83, 58, 21, 36, 68, -117, 121, 172, -135, 259, 41, -2, -159, 26, 53, -159, -71, -136, 68, 171, 247, -12, 157, -107, 29, -76, 67, -190, -223, -52, 88, 254, -284, -47, 21, -35, 94, -27, -267]
6416b67L75o6J4l02J04j01K07J65p0L8j35J29k70L03j11j66M11j61j77j84K02
6437f2N2k4O4o8J8k65J87P5J59j47Q0R4l10J27J34j09k9j74L87Qj05k24j42J57
6461a17l1Q5Q7j24J36O2k08j7K20Q4k32L2N9r8L20j78k07K76k80K84k54j69L94
6484A24k20j16K77k39K37o4r8L84k48J36j39l15N82j58k0J81n22M33l00j6OpJ89
6507H7Q9k63J17Q6J3P6r3m5q4j50p8L38p8j56L43j78pJ93l41q6L92m30J14K17
6531G6j79j03K47l0O1l4ll2j4J22oN7k19J3M61n11q3J62J76n6k32J54R2j40MO6
6557D9m0M6j8r6%K36k10K27J14n66J63J64j1k17M7R3j95K50J42l71K51n3k13L82
6581A74l09q0L33k59L5N9L3l2L1k01N4J64j84M7J62p2J61l95J48R1j43m7K91m2
$$ y = [-267, 108, 42, 56, -246, -142, -243, -36, 129, 59, 97, -38, 91, -179, 124, 13, -153, 258, 97, -80, -264, -62, -10, -34, 30, -38, -20, -285, -98, -23, 136, -11, 69, 163, -147, -20, 114, 5, -24, -198, 189, 197, 92, -132, -274, -117, -148, -63, 24, -100, 36, 98, -110, -127, 93, 177, -55, -23, 36, -62, 258, 80, -127, 149, -131, 153, -101, -270, 124, -96, -212, 65, -174, 63, -1, -99, 285, 37, 173, 34, -281, 301, 143, 123, 304, -218, 215, -85, -101, -95, -102, 87, 176, -87, 30, 116, 129, 205, 112, 67, -17, -167, -245, 93, 15, -141, 202, 24, 17, 210, -131, -217, 175, -255, -141, 76, -103, -206, 41, 11, 72, 38, 35, 3, -11, 111, 105, 162, -57, -44, 417, -94, -177, -15, 161, 105, -127, 27, 119, -21, -17, 49, 9, 55, 37, -59, -59, 177, -33, 194, 308, -258, -95, 69, 58, -159, -112, -19, -214, 36, 178, -193, 58, 5, -208, 174, -135, -215, 118, -141, -106, -47, -14, -46, -15, -216, -162, 2, -182, -135, 27, -45, 116, -279, -131, -40, -183, -230, 61, 19]
6605A9j04M9K1R5k6j82J82J21n9k93M6J99p8N1j43K48k89%R1r1m8ML68j92R7J5
6631A01q6k38L89m30M58j80j57K78j49k49J83J09j27J27Q2k82J45J6Ql80M04j43
6653a21K74k45J69J33k39J00K2M5l78L94j17j47J83Rj55J27K3j65J49Q6r2j7P7
6676A15j48N0N6j58J85l6kJ50k12k11K45j51M5j62K93K7k1j1k92K69j73O7j30
6699b05J36K76j01j3j60J29j96K87Jl25J12K07j63j84P4L11J02l57P9P4n6J06
6721A34k44j06K86n5J62m0l08L75l09J83l01L22l17J69Mj9J59j90J65k57J24%
6743f3q6J4q8J71K1j13L69k53R0J64n20L91K2N7j81Q3j66J31o7J82m22K68r6M1
6767e1P0J59K1j77p7o1p2J74K5P6J69k57k16L29n4q1l2Q2q9k00l6J69J58L1J12
$$ y = [19, -85, -36, -15, 80, 54, -128, 54, 175, 116, -177, -131, 68, -10, 41, -102, 146, -143, -143, -52, -143, -191, -187, 181, -11, 86, 101, 15, -223, 166, -264, 194, 14, -143, 135, -14, -263, -80, 29, -98, 29, 111, -171, -26, -10, -2, -382, 22, -121, 153, -92, 77, 210, -29, 71, 93, 138, -240, 154, 37, -110, 73, 82, -73, 54, 77, -88, 61, 147, 55, 38, 115, -33, 17, 73, -85, 100, 64, 62, 212, 0, -211, 34, -117, -72, -234, 59, 86, 65, 54, -238, 31, -142, -75, -205, -69, 207, 106, 93, -67, 62, -134, 153, 154, -171, -59, 148, -15, -199, -125, 186, 288, -69, 10, 84, 28, 134, -110, -216, 70, 15, 177, 137, -171, 204, -105, 78, -223, 99, -218, -49, -45, -64, 95, -95, 70, -187, -63, -63, -149, -135, -223, -52, -31, -144, 225, -28, 62, 226, -294, 97, 119, 176, -5, 78, -88, 43, -24, 158, -264, 4, -92, -51, 19, 178, 199, 22, -55, -116, -188, -14, 11, 87, 256, -1, -217, 112, 58, -23, -55, 27, -62, -262, -298, -129, 29, 60, 172]
6792A72j09J27l23L7l5K36J4j09k24P4J64k59L67j26j24N0J28j49K73k1j90J06
6814G9k22J08J57j75N6O7j5J31j76j6J37Mj91KO7l07M29k23K80j14LK3Lj33j23
6839a49N5k2j02J72J35l45M38n8J46j75L7R0p9j22k27J32K00j09q7L36l17J93
6861A42k99nK1j44K95L9j99n4L00N8j13N5k11M56l44q3J77r1k02K5K86Q7j57l5
6885DK14m68K27K46k70J68j02J34l36K15k38K59Q4p5j85M56l70K29k24j28L26
6906A66o7k69L30j86P2j25J79j84L48j88p1M1j95RK9j2j05L73j73J59q6L3l9j87
6930a48J11k30J64J90O1k60K35J62l26J47j3k69%k49M73J56j42k1j5l8L4J60l44
6953a62m0K75j67J12J55m57L71o7k44K91J23l7m72O53l79K56k91M17l60M5J21
$$ y = [172, 63, 190, -133, -96, -131, 105, 119, 10, -214, -140, 24, -235, 132, 6, -118, -68, 60, -89, 184, 163, -27, 79, -143, -35, 122, -53, 3, 70, 55, 186, 10, -6, 131, 135, -56, -54, 13, -294, 135, -88, 192, 78, 81, 104, 107, -26, -149, -94, -116, -218, -46, 89, -256, 182, 124, 270, 95, 132, 222, 143, 21, -206, -74, 126, 17, -70, 266, -51, 142, -157, -162, -141, -285, 10, 49, -150, -204, 96, 154, 41, 96, -115, 341, -3, -86, 91, 0, -202, -177, 109, 196, 39, 4, 218, -250, -23, 223, -47, 121, 19, 153, -183, 32, -206, 53, 137, 62, -123, 333, -37, 192, -32, -160, 166, 99, -170, 160, -26, 46, -79, 100, -84, 264, 76, 5, 46, -149, -140, -111, -123, -228, 145, -28, 131, 45, 78, 39, -148, -37, -267, -103, 87, 148, -112, 123, 285, -41, 106, 93, -176, -176, -425, 48, 204, 62, 41, 26, -12, 22, 182, -162, -202, 73, -94, 18, 173, -284, 87, 20, -224, 67, 190, 153, -319, 334, -45, 211, -80, 337, -23, 22, 143]
6974A43k30n6J11o3J06k35L7K65J5j68o1L75l58l5K25l4J49j8l24J71j34J34j22
6997a07J59L6k44J52J32j74L3J6j09J11j0K28k77j57J5K27k8K7j68l6K53R5p9
7020I5N3jj83j06j38K32j65K27N5j24k05N89l10N8j78N4o3p2K08N0l23K37K02
7043A92m11K5J80m1n5P5Q7M6j19j31J71k9j37J57M3K4k28K02L8k61J70K65k46
7066A7J68m29L59r7K6j16M6K51l04k02L05J70k71J48j67j2J56j56Q4j37O5K42
7088A46k64M1J1n8P3j0j7J00j93L30Ml65M71m79L40r6L00m12K14P4n13L66k5j
7112C7n7R4j31o4L61j34k9J1J30k21k11L81l39J51O1J8l12L18j38m1J96j22j76
7135b17n7L25k8o6Q8qj55K2K70j62n3j25K14q3j8L6K42m20L43k68L9No2Q9L40
$$ y = [143, -87, -143, -32, -95, 11, -224, -187, 78, 93, -75, -136, 239, -119, -154, 71, 37, 186, 168, -156, 15, -119, 15, -107, 52, 88, -156, -4, 128, -46, -13, 3, -106, 5, -5, 223, -54, -211, -196, 31, 3, 30, -138, -174, 79, 174, 95, 148, 147, -36, -142, -280, -48, -213, 14, 69, -55, -260, 329, 19, 77, -101, -47, -110, -182, 26, 76, -247, -10, 192, -219, -194, -14, -55, -110, -35, 52, 98, -21, -152, 19, -10, -147, 10, 53, 77, -151, 51, 89, -172, -2, 263, 17, 185, -244, 115, 18, 44, -72, -26, 225, -79, -281, 24, 194, -77, 71, -96, -108, 48, -108, -24, -161, -96, 146, -118, -77, -66, -124, -51, -61, -78, 22, -171, 159, 163, -202, 269, -210, 130, 34, 334, -78, 136, 210, -303, 63, 38, 37, -20, 74, -57, -121, 240, 106, 77, 88, 218, -3, -214, 167, -172, -21, 40, 58, -254, 64, -74, -115, 81, -41, -217, -274, 51, 23, -43, 45, 37, -118, -96, 174, 12, -41, -166, 48, -35, -53, -17, 225, -195, 148, -120, -81, -76, -138, -49, 291]
7160B91k84j0j36P1J24Q2j1J00j34k66M0QN1J9K43k37l5K42k08P8j10L51k1k63
7184a5J13k44J28j2j38K65j8j11N5j27K75k6J61l72l1r1J15J60k35R3o3J18j59
7207a59L04q9L4j43K9K2J52n20K94K7J73j31J93r5j63M5O4j6j51l8O4K47j97m8
7231a02M5L07j93Pj87J90K9j80L8Q9o8j63N17j82l3j18lJ14l87J37J91m9p9J57
7255G7J80l11k11M88k01j25J80k17n0L42k28K54P6j49r1K84m51N3J12j00J37o6
7277a7J79k38L4n2n7m7M0m7jM19p6j11r2r6J79j24J00r6j2O0Q9o4J02P0J4j46
7303A0N4l0M6l3o5J60k67L3K30k5m0J01j26K9J2j75QJ43P4j1R0k05j06K69o8j91
7329h3j49L10j37q4L97j26k75K87j01q4J39l17K1Q0R7K93k75j2o0r9J79J17j51
$$ y = [291, 7, -3, -139, -68, 56, 138, 127, 227, 93, -173, -133, -125, -74, -55, 188, -49, -84, 158, -50, 28, -82, 269, 248, -15, 98, -146, -18, -30, -168, 97, 79, -32, 23, -104, 171, 145, 306, -66, -97, -188, -73, 87, -148, -55, -118, 0, -159, 145, 56, 90, -53, -24, -2, 150, -370, -76, -49, 124, -7, 186, 91, -72, -27, 37, 21, -130, -168, -104, 143, -54, -102, -57, 250, 57, 64, -123, 67, 96, -84, -46, 43, -25, -188, 329, 147, 114, -4, -7, 107, -280, -143, 48, -1, -80, 77, 257, -54, -265, 223, 22, -103, 77, -140, -190, 152, -76, 178, 254, 105, 14, 298, -153, -100, 12, -88, 49, -17, 162, -76, -42, -94, -151, -198, -158, -205, -206, 213, 137, 26, -66, -162, 17, -107, -7, -103, -115, -55, 34, -30, 72, 142, 156, 10, 64, 34, 80, 47, -18, 142, -125, -92, 138, 113, 73, 174, 48, 77, 89, -86, -78, 65, 139, 128, 218, 13, -93, 176, 108, -83, -232, 78, -59, -143, 254, 128, -147, 140, 39, -45, 94, -223, -202, -122, -25, 268, -7, -19, -79, -178, 1, 118, -33]
7352c3J35k03J58q4l3J56j2j20J31k57j02L56M7n26M08J03k62K82n7j34K8J94
7374A75k08k62M28oo6k14J12j86J47J53M1l45L36j72R6P2q3J20j15k62K83m4j03
7397a03K39m08K96RK23k14K70m54Q1p8L98m01L14J04j02j91k64K24Mj45L55k50
7419i3J0O2k0j27K12j0L44j70k41K56l57L3J34j22lL2J97j56j21R0J2J26j83P8
7443a7J37l13J74j09J21J33k37J16k62K83j9J66k80L13m07R8J98J06j55ON3k1
7465H4k76K87r0J21J08k70L29k85J42j52Q2k20M3L33j06Q6j63K6k38K5K47j6j39
7488d2J6j91K32j78L09j1o3j22r2K18r1n6j48J67J75l68J84J84N7k61O9Jm2pj84
7513b44Q5J68L2K4o1l9m6K28j47j63J99l36J10K90l32O0J23p2L31j51m46K94P6
$$ y = [-33, 102, -101, 57, -27, -60, 96, 84, -36, 95, -162, -264, 92, 139, -387, 21, 124, -138, 144, 87, -47, -19, 175, -33, -295, 133, 127, 61, -153, -41, -227, -80, 73, 114, -231, 105, -67, 29, 101, 18, 138, 23, -239, 44, 0, -103, 136, -272, 24, 33, 256, 42, 312, -142, -61, -139, 259, -142, 172, 276, 174, -17, -281, -57, -53, -198, 157, -93, -83, -21, -41, -168, 44, 34, 378, 208, -33, 223, -134, -101, 33, -89, -92, -60, 137, -19, -140, -50, -38, 88, -95, -17, 120, -193, -19, -128, -7, 126, -111, 5, -257, 26, 7, 173, -107, 206, -201, -103, 95, 201, 46, 52, 105, 84, -192, 95, 5, 126, 234, -36, 293, 8, 150, -2, 80, -140, -97, 236, 130, 216, 53, 79, -159, -134, 113, 97, -42, -26, -217, 15, -163, 146, 135, 72, -50, -142, 76, -15, -71, -219, -52, 123, -245, -61, 123, 180, -81, -12, -11, -53, -60, -244, -159, 9, 41, 65, 4, -35, -81, 147, 0, -163, 36, -300, -190, 100, -232, -172, -49, -121, 210, 59, -387, -93, -17]
7536a7k13L45j46M3k99L88J27j99k61J19P7J37l42K6L54j46L2m7K24m35J94N7
7558A8J66l96J16J58J18k23J08j6k88J23K33k38n4N27l08R2j63j22rK48J55m29
7580a84J80j68N16k63J66J8l62PK04k87M85j71rk24m8K74q6j81K44l53J72L56
7602B86l39mK04J53m19K03J5j03nj71P8N2J23j15J91k16l8qn0J42Q4j12J80j45
7626a4J64Kr0n8Qr0J18j61R0K7m9J56j98J64L5m4l57L94k61J33k4J72k60M0J23
7651B0K38j78L5l3l01K01K46k34j22M70n29K85J60j09n8O6j53j24J48P8k51K26
7673H1j04JJ27J7l05L03k84L10k1j83j67o7L42Lj37J05j70K49R3k73J65j37K34
7696A82l02l6J43K04l27J48P4M1k3k79K01K79l38j22J22L56m12j79K19j55L22
$$ y = [-17, -230, 115, -31, 12, -287, 101, 228, 29, -232, -113, -36, 101, -241, -215, 139, -7, 25, -22, 202, -233, -39, 18, 184, -212, -96, 62, 180, -43, 65, 49, -239, -116, 117, -121, -175, 352, 44, 136, -27, -149, -158, 90, 245, -184, -4, -172, 344, 81, 247, 265, -97, -90, 114, -173, 312, 141, 132, -92, -140, 134, 48, -133, 111, -242, -70, 286, -53, -57, 147, 300, -119, 84, 99, -4, -9, -180, -102, -50, 73, -42, 149, -67, -105, -113, -163, -21, 63, -49, 131, -14, 150, 152, 62, 4, 12, -78, 40, -121, -31, -4, -53, 103, -95, 69, 104, 60, -297, 97, -164, -31, -55, 117, -143, -103, 20, 258, 80, 115, 82, -219, -18, 228, -6, -128, 342, -187, 98, 258, 149, 91, 157, 4, -120, 28, 106, -145, 81, -23, -22, 105, 122, -183, 120, -164, 146, 125, -58, -225, -292, 50, 53, -84, 21, -149, 100, 193, -80, 85, -52, 182, -120, -156, -13, 191, -136, 12, 86, 127, 104, -175, 26, 305, -33, -155, -33, 323, -89, -268, -49, -204, 118]
7717A18K4l15K77m9o1nor0m0K41j21J42q3n0n7L82k62J30p9k92J39N7Q6j50J11
7742D7j27j74M10O9o6k07J08L17k98P3m84M01K06j10k14m2n0J28l9K84O2j95j88
7765h9r9K57j52N6r2J92K35q6l30K26J30l26K8J96j6j46j35L7K07k31K36j40j14
7788a56K30j5k31J58M5O2Q6j61j43L16k83M7O9J69k51K43r4r0j4q2K51j94K86
7811B48l71K74j63J51l7j26j99j41M19m2o4J33J74k48L1Q1L3l37rJ73M8J89l65
7834a48L03q2l09K19J03j99k17L04K64j03j3j30rMj3Q2j29J27J26n5k24J64n3
7857A2q4O2J32j07R0l29M01j70m3Q7L3o7MJ02j25J22J23q1j45n0k16o2N47l70
7881a34M0R3J01N3k55N0n7K17L8l4j39j10K42j41Q0k2p4M5J76j70J24J4p1R6m07
$$ y = [118, 142, -173, 104, 55, -6, -11, -17, -107, -147, 94, -27, 115, 32, -18, -75, 307, 45, 175, 96, -196, -57, 0, 86, -64, 47, -80, -254, 156, 225, 159, -48, 60, 377, 79, 152, -332, 69, 275, 165, -49, -91, -141, -13, -52, 232, 294, 99, -89, -188, 69, -83, -27, -119, 73, 308, 222, -108, 118, 248, -78, -50, 146, 130, -16, -151, -114, 93, -138, 98, -42, -156, 74, 59, -172, -14, 31, 93, 179, 18, -125, 191, -92, -45, 24, 193, -58, 185, 91, 1, -13, -95, 156, -38, 248, -123, 151, -12, 139, 102, -24, -223, -364, 55, 13, -51, 82, 256, 8, 39, 120, 153, -184, -193, -20, 28, 217, -148, 155, 73, -236, -17, 86, -113, -330, -26, 238, 135, 122, -8, -17, -13, -26, 56, -73, 54, 180, 125, -99, 65, 12, -72, -10, 122, 15, 105, -224, 177, 7, -36, 51, 84, 17, 21, 123, -2, 120, 243, 162, 17, -33, -249, -311, 236, -134, -94, -1, 100, 153, -102, -52, -109, 108, 146, 112, -27, -137, 105, -36, 44, 22, -52, -7, 169, -1, 123, 137, 66, 162, -245]
7906b45J24M6j74K54J12k32J83j90M3R5n2r1J30K65k40J59m37R4J64P3j53n4J82
7929E6l68N59k08K7r2K2R7k03J26j45N8J80k79K9N4k4N4L18l22M3K1J0k49O1J34
7954d1j76K46J91j67M4J75l39M8K43m08K44j6pJ21n8j82k0L00r5p9M3q7p3K12
7978A19j29J26k29K38k57K62k59J97k6J36J6j90N1J08J31l83K08l65J87J87l0
7999I8R5o1o8l7q1J17J55k81l7K2R7m5J34k68O6jM3J83q7j65L60l76L80l43K88
8024A88k38K8k6K49l38K75j82l1J84L5j3k01J47pj19J52q0o3N4k72K0K74L1O0
8048A27L9k25J3K45k50O0J46k94J2J15O2n7o0J88j89OL20k47M1j27J42O6P9l16
8072a04j25m1K78O0K3j70k09N70j55j76J3J03k90J88l8N0j89J97M3j13K16N0k86
$$ y = [-245, -121, -75, -249, 5, 117, -115, 68, -122, -79, 16, -36, -127, 3, 268, 28, 187, -250, -156, 8, 81, -72, -126, 56, -312, 247, 39, 66, -26, -4, 93, -110, 16, -129, -71, 109, -170, -141, -87, -111, -57, 261, -61, -18, 3, 13, -236, -175, -41, -217, 29, 220, 53, 97, 272, -67, -19, 224, -184, 60, 44, 37, 158, 100, -82, -102, 198, 103, 24, 67, -20, -93, 119, -10, 116, -113, 125, -132, 130, -129, 68, 42, 178, 194, 4, 55, 163, 294, -89, 119, -246, -59, 128, 98, 193, 132, 64, 27, -54, 63, 218, -63, -100, -78, 19, -26, 108, -160, -94, -95, -52, 131, 44, -121, 239, -137, 243, -100, 188, -50, -22, -48, 201, -137, 138, -44, -75, 109, 144, 131, -70, 77, 70, -49, 103, 23, -40, 14, -258, -238, 36, 67, 127, 166, -59, -46, 199, -51, 9, 155, -139, -127, -12, 50, -7, -67, 121, -68, -62, 258, 11, 52, -75, 67, 133, 212, -104, -229, -270, 8, 68, 91, -79, -288, 282, 127, -49, -36, 67, -223, -35, -73, -23, -212, -15, 28, -85, 131, 181, -105]
8095a05n2K20R1k29M5K55j87L1j4o2o6p9J37J16r0l56L90J11j08j45M1K27k56
8118h5k0J28K55k10J24j21k83M06r9j04J4%J68k09j2q5P1Q3R8j85M5J61L2n1n4
8143F7j44p0L64o4J4j93m2K07j26l59J89j13L23j42j6J29j39l3K3K5L3j40L91
8166A84n5k05M5K0K9o2J8j20Q0K1J81J4l30K86P2n2r0L38m78L26j20%M0j98r1
$$ y = [-105, -157, 63, 154, -75, -30, 225, 38, 69, 55, -7, -73, -152, -15, 101, 11, -345, 45, 156, 48, -97, -56, 171, -85, -105, 23, 278, 68, 192, 71, -212, 194, 95, -9, 5, 5, 173, -36, -48, -133, -62, 21, 119, -66, -21, 140, 172, 121, 67, -77, -147, 217, 153, 167, -26, -68, 139, 13, -346, -157, -270, 53, -89, -105, 24, -115, -148, -125, -100, -67, -207, 184, 129, -76, -31, -11, 18, -44, -26, -146, -66, -45, 136, 150, -180, 106, 178, 126, 36, 374, -104, 222, 102, 102, 142, -56, -147]
8191a47
$$ Imaginary data points
##PAGE= N=2
##DATA TABLE= (X++(I..I)), XYDATA
0@%%%%%%Qq%qJ6j6J6k4L2m0N1n9P3q9J07j31J55j82K13k52K93l34L87m47N13n82
32c08O62p51Q42r51J072j199J340j495J665j848K050k272K514k780L067l381L726
49A953m104M521m980N492o059O692p411Q226r163J0249j1531J3070j4951J7324
63I328k0417K4639l0775M0543n8565J02760m13478o71513O01884M84732j17513
74d8375k46728M43653N96215j3585n55079k95555J7314j22036l24540J3330L86824
85a48562K79028p850J47292L56060R453n79779n01491R6755K61071j99025l21762
96f08810K77195P27420L05606l32892l00986J24224O7706l97877m64755K1139
106e82030L52956K11603O0844J98623K44920m2312k80096j65771m4070k15334
$$ y = [0, 0, 0, 0, 0, 0, 0, 8, 0, 0, -8, 8, -8, 8, -16, 16, -24, 27, -32, 41, -48, 59, -72, 83, -99, 114, -138, 155, -179, 208, -239, 274, -308, 354, -397, 445, -506, 566, -633, 707, -788, 877, -971, 1079, -1193, 1321, -1459, 1608, -1773, 1953, -2151, 2370, -2610, 2882, -3177, 3515, -3896, 4330, -4833, 5416, -6115, 6955, -7996, 9328, -11089, 13550, -17225, 23318, -35247, 67513, -345965, -1017478, -415594, 69138, -48375, -295103, 148550, 744765, 731180, 176101, -119454, -102140, -224176, -548716, -535386, -148562, 130466, 122616, 269908, 625968, 635421, 55642, -445849, -349094, -88023, -287048, -608810, -331615, 395805, 701411, 368519, 67533, 191757, 259463, -138414, -603169, -582030, -229074, -17471, 43373, 241996, 486916, 444604, 164508, -1263, -45333, -260667]
116b60667l13423M3728M56037L38753o8205q2528K45446K11812l07719n80624
126c17390k09879K31263J60413j09837N536L55952L60283l061k29358j50489r7518
137d085k06869k01179K5641J82584J22381R8143K43631K53510o3820l51764k41541
148a43368K8300k927k26616j46704K55905M44865J80723j18288p9398O5792n0653
159B07631k96519k90473l6412J38188J29784J28069J91966J57875k262j01636
169B26211q5051j21666k41447k13216M8945K57763J78029J6880O8057K06329R5342
180D36176k20628l45486j50210M8504J6534n5390O7114K53500K40376N5539p1815
191B74214r0662j25376j87556j51434j8916O3470O9020J24156K24824J85609l0283
$$ y = [-260667, -574090, -530362, -74325, 264428, 196223, 113695, 359141, 570953, 263234, -317390, -527269, -296006, -135593, -245430, -239894, 116058, 476341, 473280, 243922, 93433, -4085, -210954, -412133, -386492, -203908, -81527, 16616, 260247, 513757, 449937, 98173, -143368, -115068, -117995, -344611, -491315, -235410, 209455, 390178, 271890, 192492, 258284, 207631, -88888, -379361, -415773, -277585, -147801, -19732, 172234, 330109, 327847, 226211, 141160, 19494, -221953, -435169, -386224, -128461, 49568, 66448, 134505, 340834, 436176, 215548, -129938, -280148, -231644, -215110, -270500, -203386, 50114, 290490, 346029, 274214, 183552, 58176, -129380, -280814, -299730, -236260, -167240, -43084, 181740, 367349, 337066]
202C37066j88678j33141l4862r7241j95048q0722J77181K75935J36167J319K4394
213B22370N2382p0229k20556k06416o5284L3065O1670J11281J69597J38041L5164
224B61085k8222m7280j16710k09150j72558P577J37221J04342M8467J11390J79150
235B75312O9809j40470k17031j17753l0144n1178n1301O6054J88059J75216P3145
246B39718L996l2642j00652j62265j33884m3766R472L0091R9063J84299J58024
257B51454J3625r2449p8883n4531j15200j62008o4876J03946J67010J05141N6448
268A29677P1860M9541o1781j58883j46432p4389k8177P753Q0849J45823J27929
279A43770N5637Q869j7343q3449j59774j44421l4028N4522N9066N8441J13311
$$ y = [337066, 148388, 15247, -19615, -116856, -311904, -392626, -215445, 60490, 196657, 197976, 222370, 274752, 204523, -16033, -222449, -287733, -254668, -192998, -81717, 87880, 225921, 261085, 232863, 185583, 68873, -140277, -312835, -305258, -168037, -63695, -15228, 96162, 275312, 345121, 204651, -12380, -130133, -160277, -211455, -262756, -196702, -8643, 166573, 239718, 243714, 211072, 110420, -51845, -185729, -229495, -220023, -189932, -90869, 93430, 251454, 265079, 172630, 93747, 39216, -75984, -237992, -302868, -198922, -31912, 73229, 129677, 201537, 251078, 189297, 30414, -116018, -190407, -218584, -210831, -129982, 15841, 143770, 199407, 208276, 190933, 107484, -52290, -196711, -230739, -176217, -117151, -58710, 54601]
290E4601J44299O3236o9755j24840r4636p2171q2948n1608M7331J28696J26121
301F8326P9788M6057P683o3616j24243j17359o4428k3736P656O9913J35896J28964
313A50901M8696k2949m2864n9658j07372j27017o2908L8909R1560Q5736Q0199
324G3233Q4607N0772l2062j01207j10466q2250n5568j7383M6935J03382J08333
335F8326P2523L5200q38n5933j11040j15357o1505n61L0813N6134R4867J11965
347A24594O6210j5238o8395p8354p9093q1242n3151J5834P9513R8783Q0860N8104
359A48425K5565k9039q4769j01599p6364l9790n687M0183R0329J06162O9493J4612
371A57521k1290m7425q0627j00731p0668k574N1761O8677P2661P8000N8735j83
$$ y = [54601, 198900, 262136, 192381, 67541, -27095, -99266, -182214, -233822, -186491, -57795, 68326, 148114, 194171, 201854, 138238, 13995, -103364, -167792, -191528, -183872, -113959, 21937, 150901, 199597, 176648, 133784, 74126, -33246, -160263, -223171, -184262, -92702, -6966, 73233, 157840, 208612, 176550, 75343, -35123, -117373, -172941, -190324, -143389, -40007, 68326, 140849, 176049, 175211, 119278, 8238, -107119, -168624, -169185, -138372, -82238, 12629, 124594, 190804, 175566, 107171, 28817, -50276, -131518, -184669, -168835, -89322, 9461, 90321, 148425, 173990, 144951, 60182, -41417, -117781, -157571, -163258, -123075, -32746, 73416, 142909, 157521, 136231, 88806, 8179, -92552, -163220, -165794, -114033, -45356, 27305, 105305, 164040, 163857]
383A63857o3413q7644p5744n8229l5333J1858O8419R3484P4751M2279J4645k3413
395A25517p3503r9014p3076k2933J1837L4545O6939R3901P5570J4483l7662n7184
407E9420o3623p4999o3810j0907M8928P4923O8566N9437M3931L57n6654q3958
419A611o9012m4101k4970Q529O0434R1670P2705K8272j769k2229n5623q6848p4993
432a16324k2039K5303M2997N4657P2617O6576J8265l7857o1637n9804n8519n0363
444a26128j0504M5424P4629O4395M4827L1868N83m9711q0862o7065l2796j0435
456a15775J0203M7768Q2055P2065K4756j4072k9558m6357o9413o7305k4336K6982
468a02987M9542N2660N7346N2394J6092l3104n9179n6308m9671m1153p863M4347
$$ y = [163857, 100444, 12800, -62944, -121173, -156506, -144648, -76229, 17255, 92006, 134285, 148930, 125517, 52014, -47000, -120076, -143009, -131172, -96627, -29688, 64213, 139783, 154266, 116604, 59420, -4203, -79202, -143012, -153919, -104991, -30068, 38498, 97935, 141866, 142223, 85569, 1611, -67401, -111502, -136472, -127943, -67509, 24161, 96866, 125138, 123369, 101140, 45517, -41331, -116324, -138363, -113060, -70063, -15406, 57211, 123787, 142052, 104195, 42558, -17246, -75765, -126128, -136632, -91208, -16579, 47816, 92643, 124511, 125094, 75383, -5479, -72544, -105340, -115775, -105572, -57804, 24251, 96316, 121072, 107000, 77442, 31085, -38328, -105633, -129969, -102987, -53445, -785, 56561, 108955, 125047, 91943, 32764, -23544, -73215, -114368, -122231, -77884]
480g7884P1935N8892L2059J9792K479l9258p6113o9203k7423M725J8156L7300
492d4543O3841O6114K9827j3778l6637m7738n8361n4351j9138K5454M6740M7025
504D455M8449M6086J6283l3110o0845n3554l5694k7264r925L1036O6843O3904
516E6664L1872N692q993l2348n9283o1035l0934N062K3767L8007N4585N4875K4654
529A02585j3421l4702m2868n1780m9947j7616K8415M9580M2598L6150L6192J8605
541A03791k6096o1525n6455k8829j2709l841K1358N5083O2065L4509K486j7180
553G2657l4129n0873n0997k4782O361K1792L3122M9817N3815K3110k1502m1908
565C6483l6318l2922m0067k5757J6855N4529N4796L1468J4941N777j5523m3971
$$ y = [-77884, -5949, 52943, 85002, 104794, 107273, 68015, -8098, -77301, -104724, -99999, -81843, -44543, 19298, 85412, 115239, 101461, 64824, 17086, -41275, -95626, -114764, -89310, -42570, 4455, 52904, 98990, 115273, 82163, 21318, -32236, -67930, -95194, -105119, -74083, -7240, 56664, 88536, 94228, 85235, 52887, -6396, -67431, -98365, -93303, -69536, -31529, 23056, 77931, 102585, 89164, 54462, 11594, -40186, -90133, -107749, -79334, -29754, 12844, 48994, 85186, 103791, 77695, 16170, -40285, -69114, -81823, -85664, -64306, -9223, 52842, 87351, 89837, 72657, 38528, -12345, -63342, -88124, -81763, -59971, -26849, 22968, 76783, 99893, 78391, 36483, 165, -32757, -72824, -98581, -81726, -27197, 27599, 59067, 74008, 79785, 64262, 20291]
577B0291n3624l7486j2788P059K8886M8295M8617K6588K211j2535k8466m8997
589a1949n2343k3907J4051L0088K9944L3988M2314K7712j1398m2316m5077l3069
601d1962k4777j3531J2463M0437M8708L5249J7990J29k2324m2882m4302k6967
613f1769r162K943K1933M6366N1504K5673p177k1206k3052l3096m5265l1521O734
626g7095L7228L9498K8985K4949J8528k863l1415m4322l8100k3625m339J8229
638e4342L6619L8742K7872J6733L772j8529m4028m7504k4267K734J2364J5787
650c4047K9878M4074L3558L46k8002l4444l0575k7784j8873O35K3791L6351L7405
663C2313K7844R124j5232l1556l1993k5173k1571j2813J2272M0620M6269K4599
$$ y = [20291, -33333, -70819, -83607, -76548, -47662, 633, 49250, 75838, 78049, 65514, 37048, -11949, -64292, -88199, -74148, -44060, -14116, 19872, 62186, 89898, 78500, 36184, -8893, -41962, -66739, -80270, -67807, -27370, 21338, 56587, 74577, 74706, 52382, 9500, -34802, -61769, -70931, -67988, -46055, 311, 51815, 77488, 70311, 49105, 26053, -7043, -52308, -83829, -77095, -39867, -369, 28616, 53565, 72093, 69230, 37815, -6507, -44607, -68232, -72571, -54342, -17723, 21019, 48891, 65624, 69396, 50867, 6839, -40665, -64932, -62198, -49834, -34047, -4169, 39905, 73463, 73809, 45807, 11363, -19212, -46996, -65869, -65234, -41443, -5092, 32313, 60157, 69281, 54049, 22493, -9500, -34673, -56244, -69057, -56785, -16165, 30104, 54703]
675E4703K254n525j0873k8523m2838l2991k875K0153K6187K6699K8938K3458M426
688F3193j7339l1137l4438k9970j4923Q867K6922K8706K5182K3117J6395p442
700E7133l4542m0732k3926o870k084M697K4704M1646L4405P433j3559k0930k4609
713B766k8672k5081p846J1939K4317L1324L0761J7829l903k0202k3461k3109k6132
726c9470k1368K178L0655L7066K2850R757O818J7k1826l7953l1841j0542O300
739d7359J3892K1881K8881K6064J0592o500j9064k7888l1270k0527O25J5627J8583
752a6463K1066K6517K3439J221k4472l1146k1215j3062j2222l078J8714L4698
764C997K9554J2705j095r033j8965k7134k4980j2603J464J3921K4312L0089K1134
$$ y = [54703, 56957, 51432, 40559, 12036, -30802, -63793, -66668, -46515, -20328, 6371, 35309, 58767, 63193, 45854, 14717, -19721, -49691, -64614, -55747, -28825, -119, 25063, 48180, 64575, 57133, 22591, -18141, -42067, -48937, -51021, -46324, -21620, 20026, 54431, 61864, 48305, 27375, 2766, -25906, -50987, -58833, -46894, -22577, 8747, 39508, 57337, 53434, 33232, 9771, -13338, -39470, -60838, -58660, -28005, 9061, 31911, 41668, 48486, 48503, 26677, -11276, -43117, -53659, -47359, -33467, -11586, 17295, 43359, 53951, 47451, 28387, 499, -30771, -51298, -50673, -35046, -16463, 4603, 31120, 54559, 55780, 31308, 162, -21053, -34115, -46337, -49415, -30701, 3997, 33551, 46256, 45161, 36128, 17163, -9971, -34951, -47554, -46090, -32169, -7857, 22232, 43366]
777D3366L278r877j4387j9570k7410k4432l406J9784K5739J8866J5524J5301N607
790D8383j5476l0046k6714j4719m490M757J6233K4960K4345J4088K615q486k1823
803A3627k8025k1142o311N436R470J7752K6573K4791N823j4357k0237j6710j7500
816b0810j7857p815J2724K5001K3925J5675Q486k60j3498k2495k2689j5069o628
829d1310M296J8098K6386K0789P710l94n516j5414k5525k4467p716R681J4885
842a8497J4911J7979J9764Q853r111k0776k0801j5669j2015k935J0560K0357K0047
855A2667J5267R345o29j4545k3948j9604r389k903K640J2856K3814K3162Q770
868C7503n186j0609j2497j7881k0659j0219O389J6620J7283J6409J4008N471p654
$$ y = [43366, 46644, 36767, 22380, 2810, -24600, -49032, -52438, -32654, -6915, 11951, 27475, 42776, 48383, 32907, 2861, -23853, -38572, -43062, -38305, -22072, 2888, 27233, 41321, 43936, 35450, 13627, -14398, -35540, -41851, -36415, -26945, -9193, 17380, 42171, 47994, 33637, 13400, -3310, -20810, -38667, -46482, -33758, -8757, 15168, 30843, 39329, 39069, 25571, 3076, -19613, -34682, -41310, -37014, -18916, 7470, 28259, 35969, 35575, 30059, 14645, -10880, -35347, -43063, -33382, -18497, -3586, 14393, 34157, 43010, 33899, 13123, -7678, -23347, -35362, -38297, -27737, -7380, 12667, 27934, 37279, 36650, 22105, -1843, -21447, -30836, -33739, -31099, -18243, 5571, 28733, 37503, 32317, 21708, 9211, -8670, -29329, -39548, -33159, -16539, 744, 17153, 31161, 36632, 28978]
881B8978j7545j8217j5386j0927k433J1385K0430J8703J0643N475M01j0074k1490
894e7k1996j0219J449P015J0628J7178J9873J1350l516j2445j4758j5528j5096
907b6122q110M956J4699J6045J4798J2505N102p824j7838j7483j1666o868k649
920c0455P004J9003J9958J1331J582l410q164j6367j9007j1987O94Q889J1745
933i184J4741J5673R827k521j1551j4342j3723j2893p141M641J4425J5867J1999
946A5818R056M660n338j5994j8381j1581l919P87N713J4401J8442J2506J527o111
960B1586r254j3291j5384j1044j9Q393J2280J3018J3772Q397k210j1970j3942
973C32j1503r864o406K507J3639J7109J1626N224J509l774j2673j6998j2448l774
$$ y = [28978, 11433, -6784, -22170, -33097, -35530, -24145, -3715, 14988, 25631, 31106, 31507, 21433, -57, -22053, -32272, -30823, -23808, -13180, 3998, 23871, 35221, 31705, 19260, 4502, -11026, -26122, -34232, -29276, -14577, 1468, 16266, 28771, 33873, 26049, 8211, -9272, -20938, -27806, -30455, -23451, -4448, 15510, 26841, 28423, 25013, 16849, 482, -18525, -30512, -29818, -20929, -9184, 5557, 21230, 31057, 28536, 16985, 2643, -11080, -23973, -31114, -26473, -12048, 3819, 15818, 24874, 29534, 24196, 8202, -10179, -21760, -25679, -24892, -19179, -4778, 13664, 26170, 27697, 21586, 12332, -959, -16343, -27387, -27406, -19013, -6733, 6285, 20057, 28454, 26244, 14274, 332, -11171, -21035, -27441, -24934, -11295, 5814, 17440, 22664, 24173, 20399, 7726, -9272, -21720, -25494]
987b5494L612P136J2003J5161J1754J099o018r698j1516j3664j0019p9R681J2738
1001c304J0542J0154P487j66j1464j4768j1319o559l977J875J1162J5931J1948
1014A7542M410m33m621j0397j5273j1868k735L814P433R831J3788J1213J465p357
1028A6812r977r686j0491r765j194R316J3552J0181P037N729K28q989j4205j2466
1042a3918n200j528K775Q948J4103J1518M068j574m886q962j3668j1536k267N622
1056a6505P361Q027J0827J0515L208p605j1562r268p883o548j902P333J2656J0739
1070I393O708L557j127p614j3235j0673m442p19K054P833J3492J1802L271l740
1084A6560o053o877j0248j1225l931N468R549Q340P799Q074L060n346j1005r929
$$ y = [-25494, -21882, -14746, -2743, 12418, 24172, 25271, 19253, 9555, -1961, -15625, -25644, -25723, -16042, -3304, 7238, 17392, 24879, 24713, 13249, -1519, -12838, -19397, -23374, -21499, -10337, 5594, 17542, 21952, 21519, 16898, 6501, -8772, -20640, -23375, -19561, -12128, -2297, 11491, 22704, 24169, 16812, 6835, -2851, -13342, -23107, -24301, -14985, -1433, 8748, 15785, 21514, 21742, 12753, -1452, -13918, -19118, -20646, -17871, -8923, 5180, 16698, 20766, 19192, 14306, 5344, -8324, -19860, -22127, -16505, -9144, -1117, 9710, 20225, 23433, 15828, 4266, -5002, -12885, -19433, -21335, -14002, -1346, 9393, 16101, 19658, 18531, 10917, -2318, -12991, -17433, -18152, -16098, -8265, 5227, 17029, 20300, 16560, 10507, 3630, -6618, -17843, -21774, -16306, -6757, 1583, 9382, 17456, 20516, 15170, 4165, -5764]
1098e764p583m270j177O096J1758J0370N736K100r20o345j1983j1332m246J525
1112a6035L727N769R907J1386N370l457p947p782p533p806m658L088R224R706
1126B959P937N254J205m063r376r448o648m250o76N283J1224J0869N266p61j878
1141A2897m331q586j1379o941J905O589O854O659P754N836q22p113r552p850n813
1156a3893k626K957P953Q664O668M424J877l075r527j0657o011o38J006K659P652
1171b567J1367P568k47n652n753n989p841o292p57N947Q218P293O069L422r34
1186A3852n991p960o968n736k703J955Q378R900N910J463N44j576o738j0176q009
1201a3855q43L828M520N099P536P266K136m554p221o757o320m416j8M878O635
$$ y = [-5764, -13347, -17617, -18794, -12698, -940, 9430, 15166, 17266, 16346, 10001, -1982, -13314, -17560, -16035, -12308, -6539, 3368, 14754, 20124, 16667, 8720, 938, -6595, -14401, -19059, -15971, -6747, 2959, 10896, 16150, 17355, 13292, 3916, -5532, -12180, -16430, -17106, -11823, -599, 10270, 15536, 14775, 12897, 8566, -20, -11399, -18340, -16435, -9846, -2992, 3667, 11421, 17257, 16435, 9322, -230, -8080, -13893, -16519, -13562, -5609, 3055, 9723, 14147, 16024, 12949, 3422, -7235, -13246, -13884, -12878, -10219, -2567, 8800, 16368, 16121, 10469, 4716, -1273, -9114, -15406, -16163, -10216, -1998, 5295, 11364, 14786, 13852, 7861, -99, -7067, -12803, -15506, -13551, -5173, 4727, 10637, 12100, 12644, 11068, 4330, -5846, -13855, -14698, -10870, -6350, -1251, 6285, 13551, 15687, 11133, 3912, -2845, -9165, -13581, -13599, -8721, -2086]
1216b086O250O004M623r57p063r122n394k417k234J61N501J0148Q047J487k486
1231A0462k616m087p395p515k729K377N344O467O324N425J135l627n816n580o280
1246h111n213O9N786P457M860L340L306J194m939r092p376k217M48J575L861O846
1262A794P355L418j393m070n680n971n432j564J451M480N020O798N449J054m589
1277H120o208m409l925m430j454L592Q207O776K769O34n00k940o130o822m121
1292a0841r6K850M978N954N503K150j064l036m178o143o238j135K747N398L461
1307C10M106M692K714l020o669n896l389j570n31K194N572O229L789J447j425
1322H553l525n851n258k835k06J923L416N915O069K083k003l494l548l994m717
$$ y = [-2086, 4164, 10168, 14791, 13834, 6771, -2351, -7745, -10162, -12396, -12235, -6734, 3414, 11461, 12948, 10462, 7846, 3759, -3636, -11151, -13880, -11503, -6159, 308, 6632, 12057, 13192, 9565, 3749, -1831, -8111, -13324, -13255, -7469, -12, 4848, 8188, 11494, 12688, 7749, -1343, -8719, -10936, -10488, -8913, -5052, 1794, 9149, 12567, 11174, 7104, 1424, -4547, -9979, -11543, -10092, -5612, -592, 6206, 11655, 12709, 8120, 1912, -2497, -6422, -10852, -12306, -8714, -507, 6269, 9038, 9672, 9172, 6232, 102, -6720, -10841, -10937, -8087, -3109, 2845, 8348, 10498, 9434, 6398, 2220, -3923, -10161, -11296, -8549, -3151, 310, 4416, 9108, 11822, 8802, 2133, -3763, -7152, -8722, -9253, -7059, -1487, 4742, 8531, 9978, 8553, 5028, -823, -6081, -8916, -9122, -7199, -3783, 2132, 8201, 10284, 8281, 4787, 1239, -2755, -7472]
1337g472l287J899N301N115L531K377J619j407m679n672m198j797M02K499M942
1352h27M919L081J469j113k730n073n718k538O29K459K641L793N084L263o59m112
1368D568m530l492k890j826N08L734M957L953K417M11j618l714m801l589j256
1383g168l86K101M385N320L011J41j681k224l125m791l339k63L134L371L360L003
1399D849K384K02k606m456l978k411j008P79L198M089L455K147O34j860l883m176
1415b641k991r80Q58J501L098M405L086P20j722k982k986k954k806n13J886L653
1431a368L576K620J550l24k310l401l213k355r44J114K222L782L046J537M5j017
1447D560k398l948l351j066J048K177K292L031K822Q82j153k354l460k528j737
$$ y = [-7472, -10759, -8860, -3559, 1556, 5087, 7464, 9083, 7676, 2997, -2675, -6873, -8670, -8268, -5769, -827, 4092, 7173, 8642, 7529, 4799, -274, -5992, -8530, -7901, -5442, -2801, 992, 6076, 9339, 8680, 4568, 38, -3454, -6344, -8170, -7662, -3928, 1029, 4982, 7399, 7810, 6192, 2478, -2323, -5912, -7168, -7554, -5453, -1068, 4252, 7263, 7404, 5723, 3499, 374, -4417, -7756, -8019, -4885, -1514, 1846, 4849, 7233, 7435, 4829, 373, -3605, -6016, -7024, -6245, -3047, 1042, 4497, 6644, 7278, 5418, 1535, -2641, -5632, -6612, -5754, -4253, -1155, 3250, 6336, 7056, 5334, 2352, -634, -3588, -6394, -6907, -5021, -1368, 2208, 4828, 6378, 6054, 3744, 343, -2870, -5225, -6169, -5055, -2833, 949, 3995, 5532, 5577, 4560, 2162, -1786, -5137, -6203, -5155, -2978, -686, 2345, 5167, 6049, 4896, 2542, -918, -3446, -5183]
1462e183m10J407K836L061K190J608k36j773l289k996j746n49K42K102L310K864
1478C438J772k09j573j916k844k563j482M42K332K176K550K166R87r41k045k812
1494e22k548j429k48N88L100K699J773J038K0j354k534k937j737m49Q98J138K748
1511B44K695J766j2j627j908k161k222j430K68J716K223K367J937N03m15k486
1527A458k188j701j025o93Q24K318K301J851O49k21j061j933k586j948k57J028
1543c184J659J913J781J662J80j425j892j716j863q07l48K062J757J532J929M83
1559C723r4j872k420j623o88n38M85J756K376J841P21n74r35j668j870j804l49
1576c533P83J241J643J907J235L21j167j862j225j638r64n5J420J770J699J262
$$ y = [-5183, -5593, -4186, -1350, 1711, 3901, 5509, 5273, 3500, 211, -2785, -4531, -5080, -4838, -2736, 574, 3438, 5210, 5001, 3428, 1512, -1332, -3895, -5377, -4935, -2603, -427, 2123, 4289, 5276, 4335, 2290, -522, -3070, -4499, -4747, -4159, -1059, 1640, 3413, 4451, 4471, 3117, 583, -2354, -4091, -4540, -3642, -2504, 244, 2939, 4705, 4693, 3066, 1158, -1003, -3225, -4655, -4387, -2671, -448, 1919, 3856, 4359, 3944, 1458, -730, -2431, -3456, -4149, -3325, -1007, 1294, 3145, 3794, 3573, 2512, 579, -2007, -3955, -4212, -3184, -1525, 388, 2169, 3831, 4011, 2586, 694, -1022, -2885, -3692, -4040, -1978, -221, 1311, 3240, 3723, 3629, 1757, -663, -2286, -2974, -3512, -3027, -1271, 1105, 2946, 3667, 3093, 2158, 490, -1380, -3184, -3533, -2750, -1509, 134, 2041, 3276, 3597, 2430, 568, -657, -2295, -3259, -3314, -1894, -124, 1575, 2837]
1592B837J82k06j008k314j641o18J08L07J301J944J548O23l94j008j442j287j815
1609b883m64J043J096J211J727J168N22j062j989j251j082p92k46R11J674J639
1625A222Q46M36Kq38j740j668r50p0P05R06J752J635L96l00o83j329j395j353
1643b426m63P50J152J518P72J096N08o76j617j500j000l54k64N84J639J292J295
1660B306K2k05p46j603j138j006K7O29N24J619J455P48m33r88p55j292j084p29
1678b649K59J352J179J109J284J26q04j152j284j297o23j28J154J204J172J185
1694B087j66l67k28j089j371j137n4P29Q68J242J097P03l47o55j083j092j191
1711b054k01K9J245J084J271P08J13l31j140j615q03l18K37K01R62J725R10M6
$$ y = [2837, 3019, 2813, 1805, -509, -2150, -2768, -2660, -2353, -1052, 892, 2440, 3063, 2669, 1661, 219, -1068, -2883, -3347, -2304, -1208, 3, 1730, 2898, 3420, 2358, 369, -882, -1964, -2756, -3002, -2091, -417, 1222, 2068, 2504, 2506, 1668, -72, -1740, -2690, -2760, -2055, -1149, 603, 2238, 2634, 2334, 1651, 322, -1073, -2426, -2889, -2139, -987, 531, 1303, 2399, 2907, 2231, 614, -886, -1886, -2240, -2504, -1920, -281, 1011, 2306, 2328, 2123, 1377, -226, -1364, -2370, -2343, -1714, -1190, 429, 1884, 2632, 2199, 1211, 456, -836, -1920, -2649, -2390, -1038, 141, 1250, 2534, 2660, 1856, 704, -580, -1877, -2500, -2628, -1474, -270, 902, 2087, 1921, 1554, 1326, 237, -1134, -2271, -2325, -1596, -728, 514, 1611, 2314, 1967, 1312, 229, -863, -2054, -2255, -2226, -981, 103, 1374, 2082, 2195, 1864, 724, -891, -1694, -2012, -1775, -1574, -612, 1113, 2023, 2069]
1729B069k25q98m06j568j005j54M24J277Q61R82Q48jj029p82j260j043k73K61
1747a922J066J177Q64L73M85j22q10j579j334j99K0L48J104J723M18O04k85j048
1765H83q61j118r28l3N30P34J041R60R12q6p16j172p78n68p16N1Q37J132J296
1784A400O64j7m49n63j392q62o12j51Q60P55J180R21M39l84o41j018r79q33l48
1803b030O15P93J014Q90O18L62p32j268j300n80j62o8O82J320P94O47L52k82o76
1822I89j168j139n39L9L00Q44J233R52L61q9o56j040q30r44m82N89O48J208J133
1841A409J39M12n85n87j494o89q39K37O85J162J243L64M63j68r91r81j059o14
1859a893K68L22J055Q03J196L52k57o05j259r44p23l58L52R02R03J082P75n8l32
$$ y = [2069, 1844, 946, 540, -1028, -2033, -2187, -1763, -486, 375, 1357, 2205, 2204, 1175, 393, -867, -1910, -2183, -1922, -856, 321, 1185, 1558, 2043, 1921, 1111, -468, -1802, -2001, -1981, -1633, -529, 1194, 1612, 2216, 1931, 883, 22, -1096, -2024, -2057, -1527, -793, 248, 1208, 2120, 2034, 1318, 146, -632, -1200, -1916, -1865, -1028, 104, 1400, 2064, 2047, 1598, 1035, -357, -1219, -1831, -1982, -1122, -367, 813, 1734, 2173, 1789, 1148, 130, -849, -1682, -2030, -1415, -622, 392, 1282, 1900, 2262, 1530, 262, -1038, -1618, -1780, -1848, -1166, 154, 948, 1595, 1947, 1665, 989, -179, -1318, -1857, -1818, -1518, -674, 559, 1511, 1872, 1783, 1127, 87, -743, -1687, -2169, -1580, -932, 276, 1409, 1548, 1960, 1375, 788, -706, -1395, -2234, -1997, -1312, -150, 1093, 1457, 1920, 1752, 761, -220, -1279, -1893, -1625, -1303, -248, 555, 1751, 2103, 1846, 1241, -18, -962, -1685, -2043, -1691, -789, 114, 1196, 1971, 1913, 1581]
1878A581j138j108o59o05L1M32J302J205P88M1l86n31q35j382o56O5M01J174Q60
1897E80O42N17L05p02j077j236m00n21L10O67J124J065M54K14p7j332j149r65
1915a581l49R3P10P25J264J076j48r6r67q47j115n40k69O84J009P06J096O23k65
1934A809q68r91n68j033k67J08Q60J387Q72L70J7j60j040r95p71r44K67Q20Q44
1953b83J097P91L09l63q07q25j041q03n0O33J089Q91P55N95j42j040o30j286n18
1972a628m0k5P71J092J384N42k02o68o26j093j092l26L50M35R54J158P17Q3k05
1991A581j138o48r66p32k24P58R82J170P44L85p4p39j090j242l56j09K17R26J022
2010D67Q55N70O4n71r92j082r30k10P2P17P29J418O95J57k42r48j279p51m40l54
$$ y = [1581, 443, -665, -1324, -1929, -1898, -1466, -164, 1041, 1829, 1870, 1484, 953, 118, -1264, -1920, -1855, -1454, -280, 580, 1222, 1739, 2044, 1342, 265, -971, -1371, -1892, -1582, -915, 209, 1274, 1728, 1942, 1865, 533, -616, -1581, -1930, -1837, -1127, -402, 862, 1938, 1790, 1694, 727, -120, -1235, -1775, -2044, -1360, -351, 355, 1451, 2074, 1809, 941, -50, -618, -1651, -1918, -1810, -950, 437, 1309, 1679, 1696, 1536, 496, -499, -1270, -2214, -1947, -1127, -283, 814, 1605, 1914, 1551, 744, -81, -1122, -1925, -1975, -1342, -253, 638, 1393, 1988, 1846, 806, 176, -1110, -1628, -1668, -1693, -922, 170, 1554, 2096, 1894, 1226, 600, -493, -1585, -1911, -1561, -1126, -172, 986, 1703, 1786, 1581, 443, -205, -1171, -1903, -2127, -1369, -387, 783, 1527, 1912, 1838, 1099, 9, -1233, -1589, -1698, -1481, -555, 467, 1322, 1892, 1956, 1385, 393, -689, -1619, -1829, -1757, -1040, -311, 1107, 1802, 1959, 1717, 769, -510, -1261, -1701, -2055]
2030b055O14J016J445M20M47k40o75j026r30q74k33M29Q77J208J122J67k15l32
2048A165p88j087q36l70K43O81J187P74O82L31l82j001j243q12j68J07K11R86
2066c20P18P65O64k00p29r26j051o89J78P9P06J294Q37N06L4p97o21j293n78m65
2086a888K15R27P52J097O19J41k36j048q25j196l36l5O61O70J400O97J80j99n42
2105A054j069j115p34L56K30Q73P44Q97O99J2o36j073p38r74l83J58Q26R98R65
2124A090L55L3Qp43j260q21m04N8O35Q03J002O23L68l02o26o87r04p42k44M05
2144a353Q32P56J027M84j58m84j000r76n20k00J25R80Q93N91Q34q3n97o62q51
2163c62q36m21J67J13R13J344P06n1p9o67r01r44o02o8N26Q82P44P35N89k97m30
$$ y = [-2055, -1441, -425, 1020, 1440, 1887, 1647, 972, -54, -984, -1858, -2091, -1662, -785, 423, 1545, 1712, 1497, 1165, 377, -710, -1546, -1916, -1673, -992, 195, 969, 1651, 1982, 1600, 599, -644, -1456, -1624, -1517, -1306, -320, 398, 1163, 1827, 1627, 898, -28, -1079, -1768, -1590, -1511, -805, 489, 1326, 1832, 1866, 1069, 448, -845, -1423, -1888, -1673, -746, 6, 1103, 1722, 1863, 1627, 579, -246, -1442, -1778, -1813, -1152, -482, 918, 1615, 1795, 1596, 1054, -15, -1130, -1864, -1508, -1278, -405, 339, 1236, 1935, 1947, 1311, 238, -500, -1474, -1857, -1699, -873, 125, 1090, 1445, 1478, 1486, 743, -517, -1338, -1742, -1684, -1049, -246, 756, 1379, 1747, 1445, 819, 132, -772, -1514, -1758, -1353, -521, 235, 1262, 1746, 1588, 1104, 104, -872, -1392, -1592, -1467, -487, 406, 997, 1831, 1748, 1151, 489, -362, -1198, -1619, -1452, -1339, -426, 918, 1624, 1573, 1494, 827, -74, -1018, -1620, -1688, -1162, -280, 464, 1199, 1788, 1491, 1061]
2184A061r65j020n24j03L90N77R29O21N55O0m24o45j124p27r7M5L45J060P30O16
2204A360M57m05q95q60n87n18l93N84R24Q03N87M61J7n48j025p18m57l52L35N29
2224g01P58J178J66J63n86o63q64o09l25j12Q20P18P16J080j47k71r40o01p79
2243i99n39oJ59J338P61N29L70j93o65p43r87n73P1J96R03P14O69L56J77n15n37
2264D86p78r25j97R8P10P28P93K54Q58p40q67q05o40n54n2P66O62J127O33J76
2284A733l74m85q73j065l15j64M02N51R98O40O68m21m77o35q77o62l73J92R59
2303e78Q21N22O44J01j70r71q69r14J21J23lP33J196P12M0l82n90r83n86k79l29
2324a641N59N88O75Q93N80k88l51r03p36p05j94K9R20R66L87O30j02k54j049o02
$$ y = [1061, 96, -924, -1448, -1551, -1161, -584, 345, 966, 1521, 1581, 1157, 512, -612, -1339, -1436, -1391, -1046, 14, 744, 1360, 1817, 1412, 517, -343, -930, -1448, -1841, -1257, -333, 470, 1057, 1518, 1535, 987, -38, -756, -1213, -1565, -1230, -701, 57, 1235, 1401, 1564, 978, 315, -549, -1158, -1483, -1595, -775, -57, 659, 1739, 1592, 1321, 381, -220, -999, -1538, -1544, -1385, -47, 714, 1243, 1613, 1420, 755, 12, -975, -1548, -1477, -1281, -378, 336, 1005, 1361, 1538, 1023, 486, -292, -1217, -1414, -1316, -606, 122, 915, 1169, 2027, 1287, 420, -385, -1025, -1579, -1631, -865, -203, 924, 1557, 1733, 1359, 874, 1, -1064, -1379, -1543, -1141, -590, 408, 1048, 1716, 1295, 818, 183, -694, -1356, -1729, -1537, -578, 243, 765, 1409, 1510, 1340, 369, -500, -1414, -1293, -1170, -1173, -440, 756, 1468, 1508, 1126, 536, -447, -1033, -1312, -1641, -1082, -494, 181, 1074, 1654, 1366, 1015, 112, -624, -1329, -1523, -1494, -574, 392, 779, 1409, 1307, 1053, 4, -598]
2344e98o12j11K41J70N82R20O33L16m03m08r02q95l31j98M51R00N53M97O77J6
2364A498o27q98q10k41j52R0N72P54P44K63K73o18m66r21n39m57L37K78J019M87
2384E86N42N31n25r39m41p42n69J49K16Q69Q11O34N24j82p05r44o37n94J17J42
2404a157N76R72P99P2J00m80o37r48p00k74L26O83P55P65N77l9k74q47n50n90
2424h71n45j53N63R74P78M57K18l2p27j008o65j46q2L25J91J214O95K39k07m84
2444G34p79l97o66m19L13N65P96Q16M08K9m88o86q49m26l25P3L22Q75Q46L20K24
2465A286p4m58j163o54m48L29K22O59O05M81N73m6p54n43o93o25j02M28N57N77
2485A57P64L54K1n68p86n63n54K22j41K43O77R85P62j57l16p00q18o08l08K45
$$ y = [-598, -1210, -1321, -1080, -910, -328, 592, 1225, 1541, 1138, 730, -172, -1067, -1398, -1596, -1145, -245, 308, 805, 1482, 1498, 871, -27, -837, -1078, -1230, -1140, -568, 186, 930, 1193, 1466, 848, 382, -539, -1078, -1535, -1198, -920, 99, 586, 1128, 1659, 1134, 195, -246, -988, -1557, -1408, -1192, -323, 488, 1122, 1646, 1464, 759, -185, -822, -1416, -1299, -1157, -581, 391, 1190, 1262, 1362, 882, 245, -703, -1403, -1677, -1351, -668, 87, 852, 1429, 1390, 1116, 269, -281, -871, -1416, -1569, -1006, -32, 746, 1203, 1421, 1389, 662, -346, -1011, -1157, -1239, -914, -723, 491, 1186, 1425, 1218, 734, -45, -442, -1108, -1527, -1214, -649, 147, 963, 1371, 1400, 912, 226, -623, -1049, -1374, -1301, -979, -104, 742, 1062, 1286, 1212, 754, -409, -1063, -1511, -1182, -960, -301, 304, 785, 1358, 1312, 558, 15, -678, -1303, -1405, -977, -420, 157, 921, 1275, 1296, 728, -58, -621, -1175, -953, -1094, -851, -174, 811, 1573, 1416, 1100, 400, -418, -1026, -1334, -1089]
2505a089K24Q63N52O45L53l58o17m94p16n91k50K10R22O76N74O8J76l27p09p46
2525f34m90j96oQ80M02P84M81J94l56n88r38n16m77k3N45O88Q59N98l9n3p75n95
2547b55n79k31l86L56R98N18O78M19l15l54o80j020m27o1K27M22R67N52M92j5
2567A306l37p05n28q21k93K7P83N38P83L99n2k10n02p26p74k11J44K41N01Q46
2587D09L95L62j77l91j53j184k93l27L44M42R16R11Q5m7k63j034n01o49j59K48
2607a066K55R60O10K77J14k12l62r61m02m60P3N55L99Q26N25L09l25n57n04o83
2627f29p23n9L76N77N46O02N25P2m54o01o61n53k04K28N25P01N83j54O04l83p62
2648A56l34o68k38j59P82L79Q30L39N1j89n31k96r81k65j14J76P76P86M51l6K80
$$ y = [-1089, -865, -2, 550, 1195, 1548, 1190, 573, 79, -637, -1228, -1478, -1268, -346, 330, 904, 972, 1148, 821, 112, -634, -1124, -1320, -1326, -446, -44, 740, 1221, 1415, 1059, 471, -467, -983, -1460, -1483, -938, -250, 609, 1207, 1168, 1115, 340, -255, -834, -1065, -1451, -1095, -97, 421, 1099, 1518, 1203, 849, 169, -851, -1278, -1339, -1112, -690, 277, 829, 1321, 1306, 969, 264, -264, -1085, -1378, -1351, -568, -30, 753, 1152, 1100, 890, 388, -338, -1112, -1323, -1179, -938, -437, 409, 804, 1166, 989, 598, 445, -739, -1032, -1359, -1015, -573, 343, 1254, 1339, 1292, 1029, -5, -506, -1155, -1314, -1066, -811, 149, 759, 1036, 1150, 938, 576, -385, -787, -1247, -1174, -619, -220, 606, 1131, 1440, 1115, 558, 54, -629, -1352, -1411, -1035, -458, 88, 690, 1215, 1287, 833, 232, -429, -982, -1186, -958, -433, 268, 851, 697, 1301, 918, 156, -178, -846, -1084, -1243, -461, -82, 748, 1087, 1138, 949, 418, 122, -859, -1124, -1238, -1062, -286, 500, 951, 915, 1195]
2669A195l51q07p27l74jR2N04O63M03O11l44nk72r12n30l79P4O77N17O11M78q9
2691A034k98m55m29n88k22j70N41J72Q22L35J30Q0k10q07m22k18k36K41L53Q83
2711E36M07qJ08k57n99o10m37k1j52N90P00J85M07K74k86n30o24m00k27l0LQ83
2733h8N08L54K92j13l78n79n68m87j7K92K39O08J022J3j7m52m87n69p32j05L71
2754h93O33K23L51O57j46m3o76m75n00j29K4M92K96O66L64Q9j54k98m32o92k44
2775h87J56J58K62P26K48L28j02l07o15k84n23m7J79K10P27M82J51O6l21k79p00
2796c72k58l54J06K92N97O86q1J60j98k48l91n83l48J09Q6L87O12L07M44j86l53
2817D14o17j58l66k81Q1M43Q30J54L49mk50m84n39m89NK4M10N09N83L61j71r2
$$ y = [1195, 844, 37, -690, -1064, -1065, -973, -469, 194, 597, 1208, 864, 859, 587, -325, -855, -1234, -1160, -483, 34, 645, 1123, 1034, 736, 281, -148, -736, -958, -1128, -587, -415, 407, 742, 872, 952, 742, -65, -487, -705, -941, -700, -347, 536, 943, 935, 1043, 786, 187, -423, -860, -881, -1033, -443, 257, 442, 849, 1123, 837, 307, -317, -717, -944, -974, -971, -88, 420, 774, 1066, 953, 575, -4, -572, -1059, -1076, -784, -545, 63, 1085, 1098, 1081, 629, 142, -427, -1159, -1264, -893, -260, -37, 314, 971, 825, 782, 106, -369, -869, -998, -974, -482, -186, 480, 844, 933, 779, 481, 49, -643, -887, -731, -573, -311, 415, 663, 991, 889, 582, -33, -317, -840, -887, -708, -498, 229, 711, 862, 928, 607, 328, -372, -630, -984, -878, -586, 11, 697, 616, 776, 578, 330, -61, -644, -992, -883, -797, -410, 202, 509, 953, 767, 414, -203, -361, -727, -1008, -927, -484, 346, 500, 849, 845, 595, 111, -428, -917, -912, -888, -478, 31, 614, 975, 804, 712]
2839G12k40p90m68j41J97J82O32M06J57m2J47n87m08k94k26o3P4N72L87P30k03
2860G34O8n47N5o73l10k35J87L82K17P13m3K12l57k65l91k57k32K38m0O42L80
2881D78J03L69k36l81l58m67k40n7J21N30J16L62N52k06k55k22k78m83k03M01
2901c54J05K57N27L23k42n2l87o55j58j72M20j87O60J55K26j07k8k33l75l08j61
2922g46jL99M80K42J78J49l08j33k58m23j9k68L46J27L52L07K24P2l00k18n25
2943c23m53J43N5K77L89J47K75L33m55j15n52k62j59L25Q1K00N40P4P9m5j10l90
2965E4k79m74j74L25N91O7L29J07Q3k85m8o04k57J50k1o1J31O53J40K14M0l11
2987C70o28k28j43K19K56J71K93K07J57j82o9k48n27j9j43J57K48J10N20oj0k03
$$ y = [712, 472, -318, -786, -927, -730, -548, 84, 490, 647, 605, 752, 165, -243, -537, -763, -826, -752, -180, 207, 937, 734, 802, 255, 310, -363, -673, -908, -721, -339, -122, 591, 548, 760, 403, 138, -253, -510, -742, -504, -544, 98, 478, 581, 950, 714, 333, -25, -492, -732, -789, -668, -138, -22, 340, 892, 686, 431, 209, -69, -552, -755, -354, -249, 8, 535, 858, 616, 564, 177, -478, -636, -808, -388, -575, 85, 240, 466, 359, 331, 98, -277, -585, -746, -747, -348, 132, 374, 552, 701, 393, 260, 2, -421, -440, -708, -362, -235, 117, 424, 648, 720, 420, 202, -323, -776, -633, -578, -301, 88, 235, 510, 843, 388, 273, -279, -541, -700, -375, -294, -94, 446, 520, 599, 554, 444, 54, -225, -699, -873, -548, 43, 110, 439, 546, 629, 344, 296, -308, -565, -415, -436, -497, -366, 287, 427, 641, 681, 370, -258, -486, -629, -410, -154, 17, 310, 517, 674, 492, 423, 175, -352, -371, -514, -357, -109, 1, 521, 515, 505, 302]
3009C02n45Q6L6j98K00j8L43J43K01j09k94j26j21k96k42K02Q2M06J26J91r5L87
3031F61k53m75k19k43N4J37J87K87J66J4J78k54j69k86k83J64Q4j31K37N29rq0
3053B96J41j97j80n39Q3N5n0L36M84k6q0q3Q1m26j55n73L30L22J60K70M38k64
3075D23R4j76m18k01j61j29J95M17j17L29N9j21K34o52L16m16k2p7J78l9J54M62
3097C32J92l93j15j44J1n1l16R2L61K73L8k37L59k13k51N3l25r2L4J36L95K80
3119D19k90K17j40q4l99J49J2k17K25m6M98K2q7j2j29r4j36J1j21r1J25N8J70
3142F0K32J9j38n3k42j39L1j56K72O2K40K66j01l6j8j73m08l28K84R8K49P9M01
3165E01k46k8l08K66m94N4r7j47K69M49j21M5J81j76l9j20k40K1J79n4J47K84
$$ y = [302, -243, -157, -121, -319, -119, -137, 206, 349, 550, 441, 147, 21, -100, -396, -638, -436, -354, 52, 178, 369, 274, 661, 408, -67, -286, -529, -475, -338, -151, 136, 302, 316, 494, 240, 71, -215, -498, -334, -250, -381, -144, 385, 376, 296, 437, 240, 60, -479, -396, -341, -391, -55, 429, 403, 323, 240, 321, -105, -260, -833, -503, -181, -21, 249, 687, 423, 517, 341, -77, -278, -439, -568, -373, 44, -73, 256, 315, 194, 428, -224, 92, -324, -346, -423, -245, -284, -130, 332, 524, 131, 16, -128, -117, -168, -484, -392, -31, 242, 280, 43, 402, 189, -62, -9, -334, -426, -392, -256, 139, 419, 129, 346, 206, 122, -277, -128, -116, -333, -108, -154, 344, 366, 279, 267, 138, 44, -92, -81, -202, -293, -168, -110, 60, 292, 311, 173, 120, -122, -261, -230, -386, -114, -52, 188, 454, 353, 317, 299, 126, -282, -610, -326, -228, 21, 100, 501, 255, 227, -81, 185, -309, -255, -352, -499, -230, 219, 98, 143, 324, 148, 109, -11, -251, -230, -51, -105, 42, 326]
3187C26j06M9r2p9J11n61K1j66m0O29O5J87J57o11n0J74r1k37L47k95N2K78Q5
3210A53P2P2l67K04j83m14L85j94K36J01NL09q2n5k01j0m1m31L23l48N03J98k44
3233iL58j95K3Ol25m5k7J28l00J79M71l10L21J7k09n3p1k67N8R3J57q8J89K59
3257C60n2j51j57l01J10k78L31O8K58j52K78k09J55j87m6j27j97N6k4K89o7K43
3279B00K7p1q0k65J93j90J54k00mL06J01r3J25J6j1l64l17L78p0q2L45j01K84
3302B81J14k92j34k54K14m18O20L5n2K3p5J53p4k8j54q0J39k80P2L66r0MJ2P2
3326A74j60L1L4l13J25n2J32K93j64Q7J75j07k11j88J59R9m14J67K07OR8N0q7
3349A41R4l44m5j9n3R4P7K11J72m33K16j0k22j8K12m22M16l5j04J12o0jK38J2
$$ y = [326, 220, 269, 177, 98, 209, -352, -331, -497, -537, 92, 157, 344, 501, -110, -160, 14, -77, -314, 33, -262, -210, 68, 153, 225, 297, -70, 134, -49, -463, -78, -272, -36, 65, 70, 379, 297, 242, 41, 31, -10, -441, -118, -466, 37, 235, -9, 349, 154, 177, 183, -142, -187, -214, -86, -386, -207, 264, -46, 275, 292, 83, 30, -41, -308, -250, -157, 0, -88, 101, 360, 308, 157, 0, -301, -191, -469, -138, -70, 188, 36, 314, 105, 260, 73, 27, -100, -297, -241, -265, 24, -43, 200, 227, 156, 76, -189, 4, -186, -32, -232, -236, 70, 171, 78, 203, 219, 208, -156, -473, -95, -165, -247, 98, -3, 281, 395, 103, -31, -285, -71, -489, 131, 166, 114, 137, 62, 215, 141, 113, -41, -121, 18, -262, -190, 176, 86, 90, 102, 174, 14, 45, 79, -234, -109, -161, -29, 264, 100, 187, 362, 255, 44, -144, 15, 114, -300, -133, 74, 80, 178, 228, 141, 235, -109, -154, -173, -226, -132, -55, 156, 328, -105, 111, 101, -121, -139, 73, -349, 67, 32, -72, 40, -20, -21, 217, 229]
3373B29l02k93M0J5K98K3Q3M0n0P3k1K2m61R3j70K73k4o5P07j04m38j34O8K21
3397A23k67j58L6K26K13q3k4j8O4k34K30k37L4j90J28r8M81ML7j30P0mk35j40
3421a72K79k30n7O8J67P9p0l02K16K9k67j14K66P9kJ26J84k56j14K02j10jk55
3444b55q9K17Q8J57rn4J57J38n30q5p6K13K2q8M25k01R0M5k8j24k27J22k65L02
3468e5m6K09M3j51J54n9m7m5m6k67N1K34j7k7K26J89j47l53N2j76p3K17oJ08Q1
3493D9P0K46j19j65j04k67J76l20P7j23O76Pk62J92k7%q6j84L2l03K25J37K93
3516B20j37Q8J90m19M4J51l90J18n6J39J2J98j25J92j59j10r7j19P0k45M46k10
3538a99K70K17n8K3m35J1P6k26K78J71l56L90J23j56J66k00j25o3k82J39j14K64
$$ y = [229, -73, -366, -326, -311, -13, 10, 93, 133, 83, 156, 135, 157, -304, -211, -381, -108, -132, -197, 510, 406, -32, -166, -98, 123, -144, -302, -266, -40, 173, 90, 66, 48, 112, -122, 108, -129, -95, -285, -157, -255, 226, 230, 267, 137, 207, 203, -32, -172, 107, -123, -180, -112, 55, 134, 64, -238, -22, 7, -260, -374, -108, -29, -31, 95, 279, 23, -91, 111, 1, 0, -255, -344, -127, -39, 118, 109, 55, 212, 350, -180, -265, -341, -128, -106, -194, 231, 30, 120, 165, 137, 13, -214, -92, -357, -55, -101, 108, 151, 0, 154, 95, 48, 3, -43, -310, -259, -25, -42, -69, 157, 346, 199, -154, -102, -278, -351, -134, -140, -32, 49, 119, 365, 246, 81, -23, -290, -114, -434, -357, -480, 196, 203, -59, 133, 106, 106, 20, -164, -132, -435, -210, -73, 220, 83, 171, 361, -58, -14, 137, -253, -135, -191, -52, -40, 158, 33, 225, 66, -44, -141, -260, -190, -435, 11, -199, 71, 288, 230, 253, -182, -171, -95, -321, -43, 128, -228, 162, 285, 129, 295, 95, -30, -93, -375, -236, -350, -86]
3560h6L9J37r6K56l16n4J3r4j4j26L43K37j50l7P2n0k51j4q6JJ62RM0N6K02K2
3586B15k32L24l34j87k53K18K8Q2M58m4l6j49P4j19q0l4l22k5L45L04pj9J45k8
3610C24l74j50N9k13O6O3M16k02K43j32p2J7m63K50N9K3r7L16J20J45J3p6l27
3633HR6j89J4j13N5j4R2J75J53j04Q3mo87L83j52N1P3L64j64j09K88p2j03l22
3657a98j33M5J61p8J97J52J1J4j65M9J58l36r4J79q9k6L20q9K27m2k61k52J85
3680f5k2j9r1j13N17mM7j2j16K2q5o9q9k0PK6K69k03K06j08L5j51l3l09L50k51
3706b81L82o8l5L29%l72n8J57j81j64J13n1M41M3o0L7O6j18o32K32R5j84O9K97
3730E7j43K15j8J14n5k35j86L1nR4J54j46K21K07k5j28j68m90K94n7M3K55J83
$$ y = [-86, -47, 90, -6, 250, -66, -120, -107, -201, -215, -341, 2, 239, 89, 52, 124, 74, -177, -191, -277, -276, -114, -105, -65, -9, 193, 215, -17, 307, -27, -214, -467, -249, -221, -139, 319, 275, 239, 90, 164, 45, -35, -69, -391, -416, -71, 233, 226, 207, 352, 324, -50, -200, -141, -354, -288, -225, 191, -11, 232, 100, 28, 45, -418, -168, -109, -86, -183, 133, 253, 398, 411, 335, 8, 104, -85, -71, -184, -129, -143, -51, 124, 277, 173, 256, 252, -435, -52, -204, -153, -80, 284, 120, 11, 299, 227, 124, -198, -331, -286, -125, -203, -6, 146, 157, 171, 6, 55, 213, -123, -217, -38, -127, -153, 167, 78, 305, 263, 2, -250, -65, -87, -106, -197, -310, 207, 203, 250, 238, 122, 144, 59, -10, -99, -119, -112, -86, 183, -20, 186, 78, 113, -38, -71, -380, -30, -281, 101, 33, -2, 327, 327, -45, -103, 54, -127, -291, -178, -229, 212, 255, 195, 232, 298, 180, -452, -220, -125, -309, -240, 57, -86, 129, 111, 225, 170, -65, -251, -220, -225, -131, 23, -123, 98, 305, 280, 152, -16, -506, -212, -269, -226, 29, 212]
3753B12p9L58k20q5j54k13k25K57J91j80J68j9L09j51L4l91J72j58K3j5o5J80
3775e1J46O4J18j4k9k30l59o3K39j36J27K42J8KL36k11J07n68O3j37o0M67k54
3798a83M47j79L56j78l98K30j67l21J13J19K28j19M59l18K04j50j59q1kO4j75
3819b10K80m0k1K27n4J42q7m57J22J50k35O0J21J4J29J15k26j11P0j97k84K64
3841b28O1J81L4J56J46r5n8l88j05P9L7r1J74J04L58J14O7m34P7j56k34J97j76
3864a80M5J89J64P9J90k91j24j54J36l27O4j17j13K03O00j09n5l42P1q2l7L8O4
3887h8j79K36R2K84k79J68J62o40n7J82Q2l10L85J01k17L15j93J18j27l48j9M0
3909b92Q4L09O6j41L45j60P7k21k30J64l34L06jm8L69m7M8k23J4l0j53k33M05
$$ y = [212, 133, 491, 271, 186, 32, -181, -406, -149, 42, -138, 30, 11, 320, 169, 203, -188, -16, -174, -151, -166, -231, -51, 95, 159, 277, 263, 234, 4, -355, -418, -179, -315, -188, 54, 72, 74, 410, 199, 306, -262, -199, -336, -396, 71, -183, 264, 85, 441, 263, -135, 95, -72, -393, -280, -161, 67, -52, 407, 89, 293, 143, -16, -97, -99, -35, -210, 70, 30, 9, 236, 182, 324, 237, -220, -98, 52, -183, -123, -2, 12, 141, 256, 30, -81, -11, -208, -492, -228, -167, 14, 48, 204, 350, 255, 197, -191, -296, -217, -180, -271, -97, 7, 365, 479, 546, 112, 189, 33, -201, -4, -180, -135, 54, 218, 297, 487, 196, 72, -82, 54, -273, -209, -326, -439, -236, 364, 255, 200, -142, -71, -153, -190, -152, -88, -267, -31, 61, 345, 66, 234, 396, -244, -301, -119, -37, -347, 38, 139, -78, 237, 44, 162, 35, -313, -332, -292, -208, 101, 167, 26, 371, 211, 288, 67, -163, 1, -333, -27, -28, -76, 293, 246, 294, 71, 85, 55, -98, -331, 74]
3932G4k77P4K14J52Q5j06j07pj8l49L67j47N4K47J3j0k43J06l43J1K7j41L15o5
3956g4j54J81K65N3q5m4l72P8k08J41j43L39K5oL29k63j18K23m63M9n0L6J36J66
3980D1p9L78k68j17L26l27j14K70l57J89J99J45j53k02P7M2l36M7R3m32O48N0
4002A20j8j09K23j99J72o17O60n21j16M67j38J48K53j37l0k49L30n53J52J1P1
4023h0J75j82L17j18J57j79j23J68m89J01L8K39j03O3J01m1p4J08k81O7p5P7K36
4046A02j80J17J78l27L94j58k09M6j86J30k41L58K67j64K06k31K00m71j9J07j6
4067i7r3M3J38MJ70O7j74l8j17m7lj25J43K73q8O9J46l14J11m09L77r5j44J1L4
4092a58R3P7K3J72l99j12O38m25j12k04K55Q9N3M3p6J36k07m1o8J21KJ91l23J32
$$ y = [74, -203, -129, 85, 237, 322, 216, 109, 102, 84, -265, 102, -45, 9, 256, 269, 259, 16, 122, -221, -210, -183, -324, -9, -74, -228, -47, 218, 271, 186, 142, -230, -152, -360, -219, -362, -23, 2, -4, 325, 62, -56, 167, -296, -247, -297, -261, -125, 41, -38, 340, 72, -45, 281, -46, -160, 110, -247, -58, 141, 286, 133, -69, 8, 50, -286, -239, -146, -578, 70, 120, 102, -7, 216, 17, 189, -428, 232, -289, -405, 62, -76, 72, 325, 188, 158, -91, 239, -314, -162, -151, -80, 95, -87, 230, 112, 269, 90, -33, 135, -354, -253, -215, 24, -79, -16, 85, 44, -30, 78, -203, -136, -211, -134, 102, -78, 39, 217, -110, 284, 126, -83, -37, -223, -93, -334, 24, 291, 127, 333, 102, 302, -169, -188, -81, -97, -190, -147, -9, -5, 165, 232, 58, 20, -97, -144, -147, -272, -129, 144, 56, 125, 271, -43, 68, -341, 36, -59, -203, -192, -158, -65, 12, 35, 207, -192, -304, 334, -91, -203, -407, -152, -63, -10, 33, -43, 93, -114, -155, -223, -102, -100, 91, -232, -100]
4116a00M60j98R7j4n64J19l9P9J5J48L52k95J42j3q0k25j0k80L09m1M26l97R7
4139a2J20K4k10j3K0j47Q0L02j69J28j45O5L15k75l8l3J5k62j70J59L31k1k01
4162a37J91L1M1k56J66k68M3J89q3J42j10K40P4l71J76k26K6K2K2J8n7J45J36
4185A54Q6j6j27Ok16j9j25K08J04L3J22n1k37J40N5j93Q3k5Mj37P5L82j32j62
4209A2J57k5j3l92l2K56J02j64K7K1Q9J86l03J28k04K8J54j73J17J39o9j12K19
4232A48n7j68J88o4j48k6n1J02J34N5k49M0J04j21k44L49k51J85N7K42j05p7J44
4255A87k10lk35Q4K21l06J7L89J55j33r1Op6k5Qj86K57j65J63N6q3K94j55R5l82
4280a18J81l95L49j19K25J02k57N0J69j66J81j26l00P3L1K92L0n6mj90O3K57j46
$$ y = [-100, 360, 162, 259, 245, -319, -200, -239, -160, -145, 3, 355, 60, 202, 189, 109, -116, -126, -406, -97, -138, 288, -109, -12, 108, 132, -78, -91, -71, -218, -138, 164, -5, 123, -22, 43, 358, 83, 45, 12, 27, -235, -405, -246, 85, 64, -137, 54, 85, 126, -130, 36, -232, -189, 0, -83, 59, -51, 189, 263, -108, 68, -158, -132, -110, -88, -70, -127, 18, 154, 240, 224, 97, 103, -113, -132, -257, -49, 55, 88, 210, 159, -78, 62, 117, -76, 7, -18, -14, -151, -76, 306, 174, 12, 169, 144, 131, -261, -293, -37, 65, -99, -72, -51, 38, 224, -79, 49, -155, -127, 27, -146, -29, 110, 41, -71, 148, 91, -77, 111, 47, -101, -127, -178, -76, 58, 113, -136, -96, 8, -113, -357, -8, -259, -74, -17, 225, 120, 43, 187, -23, -26, -261, -177, 44, -262, -245, 144, 299, 166, 75, 81, 5, -20, -12, -198, 59, -106, 57, 113, 30, 324, 169, 264, -118, 63, -332, 17, -102, 123, 225, -32, 18, 187, 21, 202, 76, -224, -151, -120, 172, 202, 146, 142, -48, 15, 272, 126]
4303A26k18k26Q3J78J22J27K95m20J32m26L08j56Q9j57O0J78j83J34Q3R8jk33
4325gj27p8J36R6K78q1j03kL7l97J26k7j3K34j21Q6j40k99O07k33L36l89k55L99
4349F3L1j02m9R0q4K84j57n3m9J94j7k47j90L69Q6l27L39q8O4Q3j53k46K28J06
4373A75l24L2M55l69j29J64K35m4l20j8K0j30K19n8K61mk64M8K33q3l06J0J45
4396e2J66k78M11j39j71K23j51Q2j57k77K74K1K77k50P9J21j00j87n2J49j35K36
4418I0q0Q3j8QJ15j01K2k8j51o3K9Mk15K00l0J19N2r5N9j9k1K50n46J65Q8O7p4
4445i0O6r9K73j78k4K1o2N5J78N9j80Lk2j29J07O5k07j8K78J71k27K05k62N43
4469E26m72on1r1J60j13L0p6mm8L36k4Q2j46l2q1k58K66k10J56J27j66L6K28k7
$$ y = [126, -92, -318, -235, -57, 65, 192, 487, 67, 199, -227, 81, -75, 14, -143, -83, 95, -88, 46, 129, 227, 226, -7, -134, -212, -76, 20, 298, 217, 114, 112, 149, -248, -122, -149, -162, 72, -49, 37, -103, -402, 205, -28, 308, -81, -336, 63, 94, -8, -57, 33, -51, 233, 76, 23, -26, 168, 151, -96, -286, 83, 169, -158, 181, 93, 157, 240, 87, -159, 69, 175, -149, -117, 338, -31, -160, 4, 239, 195, -125, -143, -123, -253, -34, -92, 169, 165, -99, -51, 182, 99, -207, -197, -52, 114, -164, 247, 108, -63, 160, 9, 91, -66, -343, -69, -48, 229, -21, 58, 179, 79, -108, -160, -11, -146, 90, 10, 93, 75, 83, 198, 97, 119, 91, -60, -123, -94, -90, -305, -105, -135, -16, 36, -59, 0, -19, -40, 210, -336, -171, -83, -16, -90, -24, -123, 150, -28, -52, -31, -93, -38, 140, 199, 19, 22, 0, -129, -22, 43, -164, -182, 96, 267, 40, 245, -17, 526, 54, 48, -3, -94, 66, -47, -17, -93, -97, -145, 191, 167, 249, 103, 71, -10, -268, -2, -212, -56, 71, -95, -59, 169, 142]
4494A42q7k06M51m36%K81M4j67q0K41j47k2P1o6j65P3J75j00r7p3M03Q8m91M81
4518C13m42p1M34n58K90kK92k67O1j89J09o1o2J22j27P2n8J59q4R5k78J52R0L
4542gm7m2J35l8m9K48m8l21j0K59J89j74q6L3J16k17o2Q7K32l94R6K09r3q6J52
4567H2o8p6L05n30L17P2n2j72J81o0k87L47j93J50k7L2J83n7k82L96m46N2J70
4590C7l44L34k76K12J95r3M2lm22M43j46j91K23o1J65j32LK22j39j26n4K73j95
4613c3k04J18K1R6J79k01O3K52l15m3j29J53j19M40k48kj06L02k00K0%j26J94
4636A12k84Q2K9J42J17j1q2J08k92J48k38M9J56p9j01J73M4j00R9j13l3O6k77
4659b85M42j52p8K38m17M83n17L37j37K28j97j52K46j42K05j19K01L2J72o13K12
$$ y = [142, 55, -151, 300, -136, -136, 145, 189, 22, -58, 183, 36, 14, 85, 19, -146, -73, 102, 2, -95, -168, 235, 323, -168, 313, -129, -200, 234, -324, -34, -36, 256, -11, 50, -139, -30, -91, -153, -31, -158, -86, -144, 15, -69, 26, -252, -100, -10, -7, -54, -96, 39, 1, -48, 200, 152, -169, -179, 80, 269, 95, 9, 42, 158, -59, -121, -34, 198, -196, -100, 109, 16, -70, 82, 14, -62, 243, -287, 30, 102, 50, -122, 59, -1, -288, 59, -134, 16, -11, 21, 204, 147, -135, 261, -185, -133, 37, -307, 27, -249, -37, 158, 65, 107, 104, -318, 125, -21, -212, 11, -50, 115, -17, -14, 208, 69, -57, -111, 162, -33, -237, -119, -98, -2, 177, -24, 39, 291, -24, -67, -196, -43, -162, 278, 30, 28, -78, 224, 24, 44, 44, -82, 112, -172, -90, -61, 81, 198, 187, 105, 213, -79, 69, -169, -120, 36, -43, -144, 29, 73, -27, 72, -41, -74, -8, -285, 157, 5, -73, 165, -252, 231, -286, 51, -86, 142, -55, -207, 39, -103, 102, -17, 184, 216, 388, -225, -13]
4680a3j25l4J25L2J83j36J00j11K47p8l12n0J37j63L37k51K49j02L27l38k8Qq5
4703h1K5P7r3J76k5L23j43m2k6k58J18j35L8Q8k9K12k67J66j04J07j30P0p5j87
4727a95N7M5J06L4K09J63k64j53p2Kp7K01k96K50K86k01k31R5K01l71L36m3Q9
4750A71k51L0k64J94N30j01R3o26J7N4k2n4L6J48J43l80K40K13k13j32KK9j01
4773b44J75J12j30K53R5j70J3j77j40Q6j1K26L4k08K89r2J70l25J51l02L1J5n5
4796b04PJ91Q2Q7j5L6m29J47j1j23O6M4P6r2K20m2L55k12l62K48l06K09O6m2j5
4821a9K32M8q9j32j69j41K88m39L10K06j63K18p4K07l33K18l87J49j11Q8L4K3
4843c6K49M2r6j27r5J30j49j00j82R9K63KK0J58Q6k33p8nj49J18j39J42K67j99
$$ y = [-13, -138, -172, -47, -15, 168, 32, 132, 21, 268, 190, -122, -172, -35, -198, 139, -112, 137, 35, 362, 24, -4, 4, -81, -56, 21, -72, 104, 79, 402, 259, 217, 191, -67, 51, -84, -46, 42, 13, 225, -42, 124, 20, 127, -3, 67, -8, -195, -138, -93, 13, 47, 256, 419, 155, 2, -70, -68, -145, 56, -240, 10, 296, 95, -136, -41, 160, -211, 125, 82, 171, -80, -50, -314, -120, 410, 309, 402, -224, -207, -153, -175, -229, -193, -45, 98, -282, -42, 171, -42, -174, -172, -143, -244, -69, 43, -87, 166, 261, 91, 104, -73, -213, -127, -138, 88, 122, -86, 203, 111, 281, -44, 107, -195, -164, -149, -204, -197, -6, 76, 163, 148, 184, -245, -98, -109, -232, -166, -122, -46, -138, 82, 40, 395, 183, -179, 69, -237, -28, 38, -4, -19, 213, 261, 172, 40, -129, -270, 18, -421, -111, 95, -68, 150, 76, 283, -50, 168, -219, -70, -181, -93, -59, -36, 213, 255, 159, 32, -63, 67, -82, -182, -364, -265, -2, 0, 20, 178, 264, 31, -47, -52, -201, -83, -222, -80, 187, -12]
4867a2J45j8l3J8j76n4O5j71L3J65Q3j58J9qK44l92OJ59j68J83Q9M8K11j45K05
4892C38k60K2l08l8J31R3Q4j16K30r6P8k12K47m60J36O9Lj01P5J04J56j60j08
4915i3O5J75l25J76j23J96l0L2L3j90J79J03m44n0j12K61K7J10K2K10j57K3O4
4938A52j21j75L03l06Q9J33nL20l66p1q5K23k69J56k73K33p4J79R6O8J99l73N3
4961H6lj16k58J45nn4J07K47j92J66k65J89q0j48J7j75L51RK20j9J14j80l55K8
4985a71Q4J66m43M28q9K6M2J44j70J57k82j74J73M1L0j49K37M9L5l12L87j09k28
5008a28M1J8J23j76K35p6K9p7R4R1k09k25r4L65M4j05J91J02j50J36j43j78P6
5031a6n9J23N9j43K50k4Pj6j44j74q1J92k34J71M7M6j28R3L1m5k28L46j32j3j33
$$ y = [-12, 133, 115, 82, 100, -76, -130, -65, -236, -203, -38, 45, -113, -94, -102, 142, -250, -244, -85, -253, -70, 19, 67, 278, 133, 338, 78, 100, -208, -246, -115, -22, 62, -54, 176, 80, 158, -54, 193, -267, -131, -62, -59, -160, -85, 19, 175, 15, -93, -28, 147, -178, -2, -125, 71, 41, 73, 106, -84, 95, 198, -246, -296, -408, -147, -120, -10, 12, 222, 65, 88, 152, 31, -144, 159, -147, -58, 75, 70, 390, 24, -47, -132, 91, -178, -22, -295, -62, -136, 43, 139, 207, 406, 33, 86, 83, -33, -291, -146, -151, -205, -98, 149, -43, 123, -142, 47, -33, -181, -164, -339, 12, 21, 241, 222, 336, 156, -199, -171, -87, 79, -364, 64, -25, 1, 43, 187, 17, 174, -108, -282, -109, -68, -38, -187, 50, 99, 134, -178, 209, 100, -128, -87, -69, 54, -122, 113, 37, 66, -11, 83, 174, -35, -260, -354, 11, 55, -50, 141, 243, 93, 229, 86, -92, -16, -75, 48, 107, -36, 214, 190, 197, 181, 37, -137, -218, -26, -260, -89, -42, 4, -124, -31, 0, -45, -273, 73, -59, -72, -205]
5056b05J41Q2n4K95l22J69k35lr4J0R1K23J76j43J01k15J36k05J46M4l24J02p1
5079a55O6Q5K25k52J59j40J24r8l03N1J95O8p9Q3J47k77J88Q9j49j12N6l01J15
5102b15K11J1K65p4J64k88j22k35J90n1k21N16l54M36nj00j9m58L27k93L48k83
5124b50J67L71j89J11n3m6n0l51K8j1O5K30j03P0L26Jk73J40l29K7q0J70j19P2
5148g6K89J99l54J90j25N1j34p1j07k14K94rJ42k5L13m51J03l89L70j18n4M7J35
5171FJ15j19N02m51L6j51Q0k84K2K25m2J93j67P9P8J08n2j85j58l09K58J55L22
$$ y = [-205, -64, 18, -36, 259, -63, 106, -129, -132, -226, -216, -125, 98, 274, 131, 232, 17, 153, -52, 94, 138, -186, -84, -155, -89, -4, 221, -31, 128, -12, 112, 14, -289, -238, -43, 25, -54, 29, 176, -101, 87, 176, 27, -85, -29, -330, -215, -4, 7, 272, 198, 362, 74, -48, -283, -93, -144, -365, 151, -203, 233, 228, 128, 109, -349, -22, -315, 33, -250, -83, 288, 99, 210, 157, 111, 61, -290, -262, -273, -208, 22, -81, -11, 315, 316, 43, 183, -146, -119, -199, -29, -148, -76, 213, 412, 58, 248, 123, 174, 40, -31, -138, -352, -58, -67, 75, 50, 363, -88, 15, -374, -4, -122, -176, -129, 6, 121, 2, 504, 53, 89, -62, 18, -266, -244, -19, -61, 132, -35, 44, 122, 230, 178, -7, -165, -474, -216, -61, 261]
$$ [...]
8191b58
##END NTUPLES=NMR FID
##END=
