##TITLE=1H_PR166_13
 D2O, 8 sc, 
 13.2.2019
##JCAMPDX= 6.0         $$ Bruker NMR JCAMP-DX V2.0
##DATA TYPE= NMR FID
##DATA CLASS= NTUPLES
##ORIGIN= UXNMR, Bruker Analytische Messtechnik GmbH
##OWNER= root
$$ XWIN-NMR		Version 3.5
$$ Wed Feb 13 14:58:16 2019 Russian Standard Time (UT+4h)  she@DPX200
##.OBSERVE FREQUENCY= 200.1313
##.OBSERVE NUCLEUS= ^1H
##.DELAY= (6, 6)
##.ACQUISITION MODE= SIMULTANEOUS
##.ACQUISITION SCHEME= undefined
##.AVERAGES= 8
##.DIGITISER RES= 18
##SPECTROMETER/DATA SYSTEM= spect
##.PULSE SEQUENCE= zg30
##.SOLVENT NAME= D2O
##.SHIFT REFERENCE= (INTERNAL, D2O, 0, 15.7039)
##AUDIT TRAIL= $$ (NUMBER, WHEN, WHO, WHERE, WHAT)
$$ ##TITLE= Audit trail, XWIN-NMR		Version 3.5
$$ ##JCAMPDX= 5.01
$$ ##ORIGIN= Bruker BioSpin GmbH
$$ ##OWNER= she
$$ F:/spectra/data/she/nmr/H-F/1/audita.txt
$$ ##AUDIT TRAIL=  $$ (NUMBER, WHEN, WHO, WHERE, WHAT)
(   1,<2019-02-13 14:57:25.32 +0400>,<she>,<DPX200>,
      <created by zg, POWCHK disabled, PULCHK disabled
       configuration hash MD5:
       00 E9 B6 7A A2 85 ED C7 34 08 36 98 17 FE 4E 26
       data hash MD5: 16K
       3F BE CB AD 20 EC B3 3B 40 E5 66 A1 D8 11 7A 57>)
$$ ##END=
$$ 
$$ hash MD5
$$ 16 0A B3 A7 3C EC 41 5B 19 E9 FD 8C D6 39 C8 EC
##$RELAX= 
##$RELAX= 
##$RELAX= 
##$RELAX= 
##$RELAX= 
##$RELAX= 
$$ Bruker specific parameters
$$ --------------------------
##$DU= <F:/spectra>
##$EXPNO= 1
##$NAME= <H-F>
##$PROCNO= 1
##$TYPE= <nmr>
##$USER= <she>
##$AMP= (0..31)
100 100 100 100 100 100 100 100 100 100 100 100 100 100 100 100 100 100 
100 100 100 100 100 100 100 100 100 100 100 100 100 100 
##$AQSEQ= 0
##$AQ_mod= 1
##$AUNM= <au_zg>
##$AUTOPOS= <>
##$BF1= 200.13
##$BF2= 200.13
##$BF3= 200.13
##$BF4= 200.13
##$BF5= 200.13
##$BF6= 200.13
##$BF7= 200.13
##$BF8= 200.13
##$BYTORDA= 1
##$CFDGTYP= 0
##$CFRGTYP= 5
##$CHEMSTR= <none>
##$CNST= (0..31)
1 1 145 1 1 1 1 1 1 1 1 1 1 1 1 1 1 1 1 1 1 1 1 1 1 1 1 1 1 1 1 1 
##$CPDPRG= <>
##$CPDPRG1= <>
##$CPDPRG2= <>
##$CPDPRG3= <>
##$CPDPRG4= <mlev>
##$CPDPRG5= <mlev>
##$CPDPRG6= <mlev>
##$CPDPRG7= <mlev>
##$CPDPRG8= <mlev>
##$CPDPRGB= <>
##$CPDPRGT= <>
##$D= (0..31)
0 1.2 0 0 0 0 0 0 0 0 0 0.03 0 0 0 0 0 0 0 0 0 0 0 0 0 0 0 0 0 0 0 0 
##$DATE= 1550055444
##$DBL= (0..7)
120 120 120 120 120 120 120 120 
##$DBP= (0..7)
150 150 150 150 150 150 150 150 
##$DBP07= 0
##$DBPNAM0= <>
##$DBPNAM1= <>
##$DBPNAM2= <>
##$DBPNAM3= <>
##$DBPNAM4= <>
##$DBPNAM5= <>
##$DBPNAM6= <>
##$DBPNAM7= <>
##$DBPOAL= (0..7)
0.5 0.5 0.5 0.5 0.5 0.5 0.5 0.5 
##$DBPOFFS= (0..7)
0 0 0 0 0 0 0 0 
##$DE= 6
##$DECBNUC= <off>
##$DECIM= 32
##$DECNUC= <off>
##$DECSTAT= 4
##$DIGMOD= 1
##$DIGTYP= 9
##$DL= (0..7)
0 120 120 120 120 120 120 120 
##$DP= (0..7)
150 150 150 150 150 150 150 150 
##$DP07= 0
##$DPNAME0= <>
##$DPNAME1= <>
##$DPNAME2= <>
##$DPNAME3= <>
##$DPNAME4= <>
##$DPNAME5= <>
##$DPNAME6= <>
##$DPNAME7= <>
##$DPOAL= (0..7)
0.5 0.5 0.5 0.5 0.5 0.5 0.5 0.5 
##$DPOFFS= (0..7)
0 0 0 0 0 0 0 0 
##$DQDMODE= 0
##$DR= 18
##$DS= 0
##$DSLIST= <SSSSSSSSSSSSSSS>
##$DSPFIRM= 0
$$ [...]
##$SUBNAM2= <"">
##$SUBNAM3= <"">
##$SUBNAM4= <"">
##$SUBNAM5= <"">
##$SUBNAM6= <"">
##$SUBNAM7= <"">
##$SUBNAM8= <"">
##$SUBNAM9= <"">
##$SW= 20.0189088683792
##$SWIBOX= (0..15)
0 0 2 0 0 0 0 0 0 0 0 0 0 0 0 0 
##$SW_h= 4006.41025641026
##$TD= 16384
##$TD0= 1
##$TE= 0
##$TE2= 300
##$TE3= 300
##$TEG= 300
##$TL= (0..7)
0 120 120 120 120 120 120 120 
##$TP= (0..7)
150 150 150 150 150 150 150 150 
##$TP07= 0
##$TPNAME0= <>
##$TPNAME1= <>
##$TPNAME2= <>
##$TPNAME3= <>
##$TPNAME4= <>
##$TPNAME5= <>
##$TPNAME6= <>
##$TPNAME7= <>
##$TPOAL= (0..7)
0.5 0.5 0.5 0.5 0.5 0.5 0.5 0.5 
##$TPOFFS= (0..7)
0 0 0 0 0 0 0 0 
##$TUNHIN= 0
##$TUNHOUT= 0
##$TUNXOUT= 0
##$USERA1= <user>
##$USERA2= <user>
##$USERA3= <user>
##$USERA4= <user>
##$USERA5= <user>
##$V9= 5
##$VALIST= <valist>
##$VCLIST= <CCCCCCCCCCCCCCC>
##$VD= 0
##$VDLIST= <DDDDDDDDDDDDDDD>
##$VPLIST= <PPPPPPPPPPPPPPP>
##$VTLIST= <TTTTTTTTTTTTTTT>
##$WBST= 1024
##$WBSW= 4
##$XGAIN= (0..3)
0 0 0 0 
##$XL= 0
##$YL= 0
##$YMAX_a= 93084
##$YMIN_a= -126632
##$ZGOPTNS= <>
##$ZL1= 120
##$ZL2= 120
##$ZL3= 120
##$ZL4= 120
##$ABSF1= 10
##$ABSF2= 0
##$ABSG= 5
##$ABSL= 3
##$ALPHA= 0
##$AQORDER= 0
##$ASSFAC= 0
##$ASSFACI= 0
##$ASSFACX= 0
##$ASSWID= 0
##$AUNMP= <proc_1d>
##$AZFE= 0.1
##$AZFW= 0.1
##$BCFW= 1
##$BC_mod= 2
##$BYTORDP= 1
##$COROFFS= 0
##$CY= 11.3945322036743
##$DATMOD= 1
##$DC= 2
##$DFILT= <>
##$DTYPP= 0
##$F1P= 18.9103706918063
##$F2P= -1.10871071338519
##$FCOR= 0.5
##$FTSIZE= 0
##$FT_mod= 4
##$GAMMA= 1
##$GB= 0.15
##$INTBC= 1
##$INTSCL= 1
##$ISEN= 128
##$LB= 0.24
##$LEV0= 0
##$LPBIN= 0
##$MAXI= 10000
##$MC2= 0
##$MEAN= 0
##$ME_mod= 0
##$MI= 1.114404
##$NCOEF= 0
##$NC_proc= 0
##$NLEV= 6
##$NOISF1= 3.799351
##$NOISF2= 2.8
##$NSP= 1
##$NTH_PI= 0
##$NZP= 0
##$OFFSET= 15.70392
##$PC= 1
##$PHC0= -9043.253
##$PHC1= 10.80014
##$PH_mod= 1
##$PKNL= yes
##$PPARMOD= 0
##$PSCAL= 0
##$PSIGN= 0
##$REVERSE= no
##$SF= 200.130013532006
##$SI= 16384
##$SIGF1= 3
##$SIGF2= 2
##$SINO= 400
##$SIOLD= 16384
##$SREGLST= <1H.CDCl3>
##$SSB= 0
##$STSI= 0
##$STSR= 0
##$SW_p= 3612.71676300578
##$SYMM= 0
##$S_DEV= 0
##$TDeff= 0
##$TDoff= 0
##$TI= <>
##$TILT= no
##$TM1= 0
##$TM2= 0
##$TOPLEV= 0
##$USERP1= <user>
##$USERP2= <user>
##$USERP3= <user>
##$USERP4= <user>
##$USERP5= <user>
##$WDW= 1
##$XDIM= 8192
##$YMAX_p= 0
##$YMIN_p= 0
$$ End of Bruker specific parameters
$$ ---------------------------------
##NTUPLES= NMR FID
##VAR_NAME=  TIME,          FID/REAL,        FID/IMAG
##SYMBOL=    X,             R,               I
##VAR_TYPE=  INDEPENDENT,   DEPENDENT,       DEPENDENT
##VAR_FORM=  AFFN,          ASDF,            ASDF
##VAR_DIM=   8192,          8192,            8192
##UNITS=     SECONDS,       ARBITRARY UNITS, ARBITRARY UNITS
##FACTOR=    0.0002496,     1,               1
##FIRST=     0,             0,               0
##LAST=      2.0444736,     0,               0
##MIN=       0,             -126632,         0
##MAX=       2.0444736,     93084,           0
$$ Real data points
##PAGE= N=1
##DATA TABLE= (X++(R..R)), XYDATA
$$ [...]
1981a52l97j17q2K5N53L58N78j44j43k02m99n02L7L27n0K1Q57j0L5J08j21o68
2003a88J8j74l46M2P09k67L67N88l11M2k62m79k76j23j34M12L54K13L39j08j15
2024C01k12k02k20k04k10J58L53N19K31P8p7k8m05l45k10J64n1L51J49M77J53
2045G70k51n2n69k53j12n22M49RP21N79j14l9l01l06o3j22p14L49K22M80J26K57
2067E44j33K41o80j98j49l9o5J77K47L13J19K82l19M8m39k20l33J63L11j97L93
2088F6L12J14Op9q07J44k19j5m1N05L96j63J84M8J55n84n83M90l23o8M26L43j96
2111A11K29k0%km23k62k76K28l4M84K66J08l40L86J16n85j60m09N7L32P8O60n7
2134D87k45OJ22k97r5k26k99K02QJ49O72J91k28j55l36n9m51j03L23K82J54oJ05
$$ y = [-152, -549, -666, -748, -723, -170, 188, 766, 622, 479, 277, -222, -724, -687, -360, -410, -389, 468, 458, 493, 601, 480, -188, -170, -344, -690, -648, 61, -206, 161, 749, 438, 480, 218, -261, -537, -660, -794, -382, -28, 185, 524, 416, 301, 89, -113, -333, -537, -747, -589, -236, 283, 514, 592, 515, 487, 82, -263, -473, -309, -360, -9, 140, 617, 770, 519, 467, -102, -355, -467, -989, -540, -531, 190, 769, 655, 616, 315, 9, -54, -176, -890, -541, -319, 161, 287, 544, 411, 652, -28, -226, -375, -414, -479, -302, -55, 258, 377, 659, 340, 388, -51, -271, -604, -441, -130, -327, 66, 378, 492, 498, 419, -388, -244, -463, -478, -519, -14, 382, 219, 403, 451, 606, 22, -561, -71, -394, -462, -36, 307, 111, 340, 320, 320, 318, -105, -367, -643, -415, -449, 35, 301, 409, 69, 455, 571, -14, -174, -583, -526, -194, -116, 544, 487, 242, 248, 370, 73, -22, -248, -547, -345, -337, -188, 484, 675, 447, 292, -44, -103, -554, -657, -334, -52, 102, 96, 201]
2157B01L72j48m07m80q0K0J04j24L16N79Pm9J19j50m27o1l23J74PL03L41J13j33
2180B74J71l84Q8l60k65Q4mM5N23QJ57L78n20j59n4l56K11j17N2K14K14M87l34
2203C53R4j06m47J25n16K4N95J13OJ71J14k20j36n55l4L0k5J04M72J09J01j14
2225B58L6j65o2k15k95J86j5L14P6K09K73k33j98n1J6m65k33K29K24J90K4K55
2247C58p6l7j14k71l32j48K28L41j29K32J63M2l0j61o1j89l71M56l22N16m4J23
2269A74L72m70J15j79m51R9j12K40J47L85J39l51M69m22J1k29k30Q4j71J61J45
2290g4k5M05K65p49P1n9j86O1K42j01M94p2J51k06k19J32m49L56j99k6M4M00J05
2313C61j25n9R5l72J75l96j97L59L7L28l8O2J65l48m5j18k88K98j57J65J80K02
$$ y = [201, 573, 425, 18, -462, -542, -522, -418, -542, -226, 353, 360, 311, 430, 280, -147, -208, -531, -357, -350, -47, 294, 407, 274, 445, 61, 149, -211, -476, -392, -396, -351, 172, 180, 337, 715, 195, 36, -18, -374, -163, -280, -228, -14, 200, 687, 353, 447, 341, -106, 19, -497, -473, 122, 235, 241, 412, 526, 306, 170, -385, -419, -389, -414, -310, 162, 271, 372, 258, 294, 129, 67, -148, -443, -257, -272, 42, 118, 327, 600, 367, 169, 118, 134, -331, -564, -335, -111, 79, 103, 358, 282, 245, 131, -140, -472, -620, -392, -51, -180, 52, 215, 257, 227, 66, 5, -184, -555, -99, -421, 95, 51, 174, 546, 76, 191, 12, -439, -340, -452, -212, -65, 320, 459, 108, 577, 155, 166, -63, -293, -209, -380, -219, -74, -99, 306, 571, -178, -107, -166, -352, -291, -49, -150, 344, 272, 423, 217, -2, 130, -319, 37, -162, -188, -144, 256, 361, 236, 177, 272, -100, 75, -321, -518, -159, -122, 206, 168, 230, 395, 47, 2, -116, -404, -106, -263, -98, 82, 284]
2335B84J34k68J19j8m07M7l31M12m6k99M42K52K88k87o5l17j89q8k1K60J05l1
2357b4Q5L49J68j99m86l30K21j00m3L07J95q1M00q4j69k59J19k20r9n0J71J41
2379A2L36o1J49l31m1k32j79J55j14J66l1L37J93J63l83J20n06J5m17P3K16M23
2401F3J0J65M2R8j72l09O6m92K27O5K14M01k1p3J3l4l12k44J2J02k70M09L16J32
2425D08o7o7n7l64l9R7l28K45O9J76K32K70j16l07j45l63K13m21K45J00K40K86
2447C07k6l11M95o9m77j37j1J13k93L85R1J57J11q9j9m59J32k06R4k08K98M21
2469B99j54J42j81R1l51L8k09M2k17L25Q5L41k06K17J79n82K27n47J83K39K87
2490B48j48J76J32k35j28j40J9k27n7p4K31L58k45M66m2r6k11j97n3J87l49K05
$$ y = [284, 418, 150, 269, 251, -156, -109, -440, -28, -74, -373, 69, 321, 609, 322, 257, -60, -249, -337, -358, -98, 7, -24, 61, 410, 578, 379, -107, -437, -216, -316, -359, -52, 143, 62, 462, 378, 209, -50, 69, -151, -250, -300, -129, 12, 348, 287, 436, 105, 64, -168, -347, -192, -306, -140, -171, 166, 359, 522, 139, 259, -247, -232, -649, -576, -360, 63, 73, 238, 280, 378, 206, -103, -37, -529, -302, -237, -23, 378, 357, 284, 297, 263, -49, -293, -281, -179, -449, -40, 276, 408, 341, 274, 217, -147, -186, -89, -417, -172, -103, 73, 305, 575, 459, 152, 7, -356, -143, -564, -319, -219, 21, 307, 281, -30, 465, 396, -81, -218, -229, -116, -409, -24, 67, 224, 335, 246, 227, -232, -100, -306, -212, -420, -122, 299, 145, 287, 106, 197, -154, -116, -325, -283, -500, -175, -90, 251, 45, 262, 441, -141, 86, -461, -278, -39, 248, 100, 276, 408, 173, 45, -95, -76, -303, -360, -434, -203, 155, -90, 376, 334, 238, 27, -170, -223, -36, -385, -180]
2512a80J69N2K20K54K5o08O4l76p0L61j41K13J46n6J54K4R8m22K1j89pj37J51
2535b34N61k22O5k7k0L4n02K50J5m7k0K89K86k47J9K1n1l84k01n4J01K47J62J73
2559B14P7k13K10j54j56k30l11L90Q7K78j75L74k18m0p0n9j76q3O7K35J8p9M48
2582D34k24k93J6J03L1l26j00n7K86J66R2l0L21n48R8l53j4K61k14J7O86o1K58
2605E49n89Q6j70j70J58m46M87k00J82L90k12J33l6k56Oj91k22N09n9J16K82l00
2627D7L32j0n4m94k57L99o0J13n1J97n9L88j20l48k23J97m01J93J86L7J98o1K59
2650D08k13L7k21j07k7j84J33j6L34M7n4J6j45%j33KJ34j33j95J88K25O05m64
2673B37k50J49n23J60p4K6K19p4M57j20J69j72l31J20l24J31m2KN2K84J2K37l9
$$ y = [-180, -11, 41, 261, 515, 540, -68, -4, -380, -450, -89, -230, -17, 129, 73, 227, 251, 349, -73, -52, -241, -248, -385, -234, 327, 105, 170, 143, 123, 157, -345, -95, -80, -127, -147, 142, 428, 181, 200, 221, 170, -214, -415, -469, -368, -121, 41, 214, 291, 78, 288, 134, -22, -252, -563, -173, -86, 192, 17, 391, 173, 133, 63, 4, -172, -255, -188, 47, 65, -14, 434, 210, -83, -67, 36, 67, -259, -359, -416, -130, 36, 128, 98, 419, -129, -31, -384, -398, -137, -351, -334, 352, 291, 549, -40, 46, -124, -294, -136, -582, -95, -295, -113, 277, 65, 198, 162, -94, -88, -279, -501, 8, -51, 65, 347, 47, 379, 369, 315, -179, -436, -37, -97, 16, -35, 162, 103, 491, 371, 23, -200, -3, -404, -211, -25, 12, 210, 149, 408, 195, 232, 11, -96, -123, -307, -174, -190, 144, 191, 137, 153, 8, 8, -125, -123, 11, -122, -317, -129, 96, 701, 237, -13, 136, -387, -227, -301, -275, -56, -130, 327, 207, 376, 204, -127, -7, -331, -200, -242, -240, -188, 96, 108, 345, 306]
2696C06k73j31j23j26j04L19K7J73J20J59j62k7j03k84j6J59j03K86k5K82Jl99
2718d4K01o4J7l98J62j70J98J64o2M02l15J32k23l02k63M75k01K65J82k47M43
2739C52k49kn3o0k89j95K31K84j23L09j4J25k18K59n33j35J99k20jM69J10j95
2761E1K14j13J43k91j28m3l0K91k37P3J7K93K78k93k18l74J89j33M40q4J93k02
2783C6J82L9k03R6n9k93K06k92K32L66m01J46M8K02j94l32l5k36K28L60P5L2M17
2806F20m32j19r2j74J89n12K27K02K4l8M21N3q2N1l02J60j96m8l07M38pl6K46
2829B86nl13R2qk59K7J59j89K65O1J48nk24J35k84j92qO5P6J97J71O8J12k29J26
2854B72n23L48r0k31j44K22K4L14j20O5r0l40N3J12j82M4J81J37J46j82K13P6
$$ y = [306, 33, -98, -221, -347, -451, -132, -105, 68, 188, 347, 185, 158, 55, -229, -245, -86, -189, 97, 72, 354, 355, -44, 157, 93, 110, -288, -126, -296, -98, 66, 4, 406, 91, 223, 0, -302, -565, -90, -291, -26, 156, -91, 352, 103, 101, 48, -12, -301, -496, -265, 19, -104, 205, 191, 316, 98, 357, -176, -311, -112, -332, -333, 136, 246, 51, 265, 152, 295, 4, -124, -167, -197, 94, -143, -70, -53, 240, 518, 225, 7, -367, -178, -311, 129, 45, 238, 36, 218, 257, 54, 150, 91, -202, 4, -288, -56, 310, -91, 55, 103, 305, 111, -221, -256, -492, -264, 96, 171, 203, 620, 188, 69, -23, -197, -8, -520, -293, -91, -67, -105, 316, 369, 287, 338, 36, 196, 0, -48, -355, 83, 76, 40, 286, 281, -32, 60, 52, -207, -180, -21, -210, 55, 116, 264, 259, 35, 170, -114, -306, -314, -249, -173, 24, 195, 263, 375, 146, 272, -251, 97, 7, -224, -368, -146, -122, 192, 72, 137, 47, -293, -240, -128, -310, -266, -85, 52, 198, 16, 229, 305]
2876C05m50pR7Qk12J21L5L33j33oK42m97K04m4l08K5J49K18K5L13j66R5k76k82
2900b11j40J9j10K84L54O2J42j84n9m7k60J23k05o5J65o8J86L27j60k0J85m37
2922a19L3m4l6M6j9K22J1L6R3J7k26j43J2K0m2P0J49j48M74k81Q8J1m84l5M9j94
2948d40L48L04r2J77O4j30j63%l37j35L70k20M19R5J51pr3j18q4j76k23m3K58
2971g5j32M52l9J07j80J80l06j71K53m94K91P3q9K10m1L08k16J74k04m28L9r0
2993c78M32L4J56j10lk03J59j00l31j1J77k65L60L2K54j66K2J23j45l63j01J38
3015b89L07r0J19M1M3p9O5j81j06m20K49M6J23K23k36K69P9J63l00j04r1rk69
3038d47L76J14N6o0R1plk6Ml77o0J60J43L12j33l7l7R8J77l16O1l57M34j10J0
$$ y = [305, -145, -152, -55, -47, -259, -138, -103, 230, 97, 91, 333, -164, 40, -4, -312, -287, -138, 80, 105, 418, 252, 347, 71, -211, -351, -332, -442, -158, 196, 258, 400, 216, 157, 110, -150, -27, -232, -297, -132, -200, -14, 313, 153, 133, 318, -119, -86, -130, -166, -120, -139, 83, 94, 130, 223, 240, 14, -129, -117, -97, -139, -69, 80, -68, 406, 125, 213, 224, -260, -295, -246, -440, -92, 212, 120, 297, 361, 231, 68, 68, -269, -404, -34, -254, 165, 260, 411, 404, 311, 193, 109, -67, -290, -333, -75, -207, 245, 206, 313, 133, 313, 7, -164, 89, -405, -114, -41, -130, 80, 39, 347, 131, 305, 101, -327, -288, -378, 54, 88, 244, 134, 131, -72, 87, -13, -344, -355, -178, -443, -83, -51, 203, 37, 59, 182, 37, -326, -427, -289, 18, -72, 47, 88, 131, 52, 117, -64, -170, -590, -341, -295, -172, 51, -185, 84, 163, 326, 26, -78, -169, -178, -447, -71, 43, 99, 39, 130, 123, 120, 94, 98, -279, -339, -179, -36, 276, 143, 106, 69, 167, 344, 28, 89, -268, 166, 56, 66]
3063F6N4Mk5M7n7m58N11k59RK35J6j52J60j0q2j12j61j85K48J55j07J56R7O3n1
3088A62j07K9j96j49K55l31M8L89QK22k53K55l24k52n2k0J74J20Q0N2j83L38j18
3111A47K5O2o83K33k52L16K49j67K05rj66L63j65k67j78K30k63L04K79l1j48J71
3133B55l20m9j6J15j80K18j27Q2M38j80M3j30J49m66J23k58L9rK61J08K7M3J44
3156C10k19Pj81n5n3Ll0N15j35J08p1K4m10J81l84J68L8J87P2p2J44J7k24K26
3180A66m11J29j54qK02J96J35J4j67l2k11R1j42j46J86Q0Q4J51J53N2j76k04J9
3203Gl79M1o0K3K24K29J99l02J47o8j06j14k55p0N81l2J7N5l8L19k17j44l58j57
3227d58K6K51J32P6m7L95j9k59Q0m23j73J35j82L26K63J79O6M6l63rl00j5M5J49
$$ y = [66, 120, 124, 99, 146, 89, -369, 142, -117, -108, 127, 143, -9, 151, 141, 59, -53, -214, -399, -151, 4, -103, 53, 150, 213, 162, 55, 84, -112, -261, -6, -337, -289, 100, 108, 330, 77, 332, 8, -244, -296, -316, -142, -22, 58, 110, -73, 265, 147, 172, 234, -449, -216, -468, -152, 97, -70, 135, 126, -40, 323, 158, -109, -287, -57, -320, -16, 263, 232, 84, 255, -65, -114, -130, -15, -195, 23, -104, -22, 416, 236, 279, 149, 298, -168, -45, -303, -264, -273, -12, 96, 123, 166, 310, 91, 98, -83, -138, -191, -188, -218, 297, 162, 270, 199, 223, -187, -6, -390, -222, -184, 3, 75, 3, 147, 164, -60, 166, -245, -116, -270, -278, -76, 120, 255, 269, 102, 70, -141, -50, -192, -338, -152, -72, 12, 163, 316, 368, 192, -12, 7, -372, -331, -391, -368, -144, 85, 284, -18, 129, 61, -45, -159, -414, -484, 97, 65, 82, 137, 99, 418, 201, 57, -301, -458, -432, -181, -49, 27, -20, 375, 356, 97, 177, -246, -419, -284, -466, -140, 123, 302, 368, 414, 51, 42, -258, -273, -228, -79]
3251g9R5J34J01m4K38l4o34K45k69jj00L05M0j39L99J82m15J51j37j48r2Qll7
3275b34L36j16N42k85q0j10K5m37J04J40K11k24K00O9l7J77n45Nj35J66j90K03
3297b15L05J26k66J22o0k2j58K3j16Q7J15L6J86PL06k56p0j79P6m59J7N1L85K33
3321B74O1Q0l00M3l34k89L03J34k34K2L94k8L39k56j39n2j24Q5k94P3j6L09K01
3344B52J40r5p4R4o34J81j60J29pJ08Q3L87m1J32k97l96M9r2k60K20L43K3J38
3367B23K74k03m33m3j11L44l68J78J25j90J49K64k8k6k0k24j47R4o3KK56l0M17
3390D40L2l36j1l43J28m45K35K83K25kK8R9o2l35J66o7l77j10J81L79K7J00J18
3413C53j2l36J74m46l26K57MJ60L45R7q8k85j7M00m64mj09J34R6j68M83j17%p9
$$ y = [-79, 16, 150, 251, 207, 445, 411, -223, 22, -247, -248, -348, -43, -3, -142, 257, 439, 24, 175, 38, -110, -202, -194, -197, -234, 102, -14, 528, 243, 163, 53, 78, -359, -255, -115, 96, -128, 72, 141, 104, 281, -264, -259, -394, -228, -418, -215, 90, 216, -50, 72, 12, -10, -168, -145, -261, -174, -59, -23, 163, 170, 476, 220, 150, -29, 47, -412, -395, -344, 41, 274, 335, 415, 115, 158, -176, -465, -162, -28, -262, -240, 154, 126, 465, 209, 70, 18, -106, -21, -315, -242, -258, 51, 252, 392, 297, 223, 317, -317, -136, -296, -167, -174, -66, 17, 404, 363, 495, 198, -198, -149, -241, -501, -281, 62, 85, 223, 497, 294, -139, -182, -293, 51, -317, -139, -14, -204, -55, 209, 181, 155, 135, -89, -236, -142, -205, -203, 53, 23, 440, 472, 136, 125, -218, -90, -535, -300, -17, 208, 206, 234, 333, 271, -64, 102, 35, -342, -452, -271, 108, 135, 235, 353, 341, 5, 179, -267, -593, -336, -332, -172, 173, 270, 182, -103, -120, 280, -184, -188, -297, -163, -67, -235, 248, 131, 131, 52]
3437E2O4o2l53r3N03n57L01M54q6K03n02K48m62K94k66J47K3J50K59j00m6r0O
3460H7l09P7j4j08K11M5K59k16L51L5m92Rj68p7J9J18L22Q8l8J97q5o0j83m20
3484c52K72o1o5L14p6K67j93n9j1j43j29R7j72r9N56j18J66N3J41k76j46j84Q2
3507a36k64L7N3K56J02K38p6J13J18o97L18n28K80J4J53J02L39k92j86J88Nk60
3529a23j17q2q5M17J85l25K71K03k34OJ6k70m51J29L12L13m9K48l9j30k45k04
3551b54o3J48j07O8J95l6N43m14P9q4P6j04o3j47J74m7K38j2j34K38k70O4k9R6
3575A55m42O0J79K25j3J66l4j46j31l49J05Q9j18J25m5K29J53R2k51k10J41J16
3597I6m34K36Q2q8L97j66K39k57p7j01l73N12n71M88L25n8j78J1q5J23R8n01k54
$$ y = [52, 116, 54, -299, -392, 111, -446, -145, 309, 223, 426, -76, 172, -290, 4, -262, -115, -92, 58, 317, 217, 171, 81, 87, -222, -145, -159, -267, -56, -11, 248, 32, 383, 418, -74, -65, -233, -310, -291, -173, 149, 237, 199, 396, 311, 251, 68, -352, -80, -141, -206, 108, 32, 299, 106, 47, 36, -107, -236, -139, -311, -410, 146, 28, 194, 247, 388, 112, -34, -218, -136, -400, -363, -310, -54, 48, 286, 210, 323, 441, -256, 62, -466, -186, -172, -19, 83, 422, 130, -56, 132, 137, -123, -240, -322, -407, 10, 195, -130, 141, 344, 110, 116, 132, -138, -589, -460, -148, 165, 116, 364, 325, 195, -50, -254, -317, -169, -276, -208, -13, -49, 494, 80, 159, 75, 151, 47, -16, -163, 11, -36, 202, 190, 56, 294, 24, 88, 59, 155, -287, -227, -48, 177, 164, 330, 296, 150, 19, -330, -225, -136, -254, -129, -174, 55, 208, 300, 49, -161, -20, 96, -338, -102, -20, -108, 289, 123, 362, 105, 28, -73, -446, 66, -505, -17, 308, 250, 72, 83, -2, 121, 219, -282, -536]
3620e36J95J62K80j78J88K5k80J49o0P0k71M3J19J40l1l2J05J25M1j41j09j4m1
3643e1j78J48L92l88R5L03n08N20m34P1l20L41j06J21J12Q7R6l16K74k43j87l10
3665d81R7N69j49M05l36J05O9j41j38k10O9n3L89l54k3O03l24r4m5j78O3k65L06
3688a16j08o5R7L59j17O2Q7r3K7l20Q4j23P5L11q7K48j66j64J18k17J55l48J34
3711a67J95M8j29k1L44k03j15k92J59n7K32L9n89N90K28l13R9m5j16N3l29J67
3733b22K8J43J44L76j40k50j12J29j28p0lj76K20M7J87J77n2q3j2j86j93j98K22
3756a52j11K48kJ19K28q6M9k75o4j71J61k7n8J05P0K10j13J64k72r9q1N7j17L
3780b14J25Q5p1K15j00j2p4j21O7l30M90Pm0J88j74P1j74p9r5K80o2j24N3L83
$$ y = [-536, -341, -179, 101, -77, 111, 136, -144, 5, -55, 15, -256, -213, -94, 46, 15, -17, 88, 213, 254, 113, 4, -10, -51, -229, -81, 311, -77, 18, 321, -187, 333, -101, -30, -350, -9, -115, 6, 118, 205, 301, -15, 259, 16, -171, -481, -384, 185, 36, 441, 105, 210, 279, 138, 0, -210, -141, -194, 195, -159, -182, 421, 97, 3, -42, -220, -157, -422, -116, -224, -289, -192, 167, 50, 112, 199, 106, 133, -187, -103, -226, -151, 160, 73, 321, 155, -9, 109, -108, 47, -301, -167, 28, 76, -53, -74, 270, 67, -48, -340, -181, -238, -6, 33, -556, 34, 262, -51, 48, 3, -113, -60, -389, -222, -194, -51, 93, 469, 329, 79, -33, 96, -32, -102, -105, -281, -61, -14, 173, 350, 298, 215, 203, 17, -176, -374, -152, -263, -15, -17, 102, 330, 244, 293, 18, -46, -217, -56, -83, -141, -36, 34, 244, 131, 295, 23, -76, -157, -100, -217, -214, -89, -4, -75, 140, 40, 28, -46, -167, -100, -430, 60, 67, 27, 215, 41, 112, -62, -141, -236, 44, -18, -142, -89, 294]
3804B94M9l03J79M2n03R0J74k03K65J91k82k2K94j65J17j95j89m0J95n9j46J48
3826f9J11j16K58j99J54k76j57K21m5O7J14p3K37j42p2L7o8J47j94j89J66P6K27
3849B15l5k49P6J93n9k85K4m7J18no8K38k8L8J20l22O2j92k40K83J49j52p8L90
3873A46k78M41l45N9j46J42k98J8K53j55L11J8k45L38l47j06J9j78K91J95r8J37
3895A72j55j9l0o6R1l05L37ok10J21M21M3k08lk82Q2N1k30k83K17N5L03j36J61
3919A21P6o7n0k24K4j09n5J61L21r6K12n4m30J76q7j89J04M9J19p5L09M4p4m8
3943A58l46j85L68j98j05M67k06L1L9J58Om18p1K43j86l4J00j15L35Q3k39L73
3965B58m8k61l5m4Qj40J37Q6L65k06P8j07k90p4J14J36l9J52l95M49n4K81k69
$$ y = [294, 343, 40, 219, 261, -242, -152, 22, -181, 84, 275, -7, -29, 265, 100, 217, 22, -167, -207, -12, -71, -217, -69, 42, -74, 184, -15, 139, -137, -294, -73, -118, -51, 63, -10, 227, 85, 13, 50, -18, 129, -65, -254, -88, -12, 215, 180, -69, 7, 200, 141, -144, -120, -167, -49, -54, -122, 116, 88, 126, 246, -76, -14, -206, -446, -163, -14, -166, -244, 146, -132, 309, -36, 23, -123, 19, -279, -261, -8, -163, 148, 166, -79, 259, -88, -194, -175, -353, -62, 133, 35, 172, 17, -2, -32, -98, -7, -312, 25, 19, -191, -70, 351, 394, 186, 183, -99, -17, 34, -196, -479, -262, -207, 96, -40, 121, 197, 130, 80, -144, -120, -229, -284, -123, 198, 102, 314, 260, -170, 6, -81, -270, -166, -117, 2, -73, 236, 280, 206, 158, -188, -373, -5, -203, -308, 159, -47, -16, 23, 181, 187, -231, -302, -59, -245, -279, -179, -294, 41, 124, -115, 258, 210, -51, -86, -130, -122, -262, -125, -39, 326, 120, 198, 91, -199, -273, -159, -23, -62, 90, -305, 144, 90, 371, 102]
3988A02Pj16j7n2L3j95K29J86q2J01k01j58J52j30n6L35k81J95O5K6J42n4m59
4011b28P7P1j1k80K84j53L23J24j58J16l07K34N6n2J3lk65M15l08L59o7l29K65
4034A76k32N4k3J76q3j2N7j02J46j20k47L57p2q1j69J82J70n5j50j76M26k88k73
4057c39K97o8o8J72j51R7J58K34k83J30l39Q6K7j72R1J86j01M5M49m72M7j15J3
4080g6o4j77J13J03K42K00p0k05J92k80o3J74j88p2j41N48k60P0J94k63P6Nk27
4103a69K71j61m1j24M91j85J84r3j51K95m79%K36k79M26j8l34L97k46k13K35J50
4125A92q4j06m04N82j87M40j54NkMk35n1M3Ol38K49K13j76K37j79j13R5j21J16
4149C2jk0j11M4K06l70J07K4K45k67j9J22R7l62M2L19J29l44J03j13J4N3m8lM2
$$ y = [102, 109, -7, -24, -76, -43, -238, -9, 177, 95, 196, -5, -163, -11, -141, -197, 138, -143, 52, 117, 143, 285, 231, -228, -151, -80, -91, -371, -87, -240, 83, 207, 49, 165, -142, 92, 148, 96, 109, 106, -159, 256, -52, 307, 240, -89, 176, -56, -2, -25, 151, 68, 56, 113, 11, 157, 37, -210, 147, 75, -6, -175, 7, 177, 122, -28, -204, 222, -66, -339, -42, -110, -178, -6, -157, -60, 98, 332, 49, 179, -160, -74, -47, -219, -128, 58, -43, 2, 451, -21, 26, -89, -76, -140, -317, -204, -101, 141, 341, 271, 66, 258, -22, -85, 89, -99, -171, -312, 236, -24, 46, 240, -23, 53, 58, -169, 102, -59, -100, -224, 267, 82, 266, 173, 22, 317, -162, -162, 74, -205, 221, 203, -131, 266, 20, -193, 42, 192, 108, 2, -402, 180, -7, 433, 279, 284, 282, 286, 51, 0, 43, 49, -289, -40, 173, -3, 234, 55, -58, 37, -84, 32, 31, 11, -100, -56, 150, -220, -113, -89, 156, -111, -130, -8, 89, -273, -231, 88, 217, -127, -24, -137, -123, -70, -118, -121, -79]
4174g9K59r7Oj40K58m02J3J65l32K43j50K84nJ83k7r8j35K85k55k30L47k11K63
4197A45k96N03l69J12p2J96k62k26K43L3K26j00rj10O0P7k73k2m6j50R2K53R1
4220I6k81M12j33j97l9P7j67K76R5k79o9J71P4J0Q4M4k75k53N57m36J98j37o4
4243b36L12J91k74O5q5M7j68N37l73j4J90j35K6l4j95L16q5j47j73k0NJ32J16
4266bK69j1j31k45J63j57J47m23M51l7l11K21N1rl6J32m9j4N3J82j46j84J66r8
4290a8LK8J40j21Q4j95p6O8o2J79K82k80J03q3nP6j76k18p0L45J37o2j63K33k7
4315A22k54J33l3Q8K28l24l2K2K35m65L68K1J81o8l35L68l34J49K04l61k7R6M8
4338C0n3M1l51M48l23J73J5J27j85M6j78L21k53Q0N7m1J40l26K43j1J92n60M56
$$ y = [-79, 180, 83, 89, -51, 207, -195, -182, -17, -349, -106, -256, 28, 23, 206, 179, 81, -54, 231, -24, -254, 93, -118, 145, -151, 352, -17, 95, 23, 219, -43, -269, -26, 7, 233, 133, 124, 14, 74, 151, -122, -144, -190, -340, -248, 5, 96, -185, 227, 94, -103, -142, -65, -232, 44, 139, -140, -209, -38, 36, 46, 130, 174, -101, -354, 203, -233, -35, -172, -236, 76, 267, -7, 58, -27, 20, -148, 389, 16, 2, 192, 57, 83, 49, -146, 170, 85, -62, -235, -255, -250, -118, -2, 267, 256, 125, -120, 43, -114, 33, -390, 61, 24, -287, -66, -15, -24, -60, 72, 23, 9, 62, 244, 98, -86, 80, -18, -15, 13, 153, 32, 116, -79, -155, -87, -149, 30, 312, 32, 135, 52, 47, 123, -53, -271, -341, 4, 141, 79, -84, 149, 122, -132, 1, -32, 56, 284, -40, -72, -50, 185, -280, 88, 109, 290, 222, -113, 255, -79, 70, 274, -87, -114, -18, 30, -23, 18, -333, 115, -208, -35, -20, 107, -78, -32, -210, 111, -142, -62, -5, -46, 94, -232, 11, 0, 192, -368, 88]
4361H8O4j83J46q0l51L3J36L72k40K29j44N1q6%J89l04j92J19r2L29k34L71m27
4384b06K22k4p0m3K73j26j29n2L00j62O7k85L00j35m8LK46j23j09J71J9qn46N14
4408D9m06O3M63k87N2J91j57K12j86L7l16M53j81j19J58j01P6PK5l9n0r0k69K92
4432a23R1k37M02r4J24j63J54j79o4Pj23J3K43o3j35K91l80K60p6J87j54J4j95
4455b00M14j33j89K57m7j2Oj05r9J98j91K59k41k1L05j69M3k84L14m0J24k14j4
4478c9j14J45mK25l55M81k71l05J17m7J2N9J01N3j49N1K19r7j50k4j54L15l17
4501b48J37m10N33jJ08O8q8k76K95r8Nm5Q1J0l0K42k89J73k9k79J90j81L20l03
4525a15P1M36l33J39J3l79J06J86j63O8j72Q7Q4J13L0j19m6j75J42n1j10N1R5
$$ y = [88, 152, -31, 115, 35, -316, -283, -147, 225, -15, 214, 70, 121, 35, 35, 224, -80, -272, -153, -245, 84, -150, 221, -206, 16, -8, -78, -121, 152, 26, -103, -155, 145, -17, 50, -235, 65, -70, -118, -115, 131, 8, -101, 70, 89, 81, -465, 49, -357, -294, 169, -118, -66, 125, -32, 180, -6, 31, -285, 168, -13, -132, 26, -75, 1, 8, 33, -6, -56, -146, -415, -123, -32, -269, 133, 39, 163, 0, 154, -25, -89, -82, -205, -192, 51, -12, -147, 144, -236, 24, -52, 135, -19, -5, -200, 214, 81, -108, 149, 102, 90, 96, -9, -108, 90, -101, 158, -83, -104, 201, 32, 75, -209, 105, 65, 189, -25, -39, -153, -8, -12, 213, -142, 339, 68, -237, -120, -167, -155, -96, 5, 58, -91, -40, 179, 82, -68, -92, -246, 69, -248, -111, -521, 12, 11, 119, 187, 99, -177, 118, 20, 25, -20, 61, 71, 41, 283, -6, 167, 138, -141, 49, -132, 188, -115, -44, 392, 59, 198, 211, -168, -62, 124, -39, 29, -143, -56, 28, 141, 171, 52, 6, -169, -27, -78, -188, -137, -42]
4548d2M6K1L41m02J35l94K08q7P2J65R8n3l07J28J55J41j3m95J98L38m51J6K25
4571D3K39l3k36J71k30n5R2j35j15j8K67J60j87K84k64L40l40j88J68J6k6L3k6
4594d0O7r6J09j96J87Nn2m7K2j6J11R3L1j1j6j88j20J71l48J02J24J03L4N8J52
4619B39mj94P3l85L70k32n1Q5J77j01L11k59J13J8j41l37K74p9m6J43m3j2J54
4642G3N9k01K81m05rj54J96J05O7J34J34j74k43K31j39J30k79j32K13J30K12R9
4664C28m5o5k49k45K04l07L32K31r7j1K20j52k45R6J93k38l1k14K18J70J01O0
4686B54j39Jj07K01k45K4O8l57M30J37j74Q6n6j30L2j35l4j57Q8J39L8N4O4J39
4710B21l4j09l49J61K48o0m42N04l05K78j89M9R5k00op3m1J51J02l40N57m0j99
$$ y = [-42, 4, 25, 366, -36, 99, -295, -87, -174, -102, 63, 161, 108, -199, -71, 84, 225, 212, -283, -85, 253, -198, -182, 43, 282, 249, 13, 184, -46, -101, -9, -144, -259, -277, -10, 150, -37, 247, -17, 323, -17, -205, -37, -21, -47, -14, -40, 27, -69, 40, -156, 31, 36, -16, -63, -41, -57, 54, 147, 178, 167, 151, -37, -157, 14, -334, -232, -108, -5, 29, 87, 239, 235, 41, 114, -271, 99, -133, -184, -99, 78, -23, 288, 29, 142, 160, 19, -318, -44, -123, -169, -26, -69, -81, 73, 132, -69, 212, -193, -202, -356, -160, -55, 12, 146, 280, 106, -137, 94, -45, 85, -194, -326, -113, 17, 229, 328, 283, 218, -31, -276, -72, -379, -47, 184, 87, 76, 296, 144, -101, -5, 188, -50, -81, -295, -77, 93, 194, 254, 115, 116, 9, 210, -35, -11, 57, -300, 130, 267, 93, 179, 123, -7, 25, -110, -144, -301, -213, -74, -36, 18, 82, 221, 187, 78, -271, -110, 138, 78, -364, 140, -165, 113, -76, -27, 68, -132, -138, -211, -252, -101, 1, -339, 218, 178, -21]
4733b1J28l2k20j46J07J25l7j42N17k24J76j50q7o2k12M2Q2J73p8J95j68J73j55
4756a6J92k56J36j70N1Or8L76M7j31J13k49j02J09k7o0l1L86l33J74N1Rk12J09
4780G4l23O9J92p2J82j42K9K14j90L54l96j46J01j71N4r3M16J43J68m54J75k36
4802e2J71k79J15l44M37M5l87L13R1j30j8K2j73k91K90L15j90Q4L8L2J56O5k89
4825B1k97K35k80L04O3q6J44K66j06k19L35j78l28po8j97M75Nj94M88j61j61r9
4848d5k2l6j77J27K83K9j61K62j54r3j98Q1L23k90j18r3L94K21j50K7l35j66K77
4871a4P2k37M0QJ44J61k43J43r6L7j40P5k92J07J11K16J87q1K8r6k70J15l00J
4895c24R1p6K62K29k66K30J79j20k43R1k36M0J04R2OJ69j00n7J5p3k89K82k05
$$ y = [-21, 107, 75, -145, -291, -184, -59, -96, -238, 279, 55, 231, 81, -6, -68, -280, -238, -156, 17, -61, 134, -34, 139, -16, 176, -80, 56, -114, -63, -57, -155, 221, 268, 137, 250, 1, -101, 8, -19, -79, -110, 276, -57, 117, 168, 177, -35, 74, -249, -180, 12, -60, 122, -20, 9, 223, 33, 387, -9, -155, -54, -225, -171, -264, 152, 295, 463, 9, 184, -52, 119, -160, -45, -389, 48, 93, -294, 19, 110, -20, -38, -16, -189, -480, -190, 125, -65, 19, 57, 89, 245, 310, 21, -276, -41, -321, -17, 46, -40, 104, 370, 264, 45, 380, 202, -126, -133, -201, -398, 77, 82, -112, 376, 215, 54, -45, -67, -103, -280, -153, 130, 159, -2, 260, 106, 13, -185, -104, 219, -71, -189, -282, 112, 333, 183, 210, -125, -291, -14, 58, -179, -139, -131, 13, 174, -69, 74, -22, 15, -125, -50, -342, -235, -124, 92, 279, 198, 226, 130, -140, -25, -325, -324, -233, -309, -47, 182, -84, 146, 325, 205, -38, 53, -183, -143, -39, 53, 59, 228, 128, 71, 86, 13, -276, 6, -199]
4918a99j6L25n5J14j10m7J0k22O0o2R2j70P3P2K53j17J30K09m60K07k34l11L41
4941a17J21J56k10L60L1l20L61l83j09l53L35O0q3M29k16K00R7k61K2k84l8K32
4963C0l3q6N0J4L23qjl03P0j83r7J81k3J18k22L07O6k41J06j15k2r1M36m87Q0
4988a31M4J7L3R8J39k82j8o2J38j25n2P4J52J54J18j43K6k03J04j14q6m6J79K92
5012C06k06K4k2j01k4l6r7J18K4J45k25J6K67j80j37K18l19j5J69o9r4M01j93
5035c0J60n9N7m17L76P7l03n4K26mJ96j69J86k6k48J05k81O0j07K79R8k28J76
5058G0K37L2j22n03J10K55j84J13l3P7Q0J6p6P4m11K34k42J01km1K14k12J95R8
5082H0r3J32l33J44K74n72L97j77J76J00k9m6Op1l29q1N43K32l11j57J11J92k01
$$ y = [-199, -215, 110, 55, 169, 59, 12, 22, -200, -140, -202, -110, -280, -207, -135, 118, 1, 131, 340, -120, 87, -147, -458, -117, 4, 160, -50, 310, 341, 21, 382, -1, -110, -463, -128, -68, -151, 278, 62, 262, 359, 98, 120, -164, -202, 30, -3, -89, -39, -25, 298, 290, 289, -14, 56, -127, -224, -43, -66, 52, -170, 137, 203, -38, 68, -47, -69, -160, 276, -211, -131, -87, -70, -37, 61, 200, -82, -100, -162, -24, -149, -201, -127, 25, 179, 297, 154, 180, -23, 81, -33, -119, -165, 14, 306, 100, 124, 102, 1, -23, -59, -156, -38, -14, 131, -94, -78, 189, 9, -128, 90, -229, -244, -75, -144, -238, 163, -30, 130, 71, 128, -289, 87, 164, -139, -193, 33, 29, 225, 56, 242, 216, -32, 73, -208, -148, -255, 24, 122, -106, 70, 307, 339, 217, -286, -176, 79, -105, 8, -25, 52, 132, 148, 72, 146, -265, -31, -273, -172, -174, -215, -1, -213, -18, 80, -13, 119, -214, -70, 204, -368, 29, -148, 28, 128, 99, 53, 59, -12, -341, -422, 121, 353, 42, -115, -4, 188, -13]
5105a3L18l32k45L39l00L04%o3J8J11J21k88J14j18k23J75N7J16j66K55J19k87
5127A2J10p2n0k87K39P9j12K46l1J5j42k46N8J11j39jr7J86K68j09J54j32K45
5150C05k27j33R4k9k01J43J63j37M06k82M4%o0j20Ok70%J79j2J45J4L2k05K36
5174I1k46J23j25j94J48K0M28L0k21k06K49l1n8k25K1K51j68L06J07N6j63M4j57
5197H0m5m43J77L17N0J08j2J76k95ON0l54K67M5j31j38J70L39k19j87J36j06k07
5220b16k28R7K97j82J53K70q8j04J18J60m11p7j41J68j22K02J98K77r9k45P3k12
5242a12j80R7K1J87P4q4J97O7k6k4l56J5lP3k1J33O2M0J01l93K17Jk88J17j70
5267b55Q5K75J13j57J22l5J11l14n7nj34J43J54l7J74l3K12j36n55N56m37J62
$$ y = [-13, 305, -27, -272, 67, -233, 71, 71, 8, 26, 137, 258, -30, 84, -34, -257, -82, -25, 91, -75, 180, 299, 12, 122, 50, 0, -287, -48, 31, -81, 165, 134, 149, 7, -239, -181, -70, -209, -210, -307, -121, 147, 38, 192, 60, 305, 78, -55, 39, 10, -191, -48, 115, -22, 384, 102, 146, 146, 86, -34, -28, -298, -298, -119, -131, 14, 28, 60, -145, 91, -155, -32, -157, -351, -203, -183, 245, 275, 54, -152, 97, 66, 8, -217, -196, 55, -113, 193, 300, 356, 193, 237, 80, 35, -408, -231, 86, 136, 244, 232, 408, 113, 119, 169, -185, 82, 127, -4, -142, 28, 367, 148, -39, 97, -9, -216, -444, -347, -50, -232, -79, 191, 103, -1, 117, 277, -134, -211, -352, -184, -306, -104, 94, 371, 272, 27, 100, -112, -292, -195, -174, 13, 87, 3, 200, 267, 241, 217, -139, -124, -127, -54, -75, 58, 120, 160, 261, -132, 85, 86, -202, -85, -255, -170, 105, 218, 61, 183, 148, 259, -55, -112, -117, -251, -108, 46, 9, 183, 150, 362, 226, -329, 227, -210, -48]
5289d8j00r2J77J14K40j18j87j49K29j02R5j83L01N9j30Q3J12k36M7l5n1nk79
5312b58J23PQ1N2J89R3j10j17m81L50R3k01N2J80Q5M0l0L1k38P3rj24q4n4L46
5337H9R3k21M76j38n14L83j08k08J97k12J37J03j82J12J72q4k38N2N0j34j59J80
5359a54L0J75J84l73R1K10L0n23K20L1m7J90L0K11j98k9K00n61Q7J05j38L51j52
5382c0k9N6q2Q8J36m42r8K99J62l2j10J36m5M9N6k92J06N5j38Q1n5K51m3J61m
5407B36j96o7m0m99L18J04L1k7M5j02K05J81K2l5k39j63j12J02K74k97K46K10
5429A97J02j81j8Nj96N1k02M72j72LJ62k7k3j05k0m17L23n6J87j92L87l43K70
5452B07n0j11J74m10m3j34K43Kj30M55Kj62J52m6k69l1mj58M40k7J95k43j99J05
$$ y = [-48, -148, -240, -63, 51, 291, 173, -14, -163, 66, -36, 59, -124, 177, 236, 106, 189, 301, 65, 112, 77, 26, 21, -258, -135, -128, -47, 5, 194, 287, 177, 60, -421, -71, 22, -179, -127, 53, 138, 178, 148, 179, -59, 14, 5, -119, -203, -257, 89, 182, -39, 437, 299, -215, 168, 60, -148, 49, -163, -26, 77, -105, 7, 179, 95, -143, -91, -41, -175, -334, -154, -124, 51, 235, -138, -47, 163, 193, -330, -110, -79, -126, 64, 94, 305, 107, 78, 278, -283, -196, -91, -229, 122, -30, -59, -3, -85, 3, 139, -303, -401, -102, 60, 28, -82, 54, 9, 58, 114, -178, -72, -17, -155, -74, -129, 122, 79, 240, 236, 40, -27, -67, -566, -248, -144, -113, -140, -95, -197, 8, 189, 211, 176, -63, -226, -338, -236, 38, -259, -13, 197, 299, 118, 100, 105, -91, -40, -242, 230, 58, 61, 223, 196, 173, 68, 48, -369, -46, -102, 85, -107, 280, -63, 207, 157, 46, 220, -190, -233, -367, -124, -122, -252, 203, 205, 43, 195, 149, -120, -151, -155, -313, 127, 100, 295, 52, -147, -42]
5476d2J67j73Oj22m7J53J58n6M7KK57k98P0j09p8j9K14J34k68J78j32J42k19o4
5500i9q0L74k50LJ12kM4j08j18K77m5j6k36J78j51p8L48J8l1l2m5j96K82k28J2
5525f7j91m6N74N2n2k05o6R1J30l84p4J62j02K7K55k5M2j14O2J0J04k80Q3j72
5549a86J74R3J91j67Jj17L5k33J6j08o5J59J50J11rL59n15L81k92j88N7R9n0k1
5573a25K52J62j35l0L3l68K7J25j15M24j48j13K99m8k38P4J20j63k64K84k75L54
5595A32Q3l84L34Jj36M4o5k62L67k4j58J39J07j01j63N7L44p2l62J66P4K4j04
5618D1j45K86l1k22K99j83j34m5m1K98Q3k91K03o4l7L9j05L6j48M94l94N6J11
5641A06j94J93P6K7j31j35o1J96j74r0K65j28N3J42k63k63L91j69l4K70l49K91
$$ y = [-42, 125, -48, -42, -164, -211, -58, 100, 44, 91, 93, 350, 52, 122, 13, -65, -84, 130, 264, -4, 174, 42, 184, -35, -99, -179, 195, -55, -52, 60, 58, 102, -6, -124, 153, 108, 92, -144, 34, -117, -195, 153, 171, 140, 108, 63, -133, 149, -79, -67, -258, -304, 270, 322, 270, 65, -1, 90, 220, -164, -238, -76, -178, -151, 104, 79, 121, 7, 69, 79, 183, -97, -14, -186, -12, 81, 272, 105, 106, -11, 24, -209, -193, -301, -366, -207, -57, 54, 45, 404, -111, 270, -22, -210, -153, -54, -104, -125, 127, 289, 154, 124, 157, -211, -184, -59, -174, 250, 102, -11, 288, 240, 2, 76, 196, 33, -231, 53, -222, 132, 215, -169, 165, 166, 30, 74, 9, -253, 114, 90, -68, 71, 178, 77, -86, -29, 315, 243, -119, 47, 121, 145, 41, -104, 182, 151, -71, 228, 45, -89, -134, -175, 123, 206, -85, 118, 54, 17, 56, -49, -13, -161, 333, -61, -5, 106, -88, 105, 181, 208, 77, -58, -119, 77, -97, -187, 78, -50, 3, 145, -118, -381, 10, -159, -193, 77, -272, 19]
5663A9J97l08J05K01l86K5j57K31k4j69L85n7JL14j22l66R8J3j87J25P4o1Q1N6
5687H8J15J00l18J46l90lm7K82p2J29J70J07N1j91l66K50k55j06M19l57L87Lj01
5710D1K09l8m56L57k59O6j96J41N3M71k80L3k69J68jm30L59m6J00N8P4k26K95
5733B24L6l29J28j63J37%q8r3N08k49K9J00j74K47k19l60K54q4o6K16R6J15j27
5756A38k9o2R4k13K3j5rJ14N6J09k53mJ45p8M8k81R6J00J41l4n5j6J70J29m08
5781i4p0J29l17K04J61J12k8k10L91k31M7n7k20j00K52j45J10o3L92q4j26j24
5803g1j4j70Q7L8J42O5k13K88p9K67l12Kj83j36J96j63K09K10N6J08q5k45j11
5826a14J14k53J14J57j98J55J81j3J59k36J2j43j99K06k15J65K45J83L2n2r3j60
$$ y = [19, 216, -92, 13, 214, -172, -147, -304, -73, -97, -266, 119, 62, 63, 377, 255, -111, -13, 0, -187, -62, 12, -49, 32, 88, 203, 303, -15, 131, -259, -262, -309, -27, -99, 30, 200, 307, 358, 167, -199, 51, -204, -310, 109, -248, 139, 142, 41, 250, 212, -244, 113, -146, -80, -276, -135, -82, 389, 109, 142, -127, 41, 40, -390, -31, -77, 23, 81, 155, -71, 224, 260, -69, 59, -104, 33, 33, -55, -148, 360, 111, 140, 240, 66, 313, 94, -266, -12, -96, -162, 54, 150, 265, 138, 109, 47, 141, -72, -49, -64, -73, 41, 97, 206, -47, -51, 94, 16, 64, -217, -121, -21, 120, 86, 31, 15, 185, 314, -94, -164, -35, -352, -148, 13, 125, 97, -113, 278, 47, 94, 37, -183, -283, -31, -176, -66, -129, 263, 179, 53, -71, -85, -255, -168, -130, 12, 77, -136, 152, 73, 340, 28, 30, -153, -289, -93, -256, -47, 163, 219, 327, 242, -3, -114, 0, -253, -139, 18, -180, -25, 156, 143, 302, 66, 78, -65, -264, -58, -273, -108, 137, 320, 352, 300, 207, 47]
5848D7j22j55j3j1k4O97l87L40n49J71k8l2J69m35J47Q0M1K58R7J41l74p1K24
5871B11l93J86j14j35K04J78p1r2JK44k17J09m05K39k01k2K18L46r9j49j5J51
5893A74l71J53k01k55M92j63K04k6J56j25Q2Q8k94RJ00j13j93K96N7L47l7k56
5915A24r2k74j49K73o0J50M5p3M31j2l23L03l64k17J82j72K17L3j16L46r4J31
5937B89J7l29k44L18r5m5m3J67R2J03l7l3l33K22k63k9k15O63j00Q3P0k29M4l46
5961b73K65j63q3J50J38n2J7K13q4l4p3k22K4M9k3J5j25K77o7L7l6M63l82m34
5985d03J27Q6Q5J45p1J69j00J18Q1k72Q8k58j11K68j72M45j2j20O6m52J57n6j89
6008c81K30P2o0K54K00k09%m8K16k52k10j62J59N1J83L7R7Ro3j4m2j8k38J34k1
$$ y = [47, -75, -230, -243, -254, -278, 419, 32, 372, -177, -6, -34, -66, 103, -332, -185, -105, -64, 194, 291, 432, 58, -13, 211, -182, 4, -110, -245, -41, 137, 66, -26, -25, 219, 2, 111, -294, -55, -256, -278, -60, 286, 187, 38, 23, 174, -197, -44, -245, -500, -8, -171, 33, 7, 163, 38, 120, 208, -86, -77, 23, -90, -283, 13, 70, 417, 380, 124, 32, -242, -391, -118, -178, -28, 17, -56, 375, 363, 40, 343, -21, -238, -56, -228, -11, 22, -94, 252, 158, 289, 306, -23, -267, 51, -44, -89, -132, 35, 127, 230, 193, 160, -173, 49, -214, -243, -458, 205, 105, 188, 258, 29, 73, -273, -8, -171, -254, -104, 34, -18, -1, 212, 128, 94, 21, -201, -177, -128, -151, -136, -261, 16, -51, -14, -50, 413, 31, -403, -276, -190, -105, 40, -31, 138, 38, 156, 237, -35, 53, -205, -316, -48, -220, 225, 213, 93, 159, -293, -136, -192, -381, -151, -79, -139, 115, 315, 106, 106, 58, 274, 22, -188, -350, -191, -140, 43, 80, 177, 186, 123, 109, 67, 49, -189, -55, -76]
6033g6rJ8M23j25J75p04L02o0j84O5K33J0J70j11J8J28l46L10k70O4l19L3J86
6056f9R7N7q6K96pq0p8l6q7j54PK35l5L15p8J5j49k35j56J40J84k26L8J42N0J80
6082B80r6N1l06n2L33m59K29J40j47J29K60p2m13N6R1l83J93j3J85j07K71K76
6104D46l28J45l81K8p9J31k13m4N43k36L76l8m1k44n9l85J45P9J66j66J70K4m4
6127eK3op9k26K02R4RJ73j84J3K26p9j86j39j27K16l55J87L90j89K91k16J06M5
6151A84J48m59M4pk68M26M6j44L23l35k1q5N7k50J54J18k04K95L4J2o5L77k56
6174A24Kkk53O0J56l15P05l39K6j14j67k0j30p3P1K92r6rJ27K35J19k30l01J61
6198B9k63L99m17K95Q4o2m9L34m9k4k23m27J45J18%K27j05q2K97j15rj06j52q0
$$ y = [-76, -85, -67, 356, 231, 406, -298, 4, -56, -240, -175, 58, 68, 238, 127, 145, 273, -73, 237, -33, 31, -288, -255, -69, 28, 85, -1, 295, 288, 208, 130, 94, 7, -147, -140, 95, 60, 375, 297, 312, 163, -72, -228, -88, 96, -130, -92, 50, 100, 280, 184, 235, -71, -123, 210, -249, -20, 120, -27, 102, 362, 290, -123, -67, 24, -359, -166, -179, 6, -101, 170, 446, 118, 263, -118, -90, -169, -38, -251, -295, 248, 12, 388, 350, 309, 65, 6, -379, -234, -155, 11, -155, 15, 39, -5, 18, 12, -67, -293, -91, 3, 12, 185, 1, 14, 240, 161, -25, -164, -291, -75, -430, -243, 147, -42, 249, 33, 139, 184, 332, -127, -83, -90, -358, 68, 114, -30, 293, -42, -63, -148, -91, -341, -187, -69, -273, 22, 56, 68, 3, 380, 124, 126, 124, -129, -69, 87, -228, 477, 138, 164, 50, -117, -137, -267, -340, -269, 23, -73, -82, 45, 280, 399, 169, -132, 29, -234, 165, -252, 43, 127, 65, 16, 350, 301, 277, 54, -373, -228, -110, -110, 117, 12, -70, 227, 112, 103, -3, -155, -235]
6222b35l1oL92k3J0J28j42q9O3q6k18l0M6K29j34M31n8j08k35M46k64k18K24l34
6246b42J13K21j95K27J79K2j20j79l26K88kj24K52j39K08n8l38L27k78l10L13
6267a61J1M0M24j33q6n0j30k0N8k52M99k56j17P7J50K07k00J15j56j16K83m20
6289b33K66J8n13O89k21K65q4k41m8P0k79J08J63M7j74L90j10r3J58J48k32l84
6311b90K98k50j47K03L63l10J53L17k46J80k86l8l9M1J34N3J45l77J75j07j77
6332b05L62q1K46p02K65O5K35J99n21L58L2l54J28M2m53M59M4N1l4k40J43NK0
6355F4j90K68j80l85M15J26OK7l9J3J64m63k99L85j89L18j38L76j4J14j51l73
6377a45J35l9l4j44J32L0K03o9K1J13j47k87k5J54l9K1J38K29k98J47L9l22K20
$$ y = [-235, -266, -272, 120, 97, 107, 235, 93, 4, 67, -19, -237, -267, -221, 8, -126, 305, 247, 139, -96, 350, 86, -132, 92, -242, -129, 92, -103, 124, 303, 325, 205, 26, -300, -12, -14, -138, 114, -25, 183, 125, -213, 114, -164, -474, -161, -150, -110, 314, 181, 95, 45, -85, -105, -47, -299, 200, -56, -173, -96, 54, 261, 61, 176, 20, -96, 187, -233, 33, 51, -462, 227, 6, 271, 187, -54, -102, -32, -311, -203, -40, 7, -167, 223, 113, 20, 178, 326, 94, -290, 8, -242, -389, -186, 177, -133, 20, 337, 91, 271, -15, -53, -92, -51, 83, 136, 281, -96, 79, -28, -205, 157, 76, 322, -380, -115, -50, 185, 384, -137, 221, 253, -101, 27, 69, -384, 75, 119, 170, 136, -104, 39, 44, 64, -126, 142, -38, -423, -8, 118, 124, 151, 112, 125, 289, -174, -473, -88, -277, 41, -97, 279, 265, 379, 228, -145, -10, -49, -83, -227, -95, -65, 138, 69, 90, 203, 56, -231, -256, -102, -141, -120, 18, 247, -51, 96, 135, -187, 33]
6400C3j25L4p9K52m2N1r8j31J82l4j14J51k8Q1l86L26k67N56n02R4J5K78l31K1
6424f3j21Q4o6L59r1J33j3j96K28m20J24p1J44r7J47k4l7j05M51l47j58O3r1J08
6448e9M3j49K06M34m04M8J94j87k84K26l18j06L10K15l07J14R6l79O53l43J27
6469A30O4m71J91L2MP4J10j51m0k2Q5j29J95k43K34j2O0K4j3l88M27L7j58j62
6493a22o8J57M3L9J58k93P2n8O7J12m62L3L48j03O2rJ01j7j65J35k43L5L84k48
6517d2N9O7Pp4K48n7m47p1N9K17j36J97K9l6O7Q9K1m56K38o2N0m7m4L2L60j42
6543A26q1m5m4M4k95L40j42J98j86K40N8j77K3L1j09J1o6j78J82j78N21l7N7m37
6567a44K76j57R6j33j60J83k45M04L11l61J17O3l34r0J59k98R6K18M8K19l4j94
$$ y = [33, -92, -58, -137, 115, 73, 124, 26, -105, 77, 43, -71, 80, 52, 133, -253, 73, -194, 362, -140, -46, -31, 247, -84, -63, -184, -100, -166, 193, 102, 235, 222, 26, 254, -166, -42, -113, 31, -66, 81, 57, 20, -85, 366, 19, -139, -76, -167, -59, -16, -165, 41, 475, 71, 119, 313, 126, -158, 68, -250, -356, -46, 169, -138, -24, 72, -307, 346, 3, 130, 194, -277, -86, -54, -50, 24, 134, -17, -57, -79, 6, -123, 72, -171, 63, 51, 111, 135, 122, -266, 161, 198, 40, -122, -190, -33, 10, 49, 207, -86, -14, -72, -5, 107, -355, -322, 26, -77, -15, -24, 77, 60, -105, 30, -213, -178, 206, -42, 17, 84, 91, 17, 265, 208, -239, -310, -251, -34, -170, 27, 56, 20, 87, 176, 197, -259, -21, -83, -33, -80, -124, -92, 268, 126, 45, 0, -44, 0, -295, 45, -97, 101, -85, 155, 213, 36, 59, 90, -19, -8, -74, -252, -70, -248, 273, 236, 293, -144, 132, -25, 71, -62, -222, -39, -284, 120, 431, 70, 187, 250, -84, -174, -15, -313, -217, 1, 49, 268, 234, 40]
6589D0J05q3m62L12L5m6r0L34jj53K62j80k13R4l28L54j32q7P18n33L71j22J59
6612C54k95q6p7j29O5L46j39L8r0o4M08k30k97Q3j85P1K31J44L8p6k84K29mk2
6636B9m10L75N1k29J56J91j40L1R1k30j8m7M1j79K84k65K17Q0j22o0M7N4K81l62
6660a34N0K7j5O3j58J36L13jj21j78j41q9Q5j07N51o12M11l8r1K26j7k05k23J86
6684h2MKR8L71m02K06o6k35R7P8j80P3J9n9K58p0j40J62K2j62q0O4j36K22J49
6709B13j47OJ11J09l67j75K67K2k15J94K93j96k97K67J19n0m7K7O1k47j11K8K76
6732A41j43J45k48M2L00l36M0Kj24K72k8j86L68K5k35j5K2q2q6r1K88o4rJ18o0
6757E6J79n98N13k32j06L00k99M76k92j19n2J38J16J74k62j09J28k12K02R3q2
$$ y = [40, 145, 62, -400, -88, -53, -99, -189, 145, 144, -9, 253, 73, -140, -46, -374, -20, -152, -239, 479, -54, 317, 195, 354, 59, -27, -104, -233, -168, 178, 39, 77, -13, -77, 331, 101, -196, -113, -298, -227, 4, 148, 186, 110, -174, 55, 51, 29, -381, -6, 45, -184, -28, 163, 23, 54, 145, -85, -103, -150, -109, -288, -4, -269, -52, 28, -94, -154, -107, -53, 228, -134, -84, -57, -72, -9, -167, -31, 282, 281, 160, -18, -159, -248, -163, -270, 281, -331, 80, 42, -49, 177, 160, -45, -268, -82, -78, -76, 22, 393, -9, 197, 131, -104, -7, 71, -109, -36, -17, -76, 182, 112, -28, 134, 156, -6, -86, -22, -158, 64, 213, 66, 72, 183, 292, -75, -250, 17, 39, -176, 18, 311, 115, -182, 85, 204, 154, 107, 134, 195, -52, -163, -135, 141, -2, 143, -105, -63, 237, -99, -59, -57, -181, 91, 63, -123, 245, 270, 35, 20, 42, -40, -126, -217, 71, 7, -2, 116, 56, 235, -363, 150, -82, -188, 112, -187, 289, -3, -122, -174, -36, 80, 254, -8, -117, 11, -201, 1, 94, 12]
6778A2M3Lk70O0J83j60Q4l9K52j40j22K23L2j15N6r2m2K20j83p2J22P1j60K17
6802A83q9k08O8P6j71n0j8M3L02p7k1j13K09j8m92K45L11k34j83K23J15j11J15
6825A05PJ37j45k13jJ30k09J96j78J35P8q5K56l44J66p3q2M8J09L4R1Qj81l6L8
6850ij5k6Q4j38J14j4K00j46j17m3q7L62J47m03J4R8k37K33K19q7n2J16j54J60
6874B19k96K7J12k68lM19l95O7N46m75k32o4L76J07J67p4j12M7l89K90j99K23
6896I3M6l66K05J3j0J14p5k30L6P2J38k57n8M06j02j47K15k29J62m4J1j48j73
6919c28L52j34K70k33R1J02j89J67l09J77R3m18J33M83k95k0L03q4l48K40l21
6940b68L70L4l98J41K10j90K4N7o9K5J64j62l62L59K08k1K33k04K8q9N6j2k71
$$ y = [12, 55, 58, -212, -152, 31, -129, -45, -84, 168, 28, -94, 129, 161, 46, 102, 10, -32, 188, 5, -67, 55, 126, -34, 183, 94, -114, -46, 30, -141, -191, -209, -166, 136, 59, 38, -75, 134, 116, -376, -131, 180, -54, -237, -14, 101, -10, 105, 112, 249, 104, -109, -110, 20, -189, 7, -171, -36, 42, -43, 213, -131, 35, -38, -120, -72, 37, 71, 162, 170, -11, -47, -9, -24, -50, 34, -104, 10, -4, 196, 50, -67, -110, -197, 165, 312, -91, -77, 21, -216, 17, 236, 149, 97, 213, 59, 219, -77, -50, 62, -206, -209, 210, -185, -118, 428, -47, -279, -343, 33, 140, 307, 233, 121, 168, -221, 69, -130, 93, 139, -227, -22, -9, -19, 95, 20, -210, -174, -102, 36, -221, -279, 127, 25, -122, 93, -136, 26, -18, -7, -155, -328, 24, -110, 160, -73, 18, 120, -69, 98, -211, -34, 59, -359, -226, 257, -38, -58, 245, 161, -187, 53, -268, 102, 136, -262, -121, 89, -101, -77, -20, -89, -64, 100, -62, -424, -65, 143, 122, 355, 151, 179, 90, 146, 134, -137]
6963a37l54J38L39P0j35K76K1K0j91qj59j25K35MOr6J15L8N5N1o5j53J5K77l08
6988g1L3J63K9m4k4r2K66k86J71k25K22j01j81J93k84L89j51P4K19j67j80m46
7010d93J42L03J15r7L2O2J63k25j72K26n5q0J10j97K23Qk34P0j7j1k0J4J76k44
7034b01L64J58m31K56p6j1J75j61m7o7o8q2J86q6J7N6q3J2J92m00K82J25l00K43
7058E3J09K27M1k62m25L98l74J64k6J1J88k3l8R4j17k15J45J8R9k66Q4L5J50q5
7082a5j6K39lk12l5j96O2j37J48K11n0L33k63M4j18N0K1J65j32j03J08k15J7K26
7106A29j36L6l2J60l48p1K08j50K67j04J92Nj14K8j9k23n6l4K55J96j95L82l20
7129E6j11QJ19k36R7k7L51l32J35qj39l0J05q4j87K38O4p5J48O7m7J00k34k96
$$ y = [-137, -491, -353, -14, 56, -79, 197, 218, 238, 47, 39, -120, -245, -10, -6, 0, -96, 19, 57, 112, 163, 98, -55, -40, 237, -71, -38, 125, 154, 110, 86, -6, 260, -26, 145, -80, 142, 41, -140, 53, -231, 158, 7, 81, 300, 133, -47, -493, -351, -48, 67, -30, 2, 64, 227, 2, -170, 56, 1, -79, 31, -166, 57, 65, -169, -99, -116, -127, -147, -133, 43, -201, 163, 321, -110, 146, 70, 59, 234, 73, 26, -41, -109, -191, -5, -91, -74, -18, -101, -89, 103, -297, -15, 110, -190, 53, 162, 389, 430, 168, -257, 141, -233, -69, -95, -84, 104, 81, 43, 137, 20, -195, -50, -32, 67, -199, -115, -80, 70, -15, -31, 208, 205, -7, -42, -238, -176, -313, -165, 46, -4, 329, 66, 110, -8, 42, 63, 228, 96, -7, 101, -114, -97, 129, -7, 29, -3, 157, -191, -262, -54, -204, 63, -41, 151, 156, 42, 70, 51, -172, -228, -262, -7, 189, -6, 376, 56, -55, -47, 72, -164, -67, -94, 257, -75, 60, 52, -87, -117, -12, -96, -283, -45, 19, -56, 92, 159, 112, 212, -22, -318]
7153c18N19n49J14J09p5L19L2k28J66j24p1L9j34J21r2J54j94M01l40L41l26j26
7175b62K54p9J08j98J98R5o0j53K01n4Ro5j47j06K81l24L49M0P5l59L02o1J35
7198A79n05K90k8j9J62k53J42LK44k43o2KJ35k50J58J83J61k01K6p6P0j91J23
7221E0j86j20R2J83k9j56K81J92Rl00M8j83j39K45K9k3J14j34k7L12l27K43K14
7244C88k60k52qQ0O8N4J16Q8j57k33m4P1J39q4k2j36K02J46l67K88j10J97k44
7267h0k0k45L51K83k26j45J51L98m54Q7k37r6J89J07k05j6o0L67L5m13K43o9P0
7290A5Q6k39J42J04Q7m8n9j64J92j51o2k86L62O9j3R1k92J81J49J6k76nP8m8m49
7315e20Q95j74J18l67N19p11K15o9P2l2J31R6m00L82J56m54P1J19r5k09K59j08
$$ y = [-318, 201, -348, -234, -125, -200, 119, 151, -77, 89, -35, -106, -67, -201, -80, -172, -18, -212, 189, -151, 190, -136, -262, -8, -87, 21, -177, 21, 116, 56, -97, 104, 50, 59, -6, -153, -259, 22, -302, 47, 87, 162, -197, 105, 44, 179, -326, -36, -64, -83, 79, -174, -32, -29, 215, -28, -90, -88, 47, -203, -45, 138, 299, 98, 124, 48, 118, -73, 50, -136, -256, -164, 19, -10, -166, 115, 307, 316, 16, 64, -119, -258, -13, 16, -7, 107, -27, -54, 258, -69, 174, 388, 128, -124, -132, -52, 16, 70, 186, 274, 117, -116, -160, -89, 50, -34, -56, -192, 10, 156, -211, 77, -33, 164, -80, -100, -345, 6, 289, 63, -82, 69, 467, 13, 100, -137, -233, -44, 63, -142, -158, -218, 149, 184, -229, 14, -55, 15, 101, -138, 4, 108, 195, 147, 88, -76, 116, -35, -97, -383, -21, 48, 35, 126, -166, 15, 164, 180, -96, -101, -23, -71, -520, 375, 201, 319, -48, 471, -240, -25, -94, -22, -54, 77, 173, -227, 155, 311, -143, -72, 47, -48, -257, 2, -106]
7337a06K29p0P8L0l38L67l77K54k20j00L29j22k4o1J97j00L21j36j84K25m26K35
7359AJ24m0j12j72J71M2J18l1Nj10k19J25J20k03%M31l34k18J72j97J49m9K39
7382A2K44j33k00K72j1m6k23J88j34O0l42M26K9j83j17K54j25R6j46j10J10M9
7404c0k03P5M66j82mj68L09rm47L21j70J11j35K64k31K01j96M7J78l51n0J34J34
7427F4j00QP5L6k78K67k03L08j76K62k94Kj8K35k4l01M12m64K43pj32RQ1Q0k72
7452a87L48m17L34M0Lql38K46j95J48J99L7k81J92j16j09j96L25p8j13m2M49k29
7475A2m6J82K0l64p9n9K51N3J42j40J91l99K21J48j91m2J89R0m13L92Ok18j66
7498b20K02K44l16pJ1J47QJ8j74r4R4J73J84j54j73O1R2j96R5j36P2M50m22K83
$$ y = [-106, 123, 53, 131, 161, -177, 190, -187, 67, -153, -253, 76, -46, -70, -131, 66, -34, 287, 151, -33, 192, -234, 1, 125, 85, -27, -199, -28, 14, 132, 101, 106, -4, -223, -98, 22, -181, -181, 250, -84, -302, -130, -327, -178, -227, 12, 256, 123, -77, 195, 184, 138, -85, 103, -31, 29, -313, 113, 142, -41, -158, 96, -29, 67, -79, -189, -79, -30, -233, -158, 308, 126, 122, -46, 263, 254, -193, 128, -42, 69, -66, 198, -33, 168, -28, 19, 197, -154, -204, -70, 64, -36, -28, 47, 83, -195, 72, -131, 177, 1, 263, -31, -29, -47, 188, 164, -137, 275, -189, 54, 47, -85, -76, 5, 85, -187, 161, -256, 78, 118, 121, 113, -225, 21, -174, -26, 173, 210, -71, 121, 5, -104, -300, 25, -53, -166, -208, 241, 12, -34, 148, 168, -196, -275, -334, -83, -30, 112, -28, 163, -236, -15, 133, -58, -100, 89, 179, -234, 158, 164, -54, -220, -18, 226, -90, -97, -86, 61, 69, 87, -87, -181, -87, 86, 270, 116, -57, 4, 96, -100, -5, -141, -69, 381, -41, 242]
7522B42j7M1%j16LJ33j73k22J5L6L9L6K4j07j2k26K21%P3rP4Ql20J15K98j58N5
7549E3k3J21k40M01l21k1P4p4K14k82o2K40L6k01j29M23j27K2j61k87L12J35q2
7572B1J8J7m9L7J42n8k61L10j20j55J74k17J84J01j55R1j5o4K9Q6n7k52j0K25
7596B2l41P78n22m5N2j97R6J35j23L08o2l12r0L73n5j50K88r2j37Pn5K20J75k32
7620D1J34jJ31m03J20K1M9k92r0J62J50k1j15K96k26J3j70K4K66l39N26k92N4
7643C8r3Q1K62k30k20K41k59J52J10j41K09k99K67k12J99l02J63o8L61k87j20
7664a48nL44k03j7R6j42k62M11k93J03j04L85m8j85M6L0j75J45J61j25J76j0j11
7687F9j25M78n08K55k6j64j39J24j45k0J04K1J46J64p9j22j64K97n0k49M80m22
$$ y = [242, 225, 266, 266, 150, 153, 286, 113, -109, -94, -58, -19, 17, 41, -66, -78, -304, -83, -83, -10, -19, 55, 63, -257, -142, 156, -2, 53, 30, 151, -89, 312, -9, -30, 44, -30, 184, -98, -160, 80, 116, -85, -214, 209, 82, 104, -57, -344, -32, 103, 21, 39, 56, 7, 44, 186, 128, -133, 177, 57, -98, 76, -141, 43, 144, -11, 80, 65, 1, 30, 116, 59, -193, -203, 22, -319, 459, -63, -108, -56, -253, -157, -22, -145, 163, 101, -211, -301, 72, 17, -133, 155, 63, -74, -67, -122, 98, 273, 41, 175, 174, 305, -98, 22, 43, 92, -200, -290, -128, 22, 1, -114, 182, -44, -31, -201, -177, 89, -250, 276, -16, 38, -55, 26, 288, 58, -162, 79, -180, -28, 82, -59, 150, -149, 118, -94, 105, -197, -34, -102, 259, -28, -148, -153, 191, -12, -29, 67, -75, -337, 74, -219, -116, -220, 165, 117, -68, -22, 8, -167, -22, 139, 14, 190, 180, 69, -56, 422, -86, 169, 143, -21, -160, -36, -181, -201, -97, -76, 70, 234, 155, 33, -131, 166, 116, -133, 347, -75]
7709g5M4J10Q7R6j26j62j40J18j12J13j51J95P2J44K21n11j8J9j57L45k96K36
7731E2J3j41J04J1j3ok23Q5k74J34K81k4j47J98n3J66r9k1p9k05K55j54K46r8
7755HJ06j49K53k48q7J72l62K73kJ32J3q3k63K89r9k7N0j40M13j20k11K0O15n80
7779b7J33K63m92P8L51k90k21m8J19J12j60J81j46K22K8J5N0l36J26K17J18l18
7801b5R0k07L05m59K23j0o1J22K7pL9j46K75j6n06K62R7m4p9K69k04K37k8m4k1
7826H9J21n4j52pJ85j72M9l1j15n5K51j48J04n9j32Q5M0R5J19l61N71k57k9l52
7850b15J48J72m1l2j53K23J7P9r9L2k08J85j90J35j65L05mj39l89K64q2J65j02
7873i4j05K26J09M1k24%k63K51J81j35O6k21J16k12L93j10qj9L07l68R5k47P1
$$ y = [-75, -31, 79, 166, 262, 136, -26, -166, -48, -160, -47, -198, -3, 69, 213, 434, -77, -95, -76, -233, 112, -184, 52, 65, -76, 28, 39, 26, 20, -203, -118, -392, -258, 23, -1, -148, 50, -3, 163, 64, 43, -36, -241, 14, -140, 106, 8, 114, -35, 218, -30, -117, 55, -307, -34, -36, 96, 109, 26, -237, 52, -47, -74, -24, -164, 249, 129, -82, -62, 553, -27, 106, 369, -123, -45, 306, 16, -205, -253, -134, -22, -182, -1, -147, 75, 103, 118, 168, -168, -42, 175, 293, -25, 65, -142, 163, -296, -73, -83, -144, -22, 5, -2, 37, -109, 166, 150, -356, -94, 3, -41, -120, 149, -55, 182, 154, 110, 89, 210, 156, 4, -3, 182, 10, 59, 28, -87, -142, 109, -39, 65, 6, -126, -41, -1, 94, 213, -148, 423, 166, 137, -215, -67, 105, 64, 32, -121, 102, 119, 198, 99, 131, -77, 108, -82, 53, -112, 193, 189, 50, -339, -75, -157, 8, -94, -199, 27, 136, 177, -47, -47, -310, -59, 122, -13, 53, -168, -52, -264, 129, 19, 11, -8, 299, -69, 26, -221, -150]
7896a50J27p4Q6J04p6k04J03K64k71J56M2M1L3p5k97o6L66J09k02o6P6j75J10
7919c9K69n50K30M2k17O9L41q1j04nM1k48K95k40L52k31l2K52o0%k24MK13l19
7943b42M05o6k54L94l55J86O4k7j3o5J23l07J65o3Q9L3p7L1p3K41P9l59j70K19
7967d2k88L08M4K56k97J2K3n7l0j78K67J68k8j50mJ0l9k4J01j91K77j55l6L85
7991C32l51j1j4R7l44M26m53K99J41l69K43PO8K2o2r3J80j46J0K46k83K33n2q9
8015C7r8J84q0n1O4lj49p7K47J5jJ19J1m35J25J63r6K27l44p3K20K34l08n5j7
8040a41L7J15k18L64j63O2K14k91m1loj20M33k60o9Q7J36J80l37J21l31L9J85
8063gj60M0J49q2M4J24J47j89m30L58M3J12j97J40j14J23r1J41K4k10q4L01l74
$$ y = [-150, -23, -97, -11, 93, 17, -187, -84, 180, -91, 65, 107, 148, 181, 106, -191, -257, 109, 218, 16, -50, 26, -149, -39, 230, -320, -90, -48, -265, -196, 145, 64, -40, -45, -4, -252, 43, -197, 155, -76, -108, 144, 84, 84, -140, -136, 77, -242, 163, 97, -157, 237, -118, 68, 132, 105, 92, 27, 150, -157, 8, -55, 34, 67, -10, 21, -52, 189, 268, -91, -261, -42, -330, -22, 22, 278, -19, -7, 16, -41, -71, -249, 18, 186, 158, 8, 4, 14, -25, -49, 52, -139, 138, -17, -53, 332, -19, -30, -44, 53, -291, 135, -318, -19, 122, -247, -4, 3, 71, 93, 31, -62, 118, -28, -18, 228, -55, 178, 126, 37, -61, 123, 43, -8, 56, 53, -96, -173, 74, 89, 88, 207, 218, -217, -92, 71, -25, 202, -142, -215, 5, 239, -69, -124, -141, -104, 11, -207, 157, -6, 56, 270, -21, -62, -65, -71, -191, 242, -18, -87, 0, 136, 316, -21, 100, -231, -192, -7, -167, -127, 22, -60, -16, 108, 255, 66, -364, -6, 37, 149, -48, 92, -22, 101, 10, 151, 175, -35, -119, 182, -192]
8086a92J23M0O6k47L16j32j12m7J89K64k07p7j05K11k39L2J92L17l30l4k67L21
8108H2p6j95K13m2k0J31k59K66j1j4j63K6K7L46l96K24n5k65N7O4J16o0p6Q8p2
8133f4M9j46j17L44j0K8J20m35K39k64R3OL11l02K36j05Jj53R6m0K24j71J32l1
8157D1l5j00J06K19j86J20j41J79j30o7jM8m1j0K93j49r0P5j29L9k0l35M96k57
8181g5m5J61j2k08M48m10RL46k35J50
$$ y = [-192, -69, -29, 37, -210, 106, -26, -138, -185, 4, 268, 61, -16, -121, 90, -149, -117, 75, 392, 62, 28, -239, 82, 6, -189, 24, -18, -38, 93, -166, 100, 89, 75, -88, -62, -35, 311, -85, 139, 84, -181, -124, -60, 56, -4, -80, 8, -64, -15, -161, -278, 66, 56, 84, 204, -231, 8, -256, -163, -157, 154, -148, 88, -17, -16, -169, -73, -113, 111, -60, 72, 41, 6, -94, 12, 231, 45, 165, 24, 203, 73, 6, 5, 53, 12, 2, 295, 146, 56, 131, 2, 41, 21, -314, 182, -75, -120, 41, 29, -179, 269, -141, -132, 214, -21, 129]
8191A29
$$ Imaginary data points
##PAGE= N=2
##DATA TABLE= (X++(I..I)), XYDATA
0@%%%%%%%%%%%%%%%%Lj1J6j6J6j6J9k7L2l5M3m8N2o1P1q1R4j08J17j29J49j69
38h9J88k09K33k58K85l17L51l89M30m74N23n74O30o95P68q48R37j038J151j278
58f73J429j610J825k085K413k841L422m263N601q058J4047n7461p8378Q1132N8490
73A2990k0128l3166N8546P4842o986p3012l2780Q415j3792m2426L006N0644L3720
86A9873m898J6747M2722k880p3714n4897K1183L1259l3734l9686M6359R4242K3974
99H6550n6233l3436K9211R773o0080n9311J6248N5476K0357m737K1084L4309n231
112E3980l8906k2501l525k3871l3174J3422N8393L2720j7552p611L7057K0661
124F9093n2531p2326o359M2718J1584k7016M822N7890M3362j8724m0505j1719
$$ y = [0, 0, 0, 0, 0, 0, 0, 0, 0, 0, 0, 0, 0, 0, 0, 0, 0, 3, -8, 8, -8, 8, -8, 11, -16, 16, -19, 24, -24, 28, -33, 38, -43, 51, -57, 60, -69, 80, -89, 99, -110, 123, -135, 150, -167, 184, -205, 225, -249, 274, -300, 330, -365, 403, -445, 492, -546, 605, -673, 756, -854, 971, -1114, 1299, -1542, 1880, -2383, 3218, -4840, 9207, -48254, -126632, -45500, 12990, -7138, -40304, 18242, 93084, 86098, 13086, -19694, -11279, -25071, -67497, -64491, -13847, 19873, 14975, 31722, 74444, 71564, -2150, -57047, -35864, -4605, -38339, -78025, -31666, 62576, 86550, 30317, -3119, 26092, 35865, -24215, -83526, -67278, -11802, 8555, 3818, 24902, 59211, 53980, 15074, -7427, -10952, -34823, -67997, -54575, 3818, 36538, 18986, 11375, 48432, 69093, 16562, -55764, -62123, -19405, -7821, -34837, -30015, 27875, 71237, 52513, 12008, 289]
136B89M6k3629k8222M968K8103J8246J0564K5370K2262j6418m2298j9008Q867
149a0860p865l2516m871M9063N0277r9k6064J300J8714j5264n0092l0229J6331
162d2175K7936P481N090K3077K2877l121k0504j6195j5082k3356j4427J5630K8908
175c861J1876L42J5909K5437m945m1879l4480K313J2617q643j1290K0595M2574
188B6565K0863j3438j7937m771p904k2651k0226K344J6150J4730J5681K0369J0457
201D0232j1751j9688r900o382j8866j8685R145L3385K4025r66l126J1445N388
214C4256k2718l5224j3946R612J0367K613R954K2898J7243j641j3090j2803j5137
227g616j7750q860P831J4604Q820J0475J8216J4043r952k6317j7160j373l002
$$ y = [289, 335, -23294, -51516, -46548, -18445, -199, 10365, 35735, 57997, 41579, -719, -19727, -10860, -18725, -51241, -56112, -7049, 43228, 43129, 17065, 18365, 37079, 21815, -28277, -58506, -42175, -14239, -6758, -1668, 21409, 44286, 41165, 20661, 4466, -10616, -33972, -48399, -32769, -3861, 8015, 8357, 24266, 49703, 44758, 2879, -31601, -29288, -16671, -25314, -36604, -16009, 26565, 47428, 33990, 16053, 11282, 3378, -19273, -39499, -37155, -21005, -6275, 9406, 29775, 40232, 28481, 8793, -1107, -7489, -26355, -45040, -35895, -2510, 21515, 20549, 17423, 28868, 34256, 11538, -23686, -37632, -28020, -17653, -15040, -5086, 17812, 35055, 33414, 20324, 7521, -7616, -25366, -34226, -26395, -11791, -2971, 7504, 25720, 39763, 29811, 3494, -13666, -15039, -18041]
240a8041j1745j365K2853K8129J0250o512m792j269j1498k2313j4580J704J0220
253a8959J0200J3056J6990R016n774j0921q783j1727j6917j0450Q487K0610J2989
266G817L492O939J0934j744k0587k2395q018K876L92J801J2465K0728J2458j432
280B5726p464q226j2308j5587q888L304Q939Q771J1792J5114Q462p091j4821j0838
294c115o265r268q766L393J7625J7503P258O35J874k598j3031j7875j0514N42
308b2602M821P034J1513J4065Q826j707p026q198j1770j3161p425N016J1221R732
322C39P927R455P161l782j4274j4234p376l146k475L099J2001J5558R303J249
336B0805l434o225j0351j3175q476j7N624Q563J0154J1994O910k813q506r615
$$ y = [-18041, -29786, -31151, -8298, 19831, 30081, 23569, 18777, 17508, 6010, -16303, -30883, -29179, -18959, -8759, 4297, 21287, 30303, 24529, 13608, 4825, -6902, -23819, -34269, -25782, -5172, 7817, 11309, 18248, 29182, 27438, 6851, -15544, -23562, -20686, -20294, -18493, -6028, 14700, 27158, 25726, 18262, 10036, -2272, -17859, -26747, -23443, -14504, -5733, 6059, 21173, 29635, 22544, 7723, -3115, -9380, -18648, -27414, -24021, -6396, 11107, 18365, 19000, 20874, 18276, 5245, -12630, -23144, -22602, -17781, -10747, 766, 14831, 23657, 21950, 14924, 6726, -5044, -18205, -25630, -20614, -9393, 339, 8266, 17721, 24882, 21100, 6826, -7408, -14784, -17930, -20405, -17306, -5305, 10253, 19556, 20805, 17371, 11146, 795, -12380, -20856, -20873, -15249, -6686, 3468, 15462, 22372, 19559, 11053, 1438]
350A438q719q891n964K936J0970J2516P974M480K403k934j0064j3747q984k291
364a8877K317N219R379J2029Q264J182m954p550q953j0519o821M31P215R222Q576
379F160P930N314j411q933j1094q275n081k172K124Q949J1917Q996K288r40m468
394A1304p991j1128q604j691M140O649Q125R615P247N51o705q398p390p583n990
409a7849O58P624J0559Q012M478K912j278p843j1318q338l295J110L103P310J0641
424F486Q057J866k989n433p192r605p401l22N282P163P029P242O163K14p460r056
440D4o986m756l559L45P170J0521P850K855K55j962o229j0217q610j936K942L983
456h290O590Q693P187J224m448o198o190p640o148l80O463Q028O194N105M369
$$ y = [1438, -7281, -16172, -22136, -19200, -8230, 4286, 12260, 16740, 19143, 16209, 6145, -7602, -16586, -18877, -16560, -11341, -1962, 10067, 18331, 19513, 14559, 7009, -1944, -12463, -19284, -18853, -11638, -2416, 6160, 14090, 19404, 17993, 9060, -2034, -10309, -15390, -17562, -15438, -6489, 5428, 14424, 16712, 15772, 11304, 3313, -7815, -16419, -18110, -13970, -7321, 804, 10419, 17666, 18217, 11512, 3114, -4276, -11859, -17849, -17191, -9567, 992, 9004, 13482, 16394, 15116, 7273, -4045, -12383, -15678, -14568, -11465, -4155, 6486, 14543, 16409, 13420, 7987, 795, -8810, -16211, -16533, -11251, -4088, 2941, 10183, 16346, 16560, 9100, 44, -6942, -11698, -15257, -14912, -7742, 2779, 10629, 13484, 13739, 11777, 5548, -4669, -13279, -15215, -12273, -8290, -1700, 6993, 14180, 15404, 10956, 4758, -1432, -9072, -15220, -15600, -9137, -1109, 5085, 10190, 14559]
471A4559L67o949j0277p026k519j048J347N692R717P582K467j833l828n785q495
486f029o756j289L232N005O028P933O085Rn428o836n344n555m831k64O157R253
502A370N964L127J540j24n518r380p070k390R97K906N407P909O414J549j866m390
518F445n943p882n778Q1M733N329M813N952N545J58o058q148m893l305k676j49
534a1776N292Q879O413K434m50k234m902p484o200j601J317L435O273P256M726
549A1378K15l468m240m619o420n909N40N943O622M238L483L480K89n387q065n678
565g598k439j35J659N043O120N959K587r53l416n980o992m002M5K025K901N465
581B89O806N087m93n617n345l497l908m275q47N763P522N152K387O49j343m149
$$ y = [14559, 14926, 7977, -2300, -9326, -11845, -12893, -11546, -5854, 3863, 11445, 13912, 12079, 8251, 2466, -6029, -12785, -14074, -10842, -5837, 191, 8124, 14209, 14218, 8790, 1954, -3390, -8945, -13776, -14040, -7883, 1370, 7334, 10461, 12001, 11877, 6359, -3021, -10091, -12481, -11484, -8578, -3171, 4738, 11152, 12701, 10835, 6445, 502, -7380, -13158, -13077, -8344, -3015, 1798, 7750, 13295, 13453, 7395, -753, -5646, -8951, -11627, -11776, -6484, 2395, 8808, 11242, 10792, 8558, 3656, -3828, -10028, -11629, -10312, -6877, -604, 6652, 11378, 11593, 8125, 3885, -734, -7154, -13063, -12523, -6580, 42, 4280, 7763, 11243, 11532, 6145, -1920, -7598, -10037, -10172, -8513, -3470, 2650, 8609, 11196, 10243, 6827, 847, -6145, -10147, -10102, -8077, -5176, 289, 7095, 12182, 11689, 6072, 727, -2770, -6678, -10953, -11800, -6037, 1485, 6637, 9024, 9673, 8330, 4181]
597D181o332n528k482M87L237N308O408L446P59j390k562n230p163m347J295M263
613e650M043L393M525M261L77n349o616m550k383j099N67L921O064N458K713j40
629I535l075n433n199l151j255J03K495N666O764L673j438l212k836l557n261
644f181m148K74M951N728L939K404J605n11l509n730n340k521K56K804M572M573
660C166L374J885N50l251n958n873k845J243K332J700M050N342M283o13m952m783
676c50l356k402k143l8L872N483M668K905k40k866m032l525l758k387k95K713
692e751N954N615J805p30j040j883m085n945l238J243M085L634K752L259K511
707H186j45l716n198m347k525N2K100L780L784L186K660O03k946n796m483j842
$$ y = [4181, -2151, -7679, -10161, -9674, -6437, -1129, 5279, 8725, 9484, 8094, 5532, 302, -6861, -11208, -9913, -5650, -1607, 1786, 6311, 10572, 10949, 5600, -1016, -5566, -7949, -9048, -8481, -4560, 1504, 6962, 9675, 9535, 6460, 1027, -4172, -7323, -8578, -8475, -5980, -314, 6450, 10123, 8685, 5473, 2637, -920, -6181, -10329, -10055, -5104, 624, 4563, 6967, 8572, 8061, 4552, -1178, -6518, -9039, -8783, -5979, -1407, 3166, 6540, 8425, 8975, 5724, -234, -6107, -8952, -7709, -5377, -3677, 373, 5715, 9998, 9385, 4433, -350, -3706, -6108, -8251, -8289, -4417, 1066, 5734, 8639, 8399, 5533, 1501, -2024, -5782, -8169, -8464, -5751, 203, 5818, 7623, 6893, 5853, 3970, -115, -6060, -9298, -8055, -3970, -336, 2416, 5675, 8186, 8041, 4325, -873, -5220, -7745, -7693, -5593, -1813, 1971, 5157, 7817, 8420, 5474, -322, -4805, -6647]
723f647J31N39J558M769N856K712j210l775k982l002l214k828O61L365M473M347
739D753K182M26j954k983l533l738k753l58L207N306L440J648M63N00k014n061
755d69n438k025J474K133K564L173L978K375n34l629m005l499k483o50J495L064
771b476L643L450K584M63l271m429l209j687j140p90K538N323M269J729j161j789
787D047j633l768l798k281J102K996L268L415K427Q98j396k483l181l814k716
802f917Q0K923L739K533K167J938J98k702m841l791j193M58P45K084L601M052
818E074J749j077k264k954l032k960r68J203K480L016L903K240j40k271l122k793
834a916k170k029n81L048M371L229J064J93j79k107m070l913q58N16J826K731
$$ y = [-6647, -6516, -5977, -4419, 350, 6206, 8918, 7708, 3933, 951, -2051, -5265, -8093, -7432, -4067, 406, 4753, 6935, 7361, 5407, 2424, -1109, -4847, -7600, -7958, -4751, 555, 3995, 5643, 6106, 6606, 4592, -469, -5907, -7932, -6458, -4325, -1761, 1412, 5390, 7765, 7231, 3602, -403, -3902, -6385, -7035, -5540, -2476, 1167, 4617, 7201, 7664, 4393, -36, -3245, -4932, -6072, -6862, -4324, 999, 5268, 6997, 5836, 4047, 2414, -1354, -5152, -7433, -6331, -3335, -67, 3348, 5775, 6673, 5277, 2794, -387, -4201, -6917, -6837, -3914, -175, 2358, 4525, 6463, 6661, 3959, -882, -4673, -5866, -5408, -4663, -2579, 1022, 5074, 6823, 5746, 3482, 528, -2504, -5464, -6432, -5229, -2749, 267, 4170, 6410, 6270, 3999, 877, -1916, -4086, -6115, -6696, -3648, 723, 3952, 5016, 5209, 5030, 2923, -1147, -5060, -5918, -5402, -3576, -845]
850h45L534K335P48r82j962k886l425k662Q3K357K417K678K374K376K0k985l755
867e80k626j066j107K61K206M193L028J430o89j262k431l548k676p85R55J972
883b725K816L289K190J1j871k422k143k851k077l85K974L603K306J175J170J30
899E190k605l750k774p84J82P42K058L848K381Q14j055j466k228l465k052o27
915e591K127J894K164K949K222j50k730k992j728j629j806M61K164L794K175Q81
931D205J61l60k095l622k448m91J59J446K157L102K702q6j450j730k196k592k100
948e238M70K070K321J681K021J989p19k376l105j840r71p40K72K302L308K276
964C721M49k85o54k509k944j903l38R13J536J805K985K286n35j952j804j533k454
$$ y = [-845, 2689, 5024, 5772, 4790, 2828, -58, -3483, -6145, -6062, -3705, -1288, 1390, 3764, 6140, 6160, 3175, -580, -3206, -4272, -5379, -5118, -2912, 1281, 4309, 5739, 5050, 3788, 1357, -2191, -4867, -5652, -4697, -2725, 91, 3380, 5570, 5581, 3710, 1288, -855, -3706, -5783, -6168, -3194, 409, 2715, 3890, 5060, 5190, 2585, -1165, -3939, -4723, -4541, -3799, -1741, 2107, 4488, 5302, 4247, 2781, 553, -2912, -4964, -5591, -3464, -1570, 594, 3543, 5765, 5615, 2885, -107, -1835, -3464, -5270, -4809, -2645, 1149, 3324, 4205, 4366, 4006, 1911, -1711, -4159, -4650, -4491, -3045, -888, 2214, 4916, 4830, 3380, 1650, -546, -3138, -5238, -4768, -2698, -377, 1304, 3325, 5314, 4595, 2219, -886, -2726, -3697, -4437, -4165, -1863, 1445, 3721, 4170, 3885, 3231, 722, -2222, -4125, -4463, -3550, -2014, -209, 2776, 5062, 4527, 2575, 771, -762, -3216]
981c216j789M19K152L073J696J311Q90m13k545k682k321n03K28K01K587K700K482
998D270m6q75j239j890l008j574J76J524J567J792K496J446l56k063k534j587
1014a901j458j053O64J971K984J602N95N03o17k246k831j617m53N05J025K086
1030b41K825J587k11j300j219j915k360j613K29J980K092J818J304J025j39k069
1046A793k647j389j035l57M84K087K472J896L19k81q22k256k205j817J75P21J360
1063a502J879K069J490N8j764j583j901j504j208J64K207K057J625J080M12k50
1079C329k077k569j611m11J3P96J825K545J783j94r40j143j391k382j419N88J385
1096a873J542J319J387J401j16j810k128j435j069o59J92J922K182J319P95R5
$$ y = [-3216, -5005, -4586, -2434, 639, 2335, 3646, 4536, 4123, 1578, -1104, -3425, -3928, -3700, -3499, -912, 1788, 4270, 4224, 3349, 2110, 220, -2788, -4362, -4186, -2662, -1095, 697, 3193, 4639, 4283, 2220, -314, -1901, -3359, -4412, -3748, -1777, 1207, 2809, 3404, 3907, 3290, 1044, -1787, -3404, -3857, -3352, -2327, -241, 2584, 4171, 3960, 2660, 1441, -474, -2834, -4447, -4218, -2238, -146, 1672, 2976, 4001, 3862, 1793, -854, -2243, -3278, -3635, -3151, -1064, 1408, 3304, 3623, 3342, 2520, 264, -1941, -3758, -3583, -2862, -1502, 377, 2446, 3936, 3994, 2230, 647, -1254, -2758, -3966, -3802, -1595, 462, 2087, 3167, 3579, 3329, 1252, -1317, -2928, -3339, -3326, -2530, -705, 1840, 3623, 3429, 2489, 1346, -45, -2427, -3846, -3258, -1873, -331, 988, 2375, 3776, 3660, 1850, -278, -1713, -2782, -3441, -3249, -1327, 855, 2174, 2969, 3064]
1112C064k17k144k530j315j8N87N38J783K316J463J0j498j429j116j577j760M49
1129c394J673J895R91J739N13m15j971j715j435q53M6J42K121K529Q69ok92l55
1147B082j759k159j439J7J354R81J104J655J636J5j709j624j186j224r25K45J715
1164a221J481J275R38M34l26k054j729j236j57K45K37J440K362J389M3j258q19
1181A044r94j799j553j26J756J540J194J208Q76m17j066j696j687j095o6M52J184
1198a245K114J090N83Ln11j242k454r74J51O56N11J160J779J302M7j254j555r62
1216h01q90r17M4P30J746J595J124l1m87r38j958r30m03o05O41J573J835J242
1234B570n7n62o40j227j411j309k97J001J400J137J170R48o8r83j406j592r27
$$ y = [3064, 2847, 703, -1827, -3142, -3160, -2573, -2035, -252, 2064, 3527, 3537, 2039, 610, -506, -2083, -3843, -3394, -1721, 174, 1165, 2904, 3417, 3002, 1031, -684, -2119, -2972, -2926, -2784, -663, 1866, 2735, 2729, 2437, 2082, 323, -1836, -3275, -3258, -1904, -923, 181, 1836, 3472, 3487, 1778, 154, -1032, -2256, -3181, -2936, -1221, 260, 1535, 2473, 2907, 2581, 527, -1202, -2438, -2595, -2350, -2113, -673, 1689, 3078, 3121, 1863, 1044, 50, -1749, -3302, -3428, -1672, -132, 1062, 2270, 3146, 2729, 1663, -33, -1720, -2815, -2881, -2429, -1245, 869, 1959, 2542, 2545, 2034, 792, -1662, -2636, -2485, -1829, -1318, -158, 1621, 2923, 2970, 1716, 161, -801, -1691, -2608, -2564, -1834, -88, 1507, 2631, 2600, 2113, 1175, -783, -1713, -2116, -2721, -2080, -507, 1328, 2570, 2513, 1951, 1311, 84, -1327, -2636, -2933, -1932, -532, 605, 1775, 2723, 2655, 1672, 266, -1326, -2253]
1251b253j22j8J482J303J170O35J51k23j504j794r67JM92L23R87J414J747O0j163
1270A721j075j298n11j104m89R79J652J175P99K41j92p88j419j110p82p6K95J303
1288f79J880Q86N9l9o83q51j792j182r1Q98P56Q94J252N65M47o83j679j088o04
1307a734m29L43N50J223J196R64Q6n08q36j477j081l29K43kJ315J518J073M8q43
1326A320o26o08j229q45l81Q30J258J089N61O94j93o39j341o77j176J90J80P46
1344h47J162J133J97J95k33j252j388q69J54J91M92J071Q82J081K52o13j378o94
1362d64q14o13M1M84J367Q29P92K70k79r77j092p02n97nL22Q49J478P58N4l15
1382A386k08q70j115j165N4O67O86P39R52N76N7o33r68r25n68p58O14Q54Q82Q09
$$ y = [-2253, -2375, -2393, -911, 392, 1562, 2197, 2348, 2125, 621, -1173, -2140, -2139, -1647, -1324, -337, 1077, 2824, 2884, 1721, 646, -652, -1163, -2267, -2756, -1777, -125, 1050, 1849, 2090, 1898, 1110, -309, -1419, -2201, -2277, -1982, -679, 1201, 2087, 2146, 2107, 1424, 573, -1219, -2401, -2492, -1594, -838, 56, 1308, 1873, 2320, 1637, -42, -1130, -1734, -2163, -1820, -1270, -47, 1149, 2113, 2199, 1691, 855, -622, -1703, -2032, -1789, -1791, -476, 1042, 2115, 2163, 1320, 694, 86, -1143, -1988, -2369, -1539, -281, 808, 1369, 2063, 1870, 1231, -110, -787, -1963, -1773, -1593, -847, 315, 1448, 1645, 1840, 1607, 355, -1033, -1902, -1748, -1557, -1065, 6, 888, 1969, 2221, 1608, 230, -464, -1278, -1891, -1850, -1366, 1, 830, 1622, 1892, 1613, 636, -456, -1158, -1755, -1760, -1438, -589, 889, 1647, 1701, 1386, 1178, 308, -807, -1972, -1918, -1251, -565, 174, 1126, 1702, 1759, 1126, 158, -767, -1335, -2093, -1479, -625, 257, 1066]
1402A066M06K03l03r33j150q56O7K49J22P06J104R65J27n05q24n94j162m31N7
1421a686N29R09J044Q98l2k44m75q93r50m09k85L23Q90Q68Q70m3K09j69q71j312
1441h29o77m7O73K54Q23N65P01K29r70p28q67r2n46K10N68Q83Q24L28J79j85o98
1462E98j042p69Pj5K3R27J056R51j06p22n01n47p05n62l08R45O24L87Q45L90j05
1483A371n72p83n99q50j81M80M33R50J138k33p3j33p73j041n71k0P43K72O91M65
1503G14P38K1p67n71l44j030k52L42M73Q45K69Q10J10k10n54p29p68k26R0L36
1523g03M64Q48R39l55l18l01n70p80m39J24M36O52M71O53k9j86m34m69p21n54
1543a272N1J70P24N27J029m92M23l43p01q47l32j87K99M63M44Q96J69p8j25p12
$$ y = [1066, 1472, 1675, 1372, 439, -711, -1567, -1500, -1251, -1129, -423, 681, 1646, 1773, 1268, 444, -150, -1312, -1743, -1686, -1157, -248, 796, 1694, 1662, 1418, 943, 50, -900, -1309, -1594, -1271, -381, 487, 1357, 1314, 1523, 1354, 483, -829, -1506, -1553, -880, -626, 197, 762, 1463, 1692, 722, -6, -873, -965, -1511, -1301, -733, 150, 974, 1302, 1481, 1296, 598, -444, -1213, -1206, -1221, -1198, -271, 785, 1736, 1630, 908, 407, -140, -845, -1407, -1715, -770, -146, 241, 1086, 1476, 1371, 799, 16, -583, -1433, -1614, -1134, -701, 249, 1387, 1154, 1081, 948, 175, -866, -1437, -1457, -714, -442, 249, 714, 1452, 1473, 706, 135, -209, -1239, -1491, -1149, -676, 169, 438, 1248, 1358, 1148, 594, -135, -903, -1129, -1039, -703, -239, 609, 1548, 1193, 875, 574, 4, -776, -1215, -1091, -655, -3, 468, 1121, 1092, 906, 472, 3, -718, -1272, -1221, -1051, -327, 200, 1229, 737, 1160, 817, 116, -731, -1063, -1250, -951, -488, -44, 852, 1021, 943, 818, 106]
1563A06p31l51j27j19N00R86M43L89r8k64m02p10o32J49j29J83O12P05N17K53
1583A280n57q2o32q61j81J37N81J08N65M15M13k05o08p41j15n21k58L98P18L36
1603A90P74J45%k04q80p32j18j17P0M92N09M58N24j06n30l82m14n74k63J44N06
1624e08N22P38J47M0q3n98o01n22p8k42N44O34M55K65M00k14k63p09o50j02n0
1645h75M39J48O28N15K04l5r36k82k83q00K58K49L19Q52M45J70k59k81n58m78
1665e60j24J13Q4l1P13L70N46k80k91m72p47l26l51P46L98N59K49K31Q3k20o64
1686B6m83j60l33L2O30L38P26J12M3k46l94o22l97J6j98K23M36P84L58%l02o2
1708E27o54l22m34p5J13Q36J21K36P82l53k15r79j31k6m35O6M22O87P00Ok8l49
$$ y = [106, -625, -976, -1103, -1222, -722, 264, 707, 1096, 998, 734, 332, -378, -1010, -861, -990, -807, -195, 510, 1027, 1280, 723, 641, 9, -852, -1033, -896, -315, -207, 358, 773, 1186, 981, 373, -368, -483, -1004, -1262, -864, -146, 190, 964, 1109, 1109, 905, 25, -707, -825, -942, -872, -380, 129, 587, 1111, 1005, 475, 93, -321, -895, -1158, -1014, -508, 14, 752, 899, 939, 856, 258, -343, -865, -943, -1185, -641, -7, 448, 713, 1113, 899, 636, -73, -723, -825, -875, -436, -288, 340, 855, 1059, 1024, 88, -194, -477, -1277, -1019, -770, -451, 401, 846, 1016, 757, 476, -82, -560, -684, -571, -487, -518, 195, 565, 1111, 831, 540, 68, -679, -1005, -1356, -610, -212, 347, 596, 827, 910, 690, 26, -457, -617, -950, -918, -288, 50, 776, 888, 931, 685, 291, -331, -728, -712, -910, -687, -251, 533, 891, 891, 589, 527, -127, -449, -883, -958, -845, -9, 112, 348, 1130, 777, 562, -417, -548, -574, -1009, -943, -521, 166, 866, 872, 844, 495]
1730D95k13p12o5j43j22L57N47K88M56J37o12j54m82m96j97M25r3M86N89K18J34
1751H43k3m71o79J4o69N4L11L09P22K71M85n23l30l56l57p35K48K03P17L26K80
1772F40M0K23m33m99n74qk21k2Q70K80K78L25o8j98m55r86Q7jj4O28L35J29M59
1795H15Kl56j86p10k86m7j23M28N59N40L30j61j43l21n82l29k09K05M9M74K18
1816A67M18O1l8n52j79k56k34j41K59K07L01N95N0Qj54n91k52m90Rj0P04L11L65
1839E58M41j77n97k77k48l46R4J70J54L66J36N69Q0m59n14m97j16j42J48J3N57
1860h7N59L66l0l40l93l05o00j21j05P19K10N69K69L92m77k40n37j84n90J96K25
1881e04L7P43L72Kr2j81k49m99n22K06J40O84l2K04J65J53Q7n23n04k97n7L30
$$ y = [495, 282, -430, -495, -638, -760, -403, 144, 432, 888, 1025, 413, 259, -223, -719, -916, -491, -584, -98, 491, 709, 843, 820, 349, -330, -316, -985, -931, -620, -311, 411, 682, 1167, 644, 314, -42, -399, -1134, -886, -683, 34, 360, 640, 680, 903, 470, -29, -603, -611, -832, -854, 16, 296, 574, 899, 831, 633, 178, -808, -721, -722, -736, -108, 227, 356, 815, 817, 461, 275, -435, -721, -768, -891, -463, 96, 636, 966, 805, 662, 341, -241, -570, -779, -574, -525, -51, 167, 585, 646, 608, 56, -123, -379, -613, -754, -495, -288, 13, 608, 658, 666, 512, -79, -331, -821, -812, -822, -118, 193, 558, 999, 822, 225, -52, -300, -646, -552, -382, -228, 138, 274, 843, 923, 464, -50, -547, -663, -805, -657, -644, -87, 472, 838, 808, 468, 75, -230, -830, -951, -1056, -337, -127, 442, 711, 1103, 626, 386, -151, -335, -925, -729, -504, -467, 276, 648, 650, 558, 377, 128, -371, -893, -687, -547, 137, 105, 309, 474, 627, 714, 191, -313, -610, -667, -337]
1903c37M4M46L2N58j91l7l19l55l45l15J9M93K88M59L32N7m14l0n09p20M9j6R4
1926g17N16K51M44J8l2m10l9o46K75l33j10O50O97%J55K60n17m38n44j86K3J25
1948e58L28O32N6O4N1k23q1n86k35j23O7L29M09J00N35l76M25p07m03k75r1K8
1970f34K06K83N01M17k89J57j64k81m97j75k70J35M66N21N4M9J38r8o66j12l74
1991f33r5o6N37O08j02N93r0k58m19l58m10J2K05K63n8Q21J22j10K86n80n33l7
2013c02n30L98l2L63K82K62L26l93k22l88N3l31k48M30J43L33Q5K44k35j61k23
2034a46j24k44K20n2K87l2O29J58J0m18j54k36l53j18J88L32R8K94J32j96M08
2055F83n14k09k25k58J0N5M89M65l1j81K99m86j68k00l61J99J3K46M04L48N2j20
$$ y = [-337, -293, 153, 185, 743, 552, 515, 196, -159, -504, -819, -800, -307, -19, 440, 772, 829, 415, 385, -124, -844, -795, -811, -717, -201, 50, 494, 512, 480, 70, 31, -615, -340, -673, -783, -133, 564, 564, 719, 979, 462, 24, -520, -706, -683, -558, -230, 402, 458, 522, 573, 350, 269, -317, -552, -675, -608, -279, 130, 230, 765, 389, 814, 107, -296, -571, -662, -634, -428, -145, 356, 773, 484, 641, 477, 196, -301, -476, -746, -611, -145, 376, 430, 479, 617, 519, -147, -259, -633, -728, -794, -257, 351, 249, 842, 752, 494, 75, -283, -693, -681, -476, -213, -271, 550, 672, 562, 848, 268, -265, -302, -832, -434, -466, -103, 179, 441, 767, 374, 152, -236, -183, -514, -762, -332, -189, 144, 229, 473, 238, 77, -146, -270, -514, -294, -346, -59, -91, 538, 696, 706, 288, 134, -102, -455, -573, -385, -53, 45, 339, 471, 275, 683, 169, -40, -265, -523, -513, -458, 31, 496, 465, 284, 583, 97, -71, -271, -632, -433, -420, -174, 230, 578, 630, 510]
2077E10q4m04m05K9l21K83K72L11L28R1l70L48l16n92K19l10j75M73J88K71Q6
2098D32m1J35m53j04L1n52Q2J77K03J91K33L05l01j41l18j43k23K04j7L63L2L25
2120D20p8J08l48j45j64l41J21M0J68L48J85K44k66j62k92l8l14K41M4J77R0K79
2142C17K6j13K72m11n19O6o0J12J78NN14k47J58j82J86k96m05N2J37J90MJ13K66
2165C63K85l04q8k30k80M4l30K29J08N39J00K48k45k66j13k41l4j35P3L23k9Q
2187B5M64k17q0k39J07k53j20K64j24L61O5L09j83O0l60j21j35P7l59K12J99L61
2209C13J71j71J3k11j69o3m75J11J16L37n2N46O3Kl12m16L61l24l69K07O2M43
2231A83K01N6Q2m01p4j79k79J24O0J0J93M27k98K61l9k91j86rj40p5OM73K67j6
$$ y = [510, 426, 22, -383, -354, -675, -392, -120, 191, 519, 610, 240, 588, 272, -320, -101, -411, -586, -113, 75, 346, 432, 391, 526, 73, -31, 0, -552, -470, -293, -90, 101, 334, 639, 338, 197, -121, -264, -487, -283, -300, 63, 95, 420, 342, 450, 102, -43, -207, -548, -427, -387, -219, 129, 314, 558, 292, 130, -162, -200, -514, -273, -229, -52, 38, 317, 343, 230, 502, 91, -428, -362, -422, -310, -132, -127, 387, 140, 298, 116, 302, 6, -399, -347, -210, -20, -16, 97, 363, 648, 344, 256, 26, -254, -210, -540, -311, -203, 336, 436, 684, 439, 173, 60, -181, -215, -350, -277, 46, 17, 25, 489, 272, 192, -47, 60, -193, -313, -49, -173, 188, 253, 562, 379, 439, 79, -42, -177, -100, -459, -247, -48, 313, 484, 313, 326, 115, -54, -117, -592, -481, -365, -28, -80, 466, 529, 531, 219, -197, 164, -160, -529, -322, -260, 183, 384, 440, 522, 121, 47, -132, -411, -287, -227, -217, -24, 403, 105, 366, 327, 36, -150, -159, -299, -374, -368, 105, 372, 356]
2255C56J11j43J2n66J06l01J71k0K26K04M22r0k0n15p5p7l07K75J24J84J45Q9
2277C11K50l11j14j42j11r9o5j45J31L18L69k32K56m52P5J24k47l23J12L02J26
2298A33j29K08J73k13j19o5k04Q7j93m2K32K25J99M4J73m43k04k37l46L49j4M43
2320E7MK61J17j80j35Kl59k5J22o8K02J81L74j86K1l12m12L18l99L55j32K09J12
2343A27R5K95l07J21q8l01k58Q9j87K33J12K44K69j69M2j29k06m16l7J46L24K9
2365B8O1M26n8k5n12j9N9k94L8L36M6K31j31m3J19j41jm45r4K02n6J58J34L75
2389C94L5j22j93o5k90k87J63J70q5L80j74L59Q4k22k44p6R3j65q1L64J06K9J68
2412C41K01o94j7J18m19J79J08j14M08J61J21L6p1l49k54J44m49K51K45m0oK92
$$ y = [356, 467, 324, 336, -230, -124, -425, -254, -274, -48, 156, 578, 488, 468, -47, -122, -199, -506, -231, -107, 77, 222, 311, 561, 250, 136, -6, -117, -216, -281, -426, -295, 23, 392, 160, 416, -36, 39, 163, -84, -407, -295, 7, 133, 4, 212, 385, 172, 53, -12, -216, -129, -322, -364, -132, 93, 292, 336, 509, 66, -138, -375, -721, -372, -386, 57, 61, 322, 439, 259, 124, 126, -233, -258, -136, -204, -2, 179, 553, 367, 388, 76, -336, -18, -417, -62, -194, 15, 127, 222, 517, 210, 331, 243, -58, -316, -227, -414, -181, -69, 175, 444, 275, 317, 188, -18, -434, -471, -325, -1, 28, 89, 515, 457, 432, -80, -99, -40, -334, -296, 40, 86, 317, 186, 143, 262, 121, 120, -325, -419, -217, -273, -115, 19, 394, 429, 307, 114, 49, -241, -528, -365, -195, -280, 100, -74, 285, 369, 147, -97, -173, -80, -245, -326, 38, 144, 173, 341, 542, -152, -169, -51, -470, -291, -183, -297, 111, 272, 393, 429, 358, 9, -245, -101, -550, -299, -54, -94, -100, 192]
2434A92J91k45Kj93j57j87J80J37J48K52k89M95k60j99j8j99p8k13O35k26L38
2455C06j08J06L1k09k53o9j92N2K63jK46K36j61o0J05k04k25j79j07L21K4J19
2477D1K45j21K99m67K94m66m63O1K53Q2L31J38M8K24l02j45j26l51K70K0r3J37
2499i1L18K83j88j78j92L9k68k14K64R2P4L90m8l45L02l06j87N1l63K65l3J31
2521b04M53l5J00Lq7j50j80m2p4J59j57J82J97L20j54l01J34k20l00K10mk4K50
2544G6R7n5K40p1l05J4l64J37l6j8N52m4L8M34l85k72q9j93J3L29k25K00L16J13
2568E02k4l73j3k75n1l3q0P0L55J03J22J90L5k24k45m59L10j85J17k91P41k95
2590cM94%k55k69K19l27j81j34N09k06J77K43K14j98k39j03o7n9j69M34p6R1K81
$$ y = [192, 383, 138, 140, -53, -210, -397, -217, -80, 68, 320, 31, 526, 266, 67, 49, -150, -228, -441, 194, -32, 306, 198, 304, 335, 126, -127, -196, -388, -336, -73, -74, 172, 408, 247, 187, 292, 88, -137, -316, -423, -102, -78, 41, 286, 165, 464, -3, 291, -175, -638, -577, -324, -242, 89, 227, 275, 499, 197, 52, -74, -425, -155, -135, -228, -91, 227, 510, 322, 144, -48, -9, -277, -491, -227, -135, -61, 329, 281, -64, 238, -68, -255, -204, -567, -302, -335, -204, 249, 214, 314, 317, 230, 80, -100, -142, -216, -57, -214, -32, 165, 485, 331, 30, 164, -56, -356, -146, -150, -174, 76, 173, 118, 358, 287, -18, -4, -368, -231, -267, -285, 267, 223, 261, 695, 310, 38, -51, -244, -231, 98, -127, 73, 389, 502, 478, 105, 92, -183, -234, -267, -347, -277, 78, 181, 303, 493, 528, 304, 59, -400, -90, -275, -158, -449, 292, -3, 491, 491, 236, -33, 186, -141, -322, -456, 53, -153, 24, 267, 481, 283, 44, -59, -126, -185, -354, 80, 4, 95, 376]
2613C76Q7j25Ml66j63k22R7M68j07K74j37J62j95j14J34n76J55J21K89j05n7R8
2635I8J59L4k10K59m49k38n8J87qL59K67l0o4q0k30k89O4O6K7R0L42n0o6J20k2
2660B78k75k25l8l3Q9m8N23K23l36P5j7k0n40M1J1J56k0K54J16l8K54l06l4k79
2684a89j04j65K52P7L9J80L51k48J53K6k44l23j32J01q2n5M80K89k44J39m15K3
2706i1K45o75N00q6j52J97L5M71m1J77o74K04m4l93j86L73O2K76M6K20n08N5o
2729Ej44j55m6N26j27R3o5K76j05l75K1J42l68J11j12L04J69K06j05o6R5k85j17
2752a22k66%K91L33L4k8j37m8P3k94k65N65m97K67J31M6K48l0m0mk24m00L00l81
2776d48J10M97k49O04k00o2K92m59l7n41K49R6j17Q1K57K42o9k13OJ82n39p0L72
$$ y = [376, 463, 338, 342, -24, -187, -409, -312, 156, 49, 323, 186, 348, 153, 39, 173, -403, -248, -127, 162, 57, 0, 98, 257, 291, 81, 340, -109, -347, -405, -218, -226, 133, 400, 370, 306, 226, -4, -293, -229, -163, -136, -46, 296, 246, 180, 300, 278, 3, -222, -260, -293, -204, -252, 271, 494, 158, 233, 216, 196, -344, -303, -292, -136, -156, 98, 214, 176, 430, 124, 90, -189, -293, -458, -206, -129, -90, 90, 441, 193, 346, 372, 128, -195, -327, -226, -308, -363, 117, 406, 162, 301, -114, -91, 154, -521, -21, -107, -259, -62, -27, 444, 403, 580, -94, 110, 66, -327, -513, -140, -78, 198, 244, 464, -44, 11, 5, -139, -294, -340, 186, 59, 152, 87, 363, 258, -117, -96, 46, -322, -211, -323, -19, 150, 356, 251, 185, 280, -5, -122, -388, -388, -97, 236, 270, 242, 105, 57, 130, -164, -429, 136, -361, -94, 37, 83, 331, 301, 261, 257, 33, -367, -67, -448, -338, 159, -90, 514, 314, 252, 544, 85, 48, -493, -244, -148, -265, -184, 73, 315, 246, 33, 39, 221, -318, -388, -16]
2799a6q6Q7J13j59J02Q0J31l94K25j62j30j4J47N24k95j3J53j27j55m3k8j96J15
2822a41N8K38n3K76n5j87j86j83j23J39PQ1J45L58j91J6J22k45m90M68k62k32
2844d40M31R6j53K68j83J81J41l05o6j25k68M68J83l33N03n64K43J04j73j49n4
2865a95k00L33J54k45K55qJ66m2k9j04k96q5j1l8J37M29q9LJ43k67J98r2k25l4
2889a42J07M26j41M9K59j82J83o25Nj30l8j82K99K57j16O0k4Q2J0l23p2K42l72
2912c68J88J13L54J60M6m16j6k27l9l15R5K42K27J64p1o8K70j92k99j69m6K05
2934a62k5Q5K33L48k70j7j16j51k80K05k93O10k76K20J12q9K93m84J16l27L6O2
2956a70J08L7J22J54N5k62Rk19O6k2K27l24L9M41R1k30J55l9Q6l79j85N8q1K12
$$ y = [-16, -102, -15, 98, -61, 41, 121, 252, -142, 83, -79, -209, -223, -76, 448, 153, 140, 293, 166, 11, -32, -60, -256, -141, -83, 155, 102, 378, 323, 136, -50, -233, -356, -217, -210, -129, 16, 374, 183, 199, 321, 76, -414, 54, -208, -440, -9, 87, -66, 202, 19, 200, 341, 36, -30, -155, -423, 45, 228, -105, 398, -166, 77, 181, 8, -141, -195, -395, -62, 92, -153, 102, 94, 260, 218, 189, 85, -211, -296, -307, -345, -208, 221, 132, 135, 278, 11, 209, 117, -108, -142, -35, 391, 250, 299, 558, 376, 559, -66, -61, -191, -229, -411, -112, 145, 29, 89, 65, 147, 157, -166, -238, 4, -368, -180, -67, 287, 447, 493, 77, 61, -166, -205, -520, -425, -183, 44, 208, 137, 69, 339, 147, -152, -321, -367, -162, -187, -102, 131, 479, 209, 192, 76, -75, -355, -150, -443, 167, -109, 111, 223, 134, 427, -57, 59, -268, -232, -170, -62, -25, 97, 251, 306, 44, 53, -166, -100, -122, 105, -219, -180, 261, 352, 122, 277, 238, 324, -55, -240, -182, -263, -51]
2980e1L9K40lj89M55l79k21l1n9K31m63L70L22J14j69l05K03J48m12o6J41j32
3002b17K86k7K76k9K9j04j45kj11m23Q7L43J94j33K61J51m53R9k12j91k06M52
3024g5o5J31N6M10m01p2K51j63j77k68J25M14j17J65L2J64j67p5m15J91o1j29
3046b46J98j64M50o0l7J91j18l94j41K27n5J38J00ml6J35J60l56j17N0j63j81
3068d23J78J23K13K26n1p7k03Q9m29j29L68O1j64J2Q9M89J31k1o31j37Q4K21q
3091A1k17J77Q4m7L20l84q6J85q7l36j15M90L5k37M89j43k6r0k84n2R0L2K48j59
3115a02K82k0J04r8Q9k74l10K90l68n7O26o6J97O3J61k41k85O9m57j35L21J63
3137d8J28M62n03J93K17k09n47K47k07j12K38J02K28l5M23l40Mk38j60K14l80
$$ y = [-51, -12, 228, 225, 36, 491, 112, -109, -140, -199, 32, -431, -61, 261, 375, 206, -99, 104, 252, -160, -226, -85, -217, 69, 42, 318, 289, 318, 214, 69, 67, -44, -467, -380, -37, 157, 24, 285, 436, -17, 82, -130, -321, -527, -75, -140, -9, 47, 457, 56, -16, 235, 72, -105, -373, -248, 166, 49, 214, 246, 410, 243, 168, -247, -56, -117, -246, -48, -212, 238, 178, 141, 332, 214, -180, -321, -94, -149, -11, 89, 85, 49, 184, 344, -12, -129, -79, -242, -423, -245, -122, 91, 317, 266, 189, -14, 75, -354, -483, -115, -54, -218, -206, -117, 372, 503, 482, -149, -286, -202, 19, 11, -206, -29, 55, 8, 328, -56, -142, 43, -44, -380, -495, -5, 30, -207, 282, 139, 113, 23, -261, -313, -223, -191, 57, -102, 180, 160, 264, 166, 255, -19, -329, -39, -407, -464, 162, 96, 293, 356, 517, 276, -9, 60, -397, -532, -211, -48, 80, 542, 39, 232, 449, 240, -307, -60, -267, -379, -141, -39, 189, 154, 577, 237, 241, 3, -157, 57, -323]
3158c23L27k04N37j14L4j4O9l51j02j55J61n4J3K64q2N49o3k17l28J6N3l01P5
3181b10j47N93j57K03lr6p4j44n3k92J9K5N83j91L18j23o7l04m7j90o6J9J81L62
3205A39j45K45k12Q2J28m45J46k89l43M33N24l38L12J44k73j87J63k45r4j30K55
3226a30l0K43K00l48M28l29m9k7l36K33J4q2J82M83j17K15o26J38l91Q4k52Q2
3248d15L45m4J60L56k26j39J87k91j44J44j65p7M07J7Q0P1J23j35k25k38j0r9
3270c18N8K38l8q7M41jn0r2m55K2j42J04J64J54J91J85o6k52k8k25J3k01J73J11
3294a01L17m21M18P9j16k66j11j54r5J10K03L3L40L2k69M31l50k17J69l60J12
3315b16K16q1m2N70l4l04j43ml59L4Q8J90J54j91M09j92L70j78m08p5K6l48K23
$$ y = [-323, 4, -200, 337, 223, 257, 243, 312, -39, -141, -296, -135, -189, -176, 88, 6, 555, 492, 275, -53, -37, 16, -285, -210, -357, 236, 79, 282, 279, 183, 109, -35, -88, -380, -361, -336, 247, 56, 374, 251, 184, -120, -167, -357, -423, -404, -223, 139, -6, 239, 27, 109, 237, -208, -62, -351, -694, -261, 263, -75, 237, 381, 108, -79, 84, -161, -255, -385, -130, -160, 83, 283, -65, 363, 34, -15, -42, -378, -145, -131, -213, -31, 452, 335, 550, -76, 62, -329, -245, -497, -415, -70, -114, 46, 402, 176, 37, 224, -67, -211, -67, -232, -309, 98, 115, 195, 266, 389, 254, 29, -209, -219, -318, -260, -22, -60, -147, 294, 293, 243, 151, -304, -282, -424, -320, -156, -2, 189, 374, 308, 56, 28, -197, -184, -385, -212, -101, 216, -205, 213, 292, 176, -90, -201, -355, -450, -340, -137, -104, 236, 268, -1, 430, 80, -137, 32, -328, -216, 0, -81, -123, 447, 413, 109, -34, -38, -397, -363, -275, -85, 69, -122, 287, 95, 465, 287, -121, -196, -170, -518, -295]
3338b95O0K96q6K99Q2j00j09l72JP5l3j59M20Oj05L28lJ50m41O7l01J75m17M11
3362e1OO24j65m9j7n41k01M13q5Q6J36L9Jj47P3L6p6j70k02j54K81p6L6N18n5
3387B60R7j3j92j69j91k93K61j6K26P1J56J15j94j9j62m35k6M45q9L36kJ21K65
3410E52l06k3k91j88J89j32K21j84K03L33k13K36N5l72k41l33K29m2J75K82ON7
3432B13n0j7P0m66O3M3M4Mj59N49l03L39n3j50j24l63Q4J96k20M17j8M26l30m4
3456A51l4j68j65L0k25K75Q6j6K06K40j30N1l17k85J86l08L51m2J42J19L51l51
3478A47N6k42j76N7j40J43p8K91J50J94o9k24j59m3l19k95O72j28J99J57l2J99
3500C60k56K83m74J83l12q7L2K94P2M7K57o7j76l71L64k40j07j08K79L45j78R8
$$ y = [-295, -235, 61, -25, 274, 356, 256, 147, -225, -224, -149, -182, -341, 79, 85, -20, 308, 305, 455, 14, 81, -220, -45, -462, -51, -45, 579, 414, 365, 348, -193, -394, 19, -66, 20, 156, 195, 196, 49, 122, 158, 82, -88, -290, -444, -163, -239, -203, 315, 260, 357, 344, 152, -17, -208, -501, -240, -256, -30, 41, 197, 312, 118, 99, -63, -498, -524, -79, -168, 168, 166, 287, 552, 246, 223, -68, -256, -67, -199, 22, -162, 41, 374, 161, 397, 452, 80, -161, -494, -265, -307, -132, 150, 156, 213, 163, 146, 216, -250, -187, -144, -100, -96, -255, 294, -9, 330, 277, 127, 3, -360, -276, -80, -300, 117, 99, 525, 195, 151, 117, -51, -216, -186, -411, -136, -50, -66, 140, 380, 250, 301, -16, -301, -115, -423, -72, -114, 28, 147, 498, 147, 203, -39, -215, -158, -298, -155, -233, 58, 208, 402, 333, 109, -50, -93, -412, -707, -35, -163, 36, 193, 161, 360, 104, 387, -87, 96, -216, -303, -271, 23, 95, 142, 399, 332, 156, -215, 149, -91, -198, -306, -27, 318, 140, 238]
3522B38K27l19N1n21r0J51J4O7L01m4M44l01J01l37j9m63L44N5m7M13k46J96m
3545B11K7r0k70l6k17J80K27r2l3L46p1J95k34q7j06k21J96j89K83L13l02R4J83
3568C07j68J2k08J0k51K10Q6J73l6M6L5j50q1q9k28K71j25J14L67k08NM5J73m70
3592a60K46k98l19J41K27J21M68r3p5k03R1j65k12l6K43j53L78p1lK32k95N5j24
3615eJl9j59K23j56O0J10K33j20J21k14k05j31j63L75J11Q3k61J47L33K0l62l12
3638c10M8o5J38K48l35M62j23K43j2m73o9L50k55J59j48M97k95L07l02J74J33
3659C72m38K34m31K13m50K81K48R6K54J0j90k82J62j57o6j29K39J5M6J15j7q8
3681C7N2j02n04J46M48j60j25N48l27P3L06k38k31P4j68J64j07K9J20K95k30Q3
$$ y = [238, 465, 146, 197, -324, -414, -263, -249, -182, 119, 75, 519, 218, 319, -18, -37, -500, -156, -101, -148, 265, 19, 215, 211, 238, 148, -122, -158, -375, -195, 32, -60, -93, 253, 182, 377, 143, 56, -50, -271, -75, -264, 19, 332, 30, 124, 307, 139, 151, -57, -47, -298, -88, -2, 171, 135, 181, 216, 66, -15, -104, -332, -61, -186, -72, 295, 87, 92, 137, 310, -160, 86, -212, -531, -390, -163, -42, 426, 333, 258, 55, 146, -19, -231, -267, -24, -177, 201, 130, 127, 359, 64, 119, -5, -4, -43, -202, 21, -135, -75, 35, 268, 148, 269, 55, -150, -281, -444, -69, 42, 125, -136, 11, 344, 364, 2, -310, -262, -327, -189, 59, -276, 186, 63, 306, 294, -179, -248, 102, -153, 6, -142, 355, 60, 367, 65, 239, 372, -66, 168, -263, -50, -500, -219, 29, 125, 379, 389, 199, -83, 79, -78, -144, -273, -34, -19, 27, 142, 125, 37, 89, -13, -517, -371, 77, -83, -208, 340, 13, 86, 392, 154, -77, -3, -171, -7, -114, -85, 35, 330, 100, 183]
3703A83j87O9k32J12M3k39K13J90p1L65l44J84m83J96o1j32k9K48K03l69K88k1
3725A26k09J28J08l50m5R1k49N96J0J3j81J45%n2k29k76K98l6K71j42P4K90m52
3748g1J08j2k59M6J42J3j05J83J85L4j33m1k91j62M7N31m15J02K6K00J9J35j33
3771A49j78k02P5R5j10L82k86R2P8J76m12Q0J98k09k07J80k40L32J45N7J56l45
3793FJ53r3M7k85K55l48K66K89j32O3L81m45j99kq2j70K51o6J22K27J8j69N6l75
3817b32J44K00m75L00o0J55J21k09K52k49L4J27k72J06O5j43m8L37k71L55P5k35
3839G7J69l7l22l61J76K79n9J54m1r1J68q9j67K12k60J30j18J62K58k3M3l86J05
3862b1n6N5r8k45L95n4J60J2r7L3M6k30j1P1k97K84J73K3j25k45J09o0L01m57
$$ y = [183, -4, 65, -167, -55, -12, -251, -38, 152, 81, 446, 102, 286, -197, -1, -62, -194, -223, 25, 228, -141, 147, 126, -83, 45, 153, -197, -242, -151, -400, 196, 206, 219, 38, 183, 183, 131, -98, -374, -76, -112, 159, 17, 91, 381, -71, 37, 25, -234, -188, -46, -33, -138, 45, 230, 264, 131, 90, -201, -363, -316, 215, -200, -98, -72, 128, 147, 282, 149, -29, -231, -156, -61, -171, 211, -75, 17, 95, 271, -141, -61, 137, -72, -279, -99, -339, -7, 138, 195, 351, 6, 159, 66, 113, -172, 83, -265, 1, 290, 158, 221, 602, 157, -42, -44, -126, -296, -45, -111, 11, 238, 256, 87, 143, -232, -88, 112, -363, -63, -123, 32, 153, -56, 196, -53, -19, 108, -164, -58, 7, -136, -184, 153, -118, 237, 312, 77, 246, 209, -113, -474, -298, -19, -78, 76, 35, -56, 112, 23, -144, 68, -192, -62, -180, -18, 240, 217, 260, -126, -21, -77, -22, -120, -365, 30, -24, 136, 148, 51, 84, 130, -100, -111, -40, -337, -53, 120, 143, 18, -227, -118, -178, 123, -334]
3886c34K96l57K59L35j45l23M66p3o6j13o6P3p7J16k1k40M20r2Q1k0K16m67k52
3909c84L08j06K44J01k84J22J36P0n16K35M1Mk61J28M1L80j2O9k06k65K29J0k43
3932a59J3L0K3J14J90M1l26K65q4k14n9J22J12j22q2N2l1L96k25r4L1j15j02J88
3956c6n1J8OJ73L3j22J10l03J16j25J01L80l43k5K71k66K93k40Q5j94m0O2O6n9
3980i0J67K13Q4k42L38o55J37L4J53k98J76L9J40K0k05o8R4J2m00L12Q3k29J27
4003e8L14j76J69Mm5q1M1l85L43M4k98M78k38J09j59N9L3j27k38q7L84l37K58
4026GJ27K13k14j10j34K24n20K5M37J42m24L59r2K69n96J91J14j44Ll3l0K06r7
4049g7K61j0l0r4j50JR3r0J17j06K78j78j73N96m71J71J3j60j32J85nk5j21L14
$$ y = [-334, -38, -395, -136, 199, 54, -269, 197, 124, 58, -55, -121, -48, -125, -9, -30, -270, 150, 58, 139, 119, 335, -132, -384, -76, -182, 62, 163, -121, 1, 137, 207, -309, -74, -33, -29, -290, -162, -121, 259, 247, 316, 110, -155, 74, 84, -159, -146, -116, -93, 21, 211, 252, -74, 191, 107, -107, -166, -44, 68, -54, -136, -84, -115, 281, 56, -38, -7, -122, -224, -36, -87, -69, -63, 110, 143, 21, 131, -172, -56, -181, -80, 300, -43, -68, 203, -63, 230, -10, 75, -119, -159, -97, -31, -90, 77, 290, 374, 132, 470, -185, -48, -14, 139, -159, 17, 56, 196, 216, 11, -57, 37, 49, -351, -39, 44, -185, -58, 256, 80, 249, 253, 208, 127, 168, -217, 126, 170, -128, 350, 112, 221, 62, 121, 154, 27, -211, -298, 86, -251, 7, 134, 347, 133, 23, -111, 113, -407, -382, 55, 197, -227, 132, 40, 309, -287, -96, 18, -126, -123, -156, -186, 20, -77, 184, 174, 144, 50, -100, -99, -6, -96, 21, -85, 193, 15, -158, 438, -33, 138, 151, -9, -141, 44, 39, 14, -107, 207]
4073B07j4J14k10l02M2R5R9o5R1k57L98M6N5j44l25j40M37l73J39r7K33J39o0
4096A08K20j91L7j36k16L1J10L6M2J8L59j62l19M3k5J44k83j72N13k98L24Q4l51
4119h4K03j84J92l03j30R9j4L60j90K70l5k04p9j14k7J34k28M25k83L98j68J52
4141A90l02J39O9l1k65P0j02J84K61q7k6k46M5N1R2j54J35r8P4m15P17k78J51
4164A74k39J01K35n70J28J67J25k51K69j5k92L21j69J85n62J23Q0K02p6J92J07
4185B35n8M0j58J25rl45K72O4j14L6J9P5j03K06k28k51J70k19Q2J18j3o7K62p2
4209F7K82n06J18j34j29L05R5r0J03J22j10l51M33k89M5r6J80j06J11O0j50l1
4231g1j20L21j09j74L48l82K28J30N0L6m05J66p5N0n9L64l75k82L66q9J71M1j57
$$ y = [207, 193, 307, 97, -205, -163, -68, 31, -34, 57, -200, 198, 244, 299, 155, -170, -310, 127, -246, -107, -204, 29, 168, 108, 328, 137, 174, 38, -178, -147, -37, -1, 41, 59, 418, 256, -63, -20, -45, 99, -184, -356, 157, -141, 183, 267, -84, 119, -65, 127, -176, -306, -207, -221, 139, -51, 219, 184, -20, -99, -213, -240, -106, -334, 91, -192, 206, 38, 190, -112, 27, 96, 65, -200, -130, -232, -48, 213, 126, 100, -146, -101, -50, 42, -112, 23, -75, -1, -416, 301, 23, 174, -65, 36, 271, -299, -171, -4, 121, -130, 139, 124, -168, 153, -16, 169, -393, -270, -190, 12, -64, 128, 235, 177, 217, 59, 184, 175, -170, 102, 166, 52, 88, 107, 182, 79, 285, 57, -194, -24, -243, -161, -43, -56, -123, 139, 67, 349, -157, -39, -173, -302, 3, 98, 8, 111, 233, 123, -228, 205, -84, -39, -135, 45, -61, 50, 110, -40, -71, -191, 130, 21, -153, 195, -187, 41, 171, 221, 257, -148, 18, -57, -7, -66, 298, -77, -359, 7, -82, 89, 130, -27]
4254b7q8r1L77l52k16R3K79K31l58R5J10R8l27PK71j86J9j80K84r4K55r9M06n10
4278cJ94k90J91k18K09j27L58j40J6K8j97K91l14p9J4j23j4Q1o1M24k6R5j00j57
4302E2o1k09J93J08K87k62m1l38K03L19j29j63j32J50l9J20J70l9J5l31J58K8
4324E9Q0k67J78k37n2L07N0j66jP6m4j49R2J06k22J56K05m04K92j76J52J96k33
4347bK32l21j43L03J18l62J46j50P7K65j15l52M15L8J8k26Q6K30J4k73K90j41
4369A47j49n9%p1j46m1K72J12K33j26k22J40l02K70j42m8J55l64K89K25k89K53
4391A37q1M7l20k46M90l8o7n8J58O8M2r0r3J04j40P7l0k41M83l75L1J85Q3J9J56
4416C01k33k30j60L38N5m7j00K80j5j66O2l3l57K48m8N3R5p4J46K99k47l11P3
$$ y = [-27, -115, -206, 171, -181, -397, -304, -25, 206, -152, -57, 53, 151, -176, -169, 102, -84, -65, -245, 39, -55, 200, 101, 507, -3, 191, -99, 92, -126, 83, -44, 314, 174, 190, 218, 21, 312, -2, -81, -67, -190, -204, -123, -184, 240, 214, 309, 209, 52, -9, -218, -25, 83, 370, 108, 67, -271, -68, 251, 122, -41, -173, -23, -62, 58, 228, 189, 204, -127, 31, 59, 139, -128, 50, -187, -239, 68, 118, -48, -49, 27, -17, -166, -74, 32, -190, -34, 171, -233, 59, -117, 35, 231, -2, 230, -91, -234, 69, 187, -175, -29, -179, -102, 163, 48, -304, 111, 149, 167, -59, 27, 257, 271, -2, 288, 147, -2, -61, -61, -132, -278, -319, -47, 65, 298, 172, -50, 90, -212, 58, -84, -132, 23, -341, -52, 173, -116, 137, 56, 103, -217, -463, 27, -11, -78, -136, 22, 90, 132, 42, -51, 53, -87, -10, -40, -281, 202, -173, -142, 43, 126, 145, 301, 68, -162, -322, 16, 71, 24, -76, 204, 189, 23, 85, 52, -305, -57, -105, -52, 43, -31, 115, 414, 167, -144, -71]
4439g1J23r7J87n4M5J47j41r6J9Rj38J75k76M16m29K56J19l51L44J07m7j97P7
4462A27n32M78k96K69M5n4k9J45K12l70M2j46j53K52j94J97J81j48K92j81o7p5
4484ej42k03L51J21Ml82J75M71k9q9k52Ll08J46q9oL57j40o6J89k44L5K41j59
4508b1n6M7Q0k97J07L03j28K62k56j8K4l72L16J12k72M99l07m9N55o57J97q8p7
4531i6K17j07J0k28K02L76n8j57m8N0k18K22j35l29L07m0L03l0r3k70J70n9k42
4554b53J88l2j77J40K93J31P9L2l68n5k01J81l31L36K75j44J76o1k91J64p9k86
4576b83o4q4M37J62l62L07JP4j64p5r3Kj35K61J89J25j39k61J77k72J00j12J0
4599a99O1R5l1K87j77K07K5J1l22O8o2q2q3R0J32K45j35L6p1k26l03J66L7J18
$$ y = [-71, 52, -45, 142, 88, 133, 280, 139, 43, 62, 71, -67, 108, -168, 248, -181, 75, 194, -157, 187, 294, 247, 50, 127, -405, 73, -223, 46, 91, 37, 8, 153, 365, -5, 37, -109, -262, -10, -204, -7, 174, 26, 318, 137, 70, -5, -147, -350, 1, 122, 126, -256, -81, 390, 361, 272, 20, 23, -285, -139, -228, -234, 123, -17, -83, 106, -138, -103, 138, -21, -77, -30, 50, -247, -140, 163, 35, 297, 41, 23, 47, -325, -9, 103, -169, 330, 23, -26, 529, -128, 69, -19, -96, 121, 14, 24, -204, -2, 374, 316, 159, 111, 161, -57, 165, 30, -299, 8, -32, 271, 241, 148, -122, 48, -11, -253, -65, -97, -274, -134, 159, 290, 369, 401, 33, -22, -223, -42, -373, -37, 238, 94, 270, 209, -82, 82, 3, -283, -347, -431, 6, 168, -194, 113, 114, 188, 24, -51, -144, -142, -277, -16, 173, 298, 159, -102, 75, -197, -97, -209, -199, -138, -43, -74, 213, 36, 243, 268, 279, -43, 25, -37, -119, -202, -112, 20, 265, 130, 166, 95, -131, -434, -268, -231, -113]
4623a13J50J41J56j78j53J30l53J75J40k15q4K40p3K52R2j68l3P4m04Q9K89j95
4645d1o3J67j40K93k13L2J06O6l55L7K9l48L02J17J50j74L77q7j82k08J48j96
4667a83J88lJ64j01P9O1k47K44K8p75M71j14J6L79j86n2P5K7j66K04k58k5rj70
4691c53L84J2r2J30M6n8j8j59k23m6K67M8J49O5R1Rj72k52J39J21k30l31M64K82
4715B73k45L74k44l46L47p9k83mL6J89L9l17N19j82J65l0j64j68j18k4K31L1R8
4738I8q6R5J7J07k95K3k59K80j62N6K55J08J38k43L5k01j8N7j76K6L9j02M46k85
4762d7J83j33r3Q8k72K86j09M2M2k44J94J20k78K29o3P6j96J36j58K79j00J72
4784A54o8pj62K46j76R5k26j38L00O8N9K8q6j92J31k4r0k99J03M54N7J4Pj44j78
$$ y = [-113, 37, 178, 334, 156, 3, 133, -220, -45, 95, -120, -204, 36, -37, 215, 307, 139, 106, 180, -224, -135, 154, -41, -104, 63, -77, 216, 3, 35, 141, 207, -148, -111, -82, -430, -128, -11, 139, -35, 342, 255, 73, -135, 13, -183, 5, 2, 166, 65, 144, 205, -42, 202, 230, -545, -74, -188, -172, 207, 21, -31, 44, 71, -95, 109, -149, -174, -183, -353, 31, 43, -49, 81, 127, 69, 51, -108, -331, -377, -110, -62, 87, 152, 243, 252, 80, -172, -33, 88, -142, -473, -9, 273, 28, 402, 158, -188, 159, 80, -203, -207, -171, 18, 57, -260, 259, 77, 242, 212, 48, -120, -238, -262, -31, 0, 98, 12, 107, 124, 231, -64, -41, -300, -20, -182, -126, 129, 237, 375, 132, 167, -34, -52, 5, -171, -145, -106, -208, 238, -47, 136, 3, -90, -2, -274, 12, -97, -55, -13, -257, -63, 57, -221, 8, -55, 21, -175, -39, -197, 82, -18, 154, 86, 79, -83, 163, -13, 82, -144, -282, 18, 86, 145, 173, 87, -105, 26, 2, -88, -387, -284, 170, 227, 241, 248, 104, -74]
4809g4J39R4l35K68l75M54j99k17N00o9M6l23M26m61M0M5J23l18L97J79q2p7k56
4832g5L43k49ONk08L5j34L34j48K31P1J01k91k24J1J01p4q1N71J33n6l43J30j08
4856H1J8p7k81J84K05N0j70J58Jj57mM0r4R9k94K35nJ98N3j36k3k32J05j84K61
4881C1J7q9k6K40J92k96j6lp9q0N5P5o1q6O8K26P2n7k65M07k67k8k64K73k37L66
4907A68qK92k78k40L45k92j05j72L40R5r7J65k36K3L50l52k4j0k60K87r9R4j6
4930c0k8J11K35k30j22m57O00j61j51K72l4K11k1PK9L3l88J1O7j04K33q6j18N01
4954C80j21Lj63p6j40l8J48j86J66P2K86k39k6j10K7j5K1j27J28oM0M4L0K2j38
4979a8k64K12Jj55L42k54K94kj43J35r7J65j76k49l6L56p7j68J84L39j15jj27
$$ y = [-74, 65, 159, -176, 92, -283, 171, -28, -245, 255, 186, 232, -91, 335, -126, -86, -41, 82, -236, 161, 340, 258, 181, -75, 268, 19, 25, 30, -178, -143, -277, 57, -91, 140, 211, 312, 21, -203, -192, -91, -165, -246, 325, 458, 402, 59, 189, 81, 99, 22, -259, -75, 130, 180, 10, 168, 169, 12, 8, 48, -46, 53, -241, -6, -11, 187, 240, 104, 81, -151, -46, -230, 31, 48, -41, -67, 173, 365, 69, 53, 50, -29, -109, -54, 21, -40, -126, -58, 168, 240, 183, -82, 325, 58, 30, -234, 39, -198, 168, 160, 452, 174, -66, 279, -13, -118, -290, 50, 145, 48, 213, -23, 0, 350, -2, -26, -36, -296, -9, -108, -14, -30, -58, 53, 288, 58, -64, -521, 79, -82, -233, 39, 5, 216, 195, 202, 231, 264, -124, -113, -46, -150, 83, -3, -121, 380, 259, 262, 99, 23, -117, -155, -7, -193, -27, 45, 331, 92, 66, -44, -17, -32, -11, -138, -10, -16, 24, 68, 98, 120, -18, -282, -70, -69, -224, 118, -136, 158, 156, 13, 148, 51, 216, 40, -209, -245, 111, 34, -134, 50, 389, 274, 273, 146]
5002A46l50J23J90l56L47j89K93j4j31O6j64j23j41m2M04L6j25K15K79k00Ml52
5024h4N0o3K0n9J71k05J57L26j3j36q7P0r3j67o4O8lJ53P6KM6j15N7k54K11l13
5050b49L21k37K69k67J59J48O5j53j2j36k40R7Q4l5K47P0J2j0j78j39l05K91L15
5073A17m02J85K60j15J52q7j48m9J29o3j30O6K03m79P04l46M0O3j71L2j35R5k16
5096b95M20k42J28k2P3q6J40K6l69K0J58J33j44K67j85K26k16k1J01m08L25n29
5118e00L26K43j40L97k62J13j66j65M65l31l29J41K03k0p5J83J15P1l91Q7q1p6
5140a92R2p4k4K32Q2k3o1k61J77J59m5k64M46m13L36J48k83L66l69L6l30J16k50
5163c99P5L52J11K35k45j3m9p3J18l26o0L86q5Q6M2k52L74j26n5k65R3j40K03
$$ y = [146, -204, -81, 109, -247, 100, -89, 204, 190, 59, 125, -39, -162, -303, -345, 59, 95, -30, 185, 464, 264, 268, -84, -34, -97, -77, -136, 35, -170, -13, 313, 300, 164, 77, 147, 54, -113, -177, -109, -112, 41, 117, 119, 165, 50, 107, -147, 64, -249, 72, -165, 104, -163, -4, 144, 209, 56, 44, -92, -332, -235, -151, -186, 61, 131, 143, 133, -45, -184, -489, -198, 117, -285, -100, 160, 45, 197, 110, -38, -87, 42, -21, -151, -85, 118, -361, 343, -3, 37, 100, -71, -39, -174, -79, -295, 125, -117, 11, -11, 62, -24, 116, 142, -227, -207, -49, 84, -60, 207, 22, 248, 32, 11, 112, -296, 29, -500, -174, 69, -71, 326, 64, 177, 11, -154, 311, -20, -349, -208, -5, -25, -100, 83, 198, 269, -122, -35, -116, -192, -100, -174, -198, 34, 116, 93, 32, -229, -52, 107, 62, -202, 244, -169, 167, 315, 32, 398, 29, 65, -265, -149, -399, -324, 28, 139, 374, 129, 116, 67, -6, 112, -214, -274, 112, 27, 113, 155, -97, 277, 151, 96, -169, -76, -216, -13]
5186a3K8j5k08M46k56K01k11L2J06k98k5K08o5J02l7l4J53l4j95k22j34J94K69
5209hj11J25k33L68L26m01n5K7O3n0m23J76r0O08j50k17L04j08m08L25j6l15J65
5232i8R8J22J1Q3j14J53k04j22J9o8J30MQP1Rq4J70j07k23O1n7P3l7L81o8j51
5258F0k67M42k61m0M0k33j7JO27j13Q3j56j64K5j53N8r5j42K62Q5Jl5K19j85R7
5283A39N5m43K34L02m83K78j11K26j50K63k23l09lP8K15m39K13L0K41J11K85j78
5305C31l38j60P8j68J91j78J47K95m7j19J62j93J9k86M74%l93K46n9J39J68q4
5327B25k50K9k11jq8K81r7K64J44j48m5k10L13j96j59j5p4L58j19K69j74n7k8
5350A1r8kj96K00J7k19L89N0q7J20K18k39j77j05K1K44l47K69j24K43O1l03r0
$$ y = [-13, 15, 0, -208, 238, -18, 183, -28, 4, 110, -188, -213, -5, -70, 32, -5, -39, 114, 80, -115, -337, -471, -277, -8, -119, 6, -227, 141, 467, 66, 11, 38, 101, 51, -372, -196, -286, 322, 172, -45, 259, 151, -257, 68, 52, -263, -98, 0, 122, 133, 216, 102, 255, 51, -71, -52, -120, 10, 14, 22, 93, 102, 18, 188, 81, -142, -81, -138, -65, -102, 279, 211, 60, -207, 235, -26, -66, -26, -259, -276, -275, 352, 239, 322, 166, 2, 27, -126, -68, -163, -305, -43, 42, 43, 8, 227, 42, 139, 194, -249, -15, 287, -196, 82, -29, 197, 47, 310, 87, -222, -225, -147, 68, -371, -158, -128, 113, 224, 509, 331, -7, -167, -89, -257, -66, -244, -97, 198, 151, 32, 194, 1, 20, -266, 208, 208, -185, 61, 2, 141, 309, 225, -25, 4, -207, -208, -296, -15, -112, 152, 296, 148, 103, -107, 206, 10, -149, -164, -238, 120, 1, 270, 96, 39, 11, -87, -89, -285, -85, -68, -287, 102, 152, 65, 185, 403, 164, -13, -118, -97, 147, -200, 69, -55, 188, 249, -54, -144]
5373a44J8q4k5L46k68R4R8J01J09k50J82q1n7p6M9k6j73O5K66n5J79k37j6j21
5397a06n4k1K37k99L72j81J79j95P8J57j19l21L52m03M78Q4M1J35o29K34k23K49
5419D5k09j01J65m3L66k69J90Q0l41L74j72j36j65L47j87J77M2L5j22o9j22J87
5441G2j76j78M42m95K86J73k55K98J88l61j60N2J11q7Q9l5N3N7j7K61j33O3j55
5464I3l01j59K74l02N63n6J52l05J85Q7k07j37L4K7k4j27K29P3J22O1L0o2k68
5487a8j85J63K25k07K37n4J13k24M0mr4j9J5Jk2J06j20j4J92q8k5l04K63j25K16
5512F8k89M09k50K35K1l17K28j01k10k82K59J66J50R3j62l3L1q9j4J39K6j61k64
5535c47K28o0J29K19j66o0q5J42l93K56n3M39k29m9L7j32J66L7l06L11J30m85
$$ y = [-144, -126, -210, -235, 111, -157, -63, 35, 136, 245, -5, 177, 96, 39, -37, 12, -14, -187, -122, 144, 89, 268, 31, 15, -106, -160, -181, 56, -243, 129, -52, 127, -68, 10, 167, 48, -273, 79, -324, 154, 238, 279, 414, -215, 19, -204, 45, -164, -265, -100, -143, 223, -46, 144, 224, -117, 257, 85, -51, -216, 131, -56, 121, 163, 198, 76, 7, -115, 72, -104, -282, 160, -335, -49, 124, -131, 167, 355, -6, -166, -114, -3, -90, -1, -36, 17, 74, 57, 318, 185, 248, 93, -208, -367, -93, -395, 168, 112, 264, -41, 144, 231, 24, -113, -79, -52, -76, -203, 26, 99, 221, 282, 312, 250, -18, -203, -40, 185, -22, 215, 161, 274, 50, 90, 86, -8, -27, -12, -11, -33, 73, -47, -61, 131, 43, 18, -286, -23, -148, 68, -221, 188, -62, 173, 194, -123, 105, 4, -206, -488, -229, -63, 87, 180, 18, -15, 16, -73, -87, 52, 78, -83, -347, -119, -179, -50, 169, 3, -57, -142, 0, -393, -137, -190, 249, 20, -29, 8, -124, 42, 79, -227, 84, 214, -271]
5557b71J3M60J11k28PJ71k87j75K9N5k57N90l31M2M99j84k12J81r1l36Q7o5n5
5580b47J95j4o7J74J12p5L74n08q0Q7j69j3M8J82J71j27j68L59K0n25k2J85L08
5603B00r8j19K64j05k59L09l17l2m4r8L80R1j90J67j19r0K16j12M2l29Q4K40p8
5626CJ64j31J53j52L6j17r8Q6J5j3n8J07j48J00K81k45M8N9p8m56J52L07l09N94
5650C00l18J13J80j61q2j57L9j80K31J17l01K01K36o0K1o3k01m50M72K2J26L7
5672A22j17Q0M1k23Q9l43L71k43K14J38k75L24L43l04P2l23r7M1O2j8J18Q1k7
5695A26N3L00l31l0k21k19K72o0p8M33m35L11n5m1J6M4k7k65L44j41l0K64j89
5718D1N2J04j27j30k3l55K14J39k19K13J04N5K09J01k79k82R6J10j20J59Q4J11
$$ y = [-271, -258, 202, 313, 85, 92, 263, -24, -199, -170, -115, -372, 218, -113, -71, 428, 244, 32, 213, 122, -214, -127, -192, -247, -52, -66, -133, 41, 153, 78, 452, -56, -136, -49, -218, -231, -183, -1, 170, 43, -125, 234, 254, -271, -293, -108, 200, 102, -17, 247, 142, -117, 192, -125, -157, -201, -299, 81, 172, -18, 149, 30, -60, 156, 44, 86, -243, -159, 81, 3, 167, 36, 189, 37, 73, -44, -142, -56, -41, -54, -112, -5, -153, -53, 228, -17, 31, 90, 12, -444, -292, 15, -294, 300, -18, 95, 275, 114, 32, -125, -86, -266, -35, 82, -219, -18, 218, 158, 179, 116, -85, -535, -63, -41, 85, 122, 5, 85, 126, -97, -8, -351, 20, -223, -9, 129, -146, 178, 521, 217, 289, -34, -131, -90, -28, -46, 72, 153, 126, 179, 479, 148, 118, -103, -322, -50, -110, -188, 245, -190, 121, 66, 25, 41, 85, 58, -207, 137, -4, -34, 230, 41, 93, 197, 70, -60, -83, -438, -224, -85, -304, -91, 13, 68, 277, 378, 99, -183, -87, 23, -97, 62, 146, 257]
5740B57k03L04m76J05K8K1L5m2L0o4P3j8J81M9l30Oj80q0K99J15j40Q5j6Q1l9
5765H1r1K11l58n6J04k0j36k2M57l80M45J4k18j25m2j4j77L13l7J24J02j38k70
5788b33M50j74k36K86k89J68J1j21M11j2J20k98k48K73l77O4K15K3J07K46r7l11
5810b2J7K28m97j4M7rm5K14N1O9R2J56nm14Q7P3k7l09q0M82J54j35O8k92L0p8
$$ y = [257, 54, 358, -118, -13, 15, 36, 71, 29, 59, -5, 68, 50, 231, 280, -50, -44, -224, -304, -5, 110, -30, 55, 39, 120, 81, -10, 201, -157, -213, -109, -129, -265, -287, 170, -210, 235, 249, 31, -94, -136, -150, -327, -14, -51, 73, 175, 37, -233, 217, 43, -193, 93, -196, -28, -17, -138, 273, 261, 381, 83, -165, 108, -269, -205, 10, 33, 140, 386, 289, -22, -5, 223, -274, -288, -241, -250, -295, -81, -30, 39, 131, 287, 282, -132, -45, 28, 1, -308, -388, 94, 248, 113, 181, -111, -81, -159]
$$ [...]
8191e4
##END NTUPLES=NMR FID
##END=
