##TITLE=1H_PR166-n3
 D2O, 8 sc, 
 12.2.2019
##JCAMPDX= 6.0         $$ Bruker NMR JCAMP-DX V2.0
##DATA TYPE= NMR FID
##DATA CLASS= NTUPLES
##ORIGIN= UXNMR, Bruker Analytische Messtechnik GmbH
##OWNER= root
$$ XWIN-NMR		Version 3.5
$$ Tue Feb 12 14:28:24 2019 Russian Standard Time (UT+4h)  she@DPX200
##.OBSERVE FREQUENCY= 200.1313
##.OBSERVE NUCLEUS= ^1H
##.DELAY= (6, 6)
##.ACQUISITION MODE= SIMULTANEOUS
##.ACQUISITION SCHEME= undefined
##.AVERAGES= 8
##.DIGITISER RES= 18
##SPECTROMETER/DATA SYSTEM= spect
##.PULSE SEQUENCE= zg30
##.SOLVENT NAME= D2O
##.SHIFT REFERENCE= (INTERNAL, D2O, 0, 15.7039)
##AUDIT TRAIL= $$ (NUMBER, WHEN, WHO, WHERE, WHAT)
$$ ##TITLE= Audit trail, XWIN-NMR		Version 3.5
$$ ##JCAMPDX= 5.01
$$ ##ORIGIN= Bruker BioSpin GmbH
$$ ##OWNER= she
$$ F:/spectra/data/she/nmr/H-F/1/audita.txt
$$ ##AUDIT TRAIL=  $$ (NUMBER, WHEN, WHO, WHERE, WHAT)
(   1,<2019-02-12 14:24:37.07 +0400>,<she>,<DPX200>,
      <created by zg, POWCHK disabled, PULCHK disabled
       configuration hash MD5:
       00 E9 B6 7A A2 85 ED C7 34 08 36 98 17 FE 4E 26
       data hash MD5: 16K
       7C A0 96 1C DC C3 92 E2 9C 3B 17 F5 4A D2 FE 2E>)
$$ ##END=
$$ 
$$ hash MD5
$$ 03 80 DE 70 46 41 0C 08 4F 1F 26 CA 68 F1 F7 5D
##$RELAX= 
##$RELAX= 
##$RELAX= 
##$RELAX= 
##$RELAX= 
##$RELAX= 
$$ Bruker specific parameters
$$ --------------------------
##$DU= <F:/spectra>
##$EXPNO= 1
##$NAME= <H-F>
##$PROCNO= 1
##$TYPE= <nmr>
##$USER= <she>
##$AMP= (0..31)
100 100 100 100 100 100 100 100 100 100 100 100 100 100 100 100 100 100 
100 100 100 100 100 100 100 100 100 100 100 100 100 100 
##$AQSEQ= 0
##$AQ_mod= 1
##$AUNM= <au_zg>
##$AUTOPOS= <>
##$BF1= 200.13
##$BF2= 200.13
##$BF3= 200.13
##$BF4= 200.13
##$BF5= 200.13
##$BF6= 200.13
##$BF7= 200.13
##$BF8= 200.13
##$BYTORDA= 1
##$CFDGTYP= 0
##$CFRGTYP= 5
##$CHEMSTR= <none>
##$CNST= (0..31)
1 1 145 1 1 1 1 1 1 1 1 1 1 1 1 1 1 1 1 1 1 1 1 1 1 1 1 1 1 1 1 1 
##$CPDPRG= <>
##$CPDPRG1= <>
##$CPDPRG2= <>
##$CPDPRG3= <>
##$CPDPRG4= <mlev>
##$CPDPRG5= <mlev>
##$CPDPRG6= <mlev>
##$CPDPRG7= <mlev>
##$CPDPRG8= <mlev>
##$CPDPRGB= <>
##$CPDPRGT= <>
##$D= (0..31)
0 1.2 0 0 0 0 0 0 0 0 0 0.03 0 0 0 0 0 0 0 0 0 0 0 0 0 0 0 0 0 0 0 0 
##$DATE= 1549967076
##$DBL= (0..7)
120 120 120 120 120 120 120 120 
##$DBP= (0..7)
150 150 150 150 150 150 150 150 
##$DBP07= 0
##$DBPNAM0= <>
##$DBPNAM1= <>
##$DBPNAM2= <>
##$DBPNAM3= <>
##$DBPNAM4= <>
##$DBPNAM5= <>
##$DBPNAM6= <>
##$DBPNAM7= <>
##$DBPOAL= (0..7)
0.5 0.5 0.5 0.5 0.5 0.5 0.5 0.5 
##$DBPOFFS= (0..7)
0 0 0 0 0 0 0 0 
##$DE= 6
##$DECBNUC= <off>
##$DECIM= 32
##$DECNUC= <off>
##$DECSTAT= 4
##$DIGMOD= 1
##$DIGTYP= 9
##$DL= (0..7)
0 120 120 120 120 120 120 120 
##$DP= (0..7)
150 150 150 150 150 150 150 150 
##$DP07= 0
##$DPNAME0= <>
##$DPNAME1= <>
##$DPNAME2= <>
##$DPNAME3= <>
##$DPNAME4= <>
##$DPNAME5= <>
##$DPNAME6= <>
##$DPNAME7= <>
##$DPOAL= (0..7)
0.5 0.5 0.5 0.5 0.5 0.5 0.5 0.5 
##$DPOFFS= (0..7)
0 0 0 0 0 0 0 0 
##$DQDMODE= 0
##$DR= 18
##$DS= 0
##$DSLIST= <SSSSSSSSSSSSSSS>
##$DSPFIRM= 0
$$ [...]
##$SUBNAM2= <"">
##$SUBNAM3= <"">
##$SUBNAM4= <"">
##$SUBNAM5= <"">
##$SUBNAM6= <"">
##$SUBNAM7= <"">
##$SUBNAM8= <"">
##$SUBNAM9= <"">
##$SW= 20.0189088683792
##$SWIBOX= (0..15)
0 0 2 0 0 0 0 0 0 0 0 0 0 0 0 0 
##$SW_h= 4006.41025641026
##$TD= 16384
##$TD0= 1
##$TE= 0
##$TE2= 300
##$TE3= 300
##$TEG= 300
##$TL= (0..7)
0 120 120 120 120 120 120 120 
##$TP= (0..7)
150 150 150 150 150 150 150 150 
##$TP07= 0
##$TPNAME0= <>
##$TPNAME1= <>
##$TPNAME2= <>
##$TPNAME3= <>
##$TPNAME4= <>
##$TPNAME5= <>
##$TPNAME6= <>
##$TPNAME7= <>
##$TPOAL= (0..7)
0.5 0.5 0.5 0.5 0.5 0.5 0.5 0.5 
##$TPOFFS= (0..7)
0 0 0 0 0 0 0 0 
##$TUNHIN= 0
##$TUNHOUT= 0
##$TUNXOUT= 0
##$USERA1= <user>
##$USERA2= <user>
##$USERA3= <user>
##$USERA4= <user>
##$USERA5= <user>
##$V9= 5
##$VALIST= <valist>
##$VCLIST= <CCCCCCCCCCCCCCC>
##$VD= 0
##$VDLIST= <DDDDDDDDDDDDDDD>
##$VPLIST= <PPPPPPPPPPPPPPP>
##$VTLIST= <TTTTTTTTTTTTTTT>
##$WBST= 1024
##$WBSW= 4
##$XGAIN= (0..3)
0 0 0 0 
##$XL= 0
##$YL= 0
##$YMAX_a= 462291
##$YMIN_a= -559985
##$ZGOPTNS= <>
##$ZL1= 120
##$ZL2= 120
##$ZL3= 120
##$ZL4= 120
##$ABSF1= 10
##$ABSF2= 0
##$ABSG= 5
##$ABSL= 3
##$ALPHA= 0
##$AQORDER= 0
##$ASSFAC= 0
##$ASSFACI= 0
##$ASSFACX= 0
##$ASSWID= 0
##$AUNMP= <proc_1d>
##$AZFE= 0.1
##$AZFW= 0.1
##$BCFW= 1
##$BC_mod= 2
##$BYTORDP= 1
##$COROFFS= 0
##$CY= 11.3945322036743
##$DATMOD= 1
##$DC= 2
##$DFILT= <>
##$DTYPP= 0
##$F1P= 18.9103706918063
##$F2P= -1.10871071338519
##$FCOR= 0.5
##$FTSIZE= 0
##$FT_mod= 4
##$GAMMA= 1
##$GB= 0.15
##$INTBC= 1
##$INTSCL= 1
##$ISEN= 128
##$LB= 0.24
##$LEV0= 0
##$LPBIN= 0
##$MAXI= 10000
##$MC2= 0
##$MEAN= 0
##$ME_mod= 0
##$MI= 1.114404
##$NCOEF= 0
##$NC_proc= 0
##$NLEV= 6
##$NOISF1= 3.799351
##$NOISF2= 2.8
##$NSP= 1
##$NTH_PI= 0
##$NZP= 0
##$OFFSET= 15.70392
##$PC= 1
##$PHC0= -8694.289
##$PHC1= 8.80018
##$PH_mod= 1
##$PKNL= yes
##$PPARMOD= 0
##$PSCAL= 0
##$PSIGN= 0
##$REVERSE= no
##$SF= 200.130013532006
##$SI= 16384
##$SIGF1= 3
##$SIGF2= 2
##$SINO= 400
##$SIOLD= 16384
##$SREGLST= <1H.CDCl3>
##$SSB= 0
##$STSI= 0
##$STSR= 0
##$SW_p= 3612.71676300578
##$SYMM= 0
##$S_DEV= 0
##$TDeff= 0
##$TDoff= 0
##$TI= <>
##$TILT= no
##$TM1= 0
##$TM2= 0
##$TOPLEV= 0
##$USERP1= <user>
##$USERP2= <user>
##$USERP3= <user>
##$USERP4= <user>
##$USERP5= <user>
##$WDW= 1
##$XDIM= 8192
##$YMAX_p= 0
##$YMIN_p= 0
$$ End of Bruker specific parameters
$$ ---------------------------------
##NTUPLES= NMR FID
##VAR_NAME=  TIME,          FID/REAL,        FID/IMAG
##SYMBOL=    X,             R,               I
##VAR_TYPE=  INDEPENDENT,   DEPENDENT,       DEPENDENT
##VAR_FORM=  AFFN,          ASDF,            ASDF
##VAR_DIM=   8192,          8192,            8192
##UNITS=     SECONDS,       ARBITRARY UNITS, ARBITRARY UNITS
##FACTOR=    0.0002496,     1,               1
##FIRST=     0,             0,               0
##LAST=      2.0444736,     0,               0
##MIN=       0,             -559985,         0
##MAX=       2.0444736,     462291,          0
$$ Real data points
##PAGE= N=1
##DATA TABLE= (X++(R..R)), XYDATA
$$ plain form
0 0 0 0 0 0 0 0 0 0 0 0 0 8 -8 8 -11 16 -16 21 -25 32 -36 46 -52 64 -73 85 -101 114 -133 153 -175 199 -226
33 -226 257 -289 325 -367 409 -460 512 -572 635 -703 781 -863 954 -1052 1161 -1281 1408
50 1408 -1555 1711 -1887 2081 -2299 2546 -2823 3144 -3512 3951 -4473 5108 -5910 6948 -8353
65 -8353 10378 -13564 19337 -33157 139939 -18699 -351451 -183699 -90082 -221751 -353166
76 -353166 -93764 274211 388977 235965 159221 155495 25629 -242587 -347836 -241713 -138001
87 -138001 -135114 -4899 293782 452081 251341 -23926 -54172 22186 -137692 -422822 -411048
98 -411048 -42040 247745 209096 101932 202172 318935 154436 -183070 -338284 -256080
108 -256080 -169301 -155754 -51446 170838 302510 242995 153287 130616 30249 -219684 -388367
$$ packed form
0@%%%%%%%%%%%Qj6J6j9K7l2L7m6N7o8Q2r8J16j37J58j86K15k47K86l28L74m25
33b26M83n46O14o92P76q69R72j084J207j338J484j644J817k006K213k442K689
50A408k963L266l598L968m380M845n369N967o656P463q424R581j1018J2858j5301
65h353J8731k3942L2901n2494J73096j58638l32752J67752R3617j31669j31415
76c53166K59402L67975J14766j53012p6744l726j29866k68216j05249J06123J03712
87a38001K887J30215K98681J58299k00740k75267l0246P6358j59878k85130J1774
98d11048L69008K89785l8649j07164J00240J16763j64499l37506j55214Q2204
108b56080Q6779J3547J04308K22284J31672n9515q9708k2671j00367k49933j68683
$$ plain form
119 -388367 -270214 -36639 28597 -14639 104914 353788 387779 102450 -180616 -198836 -113760
130 -113760 -174592 -282503 -176861 107642 287305 255796 178021 151982 72316 -111526 -252717
141 -252717 -240115 -166685 -126272 -37399 167478 331218 272205 81523 -10110 375 -86537
152 -86537 -289010 -356263 -155786 101667 174802 127173 157823 241878 181760 -45365 -232342
163 -232342 -249350 -185970 -142508 -71712 75500 210414 232822 181281 132200 47946 -121684
174 -121684 -275950 -263967 -120470 -18677 2362 75345 237766 313912 175074 -48226 -150040
185 -150040 -134936 -152041 -214408 -178097 3316 182970 232730 192028 146900 82124 -44354
196 -44354 -175514 -220371 -186632 -134526 -55051 88593 231025 250084 145119 43514 1998
$$ packed form
119c88367J18153K33575O5236m3236J19553K48874L3991k85329k83066j8220Q5076
130a13760o0832j07911J05642K84503J79663l1509p7775k6039p9666j83842j41191
141b52717J2602P3430M0413Q8873K04877J63740n9013j90682r1633J0485q6912
152h6537k02473o7253K00477K57453P3135m7629L0650Q4055o0118k27125j86977
163b32342j7008O3380M3462P0796J47212J34914K2408n1541m9081q4254j69630
174a21684j54266J1983J43497J01793K1039P2983J62421P6146j38838k23300j01814
185a50040J5104j7105o2367L6311J81413J79654M9760m0702m5128o4776j26478
196d4354j31160m4857L3739N2106P9475J43644J42432J9059j04965j01605m1516
$$ plain form
207 1998 -63330 -197022 -278913 -188442 1198 119810 134460 149611 196652 173886 26147
218 26147 -144368 -215345 -194154 -151697 -92987 16164 140485 202026 186028 137501 64745
229 64745 -58831 -192006 -234435 -161267 -62901 -4963 58723 170846 253273 197900 38160
240 38160 -88286 -126313 -144731 -183058 -170825 -52459 104106 189390 188006 153603 100687 3033
252 3033 -117117 -189000 -185430 -140076 -72543 34412 157614 217820 174249 84812 15717 -48514
264 -48514 -144753 -224125 -196934 -68544 57214 115865 143119 174560 166172 68447 -72731 -165184
276 -165184 -180216 -155935 -109615 -22720 91497 172370 182513 143227 79746 -13857 -126660
287 -126660 -198068 -181651 -106248 -30104 38742 123834 197425 191124 92580 -25520 -98790 -136729
$$ packed form
207A998o5328j33692q1891R0471J89640J18612J4650J5151M7041k2766j47739
218B6147j70515p0977K1191M2457N8710J09151J24321O1541j5998m8527p2756
229F4745j23576j33175m2429P3168R8366N7938O3686J12123Q2427n5373j59740
240C8160j26446l8027j8418l8327J2233J18366J56565Q5284j384l4403n2916r7654
252C033j20150p1883L570M5354O7533J06955J23202O0206m3571q9437o9095o4231
264d8514r6239p9372K7191J28390J25758N8651K7254L1441q388r7725j41178r2453
276a65184j5032K4281M6320Q6895J14217Q0873J0143l9286o3481r3603j12803
287a26660p1408J6417P5403P6144O8846Q5092P3591o301r8544j18100p3270l7939
$$ plain form
299 -136729 -165473 -160022 -81725 44034 141455 173521 160016 119335 41959 -64331 -150903 -177678
311 -177678 -149077 -89895 -5798 95956 172059 179027 122933 46323 -28957 -108484 -175879 -183129
323 -183129 -111915 -6195 78505 130166 160658 156670 94147 -13586 -111952 -160086 -159856 -124297
335 -124297 -55422 40265 128273 168700 153408 98529 19044 -72556 -147989 -172473 -136876 -65203
347 -65203 15931 94658 155226 170647 123388 33763 -56974 -121311 -154816 -151561 -101278 -10790
359 -10790 85032 146660 159084 128788 65860 -19114 -103810 -156608 -155959 -107356 -30873 53764
371 53764 125418 161513 145612 83420 -903 -81102 -138202 -158012 -129730 -56926 33665 108182
383 108182 146714 144922 104125 29002 -61270 -132063 -156545 -131825 -73971 2149 82193 142653
$$ packed form
299a36729k8744N451P8297J25759R7421L2066j3505m0681p7376j06290q6572k6775
311a77678K8601N9182Q4097J01754P6103O968n6094p6610p5280p9527o7395p250
323a83129P1214J05720Q4700N1661L0492l988o2523j07733r8366m8134K30L5559
335a24297O8875R5687Q8008M0427j5292n4879p9485r1600p5433k4484L5597P1673
347f5203Q1134P8727O0568J5421m7259q9625r0737o4337l3505L255N0283R0488
359a0790R5822O1628J2424l0296o2928q4974q4696n2798O49M8603P6483Q4637
371E3764P1654L6095j5901o2192q4323q0199n7100j9810K8282P2804R0591P4517
383A08182L8532j792m0797p5123r0272p0793k4482K4720N7854P6120Q0044O0460
$$ plain form
395 142653 156609 116850 43725 -35898 -104317 -147064 -147622 -97247 -14103 67199 122881 146100
407 146100 131769 74237 -13257 -95115 -139277 -140175 -107672 -45992 36904 114825 151436 134415
419 134415 80879 12719 -60917 -125665 -152543 -123976 -55107 20630 85517 132654 146083 109067
431 109067 30451 -52111 -108432 -134581 -131089 -87960 -6962 79099 129971 135354 109985 59932
443 59932 -15236 -96476 -143370 -135806 -88342 -27062 40646 107722 146123 129425 66298 -7475
455 -7475 -69694 -117675 -140775 -117014 -46461 35897 95437 125070 129138 97820 25195 -60864
467 -60864 -117520 -129628 -110729 -70303 -2826 79159 135035 134654 92048 35892 -24419 -89107
479 -89107 -136922 -134428 -79690 -6188 57047 105104 132952 120498 60783 -18435 -81793 -116983
$$ packed form
395A42653J3956l9759p3125p9623o8419m2747n58N0375Q3144Q1302N5682K3219
407A46100j4331n7532q7494q1858m4162q98L2503O1680Q2896P7921L6611j7021
419A34415n3536o8160p3636o4748k6878K8567O8869P5737O4887M7137J3429l7016
431A09067p8616q2562n6321k6149L492M3129Q0998Q6061N0872N383k5369n0053
443E9932p5168q1240m6894P564M7464O1280O7708O7076L8401j6698o3127p3773
455g475o2219m7981k3100K3761P0553Q2358N9540K9633M068l1318p2625q6059
467f0864n6656j2108J8899M0426O7477Q1985N5876l81m2606n6156o0311o4688
479h9107m7815K494N4738P3502O3235M8057K7848j2454n9715p9218o3358l5190
$$ plain form
491 -116983 -126896 -103379 -38776 44768 105341 122903 110836 79283 20372 -60250 -124494 -135459
503 -135459 -98806 -45289 11665 73556 125017 134231 90289 20261 -44235 -93633 -124984 -121281
515 -121281 -72226 1417 66387 106907 123782 108971 52725 -28213 -93119 -117826 -111098 -85522
527 -85522 -33764 43477 111895 132126 103052 54551 3133 -55310 -112248 -134367 -101334 -34347
539 -34347 31785 81961 115334 120442 83138 15463 -52839 -99218 -120150 -110836 -62826 11356
551 11356 76732 108669 110462 92852 48291 -25508 -98848 -129478 -108129 -61701 -12737 41531
563 41531 97636 129138 110143 49500 -19171 -73382 -106918 -115229 -88797 -32424 33495 87584
575 87584 118636 115449 71147 694 -63794 -98754 -107260 -96547 -58918 9655 83947 122042
$$ packed form
491a16983r913K3517O4603Q3544O0573J7562j2067l1553n8911q0622o4244j0965
503a35459L6653N3517N6954O1891N1461R214m3942p0028o4496m9398l1351L703
515a21281M9055P3643O4970M0520J6875j4811n6246q0938o4906k4707O728K5576
527h5522N1758P7241O8418K0231k9074m8501n1418n8443n6938k2119L3033O6987
539c4347O6132N0176L3373N108l7304o7675o8302m6379k0932R314M8010P4182
551A1356O5376L1937J793j7610m4561p3799p3340l0630K1349M6428M8964N4268
563D1531N6105L1502j8995o0643o8671n4211l3536q311K6432N6373O5919N4089
575H7584L1052l187m4302p0453o4488l4960q506J0713L7629O8573P4292L8095
$$ plain form
587 122042 110292 69300 22752 -28219 -83883 -121942 -114584 -62685 4990 63065 100477 112619
599 112619 92272 43291 -19033 -74900 -111032 -115338 -79672 -15237 49416 89437 104208 98933
611 98933 68315 5668 -69168 -115329 -112372 -76128 -31367 16471 69680 112597 116795 74317
623 74317 8254 -51580 -90358 -105675 -95099 -56363 2759 63456 106605 115428 84174 25634
635 25634 -35567 -78045 -98882 -100475 -75459 -18468 53916 104666 111024 82283 40669 -4910
647 -4910 -56481 -102766 -117252 -85099 -21803 41909 83812 100238 93242 63206 12521 -48321
659 -48321 -98248 -115217 -90131 -35364 22923 66244 91995 100812 83136 30748 -40501 -95964
671 -95964 -109548 -86615 -47780 -3908 44947 91650 113195 92048 35531 -28662 -75356 -96330
$$ packed form
587A22042j1750m0992m6548n0971n5664l8059P358N1899O7675N8075L7412J2142
599A12619k0347m8981o2324n5867l6132m306L5666O4435O4653M0021J4771n275
611I8933l0618o2647p4836m6161K957L6244M4761M7838N3209M2917M198m2478
623G4317o6063n9834l8778j5317J0576L8736N9122O0697M3149Q823l1254n8540
635B5634o1201m2478k0837j593K5016N6991P2384N0750O358k8741m1614m5579
647d910n1571m6285j4486L2153O3296O3712M1903J6426o996l0036n0685o0842
659d8321m9927j6969K5086N4767N8287M3321K5751Q817j7676n2388p1249n5463
671i5964j3584K2933L8835M3872M8855M6703K1545k1147n6517o4193m6694k0974
$$ plain form
683 -96330 -93843 -70048 -25122 34987 89400 113353 94391 44644 -11365 -55900 -85279 -99342
695 -99342 -87414 -41311 26282 83432 105176 91205 57018 13938 -34980 -82359 -108727 -96949
707 -96949 -47372 16622 67184 91579 91580 73101 35704 -20408 -78433 -110280 -98507 -52509 746
720 746 44492 77598 97893 92226 50300 -14838 -72700 -99360 -92287 -64423 -23317 25065 72424
733 72424 102073 98998 58701 -2081 -57092 -87790 -91411 -76019 -43548 7427 66052 105088
745 105088 101062 60502 9168 -34023 -68688 -93576 -94997 -59674 2220 60190 92122 93322
757 93322 71614 32971 -15862 -63656 -95648 -98421 -66986 -11243 45772 81744 89789 78047
769 78047 50690 4888 -53742 -98348 -102464 -67838 -19008 23676 60332 89585 96165 65984
$$ packed form
683i6330K487K3795M4926O0109N4413K3953j8962m9747n6009m4535k9379j4063
695i9342J1928M6103O7593N7150K1744j3971l4187m3080m8918m7379k6368J1778
707i6949M9577O3994N0562K4395Jj8479l7397n6112n8025l1847J1773M5998N3255
720G46M3746L3106K0295n667m1926o5138n7862k6660P073K7864M1106M8382M7359
733G2424K9649l075m0297o0782n5011l0698l621J5392L2471N0975N8625L9036
745A05088m026m0560n1334m3191l4665k4888j421L5323O1894N7970L1932J200
757I3322k1708l8643m8833m7794l1992k773L1435N5743N7015L5972Q045j1742
769G8047k7357m5802n8630m4606m116L4626M8830M2684L6656K9253O580l0181
$$ plain form
781 65984 8574 -48829 -83706 -91554 -76531 -41878 6294 54882 88518 96795 73282 23391
793 23391 -34158 -75018 -88619 -79821 -56207 -14272 42053 89744 101295 73399 28134 -14118
805 -14118 -52155 -84372 -96019 -72018 -18722 37665 75329 89396 80816 50187 2985 -46159
817 -46159 -81428 -93832 -77700 -34331 21744 66685 85658 81305 60999 23708 -30160 -80439
829 -80439 -99182 -78655 -37111 4523 42908 77967 94893 76957 28310 -26143 -65944 -85396
841 -85396 -83419 -58161 -13081 37148 74389 90254 80510 44096 -8740 -57430 -82605 -81931 -65083
854 -65083 -31653 18248 70029 95810 82510 45266 4639 -33749 -70607 -92796 -81128 -37218
866 -37218 16077 56519 79492 84158 65090 22406 -28651 -67748 -85720 -80902 -51945 -2969
$$ packed form
781F5984n7410n7403l4877p848J5023L4653M8172M8588L3636Q277k3513m9891
793B3391n7549m0860j3601Q798K3614M1935N6325M7691J1551k7896m5265m2252
805a4118l8037l2217j1647K4001N3296N6387L7664J4067q580l0629m7202m9144
817d6159l5269j2404J6132M3369N6075M4941J8973m353k0306l7291n3868n0279
829h0439j8743K0527M1544M1634L8385L5059J6926j7936m8647n4453l9801j9452
841h5396J977K5258M5080N0229L7241J5865r744l6414n2836m8690k5175O74J6848
854f5083L3430M9901N1781K5781j3300l7244m0627l8388l6858k2189J1668M3910
866c7218N3295M0442K2973M666j9068m2684n1057l9097j7972M818K8957M8976
$$ plain form
878 -2969 48070 78669 82140 67097 37231 -8163 -59397 -90889 -85192 -51602 -12445 25285 62631
891 62631 89135 84352 45040 -7044 -48252 -73218 -82698 -70582 -32179 19688 61187 80792
903 80792 79367 57719 14976 -36650 -73537 -81959 -68875 -42433 -1811 48066 84667 86880 57911
916 57911 19175 -17449 -53821 -83602 -86059 -52394 -2081 40003 65840 79427 74284 41290
928 41290 -10234 -55041 -76362 -77359 -61564 -25531 25116 67305 81850 70543 46006 10307
940 10307 -35881 -76414 -87087 -63746 -26473 9489 44967 77265 86635 59652 11043 -31813
952 -31813 -58866 -74999 -76162 -49791 -88 47434 72250 74857 63204 34191 -12740 -58696
964 -58696 -79811 -72505 -49727 -17577 25575 68059 85665 68777 33086 -2381 -36802 -69807
$$ packed form
878b969N1039L0599L471j5043k9866m5394n1234l1492N697L3590L9157L7730L7346
891F2631K6504m783l9312n2084m1208k4966r480J2116L8403N1867M1499J9605
903H0792j425k1648m2743n1626l6887q422J3084K6442M0622M9877L6601K213k8969
916E7911l8736l6624l6372k9781k457L3665N0313M2084K5837J3587n143l2994
928D1290n1524m4807k1321r97J5795L6033N0647M2189J4545j1307k4537l5699
940A0307m6188m0533j0673K3341L7273L5962L5478L2298R370k6983m8609m2856
952c1813k7053j6133j163K6371M9703M7522K4816K607j1653k9013m6931m5956
964e8696k1115P306K2778L2150M3152M2484J7606j6888l5691l5467l4421l3005
$$ plain form
976 -69807 -85279 -65820 -20153 23995 52507 70180 75735 56241 10378 -38725 -67484 -73100
988 -73100 -64503 -40650 2398 50000 76501 73675 52708 23451 -15622 -58604 -82834 -72490
1000 -72490 -39260 -3401 30003 62758 81576 69526 29309 -15566 -46886 -66689 -74714 -60300
1012 -60300 -19161 29795 61915 70841 65677 45646 7071 -40451 -72133 -74487 -56037 -28422
1024 -28422 7538 48963 77102 75204 46599 10409 -24106 -55963 -77129 -71726 -37511 6508
1036 6508 41253 62371 71980 62733 27618 -19774 -56106 -69649 -66191 -48694 -14671 30391 65502
1049 65502 74701 59973 33146 -1132 -40462 -71005 -75858 -52362 -17049 17753 48919 71929
1061 71929 72631 45194 2746 -34933 -59342 -69940 -63113 -34511 8981 47842 67576 67694 51467
$$ packed form
976f9807j5472J9459M5667M4148K8512J7673N555j9494m5863m9103k8759n616
988g3100Q597K3853M3048M7602K6501k826k0967k9257l9073m2982k4230J0344
1000g2490L3230L5859L3404L2755J8818j2050m0217m4875l1320j9803q025J4414
1012f0300M1139M8956L2120Q926n164k0031l8575m7522l1682k354J8450K7615
1024b8422L5960M1425K8139j898k8605l6190l4515l1857k1166N403L4215M4019
1036F508L4745K1118R609r247l5115m7392l6332j3543L458J7497L4023M5062L5111
1049F5502R199j4728k6827l4278l9330l0543m853K3496L5313L4802L1166K3010
1061G1929P02k7437m2448l7679k4409j0598O827K8602M3492L8861J9734J18j6227
$$ plain form
1074 51467 20745 -21429 -57523 -72154 -62608 -38655 -5990 32039 64554 75272 57631 23896
1086 23896 -11923 -42877 -66157 -71400 -51140 -12055 27573 54780 67326 63496 39740 417
1098 417 -39155 -63444 -67413 -55002 -26907 12948 50439 69369 64292 42579 12043 -23537 -56968
1111 -56968 -72687 -61537 -30789 4669 36058 60177 69667 56253 21096 -19709 -50213 -64570
1123 -64570 -63306 -44258 -8909 30645 58848 67123 56541 31580 -4592 -41566 -64585 -65487 -47856
1136 -47856 -18868 16385 50141 69852 63996 36261 1811 -29366 -54222 -67333 -59601 -28759
1148 -28759 11501 44134 61063 62272 47710 17287 -21175 -52795 -66009 -59871 -36721 -2204
1160 -2204 34636 59503 64093 50754 25255 -7558 -43271 -66703 -65220 -41089 -8246 22016
$$ packed form
1074E1467l0722m2174l6094j4631R546K3953L2665L8029L2515J0718j7641l3735
1086B3896l5819l0954k3280n243K0260L9085L9628K7207J2546l830k3756l9323
1098D17l9572k4289l969J2411K8095L9855L7491J8930n077k1713l0536l5580l3431
1111e6968j5719J1150L0748L5458L1389K4119R490j3414l5157m0805l0504j4357
1123f4570J264J9048L5349L9554K8203Q275j0582k4961l6172l6974k3019r02J7631
1136d7856K8988L5253L3756J9711n856k7735l4450l1177k4856j3111P732L0842
1148b8759M0260L2633J6929J209j4562l0423l8462l1620j3214O138K3150L4517
1160b204L6840K4867M590j3339k5499l2813l5713k3432J483K4131L2843L0262
$$ plain form
1172 22016 47780 64629 62435 35680 -4338 -38752 -57304 -61081 -50296 -23696 13022 46480
1184 46480 63087 60633 41538 9884 -26945 -54378 -62889 -52901 -30607 456 36140 62552
1196 62552 65437 44740 13609 -15957 -41240 -60331 -63111 -41298 -3400 32390 53137 59358
1208 59358 52146 29657 -5627 -40043 -60109 -60765 -44540 -15333 20011 48786 60374 54002 35156
1221 35156 6473 -28598 -57707 -65376 -48446 -19037 9599 35013 56403 63166 45901 9860
1233 9860 -26262 -48743 -56737 -52655 -34204 -2019 33134 56090 60409 47474 20866 -12683 -42897
1246 -42897 -58094 -55197 -38245 -11899 21281 51777 63937 51143 23749 -4135 -29091 -51221
1258 -51221 -61958 -50461 -17158 19634 44125 54351 52975 38085 9129 -26084 -52157 -59501
$$ packed form
1172B2016K5764J6849k194k6755m0018l4414j8552l777J0785K6600L6718L3458
1184D6480J6607k454j9095l1654l6829k7433q511R988K2294L1063L5684K6412
1196F2552K885k0697l1131k9566k5283j9091k780K1813L7898L5790K0747O221
1208E9358p212k2489l5284l4416k0066o56J6225K9207L5344K8775J1588o372j8846
1221C5156k8683l5071k9109p669J6930K9409K8636K5414K1390O763j7265l6041
1233I860l6122k2481p994M082J8451L2185L5153K2956M319j2935k6608l3549l0214
1246d2897j5197K897J6952K6346L3180L0496J2160j2794k7394k7884k4956k2130
1258e1221j0737J1497L3303L6792K4491J0226j376j4890k8956l5213k6073p344
$$ plain form
1270 -59501 -49274 -25740 5715 36130 54485 55647 41922 17344 -14512 -45503 -61384 -53766
1282 -53766 -29046 -1018 23954 46116 59661 52842 23812 -13039 -40174 -51522 -51914 -41240
1294 -41240 -15995 18367 47478 58608 50915 29770 510 -29200 -50444 -55770 -44887 -21831
1306 -21831 8779 39029 57744 55174 34082 6670 -18912 -41077 -56166 -54458 -30421 5440
1318 5440 34889 49157 51280 42763 21693 -10923 -41814 -57050 -51824 -32746 -6370 22126 45759
1331 45759 55144 47788 26157 -3096 -32549 -53329 -55902 -38637 -12351 13803 36629 52967
1343 52967 54862 35572 1870 -29329 -46364 -50147 -44146 -26706 3419 35550 54420 52869 35990
1356 35990 11558 -15713 -40407 -53588 -49393 -30157 -2511 26588 48393 55092 42528 17769
$$ packed form
1270e9501J0227K3534L1455L0415J8355J162j3725k4578l1856l0991j5881P618
1282e3766K4720K8028K4972K2162J3545o819k9030l6851k7135j1348l92J0674
1294d1240K5245L4362K9111J1130p693k1145k9260k9710k1244n326J0883K3056
1306b1831L0610L0250J8715k570k1092k7412k5582k2165j5089J708K4037L5861
1318E440K9449J4268K123q517k1070l2616l0891j5236N226J9078K6376K8496K3633
1331D5759R385p356k1631k9253k9453k0780k573J7265K6286K6154K2826J6338
1343E2967J895j9290l3702l1199j7035l783O001J7440L0125L2131J8870j551j6879
1356C5990k4432k7271k4694j3181M195J9236K7646K9099K1805O699j2564k4759
$$ plain form
1368 17769 -8963 -32095 -49389 -54184 -39554 -8731 23593 42898 48808 45117 30483 2972
1380 2972 -29539 -51231 -52899 -38511 -16299 9558 34840 51247 50977 34035 7718 -20392 -43590
1393 -43590 -53177 -45242 -22995 3356 27187 45383 53331 42452 14794 -16747 -39144 -47126 -45535
1406 -45535 -33273 -8698 22905 47041 52616 40894 20606 -4001 -29558 -48056 -51204 -37307
1418 -37307 -12478 15170 38366 51011 46886 27630 1797 -22809 -41894 -51277 -44718 -20659
1430 -20659 10102 33988 45387 45895 35929 13906 -16364 -42099 -51251 -43067 -24662 -1499 23670
1443 23670 44156 51141 40264 17384 -9459 -33121 -47811 -47902 -32321 -7267 18191 38363 49192
1456 49192 45287 25329 -3608 -29221 -43090 -45575 -37864 -18374 9817 36736 49490 44984 28264
$$ packed form
1368A7769k6732k3132j7294m795J4630L0823L2324J9305N910l691j4634k7511
1380B972l2511k1692j668J4388K2212K5857K5282J6407k70j6942k6317k8110k3198
1393d3590r587P935K2247K6351K3831J8196P948j0879k7658l1541k2397p982J591
1406d5535J2262K4575L1603K4136N575j1722k0288k4607k5557j8498l148J3897
1418c7307K4829K7648K3196J2645m125j9256k5833k4606j9085r383O559K4059
1430b0659L0761K3886J1399N08r966k2023l0270k5735r152Q184J8405K3163K5169
1443B3670K0486O985j0877k2880k6843k3662j4690r1J5581K5054K5458K0172J0829
1456D9192l905j9958k8937k5613j3869k485P711J9490K8191K6919J2754m506j6720
$$ plain form
1469 28264 6040 -18148 -39459 -50023 -43041 -22040 4697 28609 44252 47324 35803 12972
1481 12972 -12793 -34493 -46639 -45655 -29401 -3109 23498 40534 45542 39004 22370 -3934 -30859
1494 -30859 -46965 -46322 -31651 -10357 13104 34470 47565 44674 26606 343 -23973 -40912
1506 -40912 -46237 -38303 -18276 7367 30621 44337 45361 32341 8758 -17603 -37486 -44953 -40106
1519 -40106 -25009 -1121 24859 43442 46265 34379 14093 -8932 -30070 -44591 -45253 -30355
1531 -30355 -5320 19360 37050 44395 39878 22882 -2560 -26402 -41874 -45142 -34594 -13605
1543 -13605 11876 33459 43893 41479 27721 6000 -19492 -39847 -46234 -37081 -18134 3873
1555 3873 25520 41256 45512 33768 10160 -14833 -33673 -42817 -40683 -26202 -3141 21487 39207
$$ packed form
1469B8264k2224k4188k1311j0564O982K1001K6737K3912J5643L072j1521k2831
1481A2972k5765k1700j2146R84J6254K6292K6607J7036N008o538j6634k6304k6925
1494c0859j6106O43J4671K1294K3461K1366J3095k891j8068k6263k4316j6939
1506d0912n325P934K0027K5643K3254J3716J024j3020k3583k6361j9883p467M847
1519d0106J5097K3888K5980J8583K823j1886k0286k3025k1138j4521o62J4898
1531c0355K5035K4680J7690P345m517j6996k5442k3842j5472l268J0548K0989
1543a3605K5481K1583J0434k414j3758k1721k5492k0355o387R153J8947K2007
1555C873K1647J5736M256j1744k3608k4993j8840r144K134J4481K3061K4628J7720
$$ plain form
1568 39207 44041 36779 17663 -6747 -29160 -41657 -41474 -30885 -10336 14055 35346 44936 38873
1581 38873 22102 387 -20929 -37756 -44467 -36316 -15395 9696 29776 40976 40746 29133 7748
1594 7748 -16432 -35333 -43314 -37990 -21556 1839 24465 39054 41620 32771 14558 -9292 -31200
1607 -31200 -42766 -40248 -25583 -4488 16866 34859 43098 37500 19617 -4535 -25532 -38813
1619 -38813 -40686 -31224 -11885 11381 31525 42198 39427 24670 2520 -20109 -36020 -41201 -34696
1632 -34696 -18261 4768 26780 40560 40552 28225 8690 -12637 -30753 -41271 -38853 -23363 57
1645 57 21703 36310 40194 32943 15820 -6513 -27794 -39967 -39868 -27607 -7098 15305 32871
1658 32871 39935 36076 21629 130 -22235 -38449 -40718 -30445 -11992 8673 26934 39062
$$ packed form
1568C9207M834p262j9116k4410k2413j2497J83J0589K0549K4391K1291R590o063
1581C8873j6771k1715k1316j6827o711Q151K0921K5091K0080J1200k30j1613k1385
1594G748k4180j8901p981N324J6434K3395K2626J4589K566q849j8213k3850k1908
1607c1200j1566K518J4665K1095K1354J7993Q239n598j7883k4152k0997j3281
1619c8813j873R462J9339K3266K0144J0673k771j4757k2150k2629j5911n181O505
1632c4696J6435K3029K2012J3780qj2327j9535k1327j8116j0518K418J5490K3420
1645E7K1646J4607L884p251j7123k2333k1281j2173R9J2261K0509K2403J7566
1658C2871P064l859j4447k1499k2365j6214k269J0273J8453K0665J8261J2128
$$ plain form
1670 39062 39331 26671 4762 -17335 -33414 -39294 -34425 -19677 1774 23319 37559 39750 29755
1683 29755 11168 -10737 -29285 -38572 -36241 -24039 -4288 17669 34669 40541 32758 15640 -4452
1696 -4452 -23015 -36034 -39450 -29797 -9028 13519 30616 37671 34890 22525 2510 -19054 -35196
1709 -35196 -39308 -31422 -14889 6317 25459 36710 37022 26539 8518 -12856 -31233 -39677 -34528
1722 -34528 -18705 931 19257 32900 38550 31752 13485 -9388 -27340 -35900 -35047 -25209 -7145
1735 -7145 14712 32090 38679 32915 17831 -1902 -21474 -34875 -37195 -28290 -11631 8421 27278
1748 27278 37886 35838 22061 2516 -15598 -29720 -37123 -34121 -18013 4861 24135 34250
1760 34250 34650 27314 11390 -9918 -28738 -37510 -33863 -20593 -2306 17040 32070 36934 30313
$$ packed form
1670C9062K69j2660k1909k2097j6079n880M869J4748K1451K1545J4240K191r995
1683B9755j8587k1905j8548r287K331J2202J9751K1957J7000N872p783j7118k0092
1696d452j8563j3019l416R653K0769K2547J7097P055k781j2365k0015k1564j6142
1709c5196m112P886J6533K1206J9142J1251L12j0483j8021k1374j8377q444N149
1722c4528J5823J9636J8326J3643N650o798j8267k2873j7952q560Q53R838J8064
1735g145K1857J7378O589n764j5084j9733j9572j3401k320Q905J6659K0052J8857
1748B7278J0608k048j3777j9545j8114j4122p403L002J6108K2874J9274J0115
1760C4250M00p336j5924k1308j8820q772L647J3270J8287J9346J5030M864o621
$$ plain form
1773 30313 14762 -4177 -23006 -35779 -36955 -24760 -6030 11990 26596 35326 34746 21718 -567
1786 -567 -21074 -32042 -34017 -28541 -14999 5179 25167 36255 34320 22967 6231 -12955 -28953
1799 -28953 -36244 -31606 -17737 371 18667 33194 36802 27553 9817 -8834 -23308 -33391 -35217
1812 -35217 -24555 -4035 17396 29842 33214 29279 17521 -873 -21434 -34215 -34917 -25034 -9420
1825 -9420 8984 25704 34843 32941 20018 3326 -14941 -29885 -36236 -29517 -13009 5101 20169
1838 20169 30789 34912 27202 8194 -13293 -27865 -32400 -29845 -20358 -3188 17287 32010 34666
1851 34666 26683 12360 -4870 -22305 -33230 -33158 -22719 -6534 11360 26896 34809 31017 16369
1864 16369 -1704 -17065 -28657 -33964 -28519 -12216 8932 24766 31105 29696 22288 6723 -12887
$$ packed form
1773C0313j5551j8939j8829j2773j176J2195J8730J8020J4606Q730n80j3028k2285
1786e67k0507j0968j975N476J3542K0178J9988J1088j935j1353j6736j9186j5998
1799b8953p291M638J3869J8108J8296J4527L608r249j7736j8651j4474j0083j826
1812c5217J0662K0520K1431J2446L372l935j1758j8394k0561j2781p02R883J5614
1825i420J8404J6720R139j902j2923j6692j8267j4944o351O719J6508J8110J5068
1838B0169J0620M123p710j9008k1487j4572m535K555R487J7170K0475J4723K656
1851C4666p983j4323j7230j7435j0925P2J0439J6185J7894J5536P913l792j4648
1864A6369j8073j5361j1592n307N445J6303K1148J5834O339j409p408j5565j9610
$$ plain form
1877 -12887 -29102 -34141 -28126 -14959 1251 18343 30989 33239 24873 9502 -7891 -23628 -32977
1890 -32977 -31512 -19482 -2033 13985 25911 32436 29589 15697 -4691 -21564 -30068 -30258 -23616
1903 -23616 -10196 8764 25953 33362 29400 17279 2251 -14712 -28151 -32855 -26964 -12665 4341
1916 4341 20192 31024 32009 22263 5576 -10966 -23315 -31198 -30154 -18402 185 18441 27951
1929 27951 29811 24783 12893 -4569 -22503 -31840 -29869 -19710 -5039 10921 24862 32029 28298
1942 28298 15414 -1141 -17062 -28625 -31740 -24106 -9083 7856 21259 29167 30223 21128 3426
1955 3426 -14643 -26236 -29285 -25657 -15614 1025 18801 29994 30368 21546 8085 -7482 -22160
1968 -22160 -30328 -29074 -17946 -1955 13698 25890 30965 25746 12062 -4043 -18147 -27783 -30014
$$ packed form
1877a2887j6215n039O015J3167J6210J7092J2646K250q366j5371j7393j5737r349
1890c2977J465J2030J7449J6018J1926O525k847j3892k0388j6873q504j90O642
1903b3616J3420J8960J7189P409l962j2121j5028j6963j3439m704N891J4299J7006
1916D341J5851J0832R85r746j6687j6542j2349p883J044J1752J8587J8256R510
1929B7951J860n028j1890j7462j7934r337J971J0159J4671J5960J3941P167l731
1942B8298j2884j6555j5921j1563l115P634J5023J6939J3403P908J056r095j7702
1955C426j8069j1593l049L628J0043J6639J7776J1193L74q822j3461j5567j4678
1968b2160q168J254J1128J5991J5653J2192N075n219j3684j6105j4104r636k231
$$ plain form
1981 -30014 -22578 -6873 10935 23665 28397 26466 17668 2286 -15269 -27732 -30224 -22983 -10443
1994 -10443 4107 19057 28782 29138 19924 5103 -10547 -23380 -29918 -26772 -14806 1033 15243
2007 15243 25652 29836 24274 10044 -7348 -21051 -27327 -26677 -19415 -5219 11902 25302 29473
2020 29473 24042 13217 -983 -15735 -26875 -29048 -21566 -8002 7125 20588 28299 27299 17445
2033 17445 1995 -12469 -23576 -28508 -25157 -12813 3764 17968 25823 26630 20807 8272 -8222
2046 -8222 -22616 -28194 -25174 -15441 -1709 12667 24361 28519 23207 10790 -4246 -17653 -26542
2059 -26542 -27192 -19323 -5627 9462 20899 27437 25691 15182 -172 -14999 -24126 -26356 -21882
2072 -21882 -10727 4957 19435 26975 25741 17127 4532 -9375 -21837 -27711 -24350 -13390 1026
$$ packed form
1981c0014P436J5705J7808J2730M732j931q798j5382j7555j2463k492P241J2540
1994a0443J4550J4950R725L56r214j4821j5650j2833o538L146J1966J5839J4210
2007A5243J0409M184n562j4230j7392j3703o276O50P262J4196J7121J3400M171
2020B9473n431j0825j4200j4752j1140k173P482J3564J5127J3463P711j000r854
2033A7445j5450j4464j1107m932L351J2344J6577J4204P855Q07n823j2535j6494
2046h222j4394n578L020R733J3732J4376J1694M158n312j2417j5036j3407q889
2059b6542o50P869J3696J5089J1437O538j746j0509j5354j4827r127k230M474
2072b1882J1155J5684J4478P540j234q614j2595j3907j2462n874L361J0960J4416
$$ plain form
2085 1026 14842 24397 26745 21107 8546 -6183 -18799 -25992 -25639 -17221 -3052 11580 22235
2098 22235 25891 22573 12941 -1403 -16052 -25520 -26041 -18824 -7110 6544 18971 26205 25010 15405
2112 15405 1663 -12209 -22157 -26245 -22234 -11122 3255 16345 24201 25510 18830 6059 -8473
2125 -8473 -20310 -25193 -22948 -14681 -1650 12927 23736 25606 19994 9273 -3925 -15934 -24395
2138 -24395 -25554 -17522 -4169 9658 19786 24827 22798 13547 -73 -13784 -22656 -25109 -20200
2151 -20200 -8668 5244 17914 24262 23360 16349 4426 -9535 -21218 -25640 -21559 -11067 945
2164 945 13240 22634 25446 19214 6895 -6652 -17820 -23570 -23019 -15513 -2292 11272 20545 24065
2178 24065 20562 11135 -2433 -15362 -22986 -23474 -17181 -6749 6457 18719 24883 22097 13080 1235
$$ packed form
2085A026J3816R555K348n638j2561j4729j2616p193L53Q418J4169J4632J0655
2098B2235L656l318r632j4344j4649r468n21P217J1714J3654J2427P234j195r605
2112A5405j3742j3872r948m088M011J1112J4377J3090P856J309o680j2771j4532
2125h473j1837m883K245Q267J3031J4577J0809J870n612j0721j3198j2009q461
2138b4395j159Q032J3353J3827J0128N041k029r251j3620j3711q872k453M909
2151b0200J1532J3912J2670O348r02p011j1923j3961j1683m422M081J0492J2012
2164I45J2295R394K812o232j2319j3547j1168n750N51P506J3221J3564R273L520
2178B4065l503r427j3568j2929p624m88O293J0432J3206J2262O164k786r017j1845
$$ plain form
2192 1235 -10614 -20356 -24612 -20336 -9293 4149 15435 22111 23076 17076 5375 -8367 -18941
2205 -18941 -23406 -21321 -13157 -745 12538 21360 23284 18408 8986 -3668 -15809 -23378 -22955 -14651
2219 -14651 -3508 7934 18059 23480 21447 11569 -1269 -12785 -20660 -22701 -18389 -7727 5526
2232 5526 16438 22116 21629 14909 3068 -9979 -19661 -22697 -19320 -10838 948 13584 21774 22838
2246 22838 16328 5666 -5768 -15713 -22263 -22107 -13667 -1345 10569 18855 22194 19186 10033 -3028
2260 -3028 -14449 -20869 -21526 -16412 -5860 7178 17653 22107 19738 12348 1724 -10564 -20154 -22714
2274 -22714 -17739 -7839 3459 13607 21070 22260 15681 3889 -8263 -17060 -21238 -20070 -11889 19
2288 19 11902 19585 21254 17316 8196 -4023 -15625 -21221 -20178 -13883 -4017 7590 18030 22149
$$ packed form
2192A235j1849r742m256M276J1043J3442J1286O676R65o000j1701j3742j0574
2205a8941m465K085Q164J2412J3283Q822J924m876r422j2654j2141p569M23Q304
2219a4651J1143J1442J0125N421k033r878j2838j1516p875k041M312J0662J3253
2232E526J0912N678m87o720j1841j3047r682l036L377Q482J1786J2636Q190J064
2246B2838o510j0662j1434r945o550J56Q440J2322J1914Q286L339l008r153j3061
2260c028j1421o420o57N114J0552J3038J0475M454k369p390j0624j2288r590k560
2274b2714M975R900J1298J0148P463J190o579j1792j2152q797m178J168Q181J1908
2288A9J1883P683J669l938r120j2219j1602n596J043O295R866J1607J0440M119
$$ plain form
2302 22149 18841 9678 -1044 -11440 -19195 -21695 -16891 -6477 5508 15076 20252 20036 13615 2439
2316 2439 -9325 -17598 -20725 -18123 -10194 1671 13215 20026 20312 15090 6000 -5000 -15815 -21542
2330 -21542 -19667 -11679 -1221 9066 17349 20838 17962 8598 -3060 -13122 -19004 -20397 -15065 -4738
2344 -4738 6657 15997 19918 18760 11859 786 -10567 -18314 -19896 -16332 -7915 2584 13454 19879
2358 19879 19878 13247 3357 -6965 -15465 -20168 -18662 -10579 548 11147 18017 19679 15884 7138 -4131
2373 -4131 -13972 -19349 -18952 -13517 -3388 8066 16714 19430 16823 9576 -260 -10992 -18528 -19989
2387 -19989 -14884 -5383 4907 13847 18963 18913 12443 1806 -8895 -16462 -19095 -16890 -8830 1813
2401 1813 11934 18197 18988 14266 5267 -5710 -14635 -19121 -17243 -10921 -1795 8803 16836 19554
$$ packed form
2302B2149l308r163j0722j0396p755k500M804J0414J1985R568N176k16o421j1176
2316B439j1764q273l127K602P929J1865J1544O811K86n222r090j1000j0815n727
2330b1542J875P988J0458J0287Q283L489k876r364j1658j0062n882j393N332J0327
2344d738J1395R340L921j158o901j1073j1353p747j582L564Q417J0499J0870O425
2358A9879jo631r890j0322q500m703J506Q083J1127J0599O870J662l795q746j1269
2373d131r841n377L97N435J0129J1454Q648K716k607p247r836j0732p536j461
2387a9989N105R501J0290Q940N116n0o470j0637j0701p567k633K205Q060J0643
2401A813J0121O263P91m722q999j0977q925m486J878O322R126J0598Q033K718
$$ plain form
2415 19554 15779 7179 -2877 -11665 -17326 -18618 -13959 -3954 6574 15091 18510 16775 10181 768
2429 768 -9952 -16953 -18659 -14952 -7183 3316 12685 17984 18065 12120 3368 -6738 -14927 -18744 -16857
2444 -16857 -9045 822 10036 16189 18520 14918 6277 -4498 -13487 -17675 -17134 -11624 -2763 7529
2458 7529 15505 18620 15728 8400 -1041 -10685 -16920 -17848 -13596 -5229 4621 13028 18097 17098 10664
2473 10664 1017 -8259 -14931 -17820 -15587 -8114 2208 11564 16689 16920 12535 4612 -5157 -13947 -17683
2488 -17683 -16275 -9935 -943 8498 15555 17862 14550 6694 -2528 -11130 -16788 -17283 -12164 -3085 6129
2503 6129 13617 17008 15904 9943 180 -9867 -15916 -16741 -13293 -6461 2929 11792 16967 16567 10955
2518 10955 2780 -6213 -13860 -17076 -15210 -8345 925 9297 15458 17251 13663 4982 -4567 -12140 -16086
$$ packed form
2415A9554l775q600j0056q788n661j292M659J0005J0528Q517L419j735o594r413
2429G68j0720p001j706L707P769J0499R369N299Q1n945q752j0106q189l817J887
2444a6857P812R867R214O153K331l602q641j0775q989m188N41N510Q861J0292
2458G529P976L115k892p328r441r644o235r28M252Q367R850Q407N069r99o434
2473A0664r647r276o672k889K233P473J0322R356N125K31m385p923r769q790l736
2488a7683J408O340Q992R441P057K307l312p856r222q602n658m95N119R079R214
2503F129P488L391j104n961r763j0047o049q25L448O832R390Q863N175m00n612
2518A0955q175q993p647l216J866O865R270Q372O161J793l588q681r549p573l946
$$ plain form
2533 -16086 -16101 -11159 -2128 7722 14422 16686 13833 7860 -754 -9892 -16235 -16698 -12076 -4384 4586
2548 4586 12249 16455 15810 9410 1037 -7759 -14288 -16736 -14006 -6686 2363 10575 14970 15947 12097
2563 12097 4173 -5907 -13005 -16070 -14673 -9173 -1157 8154 14633 16362 13053 5880 -2741 -10783
2577 -10783 -15621 -15994 -11159 -2828 5788 12588 16047 14667 8211 -547 -8677 -14287 -15688 -12733 -5384
2592 -5384 3653 11565 15675 14648 10068 2608 -5955 -13397 -16255 -13522 -7374 848 8601 14595 15689
2607 15689 11955 4366 -3987 -11213 -15304 -14784 -9629 -1290 6944 12933 15379 13223 7187 -1782 -9994
2622 -9994 -14724 -14793 -10883 -4412 4195 11650 15445 14027 8722 995 -6958 -13052 -15547 -12674 -6086
2637 -6086 2267 9767 14359 14550 10700 3170 -5292 -11813 -14683 -13562 -8318 -221 7936 13642 14701
$$ packed form
2533a6086j5M942R031R850O700K264k853n973q614r138o343m63M622P692Q970
2548D586P663M206o45o400q373q796o529k448K730P320R049Q212M395R77l850
2563A2097p924j0080p098l065J397N500Q016R311O479J729l309p173q621q042
2577a0783m838l73M835Q331Q616O800L459j380o456q758q130n610j401K955P349
2592e384R037P912M110j027m580p460q563p442k858K733O148Q222P753N994J094
2607A5689l734p589q353p226m091N20N155Q339Q234N989K446k156o036q969q212
2622i994m730o9L910O471Q607P455L795j418n305p727p953o094k495K873O588
2637f086Q353P500M592J91l850p530q462o521k870J121N244Q097Q157N706J059
$$ plain form
2652 14701 11619 5794 -2108 -9856 -14795 -14400 -9546 -2356 5409 11549 14908 13652 7420 -665 -8158
2667 -8158 -13442 -14361 -11357 -5114 3580 10577 14092 13546 9606 2146 -5958 -12463 -14206 -12173 -6505
2682 -6505 838 8121 13547 14427 10536 3647 -3592 -10186 -14082 -13856 -8594 -952 6654 11697 13971
2697 13971 12089 6283 -1743 -9044 -13430 -13576 -10169 -3646 4272 11361 13864 12337 7411 852 -6631
2712 -6631 -12441 -14433 -11517 -4947 2059 8784 12796 13886 9971 2536 -5253 -10764 -13189 -12377 -7592
2727 -7592 -31 7637 12401 13092 10603 4966 -2526 -9788 -13269 -12576 -8576 -2408 4948 11166 14003
2742 14003 11772 6195 -857 -7336 -11844 -13427 -10532 -4003 3884 9562 12500 12224 8366 1633 -5961
2757 -5961 -11459 -12986 -11030 -6101 1022 8214 12629 12940 9352 3180 -3459 -9490 -13334 -12199 -7389
$$ packed form
2652A4701l082n825p902p748m939L95M854P190P765O140L359j256o232q085p493
2667h158n284r19L004O243Q694O997L515n46l940p460q104o505j743K033N668
2682f505P343P283N426Q80l891o889p239o594l896K26N262P642P606N043K274
2697A3971j882n806q026p301m386j46L407O523P918P089K503j527m926o559p483
2712f631n810j992K916O570P006O725M012J090l915p435p789n511k425Q12M785
2727g592P561P668M764O91k489n637p492p262l481O93M000O168P356O218K837
2742A4003k231n577p052o479m508j583K895O529P887N678K938k76l858o733p594
2757e961n498j527J956M929P123P192M415L11l588o172o639o031l844J135M810
$$ plain form
2772 -7389 -369 5901 10668 13217 11111 5354 -2069 -8447 -11985 -12274 -8935 -3220 4248 9924 12880
2787 12880 11412 7191 505 -6420 -11666 -12860 -9954 -4605 1842 8046 12328 12373 8580 1883 -4726
2802 -4726 -10043 -12491 -11367 -6520 566 7084 11311 12070 9686 4536 -2612 -8823 -12167 -11356 -7859
2817 -7859 -1901 5016 10366 12293 10568 5683 -365 -6874 -11201 -12331 -9194 -3106 3463 8683 11524
2832 11524 11258 7448 925 -5629 -10284 -11865 -10094 -5548 1315 7563 11257 11539 8392 3337 -3364
2847 -3364 -9446 -12071 -10575 -6345 -890 5559 10267 12212 9616 4579 -1788 -7291 -10710 -11623 -8295
2862 -8295 -2199 4286 9269 11070 10269 6485 376 -6242 -10460 -11457 -8788 -4202 2075 7860 11293
2877 11293 10868 7174 1838 -4203 -9000 -11499 -10269 -5456 440 6084 9985 11029 8795 3735 -2838
$$ packed form
2772g389P020O270M767K549k106n757p423o378l538k89L339N715P468N676K956
2787A2880j468m221o686o925n246j194K906N349O447O204M282M5l793o697o609
2802d726n317k448J124M847P086O518M227P59k384n150p148o211l344Q11L497
2817g859N958O917N350J927j725m885o048o509m327j130L137O088O569N220K841
2832A1524k66l810o523o554m655j581J771M546O863O248L694K82l147n055o701
2847c364o082k625J496M230N455O449M708J945k596n037o367n503l419r13L328
2862h295O096O485M983J801q01l784o109o618m218r97K669M586O277N785L433
2877A1293m25l694n336o041m797k499J230M813N896N644L901J044k234n060o573
$$ plain form
2892 -2838 -8082 -10734 -10482 -7058 -1424 4744 9445 11177 9243 5081 -804 -6516 -10326 -10836 -8022
2907 -8022 -2945 2710 7901 11027 10360 6285 423 -5135 -9139 -10927 -9334 -4578 1570 6948 10057
2922 10057 10391 7750 2662 -3492 -8380 -10850 -9480 -5880 -501 5441 9520 10627 8267 3797 -1558
2937 -1558 -6707 -10498 -10403 -7056 -1716 3878 8164 10314 9797 5549 -345 -5737 -9484 -10308 -8174 -3593
2953 -3593 1980 7626 10041 9590 6552 1817 -4167 -8716 -10484 -8701 -4824 552 6039 9421 10481
2968 10481 7699 2670 -2582 -7251 -9998 -9719 -6473 -821 4657 8416 9608 8423 4781 -791 -6182
2983 -6182 -9374 -9881 -7016 -2672 3220 7799 9964 9020 5355 789 -4405 -8758 -10147 -8299 -3596
2998 -3596 1460 5950 9072 9790 6941 2026 -3295 -7656 -9714 -8695 -5478 -282 5088 8802 9532
$$ packed form
2892b838n244k652K52L424N634O168M701J732j934m162n885n712l810n10K814
2907h022N077N655N191L126o67m075n862n558m004j788J593M756O148N378L109
2922A0057L34k641n088o154m888k470J370L600N379N942M079J107k360m470n355
2937a558n149l791R5L347N340N594M286K150n17m248n894n392l747q24K134M581
2953c593N573N646K415m51l038m735n984m549j768J783L877N376N487L382J060
2968A0481k782n029n252m669k747K79L246N652N478L759J192j185l642n572n391
2983f182l192n07K865M344N892M579K165r44l665m566n194m353j389J848M703
2998c596N056M490L122P18k849m915n321m361k058J019L217N196N370L714P30
$$ plain form
3013 9532 7561 3596 -1572 -6814 -9403 -9208 -6236 -1860 3551 7809 9667 8436 4443 -610 -5016
3028 -5016 -8606 -9624 -7370 -3282 2207 6765 9145 8805 6180 1225 -3873 -7864 -9176 -8070 -4575
3043 -4575 560 5539 8661 9275 6898 2834 -2348 -6483 -9163 -9014 -5392 -854 3991 7719 9088
3058 9088 7813 4137 -1132 -5815 -8413 -8819 -6426 -2382 2653 6716 8936 8419 5157 772 -4373
3073 -4373 -8136 -9016 -7583 -3716 1159 5456 8667 8716 6166 1784 -3060 -6906 -8864 -8075 -4973 -75
3089 -75 4646 8054 8913 6850 3254 -1603 -6152 -8591 -8412 -5890 -1598 3372 7144 8665 7683 4142
3105 4142 -73 -4708 -7807 -8552 -6911 -2718 2031 6031 8322 8260 5436 1231 -3668 -7169 -8491 -6995
3121 -6995 -4001 444 5238 7985 8406 5975 2709 -1993 -6352 -8261 -7852 -4950 -674 3845 7220
$$ packed form
3013I532j971l965n168n242k589J95K972M376N411M258J858j231l993n053m406
3028e016l590j018K254M088N489M558K380l40k625m955n098l991j312J106L495
3043d575N135M979L122O14k377m064n182m135k680J49L622M538M845L728J369
3058I088j275l676n269m683k598m06K393M044N035M063K220n17l262m385n145
3073d373l763q80J433L867M875M297L211M9k550m382m844l846j958P89L102M898
3089g5M721L408Q59k063l596m857m549k439J79K522M292M970L772J521r82l541
3105D142m215m635l099p45J641M193M749M000K291o2k824m205m899l501j322J496
3121f995K994M445M794K747M21k431l266m702m359j909M09K902M276M519L375
$$ plain form
3136 7220 8465 7027 3591 -1225 -5236 -7702 -8022 -5908 -2148 2540 6627 8212 7480 4604 526
3151 526 -3886 -7197 -8243 -6626 -3095 1133 5324 7900 8043 5425 1540 -2981 -6131 -7846 -7284 -4163
3167 -4163 91 4374 6974 7836 6380 2922 -1564 -5701 -7794 -7742 -5433 -1403 3091 6426 8096 6934
3183 6934 3698 -550 -4199 -7003 -7802 -5845 -2452 1976 5433 7474 7432 4829 939 -3318 -6230 -7752
3199 -7752 -6715 -3629 396 4679 7088 7351 5621 2253 -1908 -5362 -7683 -7145 -4495 -584 3395
3214 3395 6309 7420 6400 2963 -779 -4673 -6997 -7280 -5560 -1638 2399 5709 7445 6710 4450
3229 4450 176 -3638 -6484 -7139 -6121 -2983 1001 4936 7186 6927 4899 1047 -2487 -5673 -7200
3244 -7200 -6582 -3893 306 3821 6471 6937 5812 2589 -1581 -4920 -6950 -6748 -4749 -1440 2681 5703
$$ packed form
3136G220J245j438l436m816m011k466l20K114L760M688M087J585p32k876m078
3151E26m412l311j046J617L531M228M191K576J43k618l885m521l150j715N62L121
3167d163M254M283K600Q62j456l458m486m137k093N2K309M030M494L335J670j162
3183F934l236m248l649k804p99J957L393M428L457K041m2k603l890m257k912j522
3199g752J037L086M025M283K409K63j730l368m161l454k321N38K650L911L979
3214C395K914J111j020l437l742l894k324k83J720L922M037L310J736p35k260
3229D450m274l814k846o55J018L138L984L935K250k59k028l852l534l186j527
3244g200O18K689M199L515K650M66j125l223m170l339k030K02J999L309M121L022
$$ plain form
3260 5703 7227 6048 3399 -206 -3793 -6494 -7178 -5216 -2170 1476 4903 6850 6650 4571 787
3275 787 -2837 -5881 -7072 -5881 -3244 426 4057 6429 6847 4930 1904 -1816 -5214 -6702 -6220 -3870
3291 -3870 -406 2829 5907 6895 5667 2979 -871 -4267 -6381 -6698 -4830 -1551 2237 4934 6545
3306 6545 6018 3951 250 -3580 -5907 -6558 -5468 -2721 915 4479 6399 6211 4580 1516 -2005 -5145
3322 -5145 -6536 -5978 -3403 -34 3393 5676 6487 5035 2265 -1195 -4251 -6135 -6113 -4304 -903 2615
3338 2615 5425 6401 5496 3321 -203 -3681 -5809 -6192 -4767 -2055 1683 4614 6271 6027 3882 880
3354 880 -2595 -5085 -6172 -5229 -3007 477 3767 5454 5845 4738 1865 -1882 -4402 -5974 -5732 -3757
3370 -3757 -481 2887 5125 6257 4908 2472 -774 -3756 -5652 -6009 -4505 -1696 1960 4503 5685
$$ packed form
3260E703J524j179k649l605l587k701o84J962L046L646L427J947k00k079l784
3275G87l624l044j191J191K637L670L631K372M18j917l026l720l398j488M82K350
3291c870L464L235L078R88j228k688l850l396k114l17J868L279L788K697J611
3306F545n27k067l701l830k327o51J090K747L636L564J920j88j631l064l521l140
3322e145j391N58K575L369L427K283Q11j452k770l460l056j884K2J809L401L518
3338B615K810R76r05k175l524l478k128l83J425K712L738K931J657k44k145l002
3354H80l475k490j087R43K222L484L290J687L91j107k873l747k520j572K42J975
3370c757L276L368K238J132j349k436l246k982j896l57J504K809L656K543J182
$$ plain form
3385 5685 5552 3282 367 -2950 -5076 -5875 -4889 -2422 877 3872 5912 5576 4007 1199 -2157 -4593
3401 -4593 -5993 -5185 -3226 -206 3046 5264 5646 4597 1930 -1331 -3744 -5458 -5710 -3856 -936 2238
3417 2238 4643 5699 5052 2832 -188 -3172 -5490 -5379 -4537 -1781 1283 3956 5279 5239 3549 808
3433 808 -2170 -4771 -5675 -4527 -2653 255 3262 4947 5488 4160 1645 -1406 -4130 -5266 -5027 -3223
3449 -3223 -484 2388 4653 5116 4535 2356 -327 -3435 -5215 -5208 -3936 -1422 1721 4001 5287 4845
3465 4845 3116 229 -2597 -4419 -5247 -4461 -2150 878 3327 5006 4868 3673 1278 -1829 -4038 -4985
3481 -4985 -4771 -2882 157 2670 4973 4952 3903 1734 -738 -3372 -4807 -4918 -3331 -1010 1971 4103
3497 4103 4948 4568 2555 -47 -2880 -4550 -4972 -4038 -1628 978 3501 4883 4416 3436 724 -2039
$$ packed form
3385E685j33k270k915l317k126p99R86K467L299K995K040l36j569k808l356k436
3401d593j400Q08J959L020L252K218L82j049k667l261k413j714k52J854K920L174
3417B238K405J056o47k220l020k984k318J11Q42K756L064K673J323m0j690k741
3433H08k978k601r04J148J874K908L007J685N41j328k515l051k724j136K39J804
3449c223K739K872K265M63n81k179k683l108j780PJ272K514L143K280J286m42
3465D845j729k887k826j822q28P86K311L028K449J679j38j195k395l107k209r47
3481d985K14J889L039K513K303k1j049k169k472k634j435j11J587K321K981K132
3497D103Q45l80k013k602k833j670m22R34K410K606K523J382m67r80k712k763
$$ plain form
3513 -2039 -3975 -4924 -4190 -2211 115 2789 4507 4847 3814 1282 -1158 -3460 -4839 -4651 -2921 -615
3529 -615 2063 4102 4640 4145 1908 -557 -2968 -4385 -4686 -3491 -1197 1360 3487 4497 4310 2802
3545 2802 263 -2306 -4048 -4744 -3773 -1801 565 2782 4556 4446 3083 904 -1672 -3511 -4735 -4306
3561 -4306 -2408 -154 2082 4000 4566 3552 1999 -980 -2904 -4318 -4149 -3071 -880 1736 3564
3576 3564 4642 4047 2567 -56 -2261 -3829 -4584 -3363 -1461 899 3211 4083 4080 2758 822 -1788
3592 -1788 -3391 -4235 -3626 -2035 249 2556 3962 4134 3167 1305 -969 -2990 -4021 -3987 -2588 -481
3608 -481 1747 3755 4297 3476 1658 -206 -2536 -3830 -4117 -3244 -1115 1251 3146 4042 3798 2665 427
3625 427 -2029 -3612 -4098 -3454 -1634 433 2564 3827 3727 2755 907 -1220 -3376 -4007 -3639 -2026 -222
$$ packed form
3513b039j936r49P34J979K326K674J718L40j033k532k440k302j379J88J730K306
3529f15K678K039N38m95k237k465k411j417l01J195K294K557K127J010j87j508
3545B802k539k569j742o96R71J972K366K217J774j10j363k179k576j839j224M29
3561d306J898K254K236J918N66j014j553k979j924j414J69J078K191K616J828
3576C564J078n95j480k623k205j568p55J221J902K360K312Q72lj322j936k610
3592a788j603q44O09J591K284K307J406J72r67j862k274k021j031L4J399K107
3608d81K228K008N42q21j818j864k330j294k87Q73K129K366J895Q96k44j133k238
3625D27k456j583m86O44J820K067K131J263j00r72j848k127k156o31L68J613J804
$$ plain form
3642 -222 2013 3475 4096 3314 1526 -659 -2768 -3727 -3786 -2841 -805 1572 3012 4087 3465 2057 -82
3659 -82 -2179 -3534 -3923 -3110 -1078 749 2926 3770 3752 2446 396 -1437 -3340 -3854 -3401 -1713 -30
3676 -30 2183 3707 3792 2845 997 -916 -2680 -3931 -3396 -2365 -543 1683 3331 3501 3127 1587 -447
3693 -447 -2260 -3588 -3565 -2623 -1073 965 2626 3755 3476 1956 259 -1846 -2921 -3894 -3227 -1774 761
3710 761 2405 3233 3568 2177 637 -1298 -2554 -3439 -3162 -2007 -186 1950 3445 3260 3023 1150 -678
3727 -678 -2128 -3693 -3630 -2453 -435 1342 2787 3614 3140 1910 -80 -2002 -3113 -3458 -2758 -1164 812
3744 812 2386 3476 3115 2239 455 -1592 -3087 -3345 -3072 -1586 37 1885 3368 3307 2686 1019 -869
3761 -869 -2371 -3457 -3333 -2171 -264 1756 2907 3396 2671 1429 -425 -1926 -3017 -3187 -2483 -1016
$$ packed form
3642b22K235J462O21p82j788k185k109r59n9R45K036K377J440J075o22j408k139
3659h2k097j355l89Q13K032J827K177Q44j8j306k050j833j903n14M53J688J683
3676c0K213J524Q5r47j848j913j764j251N35J031J822K226J648J70l74j540k034
3693d47j813j328K3R42J550K038J661J129k79j520j697k105j075r73O67J453K535
3710G61J644Q28L35j391j540j935j256q85K77J155J821K136J495j85k37j873j828
3727f78j450j565O3J177K018J777J445Q27m74j230j990j922j111l45P00J594J976
3744H12J574J090l61q76j784k047j495k58K73J486J623J848J483o1o21j667j888
3761h69j502j086J24J162J907K020J151M89p25j242j854j501j091j70P04J467
$$ plain form
3777 -1016 944 2406 3209 2806 1971 255 -1492 -3139 -3443 -2616 -1314 267 1935 3148 3306 2302
3793 2302 838 -1007 -2555 -3218 -2754 -1885 -264 1736 2883 3061 2579 1295 -301 -2119 -3081 -3251 -2249
3810 -2249 -554 931 2599 3164 2941 1526 160 -1773 -2859 -2896 -2639 -954 496 2179 3143 2992 1862
3827 1862 437 -1340 -2458 -3025 -2587 -1682 182 1807 2725 3003 2359 935 -867 -2100 -2940 -2966 -1926
3844 -1926 -387 1214 2416 3075 2574 1392 -54 -1810 -2859 -2968 -2388 -813 719 2160 2776 2555
3860 2555 1700 364 -1402 -2642 -3025 -2325 -1142 289 1945 2764 3040 2218 445 -937 -2394 -2868 -2586
3877 -2586 -1932 -158 1402 2525 2682 2261 1073 -273 -2122 -2784 -2756 -2047 -606 944 2356 2925 2598
3894 2598 1653 -53 -1369 -2687 -2674 -2182 -1122 597 1703 2564 2561 1983 476 -1131 -2182 -2672 -2400 -1602
$$ packed form
3777a016J960J462Q03m03q35j716j747j647l04Q27J302J581J668J213J58j004
3793B302j464j845j548o63M64Q69J621K000J147J78m82j284j596j818r62j70J002
3810b249J695J485J668N65k23j415j366j933j086l7K57J685J450J683R64j51j130
3827A862j425j777j118n67M38R05J864J625R18K78o44j424j802j233q40k6J040
3844a926J539J601J202O59n01j182j446j756j049j09N80J575J532J441O16k21
3860B555q55j336j766j240l83P00J183J431J656Q19K76q22j773j382j457m74K82
3877b586O54J774J560J123J57m21j188j346j849o62K8P09J441J550J412N69l27
3894B598r45j706j316j318J3M92J060J719J106Q61ln78j507j607j051m90K72P98
$$ plain form
3912 -1602 14 1454 2444 2630 2085 905 -620 -1792 -2598 -2371 -1811 -557 962 2085 2887 2596 1453
3929 1453 -110 -1588 -2400 -2786 -2047 -1061 572 1852 2490 2546 1881 638 -1178 -2356 -2669 -2366 -1432 92
3947 92 1644 2351 2436 1889 885 -770 -1813 -2854 -2742 -1623 -99 1318 2468 2786 2207 939 -249
3964 -249 -1808 -2668 -2432 -2111 -688 863 1986 2686 2324 1458 12 -1479 -2336 -2512 -2104 -889 412
3981 412 1848 2556 2302 1732 591 -728 -1822 -2346 -2294 -1491 -82 1347 2355 2535 2286 992 -147
3998 -147 -1603 -2490 -2339 -1648 -545 936 1983 2696 2299 1522 83 -1347 -2202 -2582 -1975 -620 416
4015 416 1752 2473 2296 1623 278 -1079 -2013 -2361 -2238 -1377 249 1342 2158 2399 1835 821 -575 -1666
4033 -1666 -2302 -2209 -1463 -310 899 2114 2520 2184 1276 -53 -1395 -2172 -2489 -2189 -771 497 1847
$$ packed form
3912a602J616J440R90J86n45j180j525j172q06K27N60J254J519J123Q02k91j143
3929A453j563j478q12l86P39R86J633J280O38N6o65j243j816j178l13L03R34J524
3947I2J552P07Q5n47j004j655j043j041J12J119J524J417J150L18n79j268j188
3964b49j559q60K36L21J423J551J123P00l62q66j446j491q57j76M08J215J301
3981D12J436P08k54n70j141j319j094n24N2Q03J409J429J008J80k49j294j139
3998a47j456q87J51O91J103J481J047P13l97p77j439j430q55l80O07J355J036
4015D16J336P21j77o73j345j357r34l48J23Q61J626J093Q16K41n64j014j396j091
4033a666o36R3P46J153J209J215M06l36r08j329j342p77l17L00J418J268J350
$$ plain form
4050 1847 2493 2288 1516 319 -1072 -1935 -2328 -2121 -971 327 1483 2178 2331 1665 719 -713 -1696 -2453
4068 -2453 -2168 -1461 5 1194 2091 2504 1906 1062 -353 -1442 -2297 -2103 -1546 -547 613 1834 2185 2340
4086 2340 1295 -67 -1359 -1942 -2460 -1811 -997 467 1432 2314 2366 1461 307 -722 -1703 -2062 -2270 -1311
4104 -1311 -92 1377 2132 2023 1693 911 -398 -1757 -2127 -2348 -1571 -198 793 1713 2361 2006 1154 202
4122 202 -1086 -2182 -2154 -1612 -702 362 1511 1920 1938 1705 430 -750 -1872 -2315 -1828 -1098 -3 1321
4140 1321 2008 1987 1421 683 -595 -1281 -2216 -2027 -1509 -432 802 1648 2271 1988 1053 -18 -1260 -1954
4158 -1954 -2100 -1530 -440 583 1486 2265 1814 1227 225 -1095 -1806 -2063 -1725 -944 62 1423 2064 2085
4176 2085 1873 604 -724 -1620 -2080 -1884 -1252 -45 1152 1637 2033 1831 931 -119 -1144 -1925 -2080 -1348
$$ packed form
4050A847O46k05p72j197j391q63l93K07J150J298J156O95J53o66r46j432r83p57
4068b453K85P07J466J189Q97M13n98q44j415j089q55J94N57R99J160J221L51J55
4086B340j045j362j292n83n18O49Q14J464R65Q82N2r05j154j029r81l59k08R59
4104a311J219J469P55j09l30p82j309j359l70k21P77J373R91R20O48l55q52r52
4122B02j288j096K8N42R10J064J149M09J8k33j275j180j122m43M87P30J095J324
4140A321O87k1n66p38j278o86r35J89N18J077J234Q46O23k83r35j071j242o94
4158a954j46N70J090J023R03P79m51n87j002j320p11k57L38P81J006J361O41K1
4176B085k12j269j328q96m60J96O32J207J197M85L96k02r00j050j025p81j55P32
$$ plain form
4194 -1348 -625 814 1594 2021 1801 1094 89 -995 -1758 -1970 -1578 -842 198 1478 1959 2201 1106 337
4212 337 -813 -1247 -1807 -2224 -1066 18 1122 1811 1666 1556 907 -471 -1444 -1853 -1937 -1296 -561 748
4230 748 1634 2002 1873 926 -212 -1002 -1662 -1952 -1549 -658 311 1338 1825 1942 1259 217 -687 -1671 -1739
4249 -1739 -1646 -840 -115 1063 1489 2070 1555 489 -428 -1371 -1923 -1707 -1137 -234 966 1574 1852 1650 698
4268 698 -479 -1340 -1694 -1975 -1619 -456 521 1422 1795 1736 972 -7 -697 -1778 -1948 -1632 -723 257 1175
4287 1175 1779 1971 1249 279 -768 -1635 -1937 -1820 -1057 -91 812 1667 1940 1631 750 -269 -1220 -1752 -1723
4306 -1723 -1229 -322 631 1397 1853 1794 967 -170 -932 -1816 -1747 -1502 -409 235 1291 2147 1737 1256 262
4325 262 -703 -1416 -1924 -1607 -907 -279 935 1498 1750 1390 780 -526 -1287 -1830 -1693 -1179 -56 637 1295
$$ packed form
4194a348P23J439P80M27k20p07j005j084p63k12L92P36J040J280M81K42j095p69
4212C37j150m34n60m17J158J084J104O89j45j10o49j378r73m09q4O41P35J309
4230G48Q86L68j29r47j138p90o60k90M03Q91R69J027M87J17o83j042r04r84o8
4249a739R3Q06P25J178M26N81n15j066r17r43n52K16N70R03J200O08K78k02r52
4268F98j177q61l54k81L56J163R77R01L73n9p64r79o90j081j70L16R09R80R18
4287A175O04J92p22r70j047q67l02J17P63R66R03Q55K73l09q81j019r51n32K9
4306a723M94R07R53P66M56n9q27j137p62q84O9K45J093O44J056Q56m10m81r94
4325B62r65p13n08L17P00O28J214N63K52l60o10j306p61n43J37N14J123O93O58
$$ plain form
4344 1295 1549 1470 608 42 -856 -1597 -1841 -1326 -458 305 1280 1542 1646 896 190 -481 -1408 -1659 -1375 -585
4364 -585 150 995 1699 1738 1272 571 -370 -964 -1611 -1647 -1206 -57 726 1569 1804 1490 817 38 -1168 -1642
4384 -1642 -1625 -1289 -565 486 1159 1532 1578 1071 3 -898 -1275 -1724 -1250 -633 37 1150 1638 1592 1337 409
4404 409 -522 -1265 -1745 -1599 -814 -48 701 1308 1787 1350 630 -328 -966 -1706 -1513 -1067 -329 569 1146 1801
4424 1801 1574 774 151 -736 -1379 -1860 -1110 -834 282 912 1473 1524 1122 311 -430 -1223 -1540 -1399 -957 108
4444 108 877 1532 1539 1083 467 -194 -1185 -1588 -1838 -1110 -118 666 1196 1844 1599 823 -52 -735 -1378 -1721 -1271
4465 -1271 -489 197 1077 1542 1320 1059 192 -695 -1344 -1469 -1305 -740 -3 1010 1483 1471 1236 379 -267 -1193
4485 -1193 -1474 -1322 -815 -290 572 1345 1512 1180 726 -67 -1190 -1340 -1393 -1145 -501 520 1247 1289 1452 908
$$ packed form
4344A295K54p9q62n66q98p41k44N15Q68P63R75K62J04p50p06o71r27k51K84P90
4364e85P35Q45P04L9m66p01r41n94o47l6M41J149P83Q43K35l14o73p79j206m74
4384a642J7L36P24J051O73L73M6n07j068r01l77m49M74O17O70J113M88m6k55r28
4404D09r31p43m80J46P85P66P49O07M79m37p20r58o38p40J93M46P38Q98N77O55
4424A801k27q00o23q87o43m81P50K76J116O30N61N1m02q11p41p93l17J41M42J065
4444A08P69O55Pm56o16o61r91m03k50P28R92P84N30O48k45p76q75o83o43l43M50
4465a271P82O86Q80M65k22k61q67q87o49j25J64N65P37J013M73j2k35q57o46r26
4485a193k81J52N07N25Q62P73J67l32m54p93j123j50n3K48O44J021P27M2J63n44
$$ plain form
4505 908 228 -632 -1401 -1561 -1293 -649 213 941 1435 1487 1255 303 -566 -1421 -1540 -1347 -976 -415 671 1347
4525 1347 1519 1096 868 -363 -957 -1377 -1285 -876 -492 678 1263 1623 1217 649 -5 -757 -1224 -1601 -1262
4544 -1262 -622 373 1087 1335 1628 844 386 -308 -1128 -1588 -1566 -627 -74 713 1312 1494 1141 649 -90 -1211
4564 -1211 -1403 -1365 -1101 -438 460 1059 1314 1324 646 127 -657 -1255 -1526 -1166 -540 354 978 1216 1462 975
4584 975 130 -689 -1081 -1535 -1547 -866 110 860 1310 1435 1213 397 -467 -976 -1386 -1440 -1039 -261 479 1245 1408
4605 1408 1198 901 -202 -862 -1187 -1406 -988 -531 256 1174 1195 1448 1075 -138 -595 -1364 -1266 -1089 -659 -44
4625 -44 717 1231 1186 1093 378 -499 -1026 -1426 -1305 -978 -177 864 1208 1256 1103 466 -184 -1003 -1463 -1405 -1183
4646 -1183 -333 379 1241 1502 1210 734 47 -512 -1153 -1295 -1318 -332 209 967 1490 1426 999 464 -420 -997
$$ packed form
4505I08o80q60p69j60K68O44Q62P28M94N2k32r52q69q55j19J93L71N61J086O76
4525A347J72m23k28j231n94m20R2M09L84J170N85L60m06n68o54p52m67l77L39
4544a262O40R95P14K48K93p84m58o94q20m60K2R39N53P87N99J82l53m92p39j121
4564a211j92L8K64O63Q98N99K55J0o78n19p84n98k71L60O26Q94O24K38K46m87
4584I75q45q19l92m54j2O81R76P50M50J25k22q16q64n09m10n4M01P78P40P66J63
4605A408k10k97j103o60l25k19M18M57P87R18K1K53l73j213m57p69R8J77M30O15
4625d4P61N14m5r3p15q77n27m00J21L27Q01J041L44M8j53o37o50q19m60N8K22
4646a183Q50P12Q62K61k92m76o87n59o41j42k3R86N41P58N23o4m27n35q84n77
$$ plain form
4666 -997 -1553 -1190 -636 -199 914 1256 1520 1256 505 -133 -1227 -1425 -1485 -900 -135 565 1196 1554 1319 918
4686 918 178 -721 -1369 -1534 -1277 -353 299 1061 1369 1417 915 181 -511 -1269 -1271 -1562 -726 79 936 1153 1309
4707 1309 1222 430 -135 -934 -1471 -1447 -811 -185 536 1223 1461 1275 478 -41 -674 -1266 -1157 -1162 -530 253 958
4728 958 1203 1160 1085 244 -596 -1079 -1588 -1219 -851 54 729 1340 1540 1198 171 -553 -1087 -1371 -1256 -896
4748 -896 40 680 1174 1670 1014 589 -150 -862 -1136 -1444 -1122 -403 380 1271 1284 1154 760 106 -826 -1499
4768 -1499 -1583 -1181 -510 207 658 1197 1440 794 294 -530 -1046 -1320 -1357 -988 -15 590 1433 1355 994 382 -87
4789 -87 -880 -1421 -1601 -1061 -192 442 1059 1437 1258 804 -36 -700 -1093 -1551 -1160 -748 485 919 1421 1391
4809 1391 1009 26 -420 -1383 -1360 -1415 -881 14 976 1388 1300 923 319 -327 -1265 -1410 -1474 -851 -109 665 1354
$$ packed form
4666i97n56L63N54M37J113L42K64k64p51o38j094j98o0N85P65P00O31L58k35m01
4686I18p40q99o48j65K57R24O52P62L08M8n02p34o92p58kk91Q36Q05Q57K17J56
4707A309q7p92n65p99n37K4O36O26P21O87K38j86p97n19o33n92J09nO32P83P05
4728I58K45m3p5q41q40m83n09L69L68R05O75O11K00l42j027p24n34k84J15L60
4748h96R36O40M94M96o56m25p39p12k74l08L22P19P83Q91J3j30l94o54r32o73
4768a499q4M02O71P17M51N39K43o46n00q24n16k74l7L69R73O05Q43p8l61o12m69
4789h7p93n41j80N40Q69O34O17L78j79m54q40o64l93m58L91M12J233M34N02l0
4809A391l82r83m46r63K3n5N34Q95R62M12q8l77o04o46r38j45o4O23P42P74O89
$$ plain form
4830 1354 1561 1390 514 -44 -847 -1645 -1703 -1238 -471 405 910 1658 1308 963 80 -446 -1126 -1452 -1277 -612
4850 -612 97 624 1248 1635 1080 293 -317 -956 -1679 -1419 -803 -60 680 1259 1495 1235 768 -245 -919 -1465
4870 -1465 -1658 -1035 -346 604 1084 1537 1408 843 148 -879 -1297 -1600 -1326 -724 559 1112 1571 1453 1182
4889 1182 199 -222 -1220 -1438 -1301 -840 -29 741 1519 1673 1046 368 -93 -973 -1514 -1414 -917 -302 726
4908 726 1213 1392 1426 973 7 -804 -1542 -1537 -1175 -528 169 1096 1428 1434 1108 273 -674 -1102 -1517 -1402 -937 165
4930 165 1044 1320 1360 1481 723 -417 -878 -1497 -1289 -979 -232 715 1139 1728 1322 824 -101 -1098 -1427 -1391
4950 -1391 -1210 -271 434 1309 1514 1364 947 242 -660 -1341 -1446 -1146 -586 120 711 1430 1595 1073 227 -448
4970 -448 -1148 -1482 -1345 -1076 -139 690 1559 1414 1171 595 -423 -987 -1568 -1730 -989 -367 771 1169 1590
$$ packed form
4830A354K07j71q76n58q03p98n8M65P67Q76N05P48l50l45q83n26o80l26J75O65
4850f12P09N27O24L87n55p87o10o39p23K60O16P43P40N79K36k60m67j013o74n46
4870a465j93O23O89R50M80M53j29n65o95j027m18l03K74O02J283N53M59j18k71
4889A182r83m21r98k18J37M61Q11P70P78J54o27o78m61q80n41J00M97O15J028
4908G26M87J79L4m53r66q11p38NL62O47O97R27L32Ol26q35r47m28m15J15M65J102
4930A65Q79K76M0J21p58j140m61o19K08L10P47R47M24N89m06m98r25r97l29L6
4950a391J81R39P05Q75K05j50m17p05r02o81j05L00N60P06N91P19J65n22q46o75
4970d48p00l34J37K69R37Q29Q69j45k43n76j018n64n81j62P41O22J138L98M21
$$ plain form
4989 1590 1588 634 197 -772 -1358 -1553 -1242 -427 275 1081 1631 1392 1198 187 -663 -1557 -1506 -1563 -751 121 937
5010 937 1583 1605 1249 454 -366 -1135 -1471 -1593 -1064 -314 617 1359 1510 1669 898 -311 -686 -1335 -1453 -1227
5030 -1227 -379 544 1207 1583 1545 1028 260 -658 -1331 -1615 -1465 -664 104 1182 1403 1693 1297 457 -440 -1171
5050 -1171 -1494 -1306 -682 -76 552 1537 1707 1364 740 -482 -1033 -1623 -1473 -854 -429 508 1031 1655 1496
5069 1496 1119 126 -892 -1586 -1698 -1132 -500 603 930 1602 1558 1123 402 -517 -1296 -1298 -1564 -1002 -19 1051
5089 1051 1399 1537 1418 673 -346 -1094 -1745 -1530 -1316 -436 667 1219 1429 1228 704 -98 -966 -1490 -1668
5108 -1668 -1220 -355 700 999 1350 1685 1073 301 -753 -1400 -1538 -1127 -771 56 988 1454 1739 1301 356
5127 356 -549 -1152 -1682 -1656 -955 -244 597 1388 1534 1296 697 -381 -1157 -1454 -1498 -1282 -361 483 1289 1504
$$ packed form
4989A590kr54m37r69n86j95L11Q15P02Q06N50k39j94j011q50q94N1n7Q12Q72Q16
5010I37O46K2l56p95q20p69l36j22N29P50R31P42J51J59p71j209l75o49j18K26
5030a227Q48R23O63L76l8n17p68r18o73k84J50Q01P68J078K21K90l96q40q97p31
5050a171l23J88O24O06O28R85J70l43o24j222n51n90J50O19M25R37N23O24j59
5069A496l77r93j018o94j12N66O32J103L27O72m4m35p21r19p79kk66N62R83J070
5089A051L48J38j19p45j019p48o51K15K14Q80J103N52K10k01n24q02q68n24j78
5108a668M48Q65J055K99L51L35o12p72j054o47j38M11L56Q27R32M66K85m38r45
5127C56r05o03n30K6P01P11Q41P91J46k38n99j078p76k97m4K16R21Q44Q06K15
$$ plain form
5147 1504 1452 1098 208 -655 -1336 -1659 -1381 -672 313 1250 1422 1598 1049 262 -545 -1229 -1669 -1346 -1015 7
5167 7 601 1501 1639 1329 462 -225 -975 -1469 -1409 -1140 -222 569 1095 1701 1656 780 -95 -672 -1681 -1637 -1194
5188 -1194 -349 549 1108 1497 1611 1052 206 -632 -1242 -1660 -1472 -985 -79 1060 1370 1605 1184 724 -459
5207 -459 -1306 -1735 -1633 -1082 -329 558 1386 1821 1478 905 139 -1135 -1559 -1675 -1014 -147 561 1066 1578 1363
5227 1363 1163 -27 -877 -1390 -1681 -1408 -740 461 1152 1442 1697 1555 374 -392 -1286 -1624 -1352 -894 -58
5246 -58 676 1292 1943 1311 713 -389 -1314 -1535 -1568 -1132 -524 362 1203 1604 1683 857 106 -885 -1783 -1767 -1431
5267 -1431 -741 438 1258 1322 1493 1228 297 -520 -1033 -1657 -1454 -1045 -21 978 1582 1622 1165 341 -356 -1283
5287 -1283 -1495 -1272 -1047 -286 729 1299 1807 1529 954 -83 -938 -1670 -1679 -1338 -456 263 1204 1633 1719 1260
$$ packed form
5147A504n2l54q90q63o81l23K78P09R85R37J72J76n49p87q07o84m40L23L31J022
5167GN94R00J38l10q67o87p50m94O0K69R18P91N26O06m5q76q75n77j009M4M43
5188a194Q45Q98N59L89J14n59q46q38o10m18J88M87R06J139L10K35m21m60j183
5207d59q47m29J02N51P53Q87Q28M35l43n73p66j274m24j16O61Q67P08N05N12k15
5227A363k00j190q50n13k91K73O68J201O91K90K55j42j181p66q94l38K72M58Q36
5246e8P34O16O51o32n98j102r25k21l3M36O08Q86Q41M01P9q26p51r91q98J6L36
5267a431O90J179Q20O4J71k65r31q17n13o24K03M09J024R99O04M0m57q24o97r27
5287a283k12K23K25P61J015N70N08k78n75j037q55p32rL41Q82P19R41M29Q6m59
$$ plain form
5307 1260 111 -1017 -1213 -1697 -1563 -749 177 1075 1599 1617 956 377 -470 -1111 -1956 -1558 -1157 -335 746
5326 746 1378 1550 1434 626 -299 -975 -1272 -1605 -1138 -430 720 1564 1656 1576 908 -31 -726 -1289 -1658 -1357
5346 -1357 -511 273 1052 1639 1448 1164 346 -570 -1338 -1597 -1333 -1013 -31 1042 1391 1477 1256 676 -394
5365 -394 -1146 -1687 -1552 -1005 -359 601 1163 1810 1471 825 -138 -1118 -1627 -1609 -1425 -596 514 1261 1795 1900
5385 1900 1229 114 -772 -1435 -1869 -1231 -921 130 800 1474 1658 1271 696 -287 -1156 -1901 -1491 -869 -338
5404 -338 670 1223 1636 1424 625 138 -1035 -1582 -1696 -1541 -401 569 1336 1644 1517 990 117 -680 -1536
5423 -1536 -1704 -1563 -656 389 983 1411 1570 1054 167 -532 -1232 -1620 -1752 -883 71 1013 1346 1499 1295
5442 1295 743 -151 -1069 -1362 -1534 -1072 -247 556 1350 1726 1497 897 -107 -978 -1637 -1568 -1301 -528 294 1039
$$ packed form
5307A260j149j128j96m84J34Q14R26Q98N24J8o61n79q47o41q45L98M01Q22J081
5326G46O32J72j16q08r25o76k97l33M67P08J150Q44R2q0o68r39o95n63l69L01
5346a357Q46P84P79N87j91k84q18r16p68k59K64L20R82J073L49Q6k21n80j070
5365c94p52n41J35N47O46R60N62O47l39o46r63r80n09J8J84Q29J110P47N34J05
5385A900o71j115q86o63m34O38L10J051O70O74J84l87n75r83q69p45M10O22N31
5404c38J008N53M13k12p99m87j173n47j14J55J140R70P67L08j27n27q73p97q56
5423a536j68J41R07J045N94M28J59n16q87o99p00l88j32Q69R54R42L33J53k04
5442A295n52q94r18k93j72M62Q25Q03P94L76k29o00j004q71o59O9K67P73Q22P45
$$ plain form
5462 1039 1685 1745 1266 99 -569 -1220 -1597 -1368 -928 168 1114 1432 1723 1288 587 -287 -1283 -1619 -1742
5481 -1742 -902 -180 959 1515 1621 1400 552 -90 -920 -1672 -1771 -1045 -263 34 1176 1463 1459 1020 47 -778
5501 -778 -1303 -1682 -1357 -521 110 1273 1646 1715 1125 331 -551 -1189 -1659 -1473 -805 -145 1029 1393 1596 1317
5521 1317 493 -22 -937 -1366 -1679 -809 -362 537 1445 1649 1386 784 -251 -1017 -1629 -1615 -1082 -625 214 1123
5541 1123 1792 1610 1203 366 -530 -1084 -1830 -1552 -763 -37 726 1424 1524 1236 378 -387 -1152 -1525 -1503 -845
5561 -845 -220 822 1464 1764 1435 479 -129 -1125 -1507 -1472 -1160 -393 384 1024 1858 1535 782 -63 -931 -1337
5581 -1337 -1633 -1377 -674 237 1328 1658 1537 1215 529 -518 -1270 -1612 -1475 -853 -123 851 1655 1674 1325
5600 1325 700 -212 -1159 -1665 -1658 -1002 -289 484 1512 1667 1370 864 -52 -1103 -1384 -1640 -1113 -423 336 1287
$$ packed form
5462A039O46O0m79j167o68o51l77K29M40J096R46L18K91m35p01q74r96l36j23
5481a742Q40P22J139N56J06k21q48o42q30p52r9P26P82K97J142K87mm39r73q25
5501g78n25l79L25Q36O31J163L73O9n90p94q82o38m70J86O68O60J174L64K03k79
5521A317q24n15r15m29l13Q70M47Q99R08K04k63o02j035p66o12J4N33M57Q39R09
5541A123O69j82m07q37q96n54p46K78P89P26P63O98J00k88q58p65p65l73K2O58
5561h45O25J042O42L00l29r56o08r96l82L5L12P67P77O40Q34l23p53q45q68m06
5581a337k96K56P03R11J091L30j21l22o86j047p52l42J37O22P30R74Q04J9l49
5600A325o25r12r47n06PO56P13P73J028J55k97n06r16j051k81k56N27O90P59R51
$$ plain form
5620 1287 1710 1453 1024 122 -822 -1207 -1425 -1356 -722 -33 1009 1420 1469 941 383 -573 -916 -1498 -1335 -1026
5640 -1026 -197 674 1096 1722 1277 436 -15 -851 -1460 -1696 -1130 -302 369 1367 1751 1603 915 32 -928 -1610
5660 -1610 -1510 -1381 -659 273 932 1522 1482 1111 326 -887 -1253 -1468 -1589 -502 -120 772 1513 1503 1409 481
5680 481 -410 -1000 -1561 -1577 -1057 -169 543 1514 1605 1614 869 -241 -834 -1425 -1594 -1313 -445 370 924 1629 1619
5701 1619 691 186 -626 -1405 -1612 -1355 -531 -26 1052 1598 1652 1271 316 -511 -1284 -1816 -1359 -1006 88
5720 88 787 1560 1757 1321 703 -260 -1046 -1720 -1710 -1283 -502 532 1154 1466 1483 1043 149 -892 -1321 -1683
5740 -1683 -1245 -706 90 837 1642 1585 1295 432 -752 -1153 -1688 -1481 -858 247 651 1446 1985 1169 496
5759 496 -131 -1021 -1826 -1621 -907 -345 698 1449 1458 1308 983 -96 -1011 -1831 -1660 -1286 -350 565 1164 1725
$$ packed form
5620A287M23k57m29r02r44l85k18O9O34O89J042M11M9n28n58r56l43n82J63L09
5640a026Q29Q71M22O26m45q41m51q36o09k36N66Q28O71R98L84j48o88q83r60o82
5660a610J00J29P22R32O59N90m0l71p85j213l66k15j21J087L82Q92P41j0r4r28
5680D81q91n90n61j6N20Q88P12R71R1Rp45j110n93n91j69K81Q68Q15N54P05j0
5701A619r28n05q12p79k07K57Q24N05J078N46N4l81r55q27p73n32M57L53J094
5720H8O99P73J97m36o18r63p86o74J0M27P81J034O22L12J7m40q94j041m29l62
5740a683M38N39P96P47Q05n7k90q63j184m01n35K07O23J105M04P95N39q16o73
5759D96o27q90q05K05P14N62J043P51Rj50l25j079r15q20J71L74R36R15N99N61
$$ plain form
5779 1725 1479 1017 182 -767 -1388 -1891 -1216 -832 -39 916 1604 1814 1305 453 -236 -1374 -1741 -1581 -914
5798 -914 -273 637 1379 1754 1353 638 -219 -1141 -1510 -1722 -1069 -76 512 985 1626 1534 1034 -7 -618 -1590
5818 -1590 -1613 -1384 -712 333 938 1600 1695 1006 367 -750 -1414 -1638 -1307 -751 204 986 1515 1547 1128 626
5838 626 -297 -1214 -1401 -1509 -1210 -516 604 1263 1432 1630 903 -313 -973 -1461 -1722 -1274 -384 492 1216
5857 1216 1597 1735 962 59 -601 -1212 -1524 -1406 -762 241 770 1541 1481 1152 545 -574 -1358 -1415 -1354 -853
5877 -853 -182 826 1437 1723 1412 759 -278 -1335 -1467 -1845 -1199 -233 639 1259 1568 1521 925 12 -841
5896 -841 -1570 -1753 -1429 -712 145 985 1799 1500 916 218 -754 -1322 -1547 -1711 -1027 79 1067 1532 1652 1358
5916 1358 635 -373 -1130 -1557 -1769 -1251 -80 760 1548 1847 1453 773 22 -820 -1332 -1414 -1210 -392 508
$$ packed form
5779A725k46m62q35r49o21n03O75L84P93R55O88K10n09q52o89j138l67J60O67
5798i14O41R10P42L75m01p15q57r22l69k12O53R93N88M73O41r2n00j041o11r72
5818a590k3K29O72J045O05O62R5o89o39j117o64k24L31N56R55P82N29L2m19n02
5838F26r23r17j87j08K99O94J120O59J69J98p27j216o60m88k61M48Q90Q76P24
5857A216L81J38p73r03o60o11l12J18O44J003N29P71o0l29o07j119p84n7O1N01
5877h53O71J008O11K86l11o53j037j057j32l78O46R66Q72O20L09m7n96r13q53
5896h41p29j83L24P17Q57Q40Q14k99n84o98r72n68k25j64O84J106R88M65J20k94
5916A358p23j008p57m27k12N18J171Q40P88K99l94o80p51q42n12q2K04Q18R00
$$ plain form
5935 508 1314 1402 1741 990 -112 -721 -1145 -1510 -1473 -864 130 931 1551 1609 1346 361 -451 -1263 -1596 -1397 -985
5956 -985 -136 811 1626 1595 1431 580 -119 -966 -1436 -1658 -1196 -544 726 1442 1701 1622 860 143 -802 -1580
5976 -1580 -1826 -1406 -581 263 1150 1693 1608 921 427 -724 -1172 -1634 -1475 -793 123 1081 1899 1656 1393 618
5996 618 -383 -1095 -1551 -1529 -939 -291 602 1102 1743 1327 522 -123 -860 -1667 -1530 -1180 -523 592 1329 1652
6016 1652 1749 1162 216 -774 -1526 -1507 -1432 -704 141 1035 1665 1490 1281 559 -521 -1150 -1518 -1480 -820 -208 537
6037 537 1668 1640 1480 700 -221 -1208 -1447 -1603 -925 -317 619 1299 1855 1378 798 -123 -704 -1436 -1781 -1323
6057 -1323 -770 432 1083 1394 1552 1202 82 -453 -1455 -1662 -1537 -829 -92 793 1652 1727 1324 405 -263
6076 -263 -1115 -1469 -1549 -900 -351 648 1245 1742 1658 562 7 -817 -1219 -1695 -1268 -441 385 1211 1694 1418
$$ packed form
5935E08Q06Q8L39p51j102o09m24l65L7O09R94Q01O20N8k63r85q12q12l33J99M12
5956i85Q49R47Q15l1j64q51o99q47m70k22M62O52J270P16K59p9p62p17r45p78
5976a580k46M20Q25Q44Q87N43q5o87m94j151m48m62J59O82R16R58Q18k43k63p75
5996F18j001p12m56K2N90O48Q93N00O41m16q05o45p37q07J37L50O57J115P37L23
6016A652R7n87r46r90p52J9P5P28Q45Q94O30j75k09p22j080o29l68L8O60O12P45
6037E37J131k8j60p80r21r87k39j56O78O08R36O80N56m77n80r21n81p32l45M58
6057a323N53J202O51L11J58l50j120n35j002k07J25P08P37Q85Q59P5m03r19o68
6076b63q52l54q0O49N49R99N97M97q4j096n55q24m02m76M27Q27Q26Q26M83k76
$$ plain form
6096 1418 816 108 -652 -1502 -1601 -1218 -1072 129 1057 1325 1624 1300 386 -358 -1322 -1583 -1364 -931 -153 895
6116 895 1488 1849 1328 742 -215 -1171 -1419 -1738 -1009 -127 402 1041 1580 1340 759 168 -975 -1499 -1636 -1221
6136 -1221 -699 499 1161 1493 1180 1101 325 -740 -1098 -1533 -1442 -967 89 1005 1368 1539 1211 443 -213
6155 -213 -1371 -1693 -1628 -1134 -260 703 1147 1552 1318 853 -2 -983 -1406 -1509 -964 -488 326 1086 1713 1502
6175 1502 1058 106 -664 -1328 -1519 -1375 -681 171 1206 1681 1476 1081 389 -502 -1044 -1553 -1583 -672 -144 900
6195 900 1538 1641 1525 472 -242 -1133 -1292 -1465 -1246 -404 721 1413 1518 1391 912 105 -927 -1662 -1623
6214 -1623 -1214 -752 288 996 1424 1520 921 86 -592 -1321 -1600 -1564 -741 151 842 1320 1815 1030 546 -435
6234 -435 -1194 -1601 -1601 -759 -264 691 1453 1458 1592 782 -142 -1183 -1474 -1604 -1048 -245 345 1100 1546 1462 944
$$ packed form
6096A418o02p08p60q50r9L83J46J201R28K68K99l24r14p44r64k61K19M33P78J048
6116H95N93L61n21n86r57r56k48l19P29Q82N29O39N39k40n81n91j143n24j37M15
6136a221N22J198O62L32l13p9p76j065l58m35R1M75J056R16L63J71l28p68o56
6155b13j158l22O5M94Q74R63M44M05k34m65q55r81m23j03N45M76Q14P60O27k11
6175A502m44r52p70o64j91J44O94Q52J035M75k05l95o92q91n42n09l0R11N28J044
6195I00O38J03j16j053p14q91j59j73K19Q42J125O92J05j27m79q07j032p35L9
6214a623M09M62J040P08M28R6n99q35o78p29k79L6Q23Q92O91M78M95p85m84r81
6234d35p59m07%Q42M95R55P62NJ34q10r24j041k91j30N56Q03N90P55M46q4n18
$$ plain form
6255 944 -24 -743 -1409 -1728 -1402 -653 387 946 1723 1395 1054 174 -720 -1315 -1790 -1500 -769 4 896 1438
6275 1438 1374 1391 607 -369 -1136 -1553 -1883 -1188 -360 446 1356 1829 1432 756 -285 -1031 -1582 -1853 -1416 -496
6295 -496 397 1121 1757 1485 1111 237 -575 -1260 -1376 -1311 -763 157 1009 1336 1542 1296 755 -610 -1255 -1552
6315 -1552 -1503 -975 -34 705 1428 1522 1389 931 -158 -1077 -1517 -1693 -1059 -381 645 1234 1584 1511 884 107
6335 107 -821 -1543 -1554 -1133 -737 351 1068 1532 1528 1179 97 -505 -1239 -1518 -1424 -673 36 967 1409 1408 1248
6356 1248 546 -373 -1002 -1666 -1625 -943 -380 719 1518 1577 1343 788 -312 -808 -1508 -1626 -1120 -651 340 1186
6376 1186 1322 1359 817 260 -696 -1335 -1680 -1518 -734 309 1049 1128 1410 1313 381 -668 -1057 -1570 -1257 -758
6396 -758 316 1099 1398 1590 1406 452 -289 -808 -1539 -1490 -952 -430 567 1099 1546 1384 812 -250 -737 -1487
$$ packed form
6255I44r68p19o66l19L26P49J040N59P77l28l41q80q94n95m75K90P31P73Q92N42
6275A438o4J7p84r76p67m17l30O95Q28Q06R10M73l97o76j041p46n51k71M37R20
6295d96Q93P24O36k72l74q74q12o85j16O5N48R20Q52L27K06k46n41j365o45k97
6315a552M9N28R41P39P23R4j33m58j089r19m40j76O34O78J026N89L50p3o27p77
6335A07r28p22j1M21L96J088P17M64ml49j082o02p34k79R4P51P09R31M42jj60
6356A248p02r19o29o64M1O82N63J099P99N9k34n55j100m96p00j18N06M69R91Q46
6376A186J36L7n42n57r56o39l45J62P84J043P40P9K82r7r32j049l89n13L13M99
6396g58J074P83K99J92j84r54p41n19p31M9N38N22R97N32M47j62n72j062m87p50
$$ plain form
6416 -1487 -1633 -1448 -432 545 1248 1602 1371 927 164 -391 -1291 -1345 -1321 -799 134 935 1382 1512 1283 523
6436 523 -337 -1212 -1637 -1830 -1136 -219 732 1167 1530 1363 734 -92 -951 -1283 -1436 -1048 -649 347 1207 1668
6456 1668 1454 943 78 -604 -1313 -1344 -1370 -525 -4 1018 1591 1612 1280 222 -255 -922 -1312 -1383 -946 18
6476 18 871 1162 1589 1168 506 -245 -1264 -1629 -1573 -1189 -348 442 1286 1591 1471 748 -239 -729 -1448 -1757
6496 -1757 -1133 -316 334 1154 1387 1400 939 293 -423 -1170 -1661 -1215 -524 143 1072 1498 1735 1185 356 -274
6516 -274 -1261 -1616 -1331 -917 -276 562 1008 1657 1523 593 -374 -930 -1402 -1473 -1008 -571 579 1016 1726 1219
6536 1219 601 -48 -852 -1367 -1550 -1359 -864 172 1246 1585 1570 1030 262 -517 -1180 -1424 -1388 -966 72
6555 72 812 1338 1532 1124 638 -111 -941 -1528 -1246 -944 -396 469 1161 1493 1511 643 -66 -1067 -1363 -1513
$$ packed form
6416a487j46J85J016R77P03L54k31m44p63n55r00n4K4N22R33Q01M47J30k29p60
6436E23q60q75m25j93O94R17R51M35L63j67o29q26q59l32j53L88L99R96Q60M61
6456A668k14n11q65o82p09l1k6Q45N21J022N73K1l32j058m77o67l90p1M37R64
6476A8Q53K91M27m21o62p51j019l65N6L84Q41P90Q44L05j20p23r87m90p19l09
6496a757O24Q17O50Q20K33J3m61o46p16p47m91M46O91O67R29M26K37n50q29o30
6516b74r87l55K85M14O41Q38M46O49j34r30r67n56m72p1M65M37J150M37P10n07
6536A219o18o49q04n15j83J91M95J036J074L39j5n40p68p79o63k44L6M22J038
6555G2P40N26J94m08m86p49q30n87K82L02N48Q65O92L32J8q68p09j001k96j50
$$ plain form
6575 -1513 -1238 -425 376 1157 1477 1295 983 62 -725 -1157 -1472 -1358 -521 33 857 1355 1386 1180 407 -336
6595 -336 -1156 -1622 -1368 -790 6 539 1231 1283 1545 906 -137 -888 -1484 -1359 -1148 -158 487 1285 1498 1514
6615 1514 745 4 -619 -1337 -1552 -1198 -555 28 1033 1489 1443 1213 320 -560 -1261 -1710 -1384 -864 37 770
6635 770 1077 1278 1261 655 -292 -967 -1583 -1371 -804 -418 663 1247 1316 1022 565 11 -881 -1205 -1597 -1237
6655 -1237 -353 357 976 1364 1403 768 -3 -818 -1127 -1374 -1424 -509 96 947 1463 1353 1148 349 -463 -946
6675 -946 -1336 -1479 -806 -242 511 1194 1496 1430 778 -500 -1057 -1423 -1395 -1133 -317 420 1176 1387 1208 793
6695 793 -220 -969 -1300 -1207 -1043 -496 361 1288 1446 1367 854 316 -430 -1380 -1322 -1336 -758 228 764 1273 1359
6716 1359 1130 491 -264 -1124 -1274 -1376 -727 -106 467 1068 1308 1326 659 -238 -939 -1572 -1225 -1113 -375 363
$$ packed form
6575a513K75Q13Q01P81L20j82l12r21p87m32l15J14Q37N54Q24M98L1k06p73p43
6595c36q20m66K54N78P96N33O92N2K62o39j043p51n96J25K11R90O45P98K13J6
6615A514p69p41o23p18k15L54O43N83J005M56m6k30q93q80p01m49L26N20R01P33
6635G70L07K01j7o06r47o75o16K12N67L86J081N84O9k94m57n54q92l24l92L60
6655a237Q84P10O19L88L9o35p71q15l09k47n0R15O05Q51N16j10k05p99q12m83
6675i46l90j43O73N64P53O83L02o6o52j278n57l66K8K62Q16P37P56K11j79m15
6695G93j013p49l31R3J64N47Q57R27J58p9n13n38p46r50N8j4N78R86N36N09Q6
6716A359k29o39p55q60j50j02O49O21N73O01K40J8o67q97p01o33L47J12P38P38
$$ plain form
6736 363 1037 1380 1397 995 191 -744 -1294 -1526 -1370 -178 254 850 1125 1539 1044 443 -821 -1460 -1689 -1350
6756 -1350 -756 174 915 1380 1639 992 555 -180 -843 -1523 -1314 -885 -183 572 1049 1310 1259 842 126 -959
6776 -959 -1279 -1444 -1198 -441 493 1032 1477 1190 758 304 -540 -1287 -1222 -1232 -446 44 680 1334 1263 1017 626
6797 626 -246 -946 -1344 -1360 -908 -217 612 1054 1297 1109 831 20 -768 -1585 -1646 -866 -248 285 962 1137 1372
6818 1372 841 49 -692 -1128 -1264 -1346 -682 208 1022 1330 1477 1038 330 -390 -1011 -1587 -1352 -622 -204 577
6838 577 1341 1596 1186 806 -314 -1195 -1332 -1567 -993 -100 365 1023 1692 1103 833 -138 -679 -1297 -1316 -1330
6858 -1330 -410 326 901 1391 1420 849 60 -818 -1288 -1415 -1507 -805 95 878 1339 1488 1018 387 -308 -1209
6878 -1209 -1642 -1350 -932 9 620 1170 1488 1321 760 -172 -1251 -1305 -1436 -1007 -142 329 1040 1354 1349 907
$$ packed form
6736C63O74L43J7m02q04r35n50k32J56J192M32N96K75M14m95o01j264o39k29L39
6756a350N94R30P41M65K59o47m37p35o63o80K09M29P02P55M77K61n1m17p16j085
6776i59l20j65K46P57R34N39M45k87m32m54q44p47O5j0P86M90O36O54p1k46l91
6797F26q72p00l98j6M52O91Q29M42K43j88k78q11p88q17o1P80O18N33O77J75K35
6818A372n31p92p41m36j36q2O64Q90Q14L08J47m39p08p20o21n76K35P30M18P81
6838E77P64K55m10l80j120q81j37k35N74Q93M65O58O69n89k70r71n41o18j9j4
6858a330R20P36N75M90K9n71p89q78m70j27r2P02R00P83M61J49m70o31o95r01
6878a209m33K92M18R41O11N50L18j67n61r32j079n4j31M29Q65M71P11L14nm42
$$ plain form
6898 907 60 -827 -1161 -1314 -1118 -685 146 1037 1414 1111 982 186 -462 -1081 -1250 -1276 -803 65 648 1273
6918 1273 1320 1081 537 -184 -932 -1298 -1290 -1298 -239 492 1121 1495 1240 559 -71 -762 -1303 -1284 -1050 -523 198
6939 198 871 1312 1559 897 256 -654 -1170 -1503 -1430 -562 234 933 1325 1669 1049 361 -376 -1074 -1401 -1398 -937
6960 -937 43 595 1185 1449 1006 674 -48 -955 -1286 -1484 -1107 -218 485 1260 1397 1113 733 219 -775 -1199
6980 -1199 -1207 -928 -598 179 810 1369 1269 875 336 -456 -941 -1254 -1172 -877 149 550 1200 1371 1447 405
7000 405 -130 -937 -1234 -1339 -859 -212 445 1084 1199 1155 764 -122 -1179 -1277 -1453 -972 -141 378 916 1398
7020 1398 1414 913 -95 -647 -1253 -1446 -1311 -515 358 899 1145 1355 1008 365 -480 -1058 -1305 -1325 -725 167
7040 167 911 1275 1333 1119 700 -187 -928 -1334 -1360 -978 -420 493 937 1333 1215 715 46 -621 -1269 -1372 -1059
$$ packed form
6898I07q47q87l34j53J96M33Q31Q91L77l03j29p96o48o19j69k6M73Q68N83O25
6918A273M7k39n44p21p48l66QqJ059P31O29L74k55o81o30o91n41J9K34N27P21
6939A98O73M41K47o62o41r10n16l33P3Q68P96O99L92L44o20o88p37o98l27LM61
6960i37R80N52N90K64m43l32p22r07l31j98L77Q89P03P75J37k84l80n14r94m24
6980a199qK79L30P77O31N59j00l94n39p92m85l13Q2K95J026M01O50J71P6j042
7000D05n35q07k97j05M80O47O57O39J15m4l91q86j057r8j76M81Q31N19N38M82
7020A398J6n01j008n52o06j93J35P96Q73N41K46K10l47o43q45n78k47k0O00Q92
7040A67P44L64N8k14m19q87p41m06k6L82N58R13M44L96j18n00o69o67o48j03L13
$$ plain form
7061 -1059 -708 214 942 1384 1195 906 63 -620 -1176 -1251 -1132 -492 98 565 1303 1191 1037 578 -399 -953
7081 -953 -1249 -1377 -883 43 645 1000 1372 953 573 68 -706 -1245 -1602 -873 -181 450 1096 1456 1267 807
7101 807 -75 -686 -1203 -1192 -1349 -568 362 908 1419 1263 864 231 -589 -1101 -1457 -1340 -439 -279 696 1228
7121 1228 1291 1032 421 -223 -1016 -1338 -1380 -1008 -129 551 1009 1353 1136 504 -196 -762 -1007 -1455 -823 -413
7141 -413 237 842 1355 1415 545 223 -359 -938 -1451 -1104 -710 51 713 1025 1461 1067 406 -515 -906 -1600
7161 -1600 -1243 -1029 -73 570 1138 1247 991 509 -17 -691 -1321 -1227 -950 -268 368 779 1402 1353 798 196
7181 196 -534 -982 -1319 -1012 -381 183 714 1066 1268 922 224 -327 -1135 -1226 -1276 -832 88 629 1061 1062 1115 429
7203 429 -77 -1030 -1319 -1035 -872 -172 488 970 1148 923 754 -130 -781 -1281 -1411 -1083 -420 234 1004 1338
$$ packed form
7061a059L51R22P28M42j89k89q43o83n56p5J19O40N90M67P38j12j54m59r77n54
7081i53k96j28M94R26O02L55L72m19l80n05p74n39l57P29O92O31O46L60j89m60
7101H07q82o11n17J1j57P81R30N46N11j56l99o33q20n12l56J17R01J60R75N32
7121A228O3k59o11o44p93l22m2L72Q79O80M58L44k17o32p00n66k45m48O32M10
7141d13O50O05N13O0q70l22n82n79n13L47L94P61O62L12M36l94o61r21l91o94
7161a600L57K14R56O43N68J09k56m82n26o74o30R4K77O82O36M11O23m9n55o02
7181A96p30m48l37L07O31N64N31L52K02l46o98n51q08r1n0M44R20N41M32JN3o86
7203D29n06r53k89K84J63P00O60M82J78k25j69q84o51n00j30L28O63O54P70L34
$$ plain form
7223 1338 1047 964 142 -623 -1110 -1426 -1092 -462 -81 754 1121 1393 951 452 -415 -843 -1305 -1191 -770 -70
7243 -70 449 1057 1287 1209 600 -390 -759 -1262 -1323 -872 -246 362 870 1432 1146 925 146 -751 -1209 -1385 -930
7264 -930 -532 -36 905 995 1122 919 -139 -329 -1148 -1103 -1294 -752 102 619 978 1011 861 237 -280 -770 -1310
7285 -1310 -1056 -841 -211 500 1009 1572 1145 485 -45 -681 -1316 -1442 -945 -340 353 1026 976 1188 664 200
7305 200 -617 -1056 -1057 -1041 -503 -133 705 1244 1325 893 314 -361 -824 -1151 -1190 -761 -176 466 1149 996 976 441
7327 441 -172 -878 -993 -1198 -1052 -312 456 961 1269 1199 747 -58 -706 -1248 -1210 -759 -495 307 865 1275 1189
7348 1189 821 326 -567 -922 -1286 -1322 -582 104 773 1035 1322 1026 414 -263 -882 -1172 -1216 -772 67 517
7368 517 1148 1200 903 418 -184 -671 -1255 -1145 -756 -415 464 968 1312 1156 734 -20 -565 -966 -992 -895 -601
$$ packed form
7223A338k91q3q22p65m87l16L34O30L81Q35L67K72m42m99q67m28m62J14M21P00
7243g0N19O08K30p8o09r90l69n03o1M51O26O08N08N62k86k21p79q97m58j76M55
7264i30L98M96R41R0J27k03j058j90q19M5j91N42Q54N17L59L3j50o24n17m90n40
7285a310K54K15O30P11N09N63m27o60n30o36o35j26M97O05O93O73n0K12n24m64
7305B00q17m39jJ6N38L70Q38N39Q1m32n79o75m63l27l9M29N85O42O83j53k0n35
7327D41o13p06j15k05J46P40P68N05L08p0m52q05o48n42L8M51K64Q02N58M10q6
7348A189l68m95q93l55l64l6P40O86O69K62K87k96o12o77o19k90m4M44Q39M50
7368E17O31N2k97m85o02m87n84J10L89L41Q79N04L44j56m22p54n45m01k6R7K94
$$ plain form
7389 -601 -12 836 1079 1277 639 252 -302 -1067 -1429 -960 -603 -247 747 1043 1083 839 639 -255 -783 -1039
7409 -1039 -1136 -834 -42 248 900 1145 971 740 -26 -665 -1066 -1151 -925 -307 162 960 1118 1025 782 36 -460
7430 -460 -958 -1132 -1251 -443 152 631 968 1274 881 342 -261 -832 -1216 -1113 -516 -253 567 798 1213 980
7450 980 603 -209 -703 -1089 -1077 -813 -176 495 746 1099 1203 691 60 -565 -1117 -1056 -930 -368 165 505 1161
7471 1161 1126 760 353 -170 -904 -1211 -960 -451 -322 767 979 1288 1173 342 -132 -719 -1093 -1143 -656 -89
7491 -89 451 678 1343 772 585 -369 -651 -1118 -1038 -703 -369 136 864 1220 994 612 135 -529 -1044 -1038 -1104 -331
7513 -331 161 503 906 995 1017 324 -193 -679 -1088 -1155 -524 30 542 989 1104 890 590 -86 -779 -927 -1104
7534 -1104 -682 -437 543 801 1196 799 453 -158 -693 -1005 -1148 -797 -598 209 728 1256 963 669 256 -386
$$ packed form
7389f01N89Q48K43J98o38l87n54p65l62M69L57L56R94K96M0k44k00q94n28k56
7409a039r7L02P92K90O52K45j74k31p66o39m01q5K26O18M69P98J58r3k43p46m96
7430d60m98j74j19Q08N95M79L37L06l93n39o03n71l84J03N97K63Q20K31M15k33
7450I80l77q12m94l86J2K64O37O71K51L53J04n12o31o25n52O1J26N62N33L40O56
7471A161l5l66m07n23p34l07K51N09J29J089K12L09j15q31m74n87l74n0M87N67
7491h9N40K27O65n71j87r54k82m67Q0L35L34N05P28L56k26l82m77o64n15Oo6P73
7513c31M92L42M03Q9K2o93n17m86m09o7O31N54N12M47J15k14l00o76o93j48j77
7534a104M22K45R80K58L95l97l46o11n35l12j43L51J99Q07N19N28k93k94m13o42
$$ plain form
7554 -386 -903 -1114 -961 -547 -83 615 938 1006 805 636 -252 -586 -1039 -803 -687 68 417 826 943 956 637
7575 637 -167 -617 -1063 -869 -973 -349 364 709 1003 1047 852 209 -551 -753 -1100 -967 -510 98 589 749
7595 749 955 681 189 -244 -698 -940 -994 -505 -27 471 1139 910 1053 468 -173 -484 -911 -1104 -715 -370
7615 -370 216 942 961 949 704 -75 -620 -1024 -958 -629 -288 346 763 963 1038 532 160 -257 -857 -1037 -931
7636 -931 -590 -122 713 927 847 903 259 -256 -700 -1066 -1094 -577 -384 386 979 899 756 241 -54 -481 -959
7657 -959 -800 -445 -288 101 761 1174 954 419 119 -267 -770 -857 -690 -487 279 479 958 1046 701 233 -63
7678 -63 -756 -1161 -968 -777 -46 192 825 1144 701 441 -36 -689 -826 -868 -600 -200 368 765 953 763 856
7699 856 -169 -597 -806 -1267 -871 -335 166 718 894 879 637 132 -582 -802 -1199 -1084 -471 272 364 791
$$ packed form
7554c86n17k11J53M14M64O98L23O8k01j69q88l34m53K36J16P55L49M09J17J3l19
7575F37q04m50m46J94j04O24P13L45K94M4j95o43p60k02l47J33M57O08M91J60
7595G49K06k74m92m33m54k42n4M89M78M98O68k29J43n85o41l11m27j93L89L45
7615c70N86P26J9j2k45p79n45m04O6L29L41O34M17K00P5n06l72m17o00j80J06
7636i31L41M68Q35K14q0N6o44n15m44l66k8N17J93P70N93q0j43n15k95m27m78
7657i59J59L55J57L89O60M13k20n35l00l86n03q7J67K03P66K00M79Q8l45m68k96
7678f3o93m05J93J91P31K38O33L19m43k60m77o53j37m2K68M00N68L97J88j90R3
7699H56j025m28k09m61L96N36N01N52J76j5k42n05p14k20l97J15O13P43R2M27
$$ plain form
7719 791 1072 790 342 -212 -734 -883 -904 -766 -231 249 741 894 958 324 -180 -547 -835 -710 -1039 -255 258
7740 258 767 982 909 536 -152 -281 -739 -895 -823 -435 133 529 756 962 860 262 -232 -762 -927 -1011 -652
7761 -652 54 466 597 734 815 505 -123 -557 -957 -1041 -670 -251 205 712 820 1053 391 95 -269 -998 -796
7782 -796 -631 -443 95 585 907 704 657 183 -283 -703 -1031 -561 -491 -28 496 759 912 484 275 47 -711
7803 -711 -985 -950 -630 -61 300 928 868 739 209 -144 -414 -1010 -770 -512 -314 138 739 684 720 659 83 -327
7825 -327 -589 -832 -493 -447 -73 307 662 751 558 164 -67 -704 -672 -799 -392 -12 315 620 970 976 433 -321
7847 -321 -725 -726 -1188 -691 -294 235 579 841 687 512 171 -587 -621 -927 -850 -507 57 402 769 756 456 354
7869 354 -399 -768 -770 -909 -488 -107 488 897 879 392 391 -264 -654 -868 -641 -558 -203 324 596 862 631 365
$$ packed form
7719G91K81k82m48n54n22j49k1J38N35M80M92J53O4o34n04l67k88J25l29P84N13
7740B58N09K15p3l73o88j29m58j56P2L88N68L96K27K06j02n98m94n30j65q4L59
7761f52P06M12J31J37Q1l10o28m34m00q4L71M19M56N07J08K33o62k96l64p29K02
7782g96J65J88N38M90L22k03m7m74m66m20l28M70P0M63N24K63J53m28k09k28p58
7803g11k74L5L20N69L61O28o0j29n30l53k70n96K40K58J98M52O01n5L6o1n76m10
7825c27k62k43L39M6L74L80L55Q9j93l94k31o37L2j27M07L80L27L05L50On43p54
7847c21m04jm62M97L97N29L44K62j54j75l41p58l4l06P7L43N64L45L67j3l00j02
7869C54p53l69kj39M21L81N95M09j8m87jo55l90k14K27Q3L55N27K72K66k31k66
$$ plain form
7891 365 -260 -404 -830 -803 -671 -393 -11 642 849 765 345 77 -215 -678 -745 -904 -482 -19 351 665 907
7912 907 533 452 -206 -376 -706 -727 -277 -88 528 510 663 496 467 85 -632 -633 -910 -1000 -351 221 741 937
7934 937 843 561 -132 -370 -757 -868 -744 -273 49 666 820 818 662 245 -290 -727 -756 -795 -243 -109 429 680
7956 680 638 439 463 -170 -675 -872 -747 -635 -367 253 653 772 769 421 -114 -550 -684 -702 -604 -300 216 549
7978 549 504 671 653 111 -335 -859 -960 -607 -603 -83 424 848 1001 624 300 -200 -540 -823 -879 -361 -66 327
8000 327 754 962 669 324 -217 -503 -794 -772 -859 -134 436 733 734 868 483 -170 -301 -545 -606 -601 -230 -157 457
8023 457 877 811 528 173 -340 -556 -788 -637 -458 11 223 679 683 543 296 -218 -485 -518 -949 -648 -191
8044 -191 405 930 746 747 336 -72 -556 -905 -742 -523 -494 68 669 527 753 532 18 -105 -785 -600 -650
$$ packed form
7891C65o25j44m26K7J32K78L82O53K07q4m20k68k92m63o7j59M22M63L70L14K42
7912I07l74q1o58j70l30k1M50J89O16j8J53j67k9l82p17jk77r0O49N72N20J96
7934I37r4k82o93k38l87j11J24M71L22O17J54kj56m17n35m37k9l9N52J34N38K51
7956F80m2j99K4o33n05j97J25J12K68O20M00J19ll48n35m36j34j8R8L04N16L33
7978E49m5J67j8n42m46n24j01L53MN20N07M24J53l77l24n00l40k83n6N18K95L93
8000C27M27K08k93l45n41k86k91K2q7P25N70K97JJ34l85o53j31k44o1NL71P3O14
8023D57M20o6k83l55n13k16k32J51J79M69K12M56Mj40k47n14k67l3m31L01M57
8044a91N96N25j84Jm11m08m84l49J63K19K9N62O01j42K26k21n14j23o80J85n0
$$ plain form
8065 -650 -364 44 337 577 793 506 383 -145 -377 -766 -730 -451 -171 506 694 538 532 356 -277 -291 -922
8086 -922 -742 -554 -366 197 622 950 699 499 28 -602 -564 -738 -656 -405 136 614 591 733 421 232 -95
8107 -95 -755 -789 -895 -378 -109 280 831 819 702 287 -211 -407 -611 -854 -335 -144 644 427 1008 606 472
8128 472 19 -371 -517 -938 -502 -308 516 703 612 852 574 31 -269 -624 -826 -678 -562 -184 279 679
8148 679 638 343 183 -196 -553 -769 -848 -491 -133 494 784 677 516 215 254 -420 -784 -1136 -550 -111 408
8169 408 524 686 751 512 -77 -318 -759 -756 -625 -157 123 510 735 656 605 174 11 -594 -972 -644 -484 -108
$$ packed form
8065f50K86M08K93K40K16k87j23n28k32l89L6K79K80O77J88j56oj76o33j4o31
8086i22J80J88J88N63M25L28k51k00m71o30L8j74Q2K51N41M78k3J42l12j89l27
8107i5o60l4j06N17K69L89N51j2j17m15m98j96k04k43N19J91P88k17N81m02j34
8128D72m53l90j46m21M36J94Q24J87r1K40k78n43l00l55k02J48J16L78M63M00
8148F79m1k95j60l79l57k16p9L57L58O27K90j07j61l01L9o74l64l52N86M39N19
8169D08J16J62O5k39n89k41m41LJ31M68K80L87K25p9n1m31j63o05l78L28J60L76
8191a08
$$ Imaginary data points
##PAGE= N=2
##DATA TABLE= (X++(I..I)), XYDATA
$$ plain form
0 0 0 0 0 0 0 0 0 0 0 0 8 -8 8 -8 11 -16 18 -24 32 -33 41 -50 58 -69 81 -95 108 -124 146 -165 190 -216 245
33 245 -279 312 -356 396 -445 496 -553 617 -683 758 -839 927 -1025 1130 -1246 1373 -1512
50 -1512 1667 -1834 2025 -2233 2469 -2736 3038 -3391 3797 -4282 4866 -5586 6504 -7710 9387
65 9387 -11869 15947 -23813 44679 -223659 -559985 -191676 22365 -19781 -82683 192619
76 192619 456777 382380 50940 -117315 -126800 -191382 -336575 -286000 -42082 142560 154678
87 154678 211213 350269 317747 -11937 -302114 -271373 -110848 -160473 -288648 -128759 276232
98 276232 462291 262572 24700 32548 74305 -118744 -383379 -374213 -118625 75498 113668
109 113668 172998 291956 283182 89919 -88775 -137290 -186940 -306274 -303463 -53779 218820
$$ packed form
0@%%%%%%%%%%Qj6J6j6J9k7L4m2N6o5P4r1J08j27J50j76K03k32K70l11L55m06M61
33B45n24N91o68P52q41R41j049J170j300J441j597J766j952K155k376K619k885
50a512L179l501L859m258M702n205N774o429P188q079R148j0452J2090j4214J7097
65I387k1256K7816l9760O8492k68338l36326L68309K14041m2146o2902K75302
76A92619K64158p4397l31440j68255r485o4582j45193N0575K43918J84642J2118
87A54678N6535J39056l2522l29684k90177L0741J60525m9625j28175J59889M04991
98B76232J86059j99719k37872P848M1757j93049k64635R166K55588J94123L8170
109A13668N9330J18958q774j93263j78694m8515m9650j19334K811K49684K72599
$$ plain form
120 218820 246650 134241 154391 259449 149461 -190341 -400333 -278539 -67252 -35126
130 -35126 -68306 73536 309057 350771 157464 -34591 -100175 -152860 -252634 -269401 -126977
141 -126977 43698 122456 177653 273511 284754 96551 -146761 -217887 -147481 -144578 -219627
152 -219627 -152615 115150 329430 283974 111433 43655 50170 -53710 -250697 -324982 -193810
163 -193810 -12626 82551 139263 217400 243886 146602 -1966 -97819 -161690 -240237 -257404
174 -257404 -118447 91150 190090 161558 151756 196928 147110 -65540 -267704 -272721 -142285
185 -142285 -60642 -45275 37055 201130 288734 204653 46941 -60325 -124894 -195734 -229002
196 -229002 -159604 -27472 78226 148526 216447 236714 133642 -45766 -158788 -162184 -153739
$$ packed form
120B18820K7830j12409K0150J05058j09988l39802k09992J21794K11287L2126
130c5126l3180J41842K35521M1714j93307j92055o5584n2685r9774j6767J42424
141a26977J70675P8758N5197R5858J1243j88203k43312p1126P0406K903p5049
152b19627O7012K67765K14280m5456j72541o7778O515j03880j96987p4285J31172
163a93810J81184R5177N6712P8137K6486r7284j48568r5853o3871p8547j7167
174b57404J38957K09597R8940k8532r802M5172m9818k12650k02164n017J30436
185a42285Q1643J5367Q2330J64075Q7604q4081j57712j07266o4569p0840l3268
196b29002O9398J32132J05698P0300O7921K0267j03072j79408j13022l396Q445
$$ plain form
207 -153739 -180520 -143853 26361 214251 256414 165382 81863 49220 -23259 -163807 -257106
218 -257106 -207303 -72177 39391 108614 174057 211483 165089 50482 -58793 -134965 -198535
229 -198535 -224069 -149895 4074 126660 157313 154364 169019 140616 4334 -167261 -233611
240 -233611 -174538 -94833 -50465 14896 136448 231714 209196 96824 -13740 -90193 -157182
251 -157182 -201311 -171861 -71410 37578 116536 176221 205464 155448 26660 -97776 -149931
262 -149931 -155342 -161167 -136266 -26280 126692 209471 182222 113317 60509 -5776 -113898 -206172
274 -206172 -203080 -112452 -8927 70669 139492 189219 175690 90354 -16820 -99740 -158424 -189741
286 -189741 -158846 -54064 66728 136902 155628 156987 132076 42078 -91866 -183649 -184116 -130876
$$ packed form
207a53739k6781L6667J70214J87890M2163r1032q3519l2643p2479j40548r3299
218b57106M9803J35126J11568O9223O5443L7426m6394j14607j09275p6172o3570
229a98535k5534P4174J53969J22586L0653k949J4655k8403j36282j71595o6350
240b33611N9073P9705M4368O5361J21552R5266k2518j12372j10564p6453o6989
251a57182m4129K9450J00451J08988P8958N9685K9243n0016j28788j24436n2155
262a49931n411n825K4901J09986J52972Q2779k7249o8905n2808o6285j08122r2274
274b06172L092R0628J03525P9596O8823M9727j3529q5336j07174q2920n8684l1317
286a89741L0895J04782J20792P0174J8726J359k4911q9998j33944r1783m67N3240
$$ plain form
298 -130876 -74156 -6646 91101 180156 195340 127936 32331 -50418 -120989 -173211 -172969 -104751
310 -104751 -4289 83726 145476 178188 160244 77284 -34488 -117856 -153516 -158013 -132587 -57050
322 -57050 57522 151644 176801 142596 86413 16445 -73036 -156176 -183813 -139194 -54454 31600
334 31600 105612 159282 169078 118766 27945 -63758 -131104 -165133 -155126 -92013 5941 95435
346 95435 147133 158072 131474 65126 -31899 -122458 -165947 -151625 -99242 -26616 57040 133633
358 133633 169889 145455 73648 -13565 -91138 -145192 -161166 -127751 -49753 42506 117029 154412
370 154412 149518 100990 18691 -70776 -135454 -155695 -131005 -70611 12509 96986 152130 156066
382 156066 110955 37908 -42228 -112932 -155291 -148825 -90746 -4954 75389 129420 150224 129829
$$ packed form
298a30876N6720O7510R7747Q9055J5184o7404r5605q2749p0571n2222K42O8218
310a04751J00462Q8015O1750L2712j7944q2960j11772q3368l5660m497K5426P5537
322e7050J14572R4122K5157l4205n6183o9968q9481q3140k7637M4619Q4740Q6054
334C1600P4012N3670R796n0312r0821r1703o7346l4029J0007O3113R7954Q9494
346I5435N1698J0939k6598o6348r7025r0559m3489J4322N2383P2626Q3656P6593
358A33633L6256k4434p1807q7213p7573n4054j5974L3415P7998R2259P4523L7383
370A54412m894m8528q2299q9467o4678k0241K4690O0394Q3120Q4477N5144L936
382A56066m5111p3047q0136p0704m2359O466N8079Q5792Q0343N4031K0804k0395
$$ plain form
394 129829 66443 -23079 -103079 -144883 -143875 -106024 -37045 48315 122171 152719 132851 77992
406 77992 5915 -71932 -135414 -155018 -119866 -48584 27874 93458 139083 147415 104113 21863
418 21863 -60650 -116051 -139523 -130389 -81165 2365 86223 134569 138597 109273 52991 -26612
430 -26612 -105617 -146595 -133896 -84904 -21080 50490 117917 151042 127280 60764 -13353 -75288
442 -75288 -123263 -143312 -113990 -38622 45088 103055 129564 129483 93290 17538 -69119 -124351 -134050
455 -134050 -111148 -65030 6254 86076 136592 133735 91345 32837 -32960 -100975 -143194 -130811
467 -130811 -71592 3 60341 109959 139107 122091 53548 -30671 -90811 -118462 -124153 -100685
479 -100685 -36302 49782 113926 131316 112443 71670 8532 -68336 -125167 -133504 -99091 -44988
$$ packed form
394A29829o3386q9522q0000m1804J008L7851O8979Q5360P3856L0548j9868n4859
406G7992p2077p7847o3482j9604L5152P1282P6458O5584M5625Q332m3302q2250
418B1863q2513n5401k3472R134M9224Q3530Q3858M8346M028k9324n6282p9603
430b6612p9005m0978J2699M8992O3824P1570O7427L3125k3762o6516p4117o1935
442g5288m7975k0049K9322P5368Q3710N7967K6509q1l6193p5752q6657n5232r699
455a34050K2902M6118P1284P9822N0516k857m2390n8508o5797o8015m2219J2383
467a30811N9219P1595O0338M9618K9148j7016o8543q4219o0140k7651n691K3468
479a00685O4383Q6084O4144J7390j8873m0773o3138p6868n6831q337L4413N4103
$$ plain form
491 -44988 18410 86387 134370 131658 80078 13049 -45104 -94967 -131254 -127111 -68680 15099
503 15099 79460 111078 119690 103979 50164 -31695 -100297 -126517 -114495 -78047 -20731 51946
515 51946 111876 129426 104671 56479 -3562 -71305 -125039 -132483 -89589 -25849 31820 82387
527 82387 122695 127996 79744 -78 -66173 -100223 -113426 -107168 -64468 12304 86675 122637
539 122637 115605 83736 33334 -33835 -96777 -125847 -110361 -66534 -8245 57477 112094 127439
551 127439 95408 39382 -16681 -68407 -114168 -129085 -91733 -16019 54025 93029 107832 105840
563 105840 73926 6819 -69436 -115535 -117855 -88583 -40722 20072 79457 114787 113837 80126
575 80126 23007 -45517 -103134 -123367 -98355 -49138 3256 54843 103676 126534 98932 30326
$$ packed form
491d4988O3398O7977M7983k712n1580o7029n8153m9863l6287M143N8431Q3779
503A5099O4361L1618Q612j5711n3815q1859o8602k6220J2022L6448N7316P2677
515E1946N9930J7550k4755m8192o0041o7743n3734p444M2894O3740N7669N0567
527H2387M0308N301m8252p9822o6095l4050j3203O258M2700P6772P4371L5962
539A22637p032l1869n0402o7169o2942k9070J5486M3827N8289O5722N4617J5345
551A27439l2031n6026n6063n1726m5761j4917L7352P5714P0044L9004J4803j992
563A05840l1914o7107p6255m6099k320K9272M7861O0794N9385L5330r50l3711
575H0126n7119o8524n7617k0233K5012M9217N2394N1587M8833K2858k7602o8606
$$ plain form
587 30326 -39720 -83091 -102384 -105155 -81488 -22616 52609 106202 117967 94568 49168 -8697
599 -8697 -66388 -105631 -112076 -86649 -35402 30731 90660 117954 102452 59304 9493 -42046
611 -42046 -92748 -123074 -105739 -44261 26251 74113 96288 102035 86000 36419 -35423 -95172
623 -95172 -116110 -97745 -56274 -4303 50669 94825 112795 95371 46642 -19741 -79754 -110075
635 -110075 -102222 -67304 -21359 29685 82510 117149 108673 55736 -11802 -62832 -90072 -99864
647 -99864 -89959 -48878 19026 83816 114012 101812 62220 11924 -38616 -81916 -106514 -100180
659 -100180 -58637 6424 69181 103476 100818 72835 32921 -16474 -71282 -111947 -111394 -65334
671 -65334 301 53312 83407 95908 90382 56922 -4105 -69299 -107616 -104361 -69930 -21753
$$ packed form
587C0326p0046m3371j9293k771K3667N8872P5225N3593J1765k3399m5400n7865
599h697n7691l9243o445K5427N1247O6133N9929K7294j5502m3148m9811n1539
611d2046n0702l0326J7335O1478P0512M7862K2175N747j6035m9581p1842n9749
623i5172k0938J8365M1471N1971N4972M4156J7970j7424m8729o6383o0013l0321
635a10075P853L4918M5945N1044N2825L4639q476n2937o7538n1030k7240r792
647i9864R905M1081O7904O4790L0196j2200l9592n0296n0540m3300k4598O334
659a00180M1543O5061O2757L4295k658k7983l9914m9395n4808m0665N53M6060
671f5334O5635N3011L0095J2501n526l3460o1027o5194l8317L255L4431M8177
$$ plain form
683 -21753 27210 71397 101081 103244 68300 5448 -58334 -96185 -99127 -77409 -41980 5091
695 5091 60006 103727 110602 74048 14249 -40671 -76190 -93701 -92106 -63959 -8509 56134 100434
708 100434 105619 75726 29336 -17762 -59869 -92748 -103605 -77567 -18509 47032 88701 95904
$$ packed form
683b1753M8963M4187K9684K163l4944o2852o3782l7851k942K1718L5429M7071
695E091N4915M3721O875l6554n9799n4920l5519j7511J595K8147N5450O4643M4300
708A00434N185k9893m6390m7098m2107l2879j0857K6038N9058O5541M1669P203
$$ [...]
##END NTUPLES=NMR FID
##END=
