##TITLE=1H_PR165R_d6
 DMSO-d6, 8 sc, 
 20.8.2019
##JCAMPDX= 6.0         $$ Bruker NMR JCAMP-DX V2.0
##DATA TYPE= NMR FID
##DATA CLASS= NTUPLES
##ORIGIN= UXNMR, Bruker Analytische Messtechnik GmbH
##OWNER= root
$$ XWIN-NMR		Version 3.5
$$ Tue Aug 20 14:59:04 2019 Russian Standard Time (UT+4h)  she@DPX200
##.OBSERVE FREQUENCY= 200.13155
##.OBSERVE NUCLEUS= ^1H
##.DELAY= (6, 6)
##.ACQUISITION MODE= SIMULTANEOUS
##.ACQUISITION SCHEME= undefined
##.AVERAGES= 8
##.DIGITISER RES= 18
##SPECTROMETER/DATA SYSTEM= spect
##.PULSE SEQUENCE= zg30
##.SOLVENT NAME= DMSO
##.SHIFT REFERENCE= (INTERNAL, DMSO, 0, 15.7039)
##AUDIT TRAIL= $$ (NUMBER, WHEN, WHO, WHERE, WHAT)
$$ ##TITLE= Audit trail, XWIN-NMR		Version 3.5
$$ ##JCAMPDX= 5.01
$$ ##ORIGIN= Bruker BioSpin GmbH
$$ ##OWNER= she
$$ F:/spectra/data/she/nmr/H-F/1/audita.txt
$$ ##AUDIT TRAIL=  $$ (NUMBER, WHEN, WHO, WHERE, WHAT)
(   1,<2019-08-20 14:57:49.98 +0400>,<she>,<DPX200>,
      <created by zg, POWCHK disabled, PULCHK disabled
       configuration hash MD5:
       00 E9 B6 7A A2 85 ED C7 34 08 36 98 17 FE 4E 26
       data hash MD5: 16K
       44 A7 6A 22 B3 2E 50 15 0F 72 17 04 A6 AF 12 1F>)
$$ ##END=
$$ 
$$ hash MD5
$$ C0 76 D1 4B 11 78 C8 4E 15 03 2F E5 71 D1 FF A7
##$RELAX= 
##$RELAX= 
##$RELAX= 
##$RELAX= 
##$RELAX= 
##$RELAX= 
$$ Bruker specific parameters
$$ --------------------------
##$DU= <F:/spectra>
##$EXPNO= 1
##$NAME= <H-F>
##$PROCNO= 1
##$TYPE= <nmr>
##$USER= <she>
##$AMP= (0..31)
100 100 100 100 100 100 100 100 100 100 100 100 100 100 100 100 100 100 
100 100 100 100 100 100 100 100 100 100 100 100 100 100 
##$AQSEQ= 0
##$AQ_mod= 1
##$AUNM= <au_zg>
##$AUTOPOS= <>
##$BF1= 200.13
##$BF2= 200.13
##$BF3= 200.13
##$BF4= 200.13
##$BF5= 200.13
##$BF6= 200.13
##$BF7= 200.13
##$BF8= 200.13
##$BYTORDA= 1
##$CFDGTYP= 0
##$CFRGTYP= 5
##$CHEMSTR= <none>
##$CNST= (0..31)
1 1 145 1 1 1 1 1 1 1 1 1 1 1 1 1 1 1 1 1 1 1 1 1 1 1 1 1 1 1 1 1 
##$CPDPRG= <>
##$CPDPRG1= <>
##$CPDPRG2= <>
##$CPDPRG3= <>
##$CPDPRG4= <mlev>
##$CPDPRG5= <mlev>
##$CPDPRG6= <mlev>
##$CPDPRG7= <mlev>
##$CPDPRG8= <mlev>
##$CPDPRGB= <>
##$CPDPRGT= <>
##$D= (0..31)
0 1.2 0 0 0 0 0 0 0 0 0 0.03 0 0 0 0 0 0 0 0 0 0 0 0 0 0 0 0 0 0 0 0 
##$DATE= 1566298669
##$DBL= (0..7)
120 120 120 120 120 120 120 120 
##$DBP= (0..7)
150 150 150 150 150 150 150 150 
##$DBP07= 0
##$DBPNAM0= <>
##$DBPNAM1= <>
##$DBPNAM2= <>
##$DBPNAM3= <>
##$DBPNAM4= <>
##$DBPNAM5= <>
##$DBPNAM6= <>
##$DBPNAM7= <>
##$DBPOAL= (0..7)
0.5 0.5 0.5 0.5 0.5 0.5 0.5 0.5 
##$DBPOFFS= (0..7)
0 0 0 0 0 0 0 0 
##$DE= 6
##$DECBNUC= <off>
##$DECIM= 24
##$DECNUC= <off>
##$DECSTAT= 4
##$DIGMOD= 1
##$DIGTYP= 9
##$DL= (0..7)
0 120 120 120 120 120 120 120 
##$DP= (0..7)
150 150 150 150 150 150 150 150 
##$DP07= 0
##$DPNAME0= <>
##$DPNAME1= <>
##$DPNAME2= <>
##$DPNAME3= <>
##$DPNAME4= <>
##$DPNAME5= <>
##$DPNAME6= <>
##$DPNAME7= <>
##$DPOAL= (0..7)
0.5 0.5 0.5 0.5 0.5 0.5 0.5 0.5 
##$DPOFFS= (0..7)
0 0 0 0 0 0 0 0 
##$DQDMODE= 0
##$DR= 18
##$DS= 0
##$DSLIST= <SSSSSSSSSSSSSSS>
##$DSPFIRM= 0
$$ [...]
##$SUBNAM2= <"">
##$SUBNAM3= <"">
##$SUBNAM4= <"">
##$SUBNAM5= <"">
##$SUBNAM6= <"">
##$SUBNAM7= <"">
##$SUBNAM8= <"">
##$SUBNAM9= <"">
##$SW= 24.9336996594482
##$SWIBOX= (0..15)
0 0 2 0 0 0 0 0 0 0 0 0 0 0 0 0 
##$SW_h= 4990.01996007984
##$TD= 16384
##$TD0= 1
##$TE= 0
##$TE2= 300
##$TE3= 300
##$TEG= 300
##$TL= (0..7)
0 120 120 120 120 120 120 120 
##$TP= (0..7)
150 150 150 150 150 150 150 150 
##$TP07= 0
##$TPNAME0= <>
##$TPNAME1= <>
##$TPNAME2= <>
##$TPNAME3= <>
##$TPNAME4= <>
##$TPNAME5= <>
##$TPNAME6= <>
##$TPNAME7= <>
##$TPOAL= (0..7)
0.5 0.5 0.5 0.5 0.5 0.5 0.5 0.5 
##$TPOFFS= (0..7)
0 0 0 0 0 0 0 0 
##$TUNHIN= 0
##$TUNHOUT= 0
##$TUNXOUT= 0
##$USERA1= <user>
##$USERA2= <user>
##$USERA3= <user>
##$USERA4= <user>
##$USERA5= <user>
##$V9= 5
##$VALIST= <valist>
##$VCLIST= <CCCCCCCCCCCCCCC>
##$VD= 0
##$VDLIST= <DDDDDDDDDDDDDDD>
##$VPLIST= <PPPPPPPPPPPPPPP>
##$VTLIST= <TTTTTTTTTTTTTTT>
##$WBST= 1024
##$WBSW= 4
##$XGAIN= (0..3)
0 0 0 0 
##$XL= 0
##$YL= 0
##$YMAX_a= 238046
##$YMIN_a= -203516
##$ZGOPTNS= <>
##$ZL1= 120
##$ZL2= 120
##$ZL3= 120
##$ZL4= 120
##$ABSF1= 10
##$ABSF2= 0
##$ABSG= 5
##$ABSL= 3
##$ALPHA= 0
##$AQORDER= 0
##$ASSFAC= 0
##$ASSFACI= 0
##$ASSFACX= 0
##$ASSWID= 0
##$AUNMP= <proc_1d>
##$AZFE= 0.1
##$AZFW= 0.1
##$BCFW= 1
##$BC_mod= 2
##$BYTORDP= 1
##$COROFFS= 0
##$CY= 11.3945322036743
##$DATMOD= 1
##$DC= 2
##$DFILT= <>
##$DTYPP= 0
##$F1P= 20.1720416913024
##$F2P= 0.152960286110954
##$FCOR= 0.5
##$FTSIZE= 0
##$FT_mod= 4
##$GAMMA= 1
##$GB= 0.15
##$INTBC= 1
##$INTSCL= 1
##$ISEN= 128
##$LB= 0.24
##$LEV0= 0
##$LPBIN= 0
##$MAXI= 10000
##$MC2= 0
##$MEAN= 0
##$ME_mod= 0
##$MI= 1.114404
##$NCOEF= 0
##$NC_proc= 0
##$NLEV= 6
##$NOISF1= 3.799351
##$NOISF2= 2.8
##$NSP= 1
##$NTH_PI= 0
##$NZP= 0
##$OFFSET= 15.70392
##$PC= 1
##$PHC0= -9218.153
##$PHC1= 18.80096
##$PH_mod= 1
##$PKNL= yes
##$PPARMOD= 0
##$PSCAL= 0
##$PSIGN= 0
##$REVERSE= no
##$SF= 200.130013532006
##$SI= 16384
##$SIGF1= 3
##$SIGF2= 2
##$SINO= 400
##$SIOLD= 16384
##$SREGLST= <1H.CDCl3>
##$SSB= 0
##$STSI= 0
##$STSR= 0
##$SW_p= 3612.71676300578
##$SYMM= 0
##$S_DEV= 0
##$TDeff= 0
##$TDoff= 0
##$TI= <>
##$TILT= no
##$TM1= 0
##$TM2= 0
##$TOPLEV= 0
##$USERP1= <user>
##$USERP2= <user>
##$USERP3= <user>
##$USERP4= <user>
##$USERP5= <user>
##$WDW= 1
##$XDIM= 8192
##$YMAX_p= 0
##$YMIN_p= 0
$$ End of Bruker specific parameters
$$ ---------------------------------
##NTUPLES= NMR FID
##VAR_NAME=  TIME,          FID/REAL,        FID/IMAG
##SYMBOL=    X,             R,               I
##VAR_TYPE=  INDEPENDENT,   DEPENDENT,       DEPENDENT
##VAR_FORM=  AFFN,          ASDF,            ASDF
##VAR_DIM=   8192,          8192,            8192
##UNITS=     SECONDS,       ARBITRARY UNITS, ARBITRARY UNITS
##FACTOR=    0.0002004,     1,               1
##FIRST=     0,             0,               0
##LAST=      1.6414764,     0,               0
##MIN=       0,             -203516,         0
##MAX=       1.6414764,     238046,          0
$$ Real data points
##PAGE= N=1
##DATA TABLE= (X++(R..R)), XYDATA
0 0 0 0 0 0 0 0 8 -8 8 -8 15 -16 16 -24 25 -32 40 -48 56 -64 77 -89 104 -119 137 -157 178 -203 230 -262
30 -262 293 -330 370 -414 462 -513 571 -636 704 -782 864 -959 1061 -1174 1301 -1444 1604
47 1604 -1786 1995 -2241 2529 -2874 3298 -3834 4534 -5498 6903 -9175 13467 -24542 118846
61 118846 238046 142608 169290 188206 208439 161092 127733 108124 120341 109346 91439 68424
73 68424 65941 52007 27990 1135 5550 16105 5434 -38031 -65558 -56519 -30506 -38574 -76888
86 -76888 -107153 -96929 -73079 -73722 -102820 -122062 -113000 -95921 -100888 -118824 -122498 -106264 -98580
99 -98580 -112385 -125612 -112440 -88134 -85806 -107560 -118027 -95780 -67436 -67036 -89276 -96691 -72956
112 -72956 -46420 -47454 -65696 -67534 -44193 -24576 -30972 -44000 -36109 -12450 -3253 -15863 -24791
125 -24791 -9165 14711 16596 -1758 -8303 11905 34515 30736 9665 5950 28253 46321 36760
138 36760 16964 18833 40153 50133 35748 20173 27463 46990 48957 29817 18252 31825 48911
151 48911 42827 21091 15265 32250 45194 33896 12774 11633 28718 37416 22436 4624 7069
164 7069 24425 27650 9779 -3881 4468 19849 17024 -2124 -10851 1980 15857 7303 -12546
177 -12546 -15971 931 10657 -2295 -19723 -17392 734 5877 -10117 -24116 -16142 1284 1198 -16358
191 -16358 -25333 -12587 2592 -3173 -20807 -24108 -7691 3419 -6555 -22313 -19813 -2993 4036
204 4036 -8798 -21465 -15321 1703 4799 -10106 -20345 -9150 6665 4518 -11537 -16387 -2585
217 -2585 10398 3228 -12284 -11795 3738 12356 1308 -12114 -7217 9027 13161 -1354 -11103 -1949
231 -1949 12956 11696 -3154 -8835 2858 15038 9126 -4860 -6440 7327 15280 6049 -6706
244 -6706 -4280 9722 14378 2956 -7690 -1636 12076 12580 -520 -8839 1007 13111 9349 -4838
258 -4838 -8389 3763 13085 5401 -8081 -7102 6450 12034 1094 -10041 -4892 8276 9796 -2909
272 -2909 -10813 -2368 9526 6738 -6630 -10435 444 9590 3456 -8664 -8781 3353 9115 -4
286 -4 -10598 -6723 5094 7825 -2739 -11106 -4354 6973 6313 -5538 -10536 -1441 8574 3897 -8102
301 -8102 -9513 1858 8567 1458 -9536 -6767 4238 8163 -1243 -9553 -4525 6571 7212 -4037
315 -4037 -9113 -1089 8037 4771 -5679 -7841 1740 8288 2557 -6887 -5977 3990 8125 424 -7727
330 -7727 -3965 5980 7685 -1726 -7695 -1675 7025 5914 -3966 -6908 493 7964 3702 -5765 -5908
345 -5908 3197 8140 1214 -7060 -4079 5259 6942 -1363 -7409 -1499 6310 5234 -3410 -6562 106
360 106 6712 3026 -4848 -5597 2400 6985 1270 -5822 -4326 3922 6053 -779 -6264 -2238 4853 4739
376 4739 -2583 -6280 -576 5925 3420 -4115 -5806 1329 6142 1626 -5382 -4745 3434 5866 -448
391 -448 -6564 -2517 4725 4418 -2340 -5797 -755 5470 3157 -4129 -4982 1093 5639 1638 -4806 -4037
407 -4037 2623 5236 118 -5237 -2682 3577 4591 -1362 -5452 -1140 4677 3738 -2774 -5417 241
422 241 5387 2339 -4345 -4308 2044 5247 551 -5058 -2982 3788 4699 -1305 -4962 -1202 4588 3522
438 3522 -2513 -4627 498 4972 1993 -3661 -3518 1596 4701 787 -4191 -2613 2820 4218 -685
453 -685 -4681 -1613 3791 3162 -2005 -4428 -327 4424 2121 -3042 -3768 1030 4633 1141 -3963 -3004
469 -3004 2704 4741 -582 -4628 -2056 3229 3620 -1710 -4511 -430 4221 2234 -2951 -3773 973 4166
485 4166 1234 -3493 -2988 1910 3840 -369 -3878 -2135 3121 3595 -1039 -4496 -855 3451 2790 -2399
501 -2399 -3722 95 3873 1811 -2929 -3263 1390 4214 609 -3871 -2240 2689 3599 -853 -4007 -1207
517 -1207 3478 2709 -1644 -3795 -33 3474 1608 -2636 -2924 1014 3431 780 -3350 -2094 1842 3535
533 3535 -237 -3062 -1338 2188 2503 -1038 -3194 -390 2910 2144 -1760 -2780 752 3335 1048 -2346
549 -2346 -2613 1452 3381 196 -3411 -2124 2205 2572 -594 -2966 -586 2730 2087 -1944 -2987 570
565 570 3046 1331 -2209 -2192 1072 2827 105 -2430 -1721 1730 2326 -526 -2692 -1180 2192 2314 -1149
582 -1149 -2664 -93 2772 1518 -1929 -2476 714 2522 783 -2201 -2037 1483 2563 -215 -2441 -1010
598 -1010 2119 2160 -1401 -2707 133 2672 1386 -1524 -2237 573 2483 645 -1930 -1492 1130 1998
614 1998 27 -2182 -928 1699 2121 -665 -2448 -704 1830 1761 -1430 -1973 279 1960 1020 -1615
630 -1615 -2108 737 2271 200 -1968 -1792 1237 2165 -244 -2357 -855 1779 1566 -1179 -2229 123
646 123 2307 922 -1458 -1600 760 2082 479 -1571 -1466 1232 2288 289 -1812 -1059 1357 1748
662 1748 -693 -1876 -466 1994 1374 -1088 -1842 105 2054 992 -1670 -1609 418 1947 417 -1839
678 -1839 -1115 1287 1596 -317 -1624 -762 1441 1296 -258 -1518 18 1546 923 -984 -1527 139 1250
695 1250 607 -1367 -1249 754 1382 263 -1424 -839 1221 1431 -601 -1538 -638 1011 1116 -631 -1624
712 -1624 -5 1465 877 -1220 -1254 543 1400 7 -1490 -973 641 1156 95 -1405 -911 1290 926
729 926 -188 -1350 -211 1282 947 -786 -922 143 988 582 -676 -1122 195 1257 86 -1021 -718
746 -718 600 865 18 -1317 -648 861 1155 -422 -1190 -36 862 646 -450 -964 126 1032 650 -1006
764 -1006 -718 388 1172 16 -703 -529 841 795 -126 -837 -276 869 568 -506 -906 -129 710 351 -663
783 -663 -510 -9 614 152 -791 -408 484 1075 198 -868 -832 282 1000 -139 -785 -497 705 447 -236
802 -236 -753 -140 356 408 -486 -929 452 618 440 -361 -502 111 430 125 -358 89 209 338 226 -489
822 -489 -160 565 489 -179 -564 -162 272 489 -388 -710 -23 583 296 -722 -593 249 725 266 -514 -190
842 -190 335 290 -159 -360 160 217 89 -186 -441 -29 108 339 -157 -286 36 351 417 -490 -294 -74 484
863 484 92 -109 1 -191 423 -29 -430 -313 114 405 -210 -480 -320 411 117 -63 -288 -109 171 262 -501
884 -501 -256 293 260 -100 -82 -365 198 278 -10 -191 -199 435 391 -73 -91 -163 129 47 -241 -482 -77 374 122
907 122 -35 -195 243 564 383 -337 -303 121 428 -107 -291 -241 422 296 -75 -386 -281 285 164 73 -709
928 -709 58 155 46 39 137 -216 -33 227 -84 -216 -29 573 108 -112 -533 -78 634 219 -225 -403 99 367
950 367 32 -377 -289 506 186 -173 -274 -55 52 33 -199 -211 316 297 112 265 -486 212 233 130 -365 -162
972 -162 32 138 295 -463 283 229 482 29 -522 -63 46 313 -232 -216 91 306 182 -213 -349 243 406
993 406 -105 -255 -181 487 346 0 -121 -318 312 254 -169 -416 31 385 203 55 -340 -47 240 303 52
1014 52 -374 53 512 44 -427 -298 45 274 149 -485 -123 344 129 -44 -465 -235 392 145 -500 -429 222
1035 222 556 128 -260 -160 38 392 -9 -309 -142 124 503 236 -136 -74 60 246 147 -158 -483 294 471
1056 471 21 -416 -317 338 507 -425 -231 -190 738 511 -349 -191 187 489 119 -120 -264 432 345 12 -176
1077 -176 -237 416 266 -99 -115 -537 158 268 -222 -193 42 291 238 96 -427 -285 366 163 -261 -276 -97 360
1099 360 -69 -519 -594 360 436 -17 -398 -31 -205 311 18 -365 -32 149 37 -393 -40 -99 299 189 -346
1120 -346 -170 59 503 32 -1 -154 -25 164 -56 -201 -65 230 164 -193 -343 -334 363 278 -123 -217 -331 199
1142 199 83 -464 -317 453 349 -150 -344 -147 82 184 -357 -189 194 57 388 349 -345 -87 192 179 -67
1163 -67 -255 -56 44 52 -42 -231 -139 821 -16 -364 -428 26 450 46 -498 -320 119 382 339 -389 3 170
1185 170 382 161 -361 113 303 -37 -62 -285 84 200 260 -53 -21 148 542 166 -469 36 245 -91 -59
1206 -59 -160 -207 417 302 207 -203 -114 250 81 -198 -208 109 239 219 -283 -428 272 207 -5 -199 -344 266
1228 266 316 -305 -370 -86 16 304 85 -90 105 120 147 53 -373 -228 364 379 262 -182 -189 361 93 -147 -179
1251 -179 40 356 -76 -423 -357 331 431 -93 -199 209 645 309 -90 -234 3 279 106 -344 -73 115
1271 115 280 261 -349 -151 429 260 -116 -202 -48 113 165 -164 -378 -170 222 531 -27 -284 34 613 335
1292 335 -223 -346 556 432 -224 -636 -319 -71 163 -108 -159 -154 565 397 -19 -496 -194 588 116 -75 -410
1313 -410 33 226 208 -26 -249 232 179 368 -395 -523 101 857 41 -729 -194 171 82 -86 -409 138 36
1334 36 63 -130 -230 16 345 297 -95 -240 120 346 -75 -401 -350 644 593 -144 -289 -250 300 292 -249 -235 -163
1357 -163 339 313 -204 -493 -131 358 133 -375 -232 -4 588 152 -465 -106 34 185 -320 -302 -199 568 114
1378 114 -134 -471 -205 431 9 8 -374 119 312 239 -526 -116 68 292 53 -477 -81 381 73 -9 -128
1399 -128 -119 180 469 -324 82 -44 45 256 -312 -259 243 104 227 -463 -536 245 604 34 45 7 234 296 -57
1422 -57 -411 -346 96 297 -123 -381 57 188 -5 -402 -89 -143 494 188 -277 -124 283 291 493 -251 -257 253
1444 253 550 -28 -292 -130 333 199 -280 -420 -251 295 241 -174 -450 -270 364 56 -464 -227 51 146 38
1465 38 -156 -436 286 63 -109 -226 -25 1 264 -103 -225 -43 -14 305 -89 -235 -8 343 380 -183 -249 135
1487 135 565 187 -248 46 161 443 64 -703 4 158 204 8 -360 148 41 235 -78 -20 -47 465 87
1508 87 -118 -175 188 35 43 -229 -184 -275 111 94 -203 -155 200 233 21 -142 16 299 294 -474 -213 599 355 170
1532 170 -434 -195 239 462 -141 -323 -31 107 67 31 -254 74 71 117 -122 9 108 397 15 -48 -416 -80
1554 -80 -62 46 172 -131 113 362 -16 -181 -447 109 199 81 -188 -75 12 -154 -98 -274 88 115 279 -275
1576 -275 -97 1 100 168 -121 -202 -122 193 -44 -63 167 230 129 338 -35 -47 285 27 -18 -227 -129 313 303 -37
1600 -37 -18 88 340 -206 -58 -106 26 28 30 -208 225 46 81 5 -240 -364 275 158 -183 -387 -47 -48 173 -262
1624 -262 -422 -17 16 162 -182 287 173 2 -16 -408 -282 -137 205 292 -45 -260 -36 175 -81 -410 -154
1645 -154 389 407 -238 -182 81 -29 117 260 -6 46 63 128 -338 -169 -80 -131 -42 -315 -305 212 105 88 -242
1668 -242 115 111 337 176 -246 -140 -85 281 3 -161 -54 408 -64 181 -300 64 30 -49 316 -167 60 336
1690 336 260 72 34 421 94 222 -238 -71 -19 -143 8 -371 166 -130 338 -314 -194 -97 109 309 -221
1711 -221 -236 5 16 18 -205 -192 16 262 -145 -568 -108 265 -14 65 -192 -171 175 221 -331 -217 273 103 284
1734 284 77 -240 106 -180 73 -97 214 328 -73 -33 23 -124 -84 213 54 -195 -194 244 337 -304 -72 175
1756 175 296 92 -183 -129 244 287 -43 2 88 273 103 20 -80 98 270 113 -236 -384 -180 112 183 -208
1778 -208 128 29 239 151 -14 -171 -79 -5 -153 -125 -229 151 194 322 -186 -89 18 10 7 -5 -160 61 76 153 -74
1803 -74 -7 110 -181 -220 -295 -30 258 97 213 -250 180 61 233 -278 -46 -131 62 92 -7 -112 225 162 12
1826 12 -7 -237 -253 324 -93 -117 -53 282 277 -150 -350 139 147 59 -5 -156 386 168 39 -199 15 -84 67 86
1850 86 -241 -50 89 248 66 -300 -187 48 101 -8 -159 -61 168 84 -262 -83 -206 305 -51 -122 -109 -55
1872 -55 165 24 -17 262 16 -132 -179 97 216 157 58 -159 -305 50 106 -231 46 216 62 182 228 -123
1894 -123 104 177 28 137 -305 -9 -119 137 52 -197 108 121 24 -394 -56 19 156 -31 -63 -61 -32 21 116 -384
1918 -384 57 300 -81 -7 -295 -100 -2 59 -284 -9 32 164 3 -217 -33 206 137 91 60 -128 -168 390 40
1941 40 5 53 -174 82 155 -85 197 47 210 324 -307 -115 196 14 85 -259 204 396 64 189 -294 -130
1963 -130 93 -110 -93 244 53 234 -173 -119 -65 56 332 -234 25 -75 241 326 -194 -55 16 368 315 -209
1985 -209 -99 98 425 -158 -419 -123 130 177 -56 -57 -62 177 129 -161 -356 -42 393 218 -139 161 43 49 225
2008 225 -22 -170 125 -121 -140 -93 -58 200 351 205 -137 157 305 278 -135 -99 -140 -7 282 -123 -304 377
2030 377 243 34 -160 -44 150 359 -121 -343 -104 492 199 376 -578 7 252 -68 31 -72 -50 153 -249
2051 -249 42 -66 75 437 31 -15 -406 184 215 360 -252 -9 37 -74 105 -175 1 260 307 63 -122
2072 -122 -166 499 481 -268 111 21 91 83 -106 -142 197 176 -186 -334 -85 211 -54 -40 -460 -104 45 189 -63
2095 -63 -511 32 294 246 59 -225 -51 337 -104 -33 -493 197 171 -81 -34 -107 -33 -93 -196 -106 -126 303 75
2118 75 -21 97 -7 220 125 126 81 208 9 -169 -350 -40 170 301 -80 -383 335 210 323 -77 -84 90 148
2141 148 350 -170 -141 -28 150 31 -4 106 54 296 -243 -287 115 387 -26 -52 -191 260 170 104 -138 -18
2163 -18 241 117 59 -248 61 -182 -143 -86 -31 -154 181 240 414 -321 -45 59 295 -208 -178 91 85 32 32 -130
2187 -130 525 86 70 132 -193 288 -23 149 -13 1 349 165 -56 -142 98 200 339 -399 -204 227 231 -121
2209 -121 24 -101 -35 164 4 -42 135 43 -116 -294 80 -336 317 -104 203 15 199 -89 70 -345 -160
2230 -160 361 39 -130 -238 -85 172 -23 37 -151 -53 68 -99 -297 -210 125 265 -28 148 -188 194 179
2251 179 -155 -161 2 280 169 5 -79 -141 174 -190 -209 75 205 177 166 224 -5 239 -217 -312 -97 -121 -30 -137
2275 -137 -301 -85 61 441 298 -406 -39 69 68 -69 -395 -180 226 94 8 -239 -12 50 64 -57 -287 -45
2297 -45 239 22 -157 -122 32 -266 -173 15 -58 -29 235 121 72 -173 152 32 160 -365 -99 79 -239 -389
2319 -389 -690 -78 91 96 -366 -133 89 26 110 -82 -126 155 47 -105 -140 113 346 386 -238 15 -76 -141 -198
2342 -198 -106 17 205 137 32 -107 -73 416 83 -214 81 153 134 -233 -266 -222 83 432 -121 -239 -13 425
2364 425 -16 -124 -436 -95 568 513 -280 -119 269 253 -38 -246 -264 72 155 108 -184 200 226 333 -154 -322
2386 -322 -53 282 -47 -176 -125 35 414 82 -167 -11 399 314 150 -438 178 556 239 -198 -191 6 144
2407 144 156 -288 -75 265 373 67 -454 -320 76 391 -62 -70 -265 103 257 -87 -268 -101 169 332 -61
2428 -61 -613 -79 436 176 -285 -249 195 447 -1 -244 4 269 382 251 -252 -246 358 296 -275 -561 -134 576
2450 576 259 175 -653 -97 303 317 -208 -226 69 237 94 -373 -13 110 411 133 -356 -292 87 347 -275
2471 -275 -474 66 457 169 -418 -507 -211 704 -32 -349 -285 123 198 -35 -476 -287 224 658 -159 -598 -176
2492 -176 607 350 -343 -433 27 575 245 -377 -505 169 318 144 -624 -281 106 650 -88 -376 -343 486 314
2513 314 127 -713 298 627 308 -647 -338 138 398 241 -332 -574 381 288 -76 -389 -301 450 588 -62
2533 -62 -575 56 580 77 -145 -371 36 523 293 -385 -460 93 623 -91 -436 -301 601 866 -342 -360 103
2554 103 541 320 69 -538 -75 525 428 -68 -481 241 824 170 -496 -359 357 606 158 -768 -351 508
2574 508 376 -122 -431 -45 572 468 -378 -457 114 446 250 -453 -458 173 572 50 -739 -630 253 679 309
2595 309 -612 -77 170 538 -431 -484 -274 542 60 -368 -282 -39 343 250 -452 -183 258 709 135 -502 -320
2616 -320 232 311 -98 -676 -266 694 334 -339 -418 90 554 341 -317 -132 219 734 326 -510 -219 361 463
2637 463 -15 -409 -95 366 624 -111 -525 -1 261 323 -353 -536 64 442 252 -100 -249 373 463 -114 -438
2658 -438 -288 692 491 82 -388 -91 328 -2 -269 -346 88 333 153 -340 -209 336 485 92 -585 -322
2678 -322 305 372 -148 -362 199 546 129 -104 -556 -73 450 455 -543 -369 154 425 100 -727 -237 133 466
2699 466 -33 -562 -88 386 299 -376 -473 185 510 427 -286 -246 306 269 241 -219 -396 74 360 -41 -425 -43
2721 -43 343 328 21 -526 -230 494 403 -133 -536 21 199 165 -715 -666 136 446 298 -204 -357 332 559 -180
2743 -180 -164 -84 242 381 -121 -188 -284 526 -43 -238 -130 0 200 -90 -232 -202 292 363 -4 -488 -243 447
2765 447 116 -353 -440 -331 330 -13 -345 -795 -8 304 94 -124 -367 1 218 -127 -514 -406 26 458
2785 458 31 -178 -81 135 456 -148 -417 172 373 289 -330 -248 -69 87 327 -245 125 338 627 -14 -536
2806 -536 108 138 172 -249 -384 -289 51 409 -183 -105 -27 482 63 -195 -20 309 248 156 -561 -323 483 67
2828 67 -72 -540 94 111 158 -237 -21 164 351 38 -357 -323 -37 187 -95 15 -318 -2 296 -144 -310
2849 -310 115 282 217 -5 -306 175 125 -160 -252 -440 -27 403 27 -321 -15 265 120 9 -419 -171 275
2870 275 103 -104 -270 -146 239 0 -312 -19 -42 140 49 115 -66 126 193 -255 -145 -63 -55 334 228 -269
2892 -269 -79 248 324 93 -245 61 479 139 2 -534 -167 -93 46 -325 -163 202 162 100 -57 388 85
2913 85 313 -12 -147 80 97 -23 -186 -246 15 84 13 -240 -91 74 85 -176 -94 -108 -142 93 79 69 88 107
2937 107 85 -247 -561 41 398 -160 -406 -171 44 139 -67 -131 -53 167 94 110 -245 -144 102 78 -13 -304 183
2960 183 71 -299 -76 46 166 347 61 -352 -42 49 438 17 -329 -120 242 184 -67 -46 398 242 50
2981 50 -308 -177 219 -49 9 1 -164 -102 115 -182 -101 59 111 111 -237 -310 83 251 170 -38 -7 -36 352 -33
3005 -33 -4 -117 70 17 -145 138 -198 227 78 -9 -265 -39 400 16 119 -235 107 300 80 -104 -48 97
3027 97 130 -348 -169 -129 103 159 63 -129 103 177 168 -158 -16 104 211 -121 -404 -104 98 16 -264 -184 -98 -9
3051 -9 -57 -237 -210 -19 175 86 121 -303 79 272 123 -37 135 -38 311 -270 18 -187 -6 257 -167 -155
3073 -155 -105 244 56 -9 -266 -114 243 -73 -72 -222 185 426 -97 -445 258 144 29 122 -256 -246 16 -2
3095 -2 -307 -244 -247 -66 26 -365 -208 42 601 59 -478 327 129 258 -261 -316 292 131 5 98 -209 -76 58
3118 58 -256 -39 8 177 -222 14 -43 -348 58 406 -76 -341 -18 227 109 -242 -187 243 513 89 1 -282
3140 -282 -253 186 -28 -16 221 53 366 -232 -198 119 166 48 -47 -141 -190 55 -181 -106 -548 229 286 -87 -109
3163 -109 -285 25 -76 13 -78 108 -93 137 -26 -251 -170 132 32 -246 -121 89 274 -21 119 -153 -208
3184 -208 277 457 -423 -193 253 295 45 -331 -41 228 180 169 -135 -171 109 197 117 25 -326 564 98 -454
3206 -454 -213 324 185 13 -123 -38 248 322 12 -413 -195 350 107 -9 -71 -83 332 -192 -447 -248 112
3227 112 -47 102 -164 -132 101 121 16 -13 -158 415 35 -92 -191 -253 15 39 -103 -106 164 207 234 -427 -322
3250 -322 -43 139 -113 -316 -158 164 271 -212 -193 48 158 26 132 -33 -104 -39 58 -279 -333 -125 115 -189
3272 -189 -31 155 320 191 -99 91 -240 -47 447 -2 14 -118 -11 242 -79 -296 -168 -176 131 -153 -214
3293 -214 -322 -63 201 -244 25 -165 114 66 -65 112 303 20 -147 -93 -40 143 144 33 -26 110 251 74
3315 74 -193 -209 -15 -168 110 -243 -15 -57 68 168 -69 -19 -93 73 -202 90 204 41 344 -150 12 -28
3337 -28 149 252 121 60 -22 254 114 28 -226 -389 -98 337 -167 181 251 132 -19 -189 -71 130 207 -69
3359 -69 -44 25 -124 367 11 31 -104 120 161 -356 -66 -21 200 203 71 -157 290 88 -109 223 19 -109 55
3382 55 -100 -51 179 -86 -287 -228 81 52 -32 -241 -238 -107 -30 125 -203 52 -126 76 27 41 132 -130 176 117
3406 117 -162 -31 -379 148 268 7 -40 155 -92 -102 -117 -40 101 28 372 177 35 24 46 1 -185 -41 276
3429 276 -95 -69 71 -156 187 21 -232 -243 -184 142 249 51 -376 -18 254 -119 -81 -386 -44 138 -101
3450 -101 -115 -10 -112 -182 21 -155 -148 11 -68 100 -65 98 -107 12 22 273 -32 278 215 425 134 -128
3472 -128 -7 9 -132 -12 349 117 173 39 117 49 -92 37 -45 -24 228 104 -57 147 -41 -222 334 87
3494 87 -266 -20 -98 37 -339 -42 -133 117 157 -104 179 -105 305 213 -221 112 233 164 111 -143 277 -177
3516 -177 307 146 173 -67 -9 -61 -157 -49 -18 -194 335 -88 -124 13 39 207 -403 -270 -195 -124 -75 -68 69 -317
3540 -317 -92 26 -177 86 24 -45 138 -201 251 -363 -125 68 -19 -2 26 375 -134 -176 -235 -189 134 98 38
3563 38 -282 388 43 -69 153 -32 88 36 9 -142 21 229 66 -190 -140 98 -46 -339 64 -207 276
3584 276 84 -124 -91 143 -233 -79 -189 -127 -173 98 -42 -149 218 205 -187 63 -17 103 152 -19 -107 -60 235
3607 235 -149 -283 67 -204 6 150 -229 -57 -86 134 145 135 89 -109 -103 -163 -11 -93 70 -53 223 -17 -191
3630 -191 -149 -222 -190 -115 -15 36 102 -290 -152 -133 102 -9 -67 -7 -183 43 -27 -147 -361 -230 260 -116 5
3653 5 0 -13 15 316 24 67 316 226 113 -128 124 101 62 -2 22 -74 74 175 -234 37 236 -20 -24 88 -7
3678 -7 -101 81 -29 -51 246 -130 13 37 -137 -81 228 10 17 -93 -173 347 72 196 43 482 119 113 -170 -105
3702 -105 7 111 33 -203 -17 150 86 -23 -399 9 86 -26 -111 -9 64 -162 85 274 4 247 -50 306
3724 306 180 -115 -103 38 59 68 96 103 -30 -150 -213 94 -138 314 356 119 -142 168 62 129 46 238 38 157
3748 157 -35 -78 -119 269 -58 -30 -24 496 106 -202 -233 -369 97 241 127 -239 -93 -50 146 88 231 -339 70
3771 70 -126 -130 147 -226 -22 -35 9 5 -3 116 -159 211 -122 -109 82 145 -110 40 129 177 -378 37 98 -130 29
3796 29 -267 30 -223 -110 -20 -351 60 54 -78 109 -51 -122 -148 201 -182 -39 -61 -125 -26 172 35 111 151 105
3820 105 -52 168 -175 33 355 -48 -76 123 -218 83 -169 -212 46 246 -74 -318 -1 93 105 80 -145 -217
3842 -217 134 232 -47 -242 10 -149 81 90 95 -333 14 84 -199 45 209 -85 454 157 23 -51 -252 -82
3864 -82 -270 21 158 -24 -123 18 10 -44 319 -72 95 27 -3 71 143 -186 9 -34 -259 131 129 -11 31 59 75
3889 75 -42 191 54 -119 -61 19 161 -280 -32 -107 -64 31 71 -2 -31 -9 9 -98 57 110 -99 -4 -148 -249
3913 -249 -91 95 78 80 -381 1 175 46 -27 167 240 -98 -202 239 -76 -153 116 194 -12 -122 -234 -72
3935 -72 -49 -13 -187 19 26 14 255 234 96 452 268 227 93 -16 195 20 -64 -101 191 -33 61 84 202 -65
3959 -65 -110 -163 -167 160 136 -463 65 165 189 -223 -31 -130 8 10 90 38 126 -102 145 -41 155 -142 -248 42
3983 42 63 31 67 -66 -12 -69 109 -245 165 -148 64 -322 -27 178 69 -43 -320 -167 -84 119 2 86 -201
4006 -201 60 110 -55 -30 275 16 -21 57 111 -46 -39 104 193 -272 196 66 125 243 98 -212 25 75 145 -22
4030 -22 190 -316 -212 -62 96 -183 129 -65 45 198 -111 -110 130 -200 152 45 -139 -143 -214 2 56 -138
4052 -138 40 -65 285 -77 -143 -144 -4 61 -18 153 -129 -26 -4 -65 -195 -83 -5 55 -70 -228 145 193 -124
4075 -124 52 -86 -181 -10 -74 5 126 -82 -59 128 21 -79 -89 0 -176 106 5 -131 -72 217 -103 -20 11
4098 11 49 13 -191 -12 -58 113 -78 297 150 -84 235 -90 -17 206 81 -122 124 -69 -196 -211 122 -472
4120 -472 -43 122 155 -264 125 -65 -29 321 -20 28 56 -141 1 201 -36 -137 51 -174 45 -112 -211 -95
4142 -95 46 23 -57 95 -47 -152 -43 -290 129 230 182 236 -42 98 95 -119 8 94 69 179 183 -229 227 -133
4166 -133 -244 -231 -1 78 -117 39 83 26 -164 -192 -72 85 57 46 -221 -26 -11 2 -116 -458 20 -218 49
4189 49 -206 83 460 229 -71 -307 -32 60 124 171 44 245 -89 -178 -92 -137 -188 284 93 36 184 -321 100
4212 100 -17 -3 -36 -83 317 -48 142 -60 -298 -166 23 98 -30 183 -15 18 197 51 162 203 -172 -289
4234 -289 -4 20 221 -129 -54 114 171 128 -202 -292 77 -33 315 30 295 250 70 -60 -91 145 -227 -88
4256 -88 198 63 255 94 24 274 285 -91 47 -8 -74 -204 -57 -122 398 -118 107 -58 189 145 97 -283 -179
4279 -179 271 0 95 -135 8 -36 -254 105 -131 -149 121 -189 -25 26 -145 382 14 124 262 -79 165
4300 165 -215 -142 185 -116 -216 -107 -194 95 -9 12 -272 -94 56 12 -65 250 -78 186 139 107 105 -68 126
4323 126 158 -91 174 74 121 12 -25 -137 249 256 -65 110 -310 -423 109 174 219 -113 31 42 -133 -124 -185 109
4347 109 -101 -40 -181 198 76 9 -150 347 -377 59 14 -81 -323 17 210 -11 7 -283 110 22 -132 341
4369 341 222 177 -191 -62 -166 -300 -87 -127 75 -118 -328 130 -300 -69 237 109 -33 96 68 4 157
4390 157 190 -97 -359 261 347 183 -1 -59 7 12 24 44 -98 -169 319 38 -47 -116 245 -27 -152 111 -88 256
4414 256 37 -118 -222 -121 -54 135 -250 116 -105 150 37 -16 -118 -130 164 95 -180 330 -118 -87 6 80
4436 80 -270 -131 8 -157 402 189 17 -310 87 94 -256 42 230 129 -98 -200 26 -112 100 -150 144
4457 144 240 295 -61 256 -132 -443 -161 -243 -225 -9 -72 -82 -115 -18 158 65 -123 -96 248 -283 -66 -129 -276 -376
4481 -376 122 -68 -197 -20 -223 -167 94 -298 -140 -38 74 -64 -334 -9 102 -197 -24 227 227 133 -293
4502 -293 96 -42 -318 -6 161 4 12 32 -5 281 62 -42 371 -346 -62 109 82 229 -131 -50 -77 -93 -59
4525 -59 178 -123 -93 106 -2 164 207 -19 -88 -74 110 21 -108 102 -18 11 1 -141 40 56 -184 217 37
4548 37 -90 185 -146 -196 -45 171 27 -261 -104 48 383 -7 -162 8 -196 -9 -101 -345 -312 -70 -2 -234
4570 -234 -239 -75 54 -105 -45 65 237 174 37 -394 -238 -171 428 9 -161 233 56 -270 -55 -12 16 190
4592 190 -96 -17 -115 25 -234 -33 -109 58 -189 -194 -50 345 -40 92 -45 213 -30 -22 62 -61 -61 63 -175
4615 -175 17 295 -42 12 160 262 -85 -116 242 35 291 106 60 62 355 -49 90 -121 -58 -15 372 -122
4637 -122 -51 177 -32 83 76 -276 -213 294 -154 74 165 47 230 -1 -376 54 -32 -38 23 126 -2 -3 -20 -101
4661 -101 311 -109 3 -449 -46 38 -191 -7 -73 126 72 -47 -53 139 -30 195 150 -23 279 54 -12 -130
4683 -130 -4 70 279 -309 -99 -163 -67 -41 37 -178 -306 321 -138 18 377 -106 -155 38 -24 119 182 -77 -84
4706 -84 78 -173 180 -66 -122 128 -290 -182 56 -8 -22 -65 139 -233 168 -60 404 149 -22 -12 118 -106
4728 -106 65 -22 6 133 -157 73 87 -88 9 -168 134 169 7 79 59 -114 -392 -159 -271 -197 -203 68 129 146
4752 146 -91 105 0 246 -29 -244 387 93 17 130 164 56 -97 125 32 13 -35 65 219 170 233 103
4774 103 -51 -10 -42 -92 69 -289 -43 107 241 -175 211 79 -34 259 -72 -64 -124 -38 -166 -72 -56 -109 -184 193
4798 193 61 116 -21 -30 47 -28 27 -120 -143 334 -117 214 -178 -139 410 358 260 15 -61 -174 106 51 136 -14
4822 -14 -89 -252 174 45 57 27 -47 -205 -157 59 281 136 299 -64 259 89 146 218 -215 -155 -197 21 171
4845 171 -298 74 -82 -128 -250 -69 19 -133 46 59 43 15 118 -176 -261 -57 164 192 -42 16 46 209 -155
4868 -155 49 -9 172 240 -25 -177 146 -197 -242 216 -260 -54 39 124 -213 -28 1 65 -40 156 -43 -145
4890 -145 -33 93 107 -194 261 53 -3 272 161 -16 -305 -349 -158 -72 128 83 -256 294 39 2 -155 210
4912 210 156 -186 33 -43 134 -132 159 178 47 -103 240 177 -145 -19 -10 57 156 -131 64 -86 -77 236 -212
4935 -212 -39 -51 -136 211 -20 -83 227 -16 327 28 138 270 -61 125 -263 -87 -104 -153 -189 77 -297 52
4957 52 -189 1 -18 -28 213 214 132 -35 -133 20 -136 -229 296 76 36 85 -313 -189 -16 72 314 -52 151 -64
4981 -64 47 -58 29 -204 -108 -163 -65 -164 -195 -44 -53 -108 -11 -254 186 209 40 -224 -77 -150 225 73 38 -20 -41
5006 -41 -51 204 -466 137 -83 314 -234 -134 -270 36 162 89 -110 -100 64 -258 18 -169 -84 -25 122 -63
5028 -63 308 1 191 231 -281 146 3 -341 -9 135 24 233 -12 -47 -126 -18 181 247 -260 -131 4 68
5050 68 87 -50 -36 38 -5 -168 -157 -83 123 -28 391 29 -70 54 -190 -67 113 -119 -75 3 58 262 -114 22
5074 22 -83 -355 -30 -71 -223 49 352 101 -124 -148 -253 221 -237 42 -7 -130 43 146 81 129 211 -162
5096 -162 164 247 -17 105 26 135 56 -101 192 172 122 -105 -168 6 -94 -91 4 -97 84 231 178 -28 -61 17
5120 17 91 242 44 1 96 36 124 337 5 -124 -12 181 -291 -20 112 -240 -30 -285 129 246 98 -32
5142 -32 -89 127 -27 -134 -247 -43 61 -137 -105 34 94 173 268 6 200 98 149 62 196 121 -204 229 126
5165 126 43 -518 61 -280 -51 -133 149 -110 -11 371 131 169 105 102 -144 -194 -178 -33 169 -99 -163 63 -399
5188 -399 -11 -85 34 -26 360 -117 -20 -48 -100 -35 -179 -87 278 -8 -5 -232 139 306 -74 62 178 94 200
5211 200 -13 35 -66 -229 67 202 131 -218 9 -100 -369 -60 -48 -164 13 -69 -86 -140 -94 24 -49 -267 22
5234 22 -30 18 217 -43 -353 51 -43 317 24 15 -22 149 238 163 -1 -243 85 65 288 -126 -97 128 -71 -131
5258 -131 24 -56 -283 -242 75 59 -115 15 -23 134 -381 299 27 -166 35 -58 -187 263 -171 -205 -65 48
5280 48 -250 -99 218 179 260 -106 47 122 230 194 147 105 171 -97 227 -83 -36 -358 -119 242 -53 -85 251
5303 251 63 0 -72 -110 94 9 -43 -69 -86 409 2 109 -65 -174 -36 -142 -450 -455 43 -127 144 -11 12
5326 12 -255 -230 35 -97 -146 -290 -119 195 -151 40 -92 187 74 74 -87 -89 -60 15 -159 215 -81 -124 -212 -276
5350 -276 268 149 -37 161 68 -186 121 118 -207 -31 -239 105 -5 2 -18 -232 -142 -85 -97 125 -233 -251 -23
5373 -23 12 -17 381 -64 309 -206 -67 -186 47 -301 -275 84 161 36 -272 -81 -85 33 -21 -56 -278 -226 -58
5396 -58 50 -244 -386 -226 219 104 140 -85 17 173 228 -10 -2 -196 -161 234 163 -161 -132 13 -223 33 21
5419 21 -82 -160 296 -137 220 -140 52 11 417 69 35 149 341 194 -14 -217 99 84 -202 2 -265 -227
5441 -227 -91 94 172 68 258 80 -34 -173 131 42 -47 -354 -65 -12 148 -94 35 146 -234 -194 -125 -83
5463 -83 8 -159 -235 313 -230 61 129 235 220 -22 445 -88 407 -80 114 -107 -225 -80 -1 -374 -73 133
5485 133 110 -4 -18 54 -6 -249 123 -69 38 1 -26 -108 109 139 -312 117 -36 -210 128 67 326 -246 -58
5508 -58 -96 -232 -22 131 -196 -393 -125 164 52 -217 -94 257 131 11 -127 381 -80 -37 11 147 349
5529 349 346 325 -232 -240 75 -104 -118 -41 -129 -71 -57 201 48 -80 120 6 219 54 -190 -190 84 54 3 195 -109
5554 -109 25 -367 2 -181 -200 210 -89 311 -163 134 62 -162 -136 22 63 96 -28 -155 -112 -163 72 -71
5576 -71 43 65 12 -42 25 -77 -335 -282 96 -95 59 108 32 17 -202 52 -56 37 -6 83 -44 17 -88 100
5600 100 188 -72 69 27 -75 270 167 142 -142 -86 -73 168 -127 -71 143 181 156 -5 -315 -76 246 -2 -231
5623 -231 7 -15 12 379 -226 -70 131 11 -66 54 318 -112 114 -7 -83 59 -11 152 -307 -15 13 25
5645 25 -99 -158 -173 69 -237 7 175 -243 -104 21 -90 -489 33 -124 52 -218 336 323 57 17 2 -244
5667 -244 45 171 -215 -6 -54 184 -159 292 284 -42 163 -138 72 142 268 63 122 -3 -112 110 286 -23
5689 -23 137 -99 132 52 94 458 -32 179 -287 61 -236 -30 -110 -403 26 -110 116 -214 70 -294 -334 37
5711 37 331 -83 56 56 129 -107 8 59 79 -50 -193 -76 80 -335 -23 -102 -97 -122 -81 -299 311 151 155 138 -99
5736 -99 -145 -151 -49 146 -113 264 28 -7 293 -93 -124 -7 26 -568 -238 -104 -6 -163 151 34 21 67 33 47
5760 47 26 -47 218 307 141 -168 89 9 -131 -86 74 119 -273 21 -333 -116 18 -35 23 158 176 -163 245
5783 245 -80 236 127 -97 -133 -94 -85 -198 -59 115 -15 -150 393 -80 22 114 -250 -104 285 142 25 -42
5805 -42 -131 -215 -84 -97 -92 -167 -66 233 53 61 180 -72 -113 -85 -282 112 -106 142 -110 8 220 46 18 235
5829 235 94 -34 232 119 85 -194 222 -17 61 -35 31 30 141 -111 -176 324 -167 -14 145 -414 130 -195
5851 -195 150 300 -98 304 188 8 83 94 -23 133 222 -122 112 -87 -104 443 145 -136 298 -149 -38
5872 -38 -117 62 115 -79 -139 -263 -163 250 79 -52 74 212 -3 76 281 -248 -83 113 66 -238 123 37
5894 37 134 87 173 15 105 109 -132 -340 119 -258 151 -57 181 -27 271 -137 206 71 -282 50 -52 -192
5916 -192 4 215 174 -243 42 -59 6 31 -55 136 69 -173 -69 -459 -259 65 124 -276 -78 113 -322 174
5938 174 -249 318 11 191 -2 134 5 50 193 -87 -197 11 131 7 208 36 134 257 88 -115 109
5959 109 373 -181 -51 77 -75 268 110 -398 45 92 14 -31 -10 -49 -255 244 46 20 234 200 -137 202
5981 202 39 -221 -292 72 320 16 176 -43 223 126 10 85 -6 -76 78 238 -388 45 -68 56 -165 180
6003 180 -79 -10 -193 -392 -135 -100 240 -212 106 -75 -29 -51 407 -36 -90 -104 -9 -41 169 24 327 286 151
6026 151 -67 337 275 -19 -184 -312 201 -194 -296 -52 62 83 117 30 -54 -70 73 -23 -63 -80 -246 136 6
6049 6 179 12 -6 -158 -44 155 -46 77 0 188 -166 59 -37 -15 -127 -86 -143 51 -39 129 39 18 292 142
6073 142 270 -285 182 -215 138 -123 -344 -135 -103 47 -173 246 -24 -66 -131 29 63 100 -159 -34 30 380
6095 380 36 6 490 -122 7 -248 162 229 87 81 123 -220 195 89 -111 -141 -389 211 -53 35 176 -61
6117 -61 145 380 -28 83 -7 204 -419 418 -30 173 54 133 -8 -92 -75 41 -85 -122 421 106 -79 235
6139 235 -261 52 8 46 -103 -3 -88 -1 64 -180 -16 -267 -321 -138 -202 -111 -115 81 98 102 301 -282 -228 174 -53
6164 -53 -363 100 197 330 19 -33 -269 178 -200 -179 94 39 341 -38 -27 -267 93 51 115 186 -13 -109 -173 -211
6188 -211 -271 -7 -4 72 -110 85 -118 -11 48 -31 -91 -75 12 283 -33 0 212 -142 -47 204 -120 -115 -122 -46 261
6213 261 111 62 145 129 -20 -65 196 -224 -146 -93 162 68 -34 158 256 -15 -316 299 -235 -78 -17 -108 138
6236 138 -126 -289 108 -30 109 -18 8 -181 -49 107 118 208 -278 102 62 -43 117 -160 184 2 -143
6257 -143 24 192 -43 -286 -33 20 -147 284 400 174 -52 55 65 -195 -132 -327 81 -194 -109 -312 14
6278 14 10 -65 11 130 118 -207 270 -20 -22 138 -269 -252 291 54 41 -226 76 189 241 -43 -159 -131 -81 -124 -205
6303 -205 -259 -199 -132 -82 -93 186 -43 45 195 17 144 0 -108 93 -83 113 11 -78 -79 65 -35 102 18
6326 18 65 -127 -186 142 249 -13 -43 -27 176 90 -250 289 -35 320 312 -49 -223 207 77 -113 -83 -12 -118
6349 -118 11 194 15 -179 -190 25 119 -12 -102 112 -23 -119 232 -60 164 21 -171 32 -53 -76 -135 -56 -16
6372 -16 -335 -89 13 212 71 -83 -21 298 16 160 -72 -549 238 273 80 164 -250 224 43 -115 160
6393 160 -179 -229 81 72 55 -75 336 110 -174 50 -250 -202 476 136 109 61 -145 -51 118 196 -2 175 -6
6416 -6 116 27 69 -189 111 246 -75 -62 23 -90 -82 -160 33 161 43 304 6 257 178 -38 24 42 6 -61 -81
6441 -81 83 85 61 43 -303 118 118 -75 206 -40 -156 -229 121 -248 132 230 62 -114 -83 61 113 -186 -44 -286
6465 -286 4 -86 -97 1 -237 35 53 -46 -230 161 47 -61 -23 -175 26 52 23 6 -69 -264 42 34 288 96
6489 96 -107 198 18 321 -40 -158 -71 300 -75 15 38 108 -12 94 -112 -161 -99 -158 -81 -111 149 -93 -77 162
6513 162 -99 -139 215 -232 60 -226 64 20 -113 -98 293 -11 -143 -71 40 -69 -71 322 69 -214 -218 338 -43
6536 -43 126 218 44 -147 -4 -48 41 187 -22 237 -155 -36 -14 -39 178 60 176 -333 228 -176 50 119
6558 119 74 43 61 8 -151 -82 -115 -276 571 204 24 -29 172 83 111 -123 50 -205 -105 88 248 -229 -93
6581 -93 84 -14 331 44 273 267 70 299 197 -25 12 224 -90 186 -312 -274 136 55 -44 -88 3 -19 202 -67
6605 -67 72 -129 -332 -205 59 69 -36 82 -178 -63 23 -215 130 18 75 151 -182 86 14 42 101 -191 -41
6628 -41 267 17 -169 200 -101 -81 112 -114 -216 50 -67 -12 72 -145 -68 109 66 275 112 34 -58 -177 17
6651 17 109 -116 145 -158 65 -122 -174 157 169 133 200 -56 -292 71 34 92 -148 -120 147 5 -215 -2 -35
6674 -35 -26 243 -25 -2 239 21 -146 122 117 85 66 44 70 -199 19 -58 34 -67 184 -50 -250 -200 -152 5 -157
6699 -157 -3 -161 190 -38 -139 -30 136 73 148 58 83 -58 -28 58 168 85 -30 142 176 313 3 -10 -81
6722 -81 -175 27 44 243 -165 100 315 221 205 -306 -191 -2 -124 -227 -200 173 -6 -237 -136 260 -65 -6
6744 -6 -9 -71 219 -100 15 -203 185 40 74 162 15 149 -38 -49 15 90 178 100 249 171 -15 -107 -45 59 9
6769 9 -251 -67 65 3 78 -176 140 60 106 -37 -154 328 -61 -10 -333 -190 -81 -7 3 -51 226 -99 48
6792 48 -110 211 -103 184 10 22 -93 285 146 -64 -117 -30 24 -318 -10 -198 150 -20 -72 73 84 -218
6814 -218 -198 -132 -216 185 0 63 -225 54 -148 121 -405 -5 84 -110 -135 -78 138 -18 179 -160 215 200 7
6837 7 -39 181 122 -86 -115 44 -111 143 29 -99 -144 14 267 54 -103 69 65 88 -24 40 133 306 -28 -124
6861 -124 -139 8 -53 20 18 -62 -53 -226 66 29 -354 210 10 83 122 46 -139 221 219 -79 119 26 -100 -232 32
6886 32 -84 -12 -120 -229 132 65 44 89 -8 -65 -73 239 86 43 -94 -259 -190 -1 -197 216 -70 70 -45 239
6910 239 3 -415 108 -127 268 -71 49 89 219 84 -182 -37 -181 31 -86 -25 211 -57 -191 47 17
6931 17 92 95 -334 -93 -31 197 -35 157 -138 -172 352 293 -140 -183 213 -91 40 257 10 -53 110 97 -335
6954 -335 79 -247 -70 -64 207 49 44 -287 -271 -143 -182 -138 -12 135 237 169 72 -123 49 -138 -45 383 -139
6977 -139 126 -104 -26 1 -155 70 -56 -30 -51 -31 -173 48 -11 -1 -218 -114 -172 105 96 8 59 166 -3 -146
7001 -146 -56 199 -19 -179 -80 222 -363 48 -235 -194 -20 108 317 -58 18 -165 -118 87 111 273 228 59
7023 59 -198 113 19 -218 -79 -174 185 60 99 43 19 191 168 49 171 -101 200 209 -81 184 -405 -102 42
7046 42 100 42 135 133 -56 44 -60 135 -1 -62 34 -127 183 371 65 233 285 290 138 220 60 -190 22 62
7070 62 260 -108 211 -66 -53 43 -55 -27 24 42 -8 -18 150 -94 267 -253 20 96 -337 40 8 147 132 -3
7094 -3 -114 95 -104 54 -296 -27 -134 -77 -235 -89 -53 33 200 -73 88 -255 -95 307 -39 -9 -59 131
7116 131 -147 24 116 111 168 350 54 153 -398 -48 133 91 -117 -15 189 -223 152 -177 -75 -29 157 -214
7138 -214 29 61 -90 186 124 -190 -156 -28 160 -147 30 41 -199 122 150 199 154 -131 96 -22 -113 -208 -306
7161 -306 -4 30 106 -41 -129 -210 -23 -33 -3 -107 16 -115 -213 202 163 -25 20 -1 86 -185 270 -13 32 -220
7185 -220 -113 -84 36 72 -138 -8 92 -221 -13 48 -253 13 10 195 17 1 16 148 -345 -72 52 -144
7207 -144 179 302 45 -42 78 139 101 157 -159 -49 76 -345 -464 -66 -9 -73 -106 334 226 -163 -47 13 29
7230 29 -120 11 -20 -183 -260 40 -278 -188 -210 -153 333 -146 282 108 -106 54 78 -46 170 46 -45 82 129
7253 129 -168 221 -268 -88 -85 243 -81 292 -47 -87 -77 -5 34 -10 154 18 232 -120 130 -114 -124 -63 -69 -168
7277 -168 149 -61 42 271 135 304 -204 94 124 161 -238 45 -74 125 236 435 293 -47 -62 37 7 359
7299 359 41 52 305 7 -10 33 -49 216 -89 103 -200 -237 -58 12 154 64 82 21 157 -37 143 127 -55
7322 -55 113 96 -98 109 -122 -45 129 -5 -105 29 -61 -12 108 142 29 253 57 62 195 -94 162 137 136 103
7346 103 -46 208 103 -111 47 106 157 -271 270 209 133 -78 -191 34 149 142 63 218 167 43 -154 -128 229
7369 229 -66 -21 123 156 397 -4 -92 56 373 282 51 -52 -202 43 42 198 46 -226 91 -223 69 -38
7391 -38 -26 -93 36 -1 -96 96 136 -211 -17 -67 -166 -173 232 -23 -159 68 339 -50 -102 57 85 -100 148 -12
7415 -12 -41 -109 -29 147 -169 87 -271 -14 40 62 91 -186 -115 -107 -24 33 139 136 -129 41 -63 82 -30 185 -203
7440 -203 -77 27 -60 221 148 -128 -89 61 143 -11 169 -121 -128 -38 -166 15 15 -9 8 108 305 -139 -133 104
7464 104 1 425 -140 -23 -100 -343 -50 44 -38 91 -102 4 254 47 -141 -105 -253 143 -45 368 19
7485 19 173 14 232 322 97 -256 45 -260 -180 -11 -19 221 257 338 -115 32 126 84 87 -269 -53 -46 -238 101
7509 101 98 271 -251 -93 -121 13 -388 -65 -131 108 -108 -137 376 -96 -31 142 79 -130 -132 -118 226 89 -134
7532 -134 158 70 -3 150 119 -215 171 -30 66 43 -72 26 61 -115 -28 -292 -68 -69 116 -100 91 -159 -212 301
7556 301 119 -207 -158 307 19 153 247 305 18 223 86 -24 225 459 -58 -159 146 51 143 -95 -20 -197
7578 -197 -201 -192 -110 -276 -345 -61 188 109 -77 203 84 -308 176 223 -57 -141 -84 51 -212 -48 -115 -109 271 110
7602 110 143 228 -92 320 -148 21 -378 206 34 -4 -41 -147 178 -52 355 37 -336 -236 -43 87 157 -138
7624 -138 153 -192 370 93 104 -89 107 193 -243 16 61 239 385 171 30 -3 -189 -186 147 40 -110 33
7646 33 -234 84 -34 159 -71 -72 -356 -209 -427 45 -10 178 -226 -34 9 -77 -85 -19 23 14 102 2 14 273 125
7671 125 28 -280 204 151 -71 81 177 166 -302 -47 -5 138 73 164 160 6 142 107 -211 316 -5 -44 -281 -121
7695 -121 177 -157 51 283 -300 -159 59 11 -121 -285 -176 245 105 -146 -350 -18 -301 100 27 171 24
7716 24 37 -200 -96 -158 -214 -66 -103 112 308 -382 -249 216 -50 53 -142 -34 31 100 116 27 262 -32 237
7739 237 127 -91 87 237 198 -5 -79 -50 3 -263 -248 195 157 61 -148 -199 -93 71 -103 208 -157 -300 42
7762 42 158 57 -444 8 31 133 -76 70 -155 -24 -2 3 99 -95 137 109 -63 -374 65 -191 148 -57
7784 -57 -36 -72 -180 -2 -21 -480 -73 103 -13 -49 101 81 -299 179 33 91 -16 20 -10 -5 175 -246 160 21
7808 21 121 -234 -615 252 -55 -133 -147 155 183 -79 -42 -174 53 -115 -223 36 -129 179 22 183 -195 296
7830 296 8 140 184 -86 -76 -8 56 96 24 107 -100 42 78 -53 -177 322 80 252 54 73 26 115 9 54
7854 54 -116 110 30 -262 223 141 89 226 -134 -75 153 347 227 47 -5 12 -185 247 -39 -53 -103 -177 -27
7877 -27 -339 277 70 -85 37 -144 130 171 215 134 138 -270 291 -31 91 -26 3 -247 136 97 -336 250 107
7900 107 55 19 157 -26 -30 104 247 55 141 147 77 98 203 81 8 -108 20 -305 296 -34 224 584 8
7923 8 20 -390 -33 -60 -10 34 126 125 -2 -3 66 204 -1 -232 -72 137 136 -169 -123 213 -269 36 -64 -406 -52
7948 -52 348 -115 95 -32 -87 -425 -175 91 -70 189 108 -31 2 286 11 81 301 -194 96 -140 -254 -115
7970 -115 -89 74 69 -201 -17 473 166 163 18 42 -94 261 268 197 -176 369 -71 157 -247 21 -188 -255 -126
7993 -126 -145 128 -63 -15 271 -126 -59 -67 81 86 -76 -167 -141 81 238 184 250 156 -224 -27 29 46 104 -181 -23
8018 -23 -65 131 86 -134 118 67 146 131 465 -159 64 -2 98 -3 10 443 -204 35 271 19 -126 218 176
8041 176 108 16 -66 64 91 -128 -214 80 97 8 145 91 44 -93 -153 31 186 -33 -109 25 -85 -180 175 -36
8065 -36 247 -251 51 77 -88 57 42 24 -39 -179 143 267 -197 -135 176 -57 58 -12 -2 235 190 -113 -314
8088 -314 150 21 -7 66 -154 108 19 173 139 -217 -120 -204 -194 -117 -41 -161 98 153 98 -312 113 -148 47 19
8112 19 -78 16 -51 144 65 -20 -187 -433 -61 -179 62 -46 -90 257 -166 45 46 -96 -223 -19 533 -270 -188
8135 -188 78 -20 -62 -46 -129 171 14 -197 72 -65 44 -76 45 3 478 9 -3 -17 217 -173 168 -31
8157 -31 -171 -57 -314 -26 167 -37 45 165 -102 195 129 140 -51 89 308 267 365 62 71 168 -182 52 157
8180 157 1 14 -21 31 112 257 127 187 245 78 40
8191D0
$$ Imaginary data points
##PAGE= N=2
##DATA TABLE= (X++(I..I)), XYDATA
0 0 0 0 0 0 0 0 0 0 0 2 -8 8 -8 8 -16 16 -17 24 -25 32 -37 41 -49 56 -65 73 -83 94 -108 120 -137 153 -172
33 -172 192 -216 239 -266 294 -326 363 -402 443 -491 544 -604 672 -744 829 -928 1042 -1176
51 -1176 1339 -1539 1793 -2127 2588 -3269 4386 -6539 12260 -59801 -175385 -137272 -108491 -106473
65 -106473 -158911 -189923 -190031 -166466 -168872 -184369 -196384 -189485 -189189 -197498 -203516 -184926 -164869 -169450
79 -169450 -195619 -198343 -165283 -130166 -134365 -161539 -167569 -134113 -98092 -95043 -115637 -117768 -90629
92 -90629 -62934 -61687 -71163 -63023 -38073 -24914 -32848 -35505 -14221 11203 11744 -6116 -6551 22409
106 22409 47680 41355 19040 19362 47220 68159 58961 38369 40314 63523 76649 63147 47209
119 47209 54922 74258 75222 56372 46869 60928 76765 68405 44978 39816 57773 71510 56466
132 56466 31897 29492 50015 58883 39968 18094 21370 39766 41645 20985 4744 13562 28940
145 28940 23839 1459 -7575 6977 19446 7112 -15138 -16684 1712 9499 -6981 -25967 -22100
158 -22100 -3622 716 -17142 -32107 -23531 -6268 -6455 -24926 -34093 -21170 -6246 -11989 -29977
171 -29977 -33051 -16065 -4539 -15175 -32180 -29208 -9625 -2149 -17106 -30628 -21911 -2746 -712
184 -712 -17107 -26663 -13480 3366 347 -16867 -21310 -4395 8629 596 -15753 -13954 4282
197 4282 12287 -628 -13533 -6544 10579 13959 -785 -10927 -286 15587 14195 -1926 -8275
210 -8275 5487 18727 12500 -3861 -5424 10430 19651 8416 -5528 -1931 14370 18478 4311
223 4311 -7091 1117 16341 15391 -91 -7767 4267 17156 11348 -4594 -7112 6445 15654 6185
237 6185 -7665 -5975 8587 13510 1135 -9974 -4377 9678 10401 -3402 -11153 -2505 10109 6512
251 6512 -7222 -11398 73 10163 3417 -10453 -10664 3069 9709 -879 -12773 -8047 5660
264 5660 8245 -4449 -13472 -5249 7566 5704 -7730 -12475 -1478 8455 2801 -9974 -10431 1738
278 1738 9049 -18 -10667 -7852 4946 8265 -3030 -11182 -4421 7333 6626 -4710 -10103 -1243
292 -1243 8875 5343 -6754 -9072 1790 9933 3197 -8223 -6785 5135 9484 184 -8628 -3782
306 -3782 7770 8301 -2516 -8748 -1075 9324 6257 -4815 -7718 2095 9442 3552 -6437 -6036 4108
321 4108 9281 1136 -7453 -4247 6279 7887 -1462 -7988 -2406 7498 6187 -3786 -7644 572 7835
336 7835 4171 -5668 -6668 2460 7914 1678 -7144 -4649 4711 7035 -944 -8055 -2745 6299 5942
351 5942 -3414 -7771 -161 7247 3400 -5329 -6252 1720 6640 1164 -6119 -4735 3602 6286 -365
366 -365 -6790 -3110 5205 5366 -2490 -6277 -761 6011 3769 -4115 -6231 1047 5944 2224 -5292 -5052
382 -5052 2748 5966 141 -6181 -3152 4687 5353 -1885 -5953 -1186 5346 3607 -3552 -5501 820
397 820 6028 2261 -4862 -4393 2350 5785 113 -5277 -2729 3763 4879 -1142 -5161 -1606 4563 3814
413 3814 -2591 -5189 253 5355 2544 -3673 -4751 1518 5528 1041 -4923 -3329 3471 5292 -837
428 -837 -5331 -1639 4614 3772 -2307 -5157 -246 4982 2433 -3564 -4058 1696 5034 869 -4263 -2960
444 -2960 2786 3944 -606 -4280 -1646 3756 3397 -1858 -4425 -234 4123 2426 -2711 -4186 752
459 752 4436 1427 -3622 -3258 2220 4275 -144 -4401 -2269 3287 3910 -1518 -4746 -944 4122 2810
475 2810 -2893 -4274 909 4486 1355 -3695 -3019 2017 4129 -189 -4275 -2210 2985 3595 -966 -4219
491 -4219 -1123 3745 2642 -2093 -4006 231 4000 1983 -2938 -3689 1073 4189 1185 -3650 -2917 2581
507 2581 4080 -508 -4243 -1546 2930 3387 -1661 -3903 -46 3476 1859 -2519 -3205 749 3706 940
523 940 -3082 -2369 1655 3314 80 -3660 -1682 2234 2931 -940 -3175 -605 2937 2096 -1843 -3030
539 -3030 341 3136 1251 -2590 -2622 1402 3270 429 -2897 -1812 2021 3188 -628 -3222 -1036 2944
555 2944 2542 -1636 -3007 134 3212 1533 -2624 -2663 934 2737 448 -2584 -1837 1818 2547 -445
571 -445 -2669 -1109 2283 2129 -1165 -2681 -99 2604 1535 -1862 -2574 531 2649 927 -2026 -1851
587 -1851 1240 2892 -15 -2386 -1254 1862 2313 -669 -2634 -339 2475 1840 -1420 -2563 641 2572
603 2572 941 -2023 -1878 1096 2234 180 -1802 -1180 1433 1782 -713 -1849 -558 1862 1703 -1087
619 -1087 -1999 -38 2143 991 -1684 -2240 822 2468 399 -1711 -1470 1168 2263 -199 -2492 -970
635 -970 1770 2282 -923 -2543 -348 2151 1237 -1436 -2080 405 2205 406 -1952 -1403 1023 1710 -90
652 -90 -1980 -1240 1514 1860 -529 -2022 -485 1509 1215 -1337 -1770 173 2047 1208 -1384 -1714 406
669 406 2085 718 -1450 -1289 870 1694 -123 -1693 -928 1395 1630 -859 -1752 -195 1564 870 -975
686 -975 -1679 87 1808 305 -1445 -1254 394 1283 89 -1824 -755 819 1243 -558 -1546 -354 1245
703 1245 1232 -403 -1610 45 1438 962 -850 -1412 762 1717 658 -1559 -1202 595 1181 -32 -1456
720 -1456 -441 1255 1092 -557 -1467 -143 1386 705 -838 -1567 40 1222 305 -1080 -989 461 1126
737 1126 49 -1000 -499 479 1270 -102 -910 -720 886 1036 -22 -1361 -234 1098 831 -689 -939
754 -939 381 819 418 -753 -873 367 1135 297 -990 -586 1179 1131 -299 -1157 -203 777 666 -211 -1009
773 -1009 174 955 256 -644 -640 100 648 360 -914 -605 338 738 168 -665 -643 661 1066 -89 -884 -379
793 -379 835 898 -384 -817 -155 871 566 -721 -408 241 675 220 -587 -577 328 681 23 -579 -253 668
813 668 841 -31 -499 160 332 355 -348 -495 -40 381 477 -539 -699 210 586 280 -453 -328 234 782 313
834 313 -385 -391 355 433 181 -621 -100 568 269 -364 -553 31 236 65 -104 -386 30 371 324 -85 -94 93
856 93 75 -43 -263 -334 37 364 33 -294 -252 -22 555 -47 -712 -70 242 273 -162 -578 -28 831 268 -310
878 -310 -239 321 273 73 -153 65 -27 181 135 -96 -311 85 148 -44 -206 -421 -180 261 -37 -414 -254 -1
900 -1 122 -78 -295 -16 153 238 -179 -68 -8 245 171 -546 -380 358 157 -130 -254 -24 606 113 -304 -344
922 -344 -47 515 605 -351 -181 28 317 293 -146 -251 -356 310 -80 48 -444 -321 220 142 -161 -39 225
943 225 161 -148 -278 -189 541 285 -75 -343 -39 322 100 -401 -291 -16 203 113 -587 -539 46 413 103 -200
965 -200 -414 5 336 272 -133 -211 18 156 26 -271 67 244 313 -304 -407 -21 634 81 -165 -475 134
986 134 524 240 -235 -405 256 326 -117 34 -229 -9 508 -103 -128 -88 166 290 -186 -218 143 150 289 -182
1008 -182 -373 -97 61 72 -421 154 -1 313 -98 -94 -171 337 113 -383 -441 -146 394 78 19 -466 -106 738
1030 738 216 -311 -486 -29 541 166 -319 -271 266 447 242 -99 -183 -64 247 -58 -236 -272 313 93 132
1051 132 -552 -169 226 156 -152 -575 -166 454 266 -213 -300 203 395 -97 -532 -336 156 464 -33 -478 -265
1072 -265 -10 528 -59 -490 -202 317 269 -161 -193 -16 367 -24 29 -303 -134 385 56 -164 -378 32 413
1093 413 134 65 -204 197 342 -343 -282 -255 330 429 65 -339 21 136 420 -272 -566 -60 288 357 -251 -192
1115 -192 86 331 64 -220 -105 -152 213 212 -369 -226 -115 -5 201 -548 343 283 119 6 -254 -361 106
1136 106 80 -409 -352 -69 400 157 -625 -115 328 395 168 -439 -45 260 461 -208 -261 -13 142 120 -281 -487
1158 -487 -249 371 180 -59 -551 60 359 64 -66 -274 45 528 338 -239 -319 211 302 20 -245 -88 358
1179 358 578 -212 -268 -174 72 100 -533 -87 -72 364 65 -142 -103 326 174 -45 -307 -262 -68 498 47 -193
1201 -193 -353 71 279 75 -354 -284 341 102 160 -597 -175 430 290 -190 -527 122 646 227 -343 -349 214
1222 214 200 70 -411 52 151 88 -33 -119 39 115 24 -125 -19 36 453 -140 -204 -324 -4 95 15 -467 -295
1245 -295 96 701 132 -220 -435 163 749 100 -311 -47 490 496 -118 -492 170 382 384 -389 -446 36 389 -35
1267 -35 -92 -259 363 124 410 -312 -116 19 93 135 -201 -189 326 381 157 -243 -97 307 271 -83 -259 100
1289 100 415 152 -270 -348 124 478 -43 -161 -22 540 440 -230 -128 133 313 169 -491 -307 -133 62
1309 62 16 -308 -182 131 391 130 -719 256 107 -47 -60 -519 -195 372 310 -555 -477 -170 380 221 -175 -671
1331 -671 239 453 284 -166 -491 308 469 -144 -522 -421 450 439 -171 -386 100 419 134 -464 -540 86 267
1352 267 210 -475 -132 -233 346 108 -178 -260 95 518 175 -672 -470 -78 278 34 -575 -107 229 405 -190
1373 -190 -486 134 609 -59 -313 -504 -49 355 233 -231 -584 179 229 -188 -140 -97 117 831 -218 -451 -122
1394 -122 463 283 -80 -450 -88 144 214 -294 -334 117 477 337 -469 -121 152 474 143 -218 -353 470 135
1415 135 -77 -175 -117 363 -57 -167 -154 249 258 252 -108 -77 353 576 2 -115 -27 326 71 -152 -106 -24 -98 244
1439 244 -109 -531 -200 119 150 -100 -116 -130 530 143 -286 -555 -38 536 42 -151 -335 108 302 3 -324
1460 -324 -82 103 183 -53 -186 96 320 317 -199 -368 87 8 119 -105 -456 28 545 114 -387 -275 249
1481 249 221 -40 -67 -356 90 198 94 -428 -110 252 345 -172 -237 -207 599 39 -340 -93 47 666 186 48
1503 48 -40 11 67 -48 -277 51 -52 265 -13 -227 -69 85 202 -256 -89 15 143 154 107 -196 76 377
1525 377 -87 -209 -193 117 413 92 -23 69 50 3 2 -88 99 423 -88 -33 -263 131 -83 -15 -262 -238 214
1548 214 -249 -76 -54 -483 -3 257 289 -462 -186 -125 241 237 -59 -62 -22 219 -122 -321 -108 51 156 -148 -22
1571 -22 354 -60 10 -205 -70 256 486 -101 114 -239 187 55 87 -283 -192 146 -101 -19 131 155 64 -119
1593 -119 111 -315 -95 136 -15 -194 69 140 497 19 -349 109 50 91 96 -135 -56 -67 -124 -181 -145 108 125 172
1617 172 -155 -185 61 115 75 -286 -142 -4 409 240 74 -172 -84 43 41 -288 -104 116 110 -39 -375 -191 171
1640 171 150 37 -213 -136 -58 212 -295 -353 191 43 112 -302 105 -31 307 12 -103 301 -188 361 37 -176
1662 -176 -280 371 69 -61 -82 -16 -131 -84 -240 -130 -76 240 35 -256 72 -28 170 -63 4 -349 20 84
1684 84 189 -130 -68 -203 303 -22 -230 15 272 168 -82 -247 -19 -64 292 -38 -319 115 -27 183 41
1705 41 118 63 187 53 -128 131 10 -82 -46 -2 -65 111 229 257 -342 74 293 208 155 -142 -326 224 207 -237
1729 -237 -124 -141 62 -105 -87 -103 67 339 -64 -47 -35 340 130 131 -200 23 98 37 -51 9 263 180 -15 -231
1753 -231 -222 -253 161 -41 -258 -248 243 400 -187 -358 -115 257 62 219 -50 188 445 335 -207 -201 -218 -61
1775 -61 -9 -281 -237 -31 -56 85 -345 -231 -144 260 100 -232 -165 30 386 -67 -122 22 43 82 -322 -324 106 173
1799 173 -31 -325 -34 -126 280 183 -275 89 -88 -95 -92 -148 -165 389 127 -96 -37 -216 -266 -21 191 195 -316 252
1823 252 228 -15 -135 -80 268 231 125 -125 -100 140 -289 -94 -197 348 -121 204 -329 -48 50 128 -55 -124
1845 -124 -1 218 131 -345 -192 433 138 276 -512 -113 -105 102 72 257 65 53 309 138 -430 -2 69 105
1867 105 109 -526 37 107 316 -179 -15 156 167 285 -109 -39 -49 31 302 -275 48 248 232 50 164 -180 142
1890 142 126 -16 -203 -87 55 -239 -22 -185 -37 -69 91 62 -143 -44 -87 48 -262 -126 -39 138 4 -217
1912 -217 -104 116 73 -95 -312 17 428 408 52 11 321 244 115 -19 -310 183 121 23 -88 -92 58 143 -161
1935 -161 -254 -334 109 87 145 -93 16 41 304 -53 -395 121 495 196 -87 -226 7 162 -47 21 -8 -101 314
1958 314 -168 -39 -116 168 301 137 -232 -67 283 -13 186 -123 -83 -28 212 12 33 143 83 21 -152 -43
1980 -43 20 97 95 60 -343 170 175 -74 -274 150 453 213 -114 -3 -140 194 -130 -106 -138 3 90 186 -390 -184
2004 -184 148 306 -9 -120 -124 -42 273 -84 0 -493 182 41 -251 -305 -213 565 -29 -174 -233 -18 129 -172
2026 -172 -55 -101 71 469 -109 -244 90 -4 443 76 90 44 126 -29 -222 -319 148 288 259 -41 -62 112 524
2049 524 196 110 155 376 131 -215 -180 -43 109 74 103 -265 -59 66 -13 -178 -282 -169 218 -2 -186 -646
2071 -646 -21 50 33 -261 21 136 141 132 -394 123 322 154 263 -497 105 14 198 -212 -167 308 186 -19 -95
2094 -95 -271 327 249 -36 -99 -231 242 18 0 -286 -119 280 59 78 -3 165 -57 171 -144 -78 230 217 238
2117 238 -427 -266 287 100 -107 -379 -11 165 3 -106 -387 -153 116 161 -3 -318 -139 -97 107 -27 131
2138 131 -269 177 234 -127 -264 189 284 -121 -256 -97 -59 -31 -139 -34 90 -26 273 -331 -302 13 464 -114
2160 -114 -95 -140 169 119 202 -359 -44 153 45 -23 -130 -37 -75 63 -15 251 -73 -103 181 -78 -237 -187 -17
2183 -17 391 -28 -33 -154 -8 19 -255 -173 262 320 -452 -154 -149 250 201 -148 -191 -200 49 -163 -162 396 -29 -40 59
2208 59 -159 139 168 35 104 173 -138 111 229 -119 -77 -58 171 -8 126 -488 -18 57 -167 -190 281 91 122
2231 122 -19 -215 143 261 40 -10 -62 154 409 115 -103 -54 216 92 -220 -258 145 6 -121 -100 -52 185
2253 185 -231 -83 93 249 187 246 -19 -229 -313 44 116 -27 39 -249 72 -109 -94 116 330 575 178 -185
2275 -185 -46 17 152 13 -226 -168 107 276 -154 -49 -138 -88 466 -304 -53 24 194 -93 34 -59 196 -229
2297 -229 -59 -242 -199 -77 125 -68 28 196 229 58 34 -258 -104 120 13 -63 -294 87 119 6 -377 -60
2319 -60 146 129 -58 -124 -140 228 184 -439 -166 219 54 94 -70 -436 88 -36 -109 -136 -154 151 311 -286 128
2342 128 -210 45 61 65 -8 83 308 64 127 -184 -113 192 -8 -447 40 237 263 -220 -303 -167 14 59 -31 141
2366 141 -260 355 -123 -500 -148 130 602 -300 -185 -10 234 405 -83 134 -39 195 -91 163 -214 -90
2386 -90 126 50 -120 -297 -102 193 11 -398 -193 476 287 -3 -237 -194 462 237 -109 -243 -152 313 180
2407 180 -340 -234 329 292 100 -283 -258 338 92 268 -738 -365 475 118 -98 129 -27 167 215 79 -192
2428 -192 -317 302 -29 -429 59 75 193 198 -352 -205 298 412 -174 -453 -3 329 644 -221 -346 96 566
2449 566 237 -419 -232 242 497 117 -334 -103 441 322 207 -388 -461 327 453 -376 -467 105 106 312 -155
2470 -155 -426 56 605 187 -332 -123 133 490 -176 -468 -450 224 372 -172 -457 -97 236 4 -289 -362 280
2491 280 -38 282 -161 -240 133 506 -46 -253 -217 99 562 -54 -472 -175 309 447 -64 -259 -82 687 197
2512 197 -248 -226 242 532 135 -460 -306 84 298 -60 -270 -430 621 347 -154 -604 -183 378 268 -212
2532 -212 -179 536 508 316 -584 -518 209 258 120 -507 -475 110 468 -62 -212 -250 606 316 -43 -667 -217 413
2554 413 91 -342 -436 187 550 359 -286 -366 315 666 -99 -508 347 -12 364 -217 -660 -125 392 209 -390
2575 -390 -376 197 712 212 -411 -770 208 170 70 -585 -188 396 351 67 -413 -280 372 599 -74 -605 -21
2596 -21 559 369 -194 -515 -50 641 652 -540 -273 506 489 -65 -721 -214 331 636 -309 -665 126 320 -39
2617 -39 -403 -423 -79 554 409 -545 -189 167 488 88 -564 -397 91 508 -209 -554 -61 266 473 90 -649
2638 -649 158 487 168 -168 -307 295 359 61 -163 -622 416 540 -57 -605 -421 437 331 -221 -677 -25
2658 -25 500 410 -191 -341 -144 753 255 -553 -134 404 447 268 -560 -285 232 243 -127 -274 -378 294 57
2679 57 26 -395 -197 326 102 -369 -319 149 509 134 -426 -454 296 609 -27 -303 -242 337 440 -206 -366 -76
2701 -76 438 94 -315 -169 84 550 -93 -394 -324 247 411 26 -527 -193 335 375 -50 -340 -42 316 460
2722 460 -213 -385 42 698 224 -400 -203 223 743 297 -456 -177 230 606 15 -508 -134 88 243 -269
2742 -269 -489 -79 238 76 -353 -623 48 275 93 -217 -478 158 747 203 -150 -92 217 289 -137 -515 162
2763 162 232 448 8 -112 -56 406 -36 -172 -351 -9 467 -77 -489 -140 468 263 150 -662 -120 170 336
2784 336 186 -377 12 592 -25 96 -286 -111 178 174 -99 -98 22 339 171 -144 157 247 264 -82 -347 -447
2806 -447 440 184 -332 -508 29 303 377 -401 -169 272 500 137 -236 -186 224 316 -266 -214 -273 372 275 -179
2828 -179 -154 -164 447 290 -90 -522 204 111 24 -382 -643 166 330 -95 -156 -269 464 256 -12 -352 -309 426
2850 426 72 -289 -376 -89 266 -210 -209 110 260 -2 -101 -475 -33 430 -34 -97 -288 171 144 126 -105 -109 60
2873 60 281 392 -127 -54 351 273 94 -86 -67 -60 423 -205 143 21 205 -112 -132 -244 90 168 5 -216 -293
2896 -293 240 156 181 -361 -261 137 142 -244 -131 162 97 356 -58 -154 115 218 63 -283 -11 226 214 91
2918 91 -308 -17 -58 0 131 -300 -51 -58 180 -378 106 35 31 231 -282 -86 112 89 344 -284 -347 59 403
2941 403 -5 -289 53 274 111 -63 -170 -23 439 151 -161 -411 -50 356 124 -20 105 134 346 -297
2961 -297 -26 -68 -67 -280 -9 -50 -4 266 157 -503 -103 -15 163 180 -205 -143 137 229 -30 -171 -244 331 -122
2984 -122 -151 -410 39 33 271 -154 -227 223 -97 -383 -238 54 -94 100 37 -5 152 -25 23 43 -369 -100 -140
3007 -140 58 55 -181 -221 332 68 -555 -81 -9 -302 306 -161 -178 171 441 -424 -324 -15 129 201 -41 -124
3029 -124 139 326 -267 221 52 243 -104 251 152 -88 329 280 42 -201 -146 -54 338 -222 116 277 88
3050 88 102 -167 -187 64 66 -147 -221 -198 190 -96 -71 -86 69 256 249 -379 100 265 163 62 227 -2 98 105
3074 105 -32 -97 -242 -237 103 46 -70 31 50 205 105 -96 257 265 -33 -70 -347 -77 -61 -262 -226 -206 190 128
3098 128 68 -256 -82 178 207 -3 -419 132 282 -127 -90 -70 9 369 -146 -216 140 127 67 269 -181 -363 176
3121 176 363 16 -72 219 140 63 -177 -145 -61 294 144 -49 -403 81 -59 95 -118 18 438 186 -215 77
3143 77 129 43 320 -253 -307 -225 425 37 -158 -216 85 270 219 -174 -215 21 311 119 -18 -239 112 101 -61
3166 -61 -572 104 29 488 -214 -155 8 303 284 -74 141 -114 200 68 -3 -174 139 326 104 -234 9 343
3188 343 327 77 69 -84 422 168 -191 92 103 -97 47 -218 -196 171 205 211 -254 -91 26 213 82 -180 178
3211 178 -108 365 -196 -169 -221 106 158 -209 -296 -254 236 96 -533 -150 -243 161 -76 -604 107 145 146 296 170
3234 170 65 330 331 -122 -312 374 -149 71 -268 25 -24 105 -230 -75 305 -163 -61 -197 -467 9 246
3255 246 73 -143 216 157 68 -71 -19 -79 -222 262 102 -170 169 215 157 -97 214 55 117 -188 -69 -181
3277 -181 172 -13 -218 107 -11 464 86 -53 -41 94 138 143 114 55 -237 145 148 -11 -144 34 53 -183 -118
3300 -118 -205 -155 -153 30 150 -53 8 176 -18 143 -232 -23 22 79 -174 -222 192 111 -4 222 -122 366 -36
3323 -36 -145 16 -136 -44 -12 297 -55 -172 221 -132 -13 0 14 103 33 -283 -30 125 268 36 -344 -241
3345 -241 -69 37 259 9 9 45 93 31 -179 122 386 -255 -54 -209 -247 86 -242 -107 -124 84 267 -128
3367 -128 -65 237 5 157 196 -204 -174 -24 33 -90 -136 -120 -245 110 5 103 164 -300 182 -179 -341 84 -56
3390 -56 -11 96 193 138 101 -114 -156 221 149 208 214 -93 -113 177 211 225 -206 29 -43 -222 -84 0 144 15 220
3415 220 26 -289 33 -173 316 -74 -87 11 297 54 9 -238 -267 270 -94 41 304 -26 172 -49 -201
3436 -201 174 302 279 -163 -135 119 95 136 -63 -225 -125 217 -176 -96 10 150 -378 -107 -46 -115 269 -56
3458 -56 -75 -64 -22 128 -264 -163 -281 -42 331 59 -332 -20 177 278 211 103 145 -157 -55 1 52 27 10
3481 10 94 -70 -151 -117 250 -127 -127 -165 218 8 -155 98 -83 24 56 278 -27 142 19 -179 -121 2 -216
3504 -216 85 42 27 -50 -265 289 -106 70 -265 -71 440 31 -58 -9 -37 15 -82 8 -155 -61 73 165 -229 -193
3528 -193 -162 -125 -110 -108 -44 -38 12 22 -327 71 -82 -140 -143 -29 271 -41 -109 20 -109 -130 364 -8 264 32 184
3553 184 2 -389 84 -118 59 -77 -283 -196 230 159 -3 19 -35 -113 -115 -155 -132 40 -4 63 24 -142 -28 66
3577 66 -193 -5 166 174 231 100 159 -39 224 24 -108 57 143 -65 297 88 5 132 102 -148 84 -190 117
3600 117 292 179 146 -63 48 -95 172 -13 22 285 -177 -53 81 -410 -158 83 -64 -8 -68 -4 75 117
3622 117 27 -44 -124 76 -14 -388 -39 121 -115 -91 -65 -152 -45 92 75 -72 -213 69 76 77 12 -203 15 -94
3646 -94 2 -228 55 -441 -134 -214 -125 86 -189 352 115 217 153 37 -240 153 40 252 -154 171 37 36
3668 36 -212 72 -33 249 264 -23 268 288 44 284 -65 -97 16 -1 -128 26 -35 8 -102 91 -13 42 -153
3691 -153 -74 -137 93 -286 -225 -38 -26 -282 -4 -84 -131 88 -225 -53 -233 17 70 -44 -170 -8 -104 102 69
3714 69 -188 272 7 107 162 120 -58 -113 146 96 -164 168 152 -239 -214 -174 118 -182 -138 -91 59 108 -123 -12
3738 -12 11 -132 111 255 71 123 70 319 74 -215 -210 101 76 -113 6 -290 146 14 216 84 -68 74
3760 74 429 -38 -22 160 151 248 -202 -97 -87 78 -81 48 -158 -52 258 64 147 -100 -159 -105 -119 -72 57 -88
3784 -88 116 -85 -138 20 -133 24 -67 -378 -174 -90 -252 -79 -114 235 311 -7 43 79 -155 -88 -100 -55 14 206
3808 206 94 199 24 88 -26 130 49 -251 306 91 -234 75 -320 -350 199 -140 2 56 111 -73 -6 -53
3830 -53 -22 130 299 -244 71 108 124 -108 188 -17 129 -122 -99 -87 -7 -40 213 6 341 -111 119 -92 -217
3853 -217 -18 -5 226 41 -138 110 2 -209 27 -248 -47 -248 138 -74 -86 53 -96 139 -48 -164 -199
3874 -199 -155 73 -133 -64 -199 24 233 -22 -252 -90 31 138 54 -182 -378 180 -223 -124 122 -197 216
3895 216 35 291 70 215 -241 10 -246 221 44 159 -76 -329 -213 310 -220 29 -106 -208 274 99
3915 99 18 131 96 158 106 -53 -41 -205 -110 -52 -77 158 227 46 -9 -238 -90 -175 -188 -187 277 -85 -102 39 -84
3940 -84 -262 110 -184 32 71 -82 97 -26 176 105 316 33 92 92 52 0 -94 -5 -44 -156 238 -1 -108 -48
3964 -48 180 -94 37 23 -32 -65 -194 -2 -165 -221 23 251 201 -153 -200 -97 49 -58 -42 -224 -60 -201 31
3987 31 13 -26 362 -59 -116 -201 -293 290 -112 -460 239 197 -34 -274 -7 38 -7 182 91 134 -54 13 253 123
4011 123 -113 133 301 109 290 -233 -60 -60 33 -99 -125 -157 -85 -198 -79 -39 425 -167 34 288 -118 234
4033 234 189 35 193 -115 287 -325 -33 275 219 -192 249 55 23 -185 -4 103 -159 -87 266 -154 -20
4054 -20 -327 277 95 67 -16 -86 263 -129 26 74 -317 71 -131 33 -187 -214 -398 134 45 -140 147 -345
4076 -345 111 196 86 -397 57 194 291 117 -132 -45 78 -132 -289 -199 -68 81 130 -197 -72 80 -156 37
4098 37 135 166 -125 -143 220 -120 -33 102 140 -68 -390 -90 -69 -28 -33 72 -217 109 -162 -171 -156 -87 113 -135 6
4123 6 -172 96 54 -238 212 90 -289 -97 79 7 -11 -30 -82 164 166 -54 34 -88 -184 -278 -63 175 -29 118
4147 118 124 147 2 -59 64 262 -157 172 7 -193 -109 74 -329 -294 -89 81 61 213 -314 166 -125 -90 74
4170 74 78 139 -243 -332 -68 79 -438 216 365 199 28 -7 254 90 167 6 246 6 164 -87 98 143 -75
4193 -75 154 -129 -255 -57 -39 -280 -238 229 -1 53 -60 -15 -285 -298 27 6 89 -177 -88 20 175 10 -40
4216 -40 244 68 10 -324 -255 186 -98 -35 -162 118 -220 -14 -70 40 150 224 -340 -113 -131 65 -72 -282
4238 -282 94 17 -93 61 -88 205 -190 59 53 -146 -77 189 209 115 40 -217 -11 144 92 -40 384 98 -208
4261 -208 -53 -17 -220 -204 -133 -129 250 80 -34 -359 21 369 269 -72 54 173 236 116 -131 155 -142 -305
4283 -305 -1 59 -59 94 -18 2 -37 68 -517 202 -12 -289 -63 -38 -170 -139 -138 21 -147 -166 30 -249 91
4306 91 36 173 140 -318 162 26 26 -242 -41 140 70 163 -15 -140 -39 257 36 244 241 -146 -48 -33 -185 -214
4330 -214 -424 334 70 -37 -55 -180 172 6 -151 73 -61 92 -231 140 -100 191 268 252 -70 191 -136
4351 -136 178 344 -93 -83 -197 188 55 -113 -87 195 72 -106 117 35 -315 -7 -396 -199 82 -43 -10
4372 -10 -7 51 98 111 105 118 -344 115 -150 -299 -130 9 -234 184 98 -329 28 -27 -342 -243 158 97 18 156 41
4397 41 19 91 31 -160 -79 -161 149 167 -338 -4 157 188 209 -138 182 78 215 -251 13 -70 15 240 -184 83
4421 83 -179 167 114 226 185 149 -9 -3 -12 -239 145 8 158 -68 60 -136 -122 -258 -100 -91 197 344 -88 265
4445 265 36 -120 109 -112 -151 -25 278 -51 -259 -187 81 193 -39 -23 21 18 -93 388 162 65 -217 -57
4467 -57 97 -80 -107 -174 -216 -60 5 -57 5 -117 53 -148 -81 -144 368 102 -36 0 45 -67 29 -47 154 22
4491 22 9 1 3 1 180 90 -61 -16 -122 148 25 -234 69 359 -23 -197 -125 172 255 -13 -371 -364 -61 111 60
4516 60 -209 129 -9 -61 34 -369 -89 -157 -112 277 -309 -2 -97 -144 -247 -199 187 -256 -57 52 -153 -63 38
4539 38 -74 -55 -223 270 -5 -41 148 126 177 -53 -126 188 -158 -268 -209 -134 -62 157 -16 263 -67 -65 389 408
4563 408 -40 68 -253 -109 48 8 -198 147 -166 46 -117 -341 90 163 28 29 89 89 105 364 -248 -32 188
4586 188 162 29 34 -391 161 -15 113 -96 -27 -262 -68 -123 -44 172 -125 -185 90 27 55 41 121 -10 -190 64
4610 64 116 -225 -126 145 140 -23 -218 -87 228 106 -42 -398 280 -153 -9 247 -33 1 -282 -44 305 -272
4632 -272 210 30 52 -209 -126 296 -303 -30 131 -9 49 -99 20 169 102 46 15 2 120 76 186 279 -29
4655 -29 229 -164 -63 68 125 -20 52 57 197 -52 21 208 140 -110 154 38 -277 127 -53 -55 207 -82 73
4678 73 -198 289 16 23 -120 -33 -14 102 127 -115 -47 -2 -99 85 133 -119 -303 225 183 -73 -119 -95 88 249
4702 249 -347 121 10 16 168 -27 86 -94 -36 -263 35 111 -225 39 321 -71 112 -112 141 157 -2 -246
4724 -246 -25 -15 -480 83 268 9 -5 31 74 57 -156 217 -84 111 124 167 -194 324 -165 -210 236 -115 -55
4747 -55 219 -27 -27 -159 -85 57 115 -182 190 420 48 -15 289 -3 -315 28 59 342 126 120 21 66 -49 -149
4771 -149 311 15 392 -295 186 -211 13 143 -264 48 252 -29 -22 -55 71 180 31 258 -313 -265 70
4792 70 49 165 147 -46 -111 -54 90 -83 438 181 -107 173 -181 311 243 -52 134 -129 -107 -161 123 75 -35
4815 -35 -60 42 -102 -8 -100 31 -266 42 89 24 70 -22 -175 -244 13 176 -103 -75 32 -47 -100 -169 81 -14 -143
4840 -143 -107 34 47 20 301 73 -41 103 -207 -123 -36 -57 112 -58 -37 -25 13 -47 -80 257 121 227 -8 -158
4864 -158 -209 213 98 134 -19 -395 -260 146 36 5 54 36 45 -35 -31 -222 153 -65 -70 -78 81 -134 25 -109 130
4889 130 -116 -217 -56 130 284 -9 -42 146 133 -326 -59 124 143 -303 39 46 -26 110 -100 -150 336 -11
4911 -11 90 -61 -89 6 120 -100 -191 333 50 -179 -107 103 145 -193 115 -99 -91 -181 151 -56 -85 187 -191
4934 -191 2 -163 45 -54 99 39 -198 283 279 89 312 157 24 -63 21 -14 25 -54 178 121 -56 17 -194 19
4958 19 -148 4 52 -100 116 -24 58 152 156 411 151 -148 -87 -250 -156 -27 -191 106 229 468 -19 84 -165
4981 -165 110 187 145 -116 -277 88 58 8 303 18 -185 -252 -221 -12 155 5 44 -161 16 -194 119 29 -203
5004 -203 -24 -206 46 35 -107 168 55 -107 -133 189 -108 25 -103 -98 62 -62 248 -214 111 192 29 113
5026 113 -149 222 -3 16 -6 70 -83 -8 -8 202 101 -237 -108 -63 -214 157 -28 -246 -283 -102 120 106 103 -36
5050 -36 54 -97 -318 228 148 -333 -125 -95 -57 -258 -198 120 -43 123 -131 -224 5 9 56 129 -72 166 163 -57
5074 -57 127 -40 -31 154 -36 -337 -99 91 -93 145 -95 3 296 31 285 -141 -162 20 118 -247 21 -10
5096 -10 86 31 -134 -34 134 40 -152 45 -311 -21 -108 144 431 -125 75 -320 234 201 136 347 -35 5 -109
5119 -109 32 -157 -118 28 44 75 323 -111 -177 -170 297 -157 110 15 -35 253 -235 -62 33 235 65 -22 -188
5142 -188 -364 46 92 -38 30 -179 168 -222 -210 -22 47 -47 -74 -96 50 114 -377 -238 -187 261 280 191 374 5
5166 5 65 18 9 -4 -105 415 115 210 -275 45 209 215 -96 -210 -129 104 59 63 -66 118 95 180 -74 33 61 -27
5192 -27 -232 10 -211 -7 105 62 11 -153 -16 173 -71 103 -13 -186 -165 -76 -166 7 354 -16 239 -137
5214 -137 -141 64 -13 81 -149 -138 -83 13 -11 206 -58 94 -183 77 200 -211 -293 -100 -187 12 -64 -39 -105 118
5238 118 250 79 -255 -345 -441 -265 -80 98 -21 -105 -31 65 57 65 6 239 123 -30 1 -95 -127 -103 -148 208 24
5263 24 173 23 48 61 -10 -106 -30 -50 206 139 -27 86 -135 -88 -99 8 -106 204 41 161 172 -137 -19 253
5287 253 191 158 117 -291 249 -21 -101 239 -15 -75 -291 126 -52 -55 -148 -47 -54 -90 -16 -52 -121 243 15 -59 11
5312 11 -97 -108 -325 -55 -216 157 23 -268 -42 39 -171 21 149 271 206 -104 30 -280 16 -153 -80 -38
5334 -38 -109 333 117 -121 -53 165 335 -258 -242 -66 120 142 -10 57 -169 187 27 379 9 -321 -50 -47 -180
5357 -180 187 11 -112 7 -188 -278 160 -299 211 111 35 136 -197 105 163 479 -152 -144 45 273 -258 78
5379 78 -99 -139 279 -121 -83 226 107 -71 42 65 -470 -2 202 -33 181 -68 156 -248 -129 104 -94
5400 -94 -125 114 -385 187 184 32 -139 216 243 -71 -51 117 150 91 -46 -286 -284 -274 83 50 63 68 -141 -407 165
5425 165 -277 -94 -8 -59 198 58 64 356 -31 -196 -11 16 -110 -22 12 95 -39 -104 -134 -101 -88 240 -223 -88
5449 -88 5 341 -9 234 -83 206 -22 86 423 -116 210 66 4 148 45 263 -18 68 117 335 4 256
5471 256 -205 -15 -40 201 -46 -81 -13 -197 2 46 -315 83 -183 -248 170 85 -183 18 48 -78 88 15 68
5494 68 2 -212 98 319 -345 5 -192 -237 19 126 -24 29 -2 187 -78 116 -176 -7 7 -438 -228 -121
5516 -121 103 19 -196 -13 184 164 14 -137 -153 131 -96 -56 -100 277 -245 -112 -312 23 -53 104 -106 -137
5538 -137 -178 -19 99 173 48 156 55 -146 -84 -35 132 -165 202 86 -132 58 91 -120 -38 185 30 294
5560 294 -8 -71 17 -260 -183 32 -380 -52 -282 -110 -193 -167 153 136 -5 104 156 -47 145 -11 346 83
5582 83 4 215 -155 -26 156 3 -109 -76 173 120 55 -54 -71 -108 -85 -88 -161 -113 -298 -60 321 -80 -30 -131
5606 -131 234 -53 -187 -127 22 -99 113 -5 85 66 -71 -413 92 5 -221 -51 86 -81 4 -12 184 -66
5628 -66 -293 3 183 42 -101 5 12 -59 195 -8 30 61 -134 72 -12 -100 -45 246 10 26 -67 170 -162 -243
5652 -243 61 -391 254 -29 212 -91 137 -96 -22 -15 -57 -264 144 107 378 285 -91 -69 -24 -68 2 108 71 115
5676 115 182 62 90 295 -37 286 -114 -103 -144 27 190 360 -176 -105 106 203 333 -213 35 191 -121 -11
5698 -11 123 -84 -9 -109 227 -7 -301 -21 169 -121 -259 112 -61 118 -22 220 -70 -2 -71 -11 -53 -13
5720 -13 214 254 166 -427 -26 -143 -192 -108 -57 171 -50 90 -153 200 49 34 58 -301 -94 38 -193 -200 45
5743 45 47 111 -14 -120 37 185 -34 -285 -264 -4 -262 69 138 148 -140 -78 -174 -58 24 -64 184 255 244 213 -146
5768 -146 -161 84 9 -92 -128 225 -229 56 148 120 -134 -197 147 -290 17 -235 89 295 5 -40 -11 30 -53
5791 -53 38 118 -86 21 67 156 25 -102 -157 -196 -117 55 -48 -124 302 234 40 175 -107 152 0 -43 -5 -44
5815 -44 104 -49 251 -98 -159 151 209 -21 -103 -65 118 -8 -104 -168 -71 -52 52 139 -34 282 226 -220 -45 -51
5839 -51 -157 146 118 7 92 168 -17 -23 -285 25 227 -145 39 -158 -76 -10 -202 72 -160 62 -232 -82 171
5862 171 18 8 117 80 69 -219 -34 100 57 -248 31 220 -257 -77 -18 243 48 -140 84 -96 -38 5
5884 5 213 267 66 55 160 -141 -265 -12 211 145 24 -10 159 124 -26 -162 -140 -15 -309 7 108 -170 -90
5907 -90 8 -130 -358 -51 154 -137 184 -132 -93 -58 5 21 75 0 -86 125 64 -281 169 293 31 251 -173
5930 -173 14 67 130 56 50 249 -56 114 -164 97 10 -2 47 37 114 169 305 -90 -122 163 -270 19 -210 -26
5954 -26 230 54 -157 -182 -462 -133 164 -200 9 60 51 342 659 -29 -51 -54 39 45 -240 -76 -60 5 172 -250
5978 -250 34 -166 -205 46 86 60 -182 67 93 11 198 -70 -22 -133 -422 274 -41 52 -137 161 271 -172
6000 -172 -57 362 -248 120 -67 -36 44 191 4 173 4 104 -27 83 14 242 354 -74 26 94 -51
6021 -51 -42 14 -79 50 132 353 -29 -276 22 585 109 -97 195 -46 -64 81 -383 -103 -285 36 -220 -149 -31
6044 -31 28 -158 119 349 -214 -45 133 167 -284 -69 182 172 134 -61 103 113 167 -136 121 -17 126 -185
6066 -185 103 -80 67 -181 -338 9 -7 1 -100 -216 -142 21 -141 -50 -317 40 -68 136 -19 51 -7 431
6088 431 72 -173 -194 91 79 -30 145 -154 -30 -180 -38 196 122 180 -17 150 -72 -184 118 -33 103
6109 103 -58 -48 338 -94 3 72 54 171 -126 -52 95 -121 -232 244 -219 46 -183 16 58 35 -33 -101 249
6132 249 233 -58 -291 177 -7 144 -21 141 336 -28 147 119 145 136 -55 51 -52 47 -110 -212 -21 145
6154 145 -134 -129 -165 -161 -112 -237 -138 68 58 252 23 164 19 -21 -74 59 8 74 -131 9 157 11 -216 -451
6178 -451 -33 -28 14 -244 -184 314 111 -366 -44 -140 -199 5 -75 -70 -85 -12 11 18 55 101 -42 334 -44 -80 -57 89
6204 89 -52 -215 -93 -94 -173 214 67 -63 171 57 -153 254 -168 -33 54 -110 50 220 -215 7 -45 138
6226 138 75 65 144 15 236 -116 153 -117 -116 155 78 -164 69 243 -21 -139 158 -52 -61 71 80 -52 101
6249 101 -261 -126 -215 217 105 62 -118 -14 93 141 -425 -86 140 -171 -32 -299 -147 2 -222 234 -211
6270 -211 -390 -86 78 -32 -207 -81 59 -286 -24 -171 -156 -275 130 44 352 -49 -3 -30 -74 80 -359 -281
6292 -281 -69 149 -111 -15 -64 -79 -56 131 -160 -31 -19 21 35 39 -255 148 -132 -228 184 45 -117 248 48
6315 48 -24 199 -99 -70 171 276 144 187 -18 -54 -219 224 -170 -104 217 112 -49 -130 28 27 -17 -49 -7 54
6339 54 82 -373 -220 89 -108 -2 -16 79 104 131 5 -56 231 -265 -3 -127 15 -116 444 167 -90 -221
6361 -221 -87 273 -124 -239 -173 14 169 92 -285 201 143 179 -10 72 -7 -74 -138 -41 -182 73 104 -140 225
6384 225 12 -50 123 228 125 -74 -3 -64 -100 -300 45 -190 8 25 152 -6 297 221 232 214 -44 130 144
6407 144 183 -104 -285 -74 -126 -31 -43 -6 -266 95 -306 -11 191 -84 -230 -41 186 -164 -38 194 73 124
6429 124 -242 -13 215 -279 19 34 132 78 132 -31 -135 -75 -149 18 -321 -324 -86 188 -274 -6 106 -192 147
6452 147 232 -45 -124 -1 -8 -353 159 -24 -358 -143 57 23 -212 -257 -458 -71 168 -108 -99 108 -136 -13 -110
6475 -110 215 85 250 28 96 146 187 9 54 43 -99 13 6 -37 61 40 89 -65 165 72 200 231 -113 96
6499 96 219 -27 140 -13 -8 -9 -145 -134 4 -84 -224 -145 234 71 -73 63 -155 -161 -197 88 24 -183 65 197
6523 197 -95 -43 79 -196 232 -4 96 -84 -64 -199 31 268 -146 41 -70 -69 -178 -397 183 107 -296 118
6545 118 22 -195 -42 -202 44 -243 180 -83 9 31 -131 -48 -6 -60 -38 -169 213 79 -85 40 -113 231
6567 231 31 -221 -22 49 69 -104 1 290 -88 -199 -109 -129 59 122 -262 12 73 -256 121 -165 -28 33
6589 33 -62 -15 -56 54 -16 -272 -2 -274 63 -310 -56 -19 127 -105 -114 -63 -141 59 22 136 -199 11 146 -2
6613 -2 -59 88 -62 -149 -76 215 89 151 -227 -360 -195 112 141 -152 -301 81 -53 137 3 -260 69 -18 -243
6636 -243 -98 220 -47 87 -84 63 -212 -18 93 -80 137 -130 -208 -212 195 -74 -113 47 92 53 134 -11
6658 -11 -159 -82 -183 66 -143 31 -125 -23 -316 26 210 -4 176 -117 43 -208 252 -39 309 -77 0
6679 0 281 126 -14 135 -315 182 268 58 47 -175 55 -106 239 -21 -77 189 128 -47 -173 -89 15 7 -49
6702 -49 206 319 -42 311 36 -136 -43 -107 3 182 42 14 25 -160 350 116 45 -235 74 359 -70 41
6724 41 43 -205 45 293 -265 -217 160 109 -119 10 -304 -144 66 -104 104 36 -3 39 210 -378 -110 133 242
6747 242 225 12 -38 25 10 -351 309 -209 78 46 194 206 24 4 -100 230 -80 5 77 203 -58 -135 -34
6770 -34 154 177 -243 216 321 -8 99 171 161 97 -29 63 260 -13 -474 116 2 51 -13 -109 -77 99 27 -148
6794 -148 116 191 -59 -114 -36 -55 44 -244 -129 107 328 -5 108 -77 42 -57 87 -59 46 57 114 100 -69
6817 -69 444 -223 -107 190 -110 2 -63 56 -49 77 -97 85 186 -185 -182 -140 0 -58 138 -192 -208 -382
6839 -382 -222 273 -54 215 188 180 243 160 -76 311 52 -25 39 31 -93 -144 -16 -19 146 -39 -106 -280 120 -137
6863 -137 -47 71 -47 -279 117 -55 187 -212 -112 171 48 -80 134 48 152 262 13 -20 271 115 145
6884 145 -90 101 -60 191 -64 -337 -88 77 23 -48 165 -276 -181 141 -61 -62 473 119 -171 118 -40 -3
6906 -3 -106 -3 -159 238 135 -157 136 35 -178 -3 -170 -62 -586 -459 220 -137 -49 -74 -129 -162 -92 50
6928 50 186 -87 183 23 34 197 273 4 3 -200 -220 28 65 -102 191 103 -13 80 -14 -143 204 -62 -70 -1
6952 -1 -114 -68 -163 -1 -119 315 29 46 -121 94 -67 -42 -72 -25 -33 -111 231 79 -7 7 2 71 138 -47 -55 74
6978 74 -141 162 -11 25 -235 -82 -254 -43 181 212 -60 75 86 -145 -10 -144 6 -7 196 -183 252 177
7000 177 -278 -429 22 61 -90 79 64 -256 54 -150 38 -77 -20 -267 -40 -94 -88 -140 -1 122 -122 261
7022 261 -330 306 472 178 -86 -58 5 62 187 -75 -20 94 -142 -210 -159 -191 -88 247 -187 61 -23 -257 -268
7045 -268 -88 52 -35 118 139 -96 -98 457 -226 -22 -71 57 69 -249 60 143 -126 -144 96 169 169 -161 144 2
7069 2 -14 32 -185 -15 -83 114 -21 -28 86 -6 -185 -85 220 -73 49 29 -13 175 126 -11 -209 21 -58 -180
7093 -180 42 -27 4 23 -41 69 159 127 28 -265 -243 347 182 154 -67 50 -164 -190 339 123 79 -142 84 -29
7117 -29 247 12 45 -411 -175 215 -33 53 100 -40 55 -16 -39 -31 155 -36 292 -163 -143 218 123 58 -178 224
7141 224 18 -10 27 363 -129 -15 12 269 172 64 298 -31 191 -197 -44 231 -57 -108 97 57 -13 -176
7163 -176 -26 66 -135 -208 -403 -172 -204 64 -3 119 275 300 -196 -249 -124 -47 -198 -13 195 -61 188 341
7185 341 78 -20 -16 -204 -7 -91 3 89 172 -302 -167 -292 0 -13 -80 -68 -255 30 -221 97 -106 -163 -6 189
7209 189 218 42 -36 187 -417 11 -179 -9 208 14 160 -78 -116 -275 -350 22 -230 404 152 31 38 102
7231 102 29 299 -64 -41 75 -128 -218 132 -134 71 31 -138 -8 -109 -77 -76 107 -234 -85 199 1 -308
7253 -308 -9 63 303 -62 -114 173 97 -1 -34 -377 -35 -251 -400 174 74 -34 -189 -88 -100 -45 -58 251 -103
7276 -103 -301 -30 -85 33 106 30 -10 -35 -242 139 116 53 -82 -103 -462 -165 214 -137 253 172 68 -196 62
7299 62 314 -199 -23 -345 -62 -2 -217 -41 86 -16 177 80 -183 389 -158 -228 135 117 23 -175 -64 26
7321 26 -5 82 293 -332 160 -34 93 -213 -81 163 -24 96 1 114 178 -124 357 94 -4 -106 113 -124
7343 -124 87 19 -43 55 151 177 -327 -155 -192 62 -131 92 344 124 193 -195 -101 -125 -116 -15 -128 138 -61 212
7367 212 93 182 -34 -198 -47 406 -3 -87 190 65 -10 310 25 -104 0 -178 128 42 -171 -91 191 -55
7389 -55 -333 -114 209 232 -70 -189 -310 91 0 49 40 129 -59 -272 -239 278 125 98 135 -99 90 -101 160
7412 160 72 -224 39 -294 21 265 214 -144 -28 162 -288 -101 553 32 132 229 -104 387 -353 133 -185
7433 -185 -185 85 32 57 18 -81 206 67 -192 -61 -62 17 -57 52 -75 -169 150 115 -100 -353 365 -145 25 86
7457 86 -60 317 -76 -152 -60 153 -36 242 -125 163 176 -128 -312 279 55 -98 142 133 225 -267 373 -109
7479 -109 43 137 161 -211 -100 -111 -192 -180 -226 -76 88 225 -66 212 105 22 182 -106 93 -48 -5 -74 209
7502 209 114 36 152 115 -256 -341 -114 21 68 -44 -168 80 162 187 16 95 -276 -159 -196 -100 23 134 75 -78
7526 -78 19 88 14 -145 -120 105 14 61 181 -116 -144 86 117 -82 165 -112 -121 -96 16 104 233 180 -284 -174 -104
7551 -104 -47 263 -265 34 30 166 -31 143 15 180 -23 14 -30 -13 165 64 -187 -70 -23 34 70 258 234
7574 234 -6 180 12 58 -210 44 -18 -29 348 -150 -67 -50 -25 -8 30 51 92 203 -71 -214 55 -170 -288
7597 -288 -131 -148 118 22 -193 101 -40 -82 -47 198 -47 103 70 -102 21 18 271 170 214 -19 238 30 136
7620 136 -88 -111 -43 -217 -98 -11 78 64 -115 15 -5 -27 -6 -188 445 71 -69 -105 -242 404 24 -18 -85 -26
7644 -26 66 284 -108 -114 29 56 211 65 -5 -96 18 -107 -50 -8 118 -54 92 -100 2 -97 97 219 -156
7667 -156 -314 -52 -85 -198 147 -65 23 71 155 -249 10 198 142 60 206 -32 -195 237 -111 -206 227 136 298
7690 298 -48 155 144 -187 50 245 -139 150 10 62 119 -101 49 19 -151 -113 25 142 23 -138 183 -77
7712 -77 -63 225 -65 -71 76 398 -271 -21 45 -53 223 -259 90 -100 -1 138 112 35 -91 116 52 79 -36 -139
7736 -139 18 32 163 -246 108 34 65 -176 -176 -53 100 -55 52 38 -10 54 -59 156 70 164 248 5 -123 -5
7760 -5 127 -236 -187 216 -127 -118 -116 -73 12 13 -21 80 -40 12 45 -473 82 22 -157 -25 45 -238 6 -350 40
7785 40 369 22 -154 -354 -111 -82 -67 -242 2 29 158 48 60 -111 250 29 -169 186 -235 -86 -92 46
7807 46 22 -332 -284 214 125 -39 -278 105 -12 -148 73 129 131 -35 120 -211 32 -7 -145 -185 -106 19 276
7830 276 143 -240 326 227 108 62 144 -52 132 -12 -374 -39 -250 147 -40 126 -63 282 62 131 -72
7851 -72 -208 57 129 414 -10 -278 6 -14 -77 154 136 195 -65 -242 -153 127 -11 150 -57 -281 15 20 -67
7874 -67 -156 -84 42 316 109 189 138 70 -154 31 -194 36 17 0 -168 -114 110 92 -79 -160 -34 216 3 -56
7898 -56 210 -62 -204 265 -23 48 12 -47 -175 -255 -168 247 -85 -69 -127 46 -67 -69 -134 -136 -87 82 30 74 160 31
7924 31 -146 365 91 30 10 -11 64 -40 -153 85 178 -413 -156 128 40 -146 -160 -196 149 137 -9 -51 0 57
7948 57 -95 -167 117 73 240 -227 87 47 -112 -31 -55 257 -31 -19 -390 169 -309 -25 9 -269 -174 54 46 -147
7972 -147 -70 -124 -20 -38 108 30 24 -47 47 -158 -130 175 78 434 -40 -32 -77 -225 -227 72 18 -70 130 83 31 -218
7998 -218 -99 -101 -126 158 132 70 235 -111 149 20 34 415 -65 -300 155 52 49 -199 86 -109 198 -22 -52
8021 -52 -177 33 -13 -250 14 155 75 -23 379 79 44 -74 -48 -156 -199 257 -230 -7 66 101 26 82 50 -280
8045 -280 -167 202 -256 -134 -7 336 15 -178 64 24 -94 216 155 -116 -23 -72 39 33 -59 -81 27 -238 18
8068 18 115 -75 154 -148 -100 -84 95 198 -62 -75 37 300 291 43 -112 199 -272 -74 223 -103 52 -279
8090 -279 180 -176 -155 -258 46 -4 -97 124 -119 79 44 -66 177 65 23 -144 -96 42 246 -332 -60 43
8112 43 -262 -369 -323 122 -17 -168 -222 138 -66 -61 18 67 30 380 -136 -58 -282 -222 259 194 191 169 224 49 -457
8137 -457 61 -197 22 252 -109 -175 88 93 254 -44 -209 -112 89 220 99 1 156 227 -196 282 -72 -233
8159 -233 -144 80 -404 31 230 -126 -28 128 -65 -65 -15 188 239 328 123 326 213 -92 -299 -141 -214 -20 -62
8182 -62 -511 134 60 49 69 -168 127 -135 -12
8191a2
##END NTUPLES=NMR FID
##END=
