##TITLE=1H_PR165-1
 D2O, 8 sc, 
 16.1.2019
##JCAMPDX= 6.0         $$ Bruker NMR JCAMP-DX V2.0
##DATA TYPE= NMR FID
##DATA CLASS= NTUPLES
##ORIGIN= UXNMR, Bruker Analytische Messtechnik GmbH
##OWNER= root
$$ XWIN-NMR		Version 3.5
$$ Wed Jan 16 16:04:00 2019 Russian Standard Time (UT+4h)  she@DPX200
##.OBSERVE FREQUENCY= 200.1313
##.OBSERVE NUCLEUS= ^1H
##.DELAY= (6, 6)
##.ACQUISITION MODE= SIMULTANEOUS
##.ACQUISITION SCHEME= undefined
##.AVERAGES= 8
##.DIGITISER RES= 18
##SPECTROMETER/DATA SYSTEM= spect
##.PULSE SEQUENCE= zg30
##.SOLVENT NAME= CDCl3
##.SHIFT REFERENCE= (INTERNAL, CDCl3, 0, 15.7039)
##AUDIT TRAIL= $$ (NUMBER, WHEN, WHO, WHERE, WHAT)
$$ ##TITLE= Audit trail, XWIN-NMR		Version 3.5
$$ ##JCAMPDX= 5.01
$$ ##ORIGIN= Bruker BioSpin GmbH
$$ ##OWNER= she
$$ F:/spectra/data/she/nmr/H-F/1/audita.txt
$$ ##AUDIT TRAIL=  $$ (NUMBER, WHEN, WHO, WHERE, WHAT)
(   1,<2019-01-16 16:02:40.35 +0400>,<she>,<DPX200>,
      <created by zg, POWCHK disabled, PULCHK disabled
       configuration hash MD5:
       00 E9 B6 7A A2 85 ED C7 34 08 36 98 17 FE 4E 26
       data hash MD5: 16K
       AB EB B2 60 D4 E7 59 93 CA 55 6C 01 2F A8 D6 F1>)
$$ ##END=
$$ 
$$ hash MD5
$$ 64 CA BE 42 A3 23 50 FB 1B C4 DC 27 15 A7 72 1A
##$RELAX= 
##$RELAX= 
##$RELAX= 
##$RELAX= 
##$RELAX= 
##$RELAX= 
$$ Bruker specific parameters
$$ --------------------------
##$DU= <F:/spectra>
##$EXPNO= 1
##$NAME= <H-F>
##$PROCNO= 1
##$TYPE= <nmr>
##$USER= <she>
##$AMP= (0..31)
100 100 100 100 100 100 100 100 100 100 100 100 100 100 100 100 100 100 
100 100 100 100 100 100 100 100 100 100 100 100 100 100 
##$AQSEQ= 0
##$AQ_mod= 1
##$AUNM= <au_zg>
##$AUTOPOS= <>
##$BF1= 200.13
##$BF2= 200.13
##$BF3= 200.13
##$BF4= 200.13
##$BF5= 200.13
##$BF6= 200.13
##$BF7= 200.13
##$BF8= 200.13
##$BYTORDA= 1
##$CFDGTYP= 0
##$CFRGTYP= 5
##$CHEMSTR= <none>
##$CNST= (0..31)
1 1 145 1 1 1 1 1 1 1 1 1 1 1 1 1 1 1 1 1 1 1 1 1 1 1 1 1 1 1 1 1 
##$CPDPRG= <>
##$CPDPRG1= <>
##$CPDPRG2= <>
##$CPDPRG3= <>
##$CPDPRG4= <mlev>
##$CPDPRG5= <mlev>
##$CPDPRG6= <mlev>
##$CPDPRG7= <mlev>
##$CPDPRG8= <mlev>
##$CPDPRGB= <>
##$CPDPRGT= <>
##$D= (0..31)
0 1.2 0 0 0 0 0 0 0 0 0 0.03 0 0 0 0 0 0 0 0 0 0 0 0 0 0 0 0 0 0 0 0 
##$DATE= 1547640159
##$DBL= (0..7)
120 120 120 120 120 120 120 120 
##$DBP= (0..7)
150 150 150 150 150 150 150 150 
##$DBP07= 0
##$DBPNAM0= <>
##$DBPNAM1= <>
##$DBPNAM2= <>
##$DBPNAM3= <>
##$DBPNAM4= <>
##$DBPNAM5= <>
##$DBPNAM6= <>
##$DBPNAM7= <>
##$DBPOAL= (0..7)
0.5 0.5 0.5 0.5 0.5 0.5 0.5 0.5 
##$DBPOFFS= (0..7)
0 0 0 0 0 0 0 0 
##$DE= 6
##$DECBNUC= <off>
##$DECIM= 32
##$DECNUC= <off>
##$DECSTAT= 4
##$DIGMOD= 1
##$DIGTYP= 9
##$DL= (0..7)
0 120 120 120 120 120 120 120 
##$DP= (0..7)
150 150 150 150 150 150 150 150 
##$DP07= 0
##$DPNAME0= <>
##$DPNAME1= <>
##$DPNAME2= <>
##$DPNAME3= <>
##$DPNAME4= <>
##$DPNAME5= <>
##$DPNAME6= <>
##$DPNAME7= <>
##$DPOAL= (0..7)
0.5 0.5 0.5 0.5 0.5 0.5 0.5 0.5 
##$DPOFFS= (0..7)
0 0 0 0 0 0 0 0 
##$DQDMODE= 0
##$DR= 18
##$DS= 0
##$DSLIST= <SSSSSSSSSSSSSSS>
##$DSPFIRM= 0
$$ [...]
##$SUBNAM2= <"">
##$SUBNAM3= <"">
##$SUBNAM4= <"">
##$SUBNAM5= <"">
##$SUBNAM6= <"">
##$SUBNAM7= <"">
##$SUBNAM8= <"">
##$SUBNAM9= <"">
##$SW= 20.0189088683792
##$SWIBOX= (0..15)
0 0 2 0 0 0 0 0 0 0 0 0 0 0 0 0 
##$SW_h= 4006.41025641026
##$TD= 16384
##$TD0= 1
##$TE= 0
##$TE2= 300
##$TE3= 300
##$TEG= 300
##$TL= (0..7)
0 120 120 120 120 120 120 120 
##$TP= (0..7)
150 150 150 150 150 150 150 150 
##$TP07= 0
##$TPNAME0= <>
##$TPNAME1= <>
##$TPNAME2= <>
##$TPNAME3= <>
##$TPNAME4= <>
##$TPNAME5= <>
##$TPNAME6= <>
##$TPNAME7= <>
##$TPOAL= (0..7)
0.5 0.5 0.5 0.5 0.5 0.5 0.5 0.5 
##$TPOFFS= (0..7)
0 0 0 0 0 0 0 0 
##$TUNHIN= 0
##$TUNHOUT= 0
##$TUNXOUT= 0
##$USERA1= <user>
##$USERA2= <user>
##$USERA3= <user>
##$USERA4= <user>
##$USERA5= <user>
##$V9= 5
##$VALIST= <valist>
##$VCLIST= <CCCCCCCCCCCCCCC>
##$VD= 0
##$VDLIST= <DDDDDDDDDDDDDDD>
##$VPLIST= <PPPPPPPPPPPPPPP>
##$VTLIST= <TTTTTTTTTTTTTTT>
##$WBST= 1024
##$WBSW= 4
##$XGAIN= (0..3)
0 0 0 0 
##$XL= 0
##$YL= 0
##$YMAX_a= 810535
##$YMIN_a= -906247
##$ZGOPTNS= <>
##$ZL1= 120
##$ZL2= 120
##$ZL3= 120
##$ZL4= 120
##$ABSF1= 10
##$ABSF2= 0
##$ABSG= 5
##$ABSL= 3
##$ALPHA= 0
##$AQORDER= 0
##$ASSFAC= 0
##$ASSFACI= 0
##$ASSFACX= 0
##$ASSWID= 0
##$AUNMP= <proc_1d>
##$AZFE= 0.1
##$AZFW= 0.1
##$BCFW= 1
##$BC_mod= 2
##$BYTORDP= 1
##$COROFFS= 0
##$CY= 11.3945322036743
##$DATMOD= 1
##$DC= 2
##$DFILT= <>
##$DTYPP= 0
##$F1P= 18.9103706918063
##$F2P= -1.10871071338519
##$FCOR= 0.5
##$FTSIZE= 0
##$FT_mod= 4
##$GAMMA= 1
##$GB= 0.15
##$INTBC= 1
##$INTSCL= 1
##$ISEN= 128
##$LB= 0.24
##$LEV0= 0
##$LPBIN= 0
##$MAXI= 10000
##$MC2= 0
##$MEAN= 0
##$ME_mod= 0
##$MI= 1.114404
##$NCOEF= 0
##$NC_proc= 0
##$NLEV= 6
##$NOISF1= 3.799351
##$NOISF2= 2.8
##$NSP= 1
##$NTH_PI= 0
##$NZP= 0
##$OFFSET= 15.70392
##$PC= 1
##$PHC0= -9058.194
##$PHC1= 11.40004
##$PH_mod= 1
##$PKNL= yes
##$PPARMOD= 0
##$PSCAL= 0
##$PSIGN= 0
##$REVERSE= no
##$SF= 200.130013532006
##$SI= 16384
##$SIGF1= 3
##$SIGF2= 2
##$SINO= 400
##$SIOLD= 16384
##$SREGLST= <1H.CDCl3>
##$SSB= 0
##$STSI= 0
##$STSR= 0
##$SW_p= 3612.71676300578
##$SYMM= 0
##$S_DEV= 0
##$TDeff= 0
##$TDoff= 0
##$TI= <>
##$TILT= no
##$TM1= 0
##$TM2= 0
##$TOPLEV= 0
##$USERP1= <user>
##$USERP2= <user>
##$USERP3= <user>
##$USERP4= <user>
##$USERP5= <user>
##$WDW= 1
##$XDIM= 8192
##$YMAX_p= 0
##$YMIN_p= 0
$$ End of Bruker specific parameters
$$ ---------------------------------
##NTUPLES= NMR FID
##VAR_NAME=  TIME,          FID/REAL,        FID/IMAG
##SYMBOL=    X,             R,               I
##VAR_TYPE=  INDEPENDENT,   DEPENDENT,       DEPENDENT
##VAR_FORM=  AFFN,          ASDF,            ASDF
##VAR_DIM=   8192,          8192,            8192
##UNITS=     SECONDS,       ARBITRARY UNITS, ARBITRARY UNITS
##FACTOR=    0.0002496,     1,               1
##FIRST=     0,             0,               0
##LAST=      2.0444736,     0,               0
##MIN=       0,             -906247,         0
##MAX=       2.0444736,     810535,          0
$$ Real data points
##PAGE= N=1
##DATA TABLE= (X++(R..R)), XYDATA
0@%%%%%%%%%QqQj6J6k4L2m0M8n6P2q8J12j36J60j86K12k50K89l35L88m42N06n74
$$ 0 0 0 0 0 0 0 0 0 0 8 0 8 -8 8 -16 16 -24 24 -32 40 -48 64 -72 88 -98 114 -136 153 -182 206 -236 270 -304
33c04O52p38Q31r38J051j177J314j463J628j806K005k218K453k709K985l294L629
$$ -304 348 -390 441 -497 554 -623 691 -772 856 -950 1055 -1163 1290 -1419 1566 -1728 1901
50A901l996M402m853N352n907O535p240Q051q991J0085j1389J2968j4939J7467
$$ 1901 -2095 2307 -2546 2806 -3101 3434 -3806 4245 -4746 5339 -6050 6918 -8021 9446
64I446k0842K5625l2977M5872p5075K64445l3601n44194k30135j20294R2603J71189
$$ 9446 -11396 14229 -18748 27124 -47951 216494 182893 -361301 -591436 -711730 -619127 -447938
76d47938L37232L82698L75382J63161r7538l60729m19097l45805j87528p4971
$$ -447938 -110706 271992 647374 810535 712997 352268 -66829 -412634 -600162 -675133
86f75133P3337K41775M04119M12186K67458R475k16079l46621l46676k81958j77339
$$ -675133 -601796 -360021 44098 456284 723742 733217 517138 170517 -176159 -458117 -635456
97f35456m1548J57601L50063M27675L24324J15720r5137k36949l13998l25692
$$ -635456 -677004 -519403 -169340 258335 582659 698379 603242 366293 52295 -273397
107b73397k69820j32784O5345K66974L81587L54991K08792K7405j29720k50033
$$ -273397 -543217 -676001 -610656 -343682 37905 392896 601688 629093 499373 249340
117B49340l26827l25610k18683k8089J74675L14615L47810K79143J41178k2234
$$ 249340 -77487 -403097 -621780 -649869 -475194 -160579 187231 466374 607552 585318
127E85318j77258k96281l40916k78391j22752O8365K27159L12079L10824K27197
$$ 585318 408060 111779 -229137 -507528 -630280 -561915 -334756 -22677 288147 515344
137E15344Q1626q9097k37113l18226l06351k04029m1454J29477K58019L13491
$$ 515344 596970 507873 270760 -47466 -353817 -557846 -599300 -469823 -211804 101687
147A01687K82344J71976J0392j52327k68822l07185k59316j38059K4397J80862
$$ 101687 384031 556007 566399 414072 145250 -161935 -421251 -559310 -534913 -354051
157c54051K83162L00714K32126R8871n9262j98890k83690k89117k11625p0028
$$ -354051 -70889 229825 461951 560822 501560 302670 18980 -270137 -481762 -551790
167e51790R2413K24601K87299K67298J75410L6361j14925k35704k87512k55082
$$ -551790 -459377 -234776 52523 319821 495231 531592 416667 180963 -106549 -361631
177c61631j48128Q35J46538K48171K79337K32278J18826k9605j71021k61388k72751
$$ -361631 -509759 -508924 -362386 -114215 165122 397400 516226 486621 315600 54212 -218539
188b18539k06282q4715N9217J88211K65408K66450J86150M9561r7468k09367k60207
$$ -218539 -424821 -509536 -450319 -262108 3300 269750 455900 505461 407993 198626 -61581
199f1581k41740j58970k9575J15298K30614K73298K29556J19964j6945j39870
$$ -61581 -303321 -462291 -491866 -376568 -145954 127344 356900 476864 459919 320049
209C20049k23733k52791k16044j11973L4071J73753K53415K48312J72546N9180
$$ 320049 96316 -156475 -372519 -484492 -450421 -276668 -23253 225059 397605 456785
219D56785n9690j67215k39432k49325j78671m1952J07013K10254K40005K04878
$$ 456785 397095 229880 -9552 -258877 -437548 -479500 -372487 -162233 77772 282650
229B82650J27173K2443r5794k02494k54820k19641j07422L4377J49525K08312
$$ 282650 409823 432266 336472 133978 -120842 -340483 -447905 -413528 -264003 -55691
239e5691K13090J75253R5407k2131j51353k37606k40648j59145l5362P8937J58420
$$ -55691 157399 332652 428059 405928 254575 16969 -223679 -382824 -418186 -339249 -180829
250a80829K00583K04363J55970M7740r0116j99937k34890j89829r6615O869R9221
$$ -180829 19754 224117 380087 427827 337711 137774 -97116 -286945 -383560 -376691 -277470
261b77470J71956K12174J95835J10075k2373j46793k11098k03028j45242o2724
$$ -277470 -105514 106660 302495 412570 390197 243404 32306 -170722 -315964 -378688
271c78688L1371J27637K00825K17150J59424M3586q2238j68530j96079j75305
$$ -378688 -347317 -219680 -18855 198295 357719 401305 319067 150537 -45542 -220847
281b20847j20509l5189P2036J70837K17737J89632J00577j2747j10696j71275
$$ -220847 -341356 -376545 -304509 -133672 84065 273697 374274 361527 250831 79556
291G9556j87499j61584r4316R066J21569J96348K02802J42638N0291m5846j27156
$$ 79556 -107943 -269527 -363843 -354777 -233208 -36860 165942 308580 358871 313025 185869
302A85869j79035j86862j40470m7653O4876J56407J93649J70647J03876J6616
$$ 185869 6834 -180028 -320498 -368151 -303275 -146868 46781 217428 321304 337920
312C37920p4067j51143j89955j70071r4650Q536J04995J66731J79141J43482P1695
$$ 337920 263853 112710 -77245 -247316 -341966 -333430 -228435 -61704 117437 260919 332614
323C32614j9265j10675j74321j83264j33251m4505M9415J25301J67831J67432
$$ 332614 313349 202674 28353 -154911 -288162 -332667 -283252 -157951 9880 177312
333A77312J18540L3247o4895j43021j76692j56487r2622o820P8379J43512J71652
$$ 177312 295852 329099 264204 121183 -55509 -211996 -304618 -311438 -233059 -89547 82105
344H2105J51482Q1940j2786j01189j55371j64147j28685n9893K4095J05510J58869
$$ 82105 233587 315527 302741 201552 46181 -117966 -246651 -306544 -282449 -176939 -18070
355a8070J66164J20624L8300n1107j20645j54748j48809j04232k8010O0007J31772
$$ -18070 148094 268718 307018 255911 135266 -19482 -168291 -272523 -300533 -240526 -108754
366a08754J63163J44650Q3990K751p6501j32893j53276j32481p3646Q567R0730
$$ -108754 54409 199059 283049 285800 209299 76406 -76870 -209351 -282997 -274430 -183700
377a83700J44224J52855J16810N0365k8034r8467j41392j45954j08622l8290M3874
$$ -183700 -39476 113379 230189 280554 252520 154053 12661 -133293 -241915 -280205 -236331
388b36331J12516J46481J37433Q9796J8197n7084j16519j43396j30601p9444m761
$$ -236331 -123815 22666 160099 249895 268092 211008 94489 -48907 -179508 -258952 -263713
399b63713P3438J28810J44224J16827N8529j3815q1021j27722j40097j11986m7867
$$ -263713 -190275 -61465 82759 199586 258115 244300 163279 35557 -104540 -216526 -264393
410b64393L0726R9753J36106J31232R0643K8823l9328j00394j36681j32877q6423
$$ -264393 -233667 -133914 2192 133424 224067 252890 213562 113168 -23513 -156390 -242813
421b42813j1458O3460J15367J31082J13267O9003M486o4716j21361j40549j12795
$$ -242813 -254271 -190811 -75444 55638 168905 237908 242394 177678 56317 -84232 -197027
432a97027m9878K2708Q2698J17133J23949R9805M5785k6408r4797j32322j25660
$$ -197027 -246905 -224197 -141499 -24366 99583 199388 245173 218765 123968 -8354 -134014
443a34014q1192j8394M2949R2866J21879J19584Q0633J2293o0804j11225j24124
$$ -134014 -215206 -233600 -190651 -97785 24094 143678 224311 236604 175800 64575 -59549
454e9549j01335n6469J083O0998J08725J26618J03236M5140k4044q0344j09889
$$ -59549 -160884 -217353 -216270 -155272 -46547 80071 183307 228447 204403 124059 14170
465A4170j11840q7102l7409K6489Q7428J20460J13999P2066J3857m2496q7202
$$ 14170 -97670 -184772 -222181 -195692 -108264 12196 126195 198261 212118 169622 82420
476H2420j10602j07692p0993p938N9382J03905J12839R0169M8944k236n6802j02119
$$ 82420 -28182 -135874 -206867 -214805 -155423 -51518 61321 151490 200434 198198 141396 39277
488C9277j18683r4841l8468K7264P6976J00374R9958P8888L6385k3421q2856j16793
$$ 39277 -79406 -174247 -212715 -185451 -108475 -8101 91857 170745 207130 183709 100853 -15940
500a5940j08357o3959o914M2297P8483R9166R9378P0623J0861n6717j03254j09638
$$ -15940 -124297 -188256 -195170 -152873 -74390 24776 124154 194777 205638 148921 45667 -63971
512f3971q1720l9060N341M8747Q9239J10127R4404M1447k6505p9043r8894r0461
$$ -63971 -145691 -184751 -179410 -130663 -41424 68703 163107 204554 178049 99006 112 -90349
524i0349o5919l0013J7584P0159J07791J07096O6323M407m8532p9288q9122q3961
$$ -90349 -156268 -186281 -168697 -98538 9253 116349 182672 187079 138547 59259 -29863 -113824
536a13824n9819j3403M6464R4529J08846Q2521L3946j5549n4091q1271r3364q1640
$$ -113824 -173643 -187046 -140582 -46053 62793 145314 179260 163711 109620 28349 -65015 -146655
548a46655m0690J9013P3103R9009R1174O0228J7543k6327o6180r2737r3261o3046
$$ -146655 -187345 -168332 -95229 3780 94954 155182 172725 146398 80218 -12519 -105780 -168826
560a68826r721M4508Q1615R2248P8414M7167K426m4934q2780r5582p8213l8063
$$ -168826 -178547 -134039 -52424 39824 118238 165405 167831 122897 40117 -55465 -133678 -171741
572a71741J1974N6384Q5008Q9594O9735K9340j9878o3080q7458q5700o1778k0459
$$ -171741 -159767 -103383 -18375 71219 140954 170294 150416 87336 -122 -85822 -147600 -168059
584a68059K8237O9491R0103Q2546N1100P054l6668p0148q5817p8617m7821j529
$$ -168059 -139822 -70331 19772 102318 153418 160472 123804 53656 -32161 -110778 -158599 -160128
596a60128M8177Q0554Q5953O6015L2125p463m6280p6957q7454o9182k6439K3571
$$ -160128 -111951 -31397 54556 120571 152696 145233 98953 21996 -65458 -134640 -161079 -137508
608a37508O2067P9333P4217N3464K0611k0523o2636q6815q1478m7917j239L8913
$$ -137508 -75441 3892 78109 131573 152184 131661 69025 -17790 -99268 -147185 -148424 -109511
620a09511O5351P4950O9000M5551M423m2425p7922q5118o3485k5911J3271M5057
$$ -109511 -44160 30790 99790 145341 149764 107339 29417 -55701 -119186 -145097 -131826 -86769
632h6769O8971P7592O4964K8471k0309o1212q0068p2802m7801j3314K3192N7056
$$ -86769 -17798 59794 124758 153229 132920 71708 -8360 -81162 -128963 -142277 -119085 -62029
644f2029P7944P6651M8445M181l8905o7100p4326o3827l8174j028L9455P0207
$$ -62029 15915 92566 141011 145192 106287 39187 -35139 -98966 -137140 -138168 -98713 -28506
656b8506P9617O2418K7427j3174m6926o8843p2907n7541k3566J9407N5470P3383
$$ -28506 51111 113529 140956 127782 80856 12013 -60894 -118435 -142001 -122594 -67124 6259
668F259O9217M7467J3399k4123n7077p4156o9221m1593k117L5332N9934O9048
$$ 6259 75476 122943 136342 112219 55142 -19014 -88235 -129828 -131945 -96613 -36679 32369
680C2369O0691L6226j11l9815o7827p3296n4370k1762J2567M2214O1818O8124
$$ 32369 93060 129286 129175 89360 21533 -51763 -106133 -127895 -115328 -73114 -11296 56828
692E6828N5205K1906k0466n5659o9694o1669l9197r645K0847N0220O8996O6969
$$ 56828 112033 133939 113473 57814 -11880 -73549 -112746 -122391 -101544 -51324 17672 84641
704H4641M0648j33l7833n9910o2756n1663l0304j335L3223O3085P2323N5281J9688
$$ 84641 125289 125156 87323 27413 -35343 -87006 -117310 -118645 -85422 -22337 49986 105267 124955
717A24955j7727m4194n7263n8697m8170k3070J4182N0618P0010O3763L7013L865
$$ 124955 107228 63034 5771 -52926 -101096 -124166 -109984 -59366 10644 74407 111420 115285
729A15285k5065m6032n9032n9418m1271o060L3664O0716O4840M9453K3593m054
$$ 115285 90220 44188 -14844 -74262 -115533 -121593 -87929 -27213 37627 87080 110673 106619
741A06619l0770n3184o3972n4229k4699J4126M5929N9522N5882L9988J5800j3126
$$ 106619 75849 22665 -41307 -95536 -120235 -106109 -60180 -658 55224 95212 111012 97886
753I7886m2314o1465o1482m0116n184K7883M9443N6578N0377L2500M752k7700
$$ 97886 55572 -5893 -67375 -107491 -112675 -84792 -35349 21229 71606 104106 108858 81158
765H1158n3786o2705n0556k3318Q854L5211N1817N5998M5840K1216j1048m1103
$$ 81158 27372 -35333 -85889 -109207 -100353 -65142 -13325 42673 88513 109729 98681 57578
777E7578n8261n6331l8327j0942J8239M2878N5637N3833L5417O493k4861m8543
$$ 57578 -683 -57014 -95341 -106283 -88044 -45166 10471 64304 99721 106214 81353 32810
789C2810n6953m9321k8099N36K9123M9602N6173M6216K2929o611l4335n1548n4632
$$ 32810 -24143 -73464 -101563 -101027 -71904 -22302 33871 80087 103016 96405 62070 10522 -44110
802d4110m1693j6702J3013L8415N2137N1357L6581J1863j7626m1908n3609m9786
$$ -44110 -85803 -102505 -89492 -51077 1060 52417 88998 100861 83235 41327 -12282 -62068
814f2068l0928l828K3510M3264N1673M5906K7034k89k8310m7911n1796m0983j9183
$$ -62068 -92996 -96824 -73314 -30050 21623 67529 94563 94274 65964 18053 -33743 -74726 -93909
827i3909P061L1061M6646N0455L8892J5245j3743l7319m8735m6275l1880r527
$$ -93909 -86848 -55787 -9141 41314 80206 95451 81708 44389 -4346 -50621 -82501 -92028
839i2028J6464L8860N0393M6115K7934J781k2972m1575m7691m2048k4193J781
$$ -92028 -75564 -36704 13689 59804 87738 89519 66547 24972 -22719 -64767 -88960 -87179
851h7179K7409M5281M8429L7906J6881p817k9918m4766m7822l6040j2855J4656
$$ -87179 -59770 -14489 33940 71846 88727 80910 50992 6226 -41596 -77636 -90491 -75835
863g5835L5849M5669M3321K9915R054j6232l8130m8828m3604k5081j26K2680L8330
$$ -75835 -39986 5683 49004 78919 87973 71741 33611 -15217 -58821 -83902 -84028 -61348 -23018
876b3018M4827M0182K3628j914k8105m4017m6269l3916j3780P895K7212M1373
$$ -23018 21809 61991 85619 83705 55600 11583 -34686 -68602 -82382 -74487 -47275 -5902
888e902M5247L5087J2098j5481l6458m3175l8239k5623p628J4104L4629M6216
$$ -5902 39345 74432 86530 71049 34591 -8584 -46823 -72446 -80074 -65970 -31341 14875
900A4875M2228K2742k346k4107l6721l9407l4261k0599R48K5329M2733M4738L0799
$$ 14875 57103 79845 77499 53392 16671 -22736 -56997 -77596 -76648 -51319 -8586 36152 66951
913F6951R700j1011k6584l7106l9566l0897j1495J4314L5270M2575L6308K0612
$$ 66951 76651 65640 39056 1950 -37616 -68513 -80008 -65694 -30424 12151 48459 69071
925F9071K938j4866l1250m1106l8272k2106K504K4068L6916L7748K9885J5973
$$ 69071 72009 57143 25893 -15213 -53485 -75591 -73087 -49019 -12103 25645 55530 71503
937G1503k523k2823l8351m1805l0116r564J1642K7499L5761L5722K6698R533j2878
$$ 71503 68980 46157 7806 -33999 -64115 -73679 -62037 -34538 1223 36945 63643 73176 60298
950F0298l1241m0228l4620k0186j846J5727L0203L7071L4406J9591j614k1836
$$ 60298 29057 -11171 -45791 -65977 -67823 -52096 -21893 15178 49584 69175 67561 45725
962D5725l4102l5905k8728j4505M684K2052L4940L7060K7420R223j0555k5835
$$ 45725 11623 -24282 -53010 -67515 -62831 -40779 -5839 31221 58641 67864 57309 31474
974C1474l3778l3365k4263p053J3083K9204L6018L1626J8991J362j5991k9521
$$ 31474 -2304 -35669 -59932 -66985 -53902 -24698 11320 42946 61937 63299 47308 17787
986A7787l5107l0520j6467K939K0760L1427L3763K6779J2750n693k3491l3267
$$ 17787 -17320 -47840 -64307 -61368 -40608 -9181 24582 51361 64111 58418 34927 1660
998A660l3292k4286p158J0101K4921L2673L2134K1835M157j4538k8396l2693k8560
$$ 1660 -31632 -55918 -63076 -52975 -28054 4619 36753 58588 62745 48207 19811 -12882 -41442
1011d1442j7059j530J5942K9447L4246K8203J2765m771k0039k8859l0221k5253
$$ -41442 -58501 -60031 -44089 -14642 19604 47807 60572 55801 35762 6903 -23318 -48571
1023d8571j2476O152K3380L3075L0719J9545M730r365k1980k9598l0262k1194
$$ -48571 -61047 -54895 -31515 1560 32279 51824 56554 47189 25209 -4389 -34651 -55845
1035e5845l036J5560K8330K9794K3691J3380R61j2856k6174l2502k7287j1559
$$ -55845 -58881 -43321 -14991 14803 38494 51874 52835 39979 13805 -18697 -45984 -57543
1047e7543P776K0945K5578K5413K0445J1309l951k0969l1641l0390j7429q34J2221
$$ -57543 -49767 -28822 -3244 22169 42614 53923 49972 29003 -2638 -33028 -50457 -51291 -39070
1060c9070K0073K4179K5389J9784M702j4285k8266l0268k1436q884K507J2193
$$ -39070 -18997 5182 30571 50355 55057 40772 12506 -17762 -39198 -48082 -45575 -33382
1072c3382K1618K7863K6185J3116o894k2355k7613k3304j5703p227L717J6946
$$ -33382 -11764 16099 42284 55400 48506 26151 -1462 -24766 -40469 -47696 -43979 -27033
1084b7033K7648K9581J9250J981j4223k2670k3176k0710j5456m686J0363K4595
$$ -27033 615 30196 49446 51427 37204 14534 -8642 -29352 -44808 -49494 -39131 -14536
1096a4536L0251K3646R120n064j4908k0778k3460k1253j1849L019J8722K7270
$$ -14536 15715 39361 48481 43417 28509 7731 -15729 -36982 -48831 -45812 -27090 180
1108A80K5160J5915L835p311j6321k3210k4363j7613m188J1435K2683K4719K0028
$$ 180 25340 41255 45090 37779 21458 -1752 -26115 -43728 -47916 -36481 -13798 10921 30949
1121C0949J0893R87j0679k0733k5232k1369j0233M159J5859K1740K2433J6919
$$ 30949 41842 42829 32150 11417 -13815 -35184 -45417 -41258 -25399 -3659 18774 35693
1133C5693P821m743j6329k3455k3002j5295l752Q652J7663K2460K0528J3620K029
$$ 35693 43514 38771 22442 -1013 -24015 -39310 -43062 -34410 -16747 5713 26241 39861 41890
1146D1890j0036j9688k3003j9413j0465J305J2212J9933K2402J7687P857l264
$$ 41890 31854 12166 -10837 -30250 -40715 -39410 -27198 -7265 15137 32824 40681 37417
1158C7417j4245k0615k1154j6283n831N942J5951K0869K0360J3321L765p698j6750
$$ 37417 23172 2557 -18597 -34880 -40711 -34769 -18818 2051 22411 35732 39497 31799 15049
1171A5049k0900j9511j2086q99J0344J7809K0226J7497R547q41j1247j8429k0950
$$ 15049 -5851 -25362 -37448 -38347 -28003 -10194 10032 27529 37076 36235 24988 6559 -14391
1184a4391j5940o938L769J3158J8330J9238J4590N268n307j5017j9386j8177j2253
$$ -14391 -30331 -37269 -33500 -20342 -2012 17226 31816 37084 31777 16760 -2626 -20803 -33056
1197c3056k564P166J5324J9355J7607J0525K22r524j6691j8516j6001q454J203
$$ -33056 -35620 -28454 -13130 6225 23832 34357 34579 25055 8364 -10152 -26153 -34607 -33404
1210c3404J1406J7476J8776J4559N860m079j2541j7248j8049j3276m530O408J4430
$$ -33404 -21998 -4522 14254 28813 34673 30594 18053 805 -17244 -30520 -35050 -28642 -14212
1223a4212J8491J6217J0404K113o707j4617j8502j7131r333Q70J0324J5772J6647
$$ -14212 4279 20496 30900 33013 26306 11689 -6813 -23944 -33277 -32407 -22083 -6311 10336
1236A0336J4032P748o50j0653j7114j8658j3458l978N285J1874J4949J5440J2454
$$ 10336 24368 32116 31466 20813 3699 -14959 -28417 -32395 -27110 -15236 -287 15153 27607
1249B7607N156n167j4866j7808j5478q298J19O844J1590J5605J5603J0064k41
$$ 27607 32763 27596 12730 -5078 -20556 -28854 -28735 -21891 -10301 5304 20907 30971 30730
1262C0730j0546j6450j5588j0735m946J250P903J4323J7066J3382M311o035j2957
$$ 30730 20184 3734 -11854 -22589 -27535 -26285 -18382 -4059 13007 26389 30700 24665 11708
1275A1708j4536j1744r312m063L727J1736J6984J5677P852j661q120j1588j2560
$$ 11708 -2828 -14572 -23884 -27947 -24220 -12484 4500 20177 28029 26368 18248 6660 -5900
1288e900j2512q426j314Q748J5515J6170J0914L076l782p826j1802j3758j2433
$$ -5900 -18412 -26838 -28152 -19404 -3889 12281 23195 26271 22489 14663 2861 -10897 -23330
1301b3330n461M488J2480J5086J2387P047J981l726j0020j4016j4488r099K14
$$ -23330 -28791 -24303 -11823 3263 15650 22697 24678 20952 10932 -3084 -17572 -26671 -26457
1314b6457Q357J2618J2736J0443O502M39o871j2915j5113j1259l894L175R135
$$ -26457 -18100 -5482 7254 17697 24199 24638 17767 4852 -10261 -21520 -25414 -22239 -13104
1327a3104J1821J2089J0266M381l535j0222j4017j2401p666j209M952J0051J2313
$$ -13104 -1283 10806 21072 25453 21918 11696 -2321 -14722 -22388 -23597 -18645 -8594 3719
1340C719J1936P622M42o948j1660j2410j0416m947Q96O959J1566J2837R978L653
$$ 3719 15655 23277 23719 16771 5111 -7299 -17715 -22662 -21766 -14807 -3241 9596 19574 23227
1354B3227k732q894j1531j1556q546l250M252R701J2190J1062O856J087m934r617
$$ 23227 20495 11601 70 -11486 -20032 -23282 -19030 -9329 2861 13923 20779 21866 16932 7315
1368G315j2095j0735o144K12O793J0470J1285R540M941j234o982j1057j1649q610
$$ 7315 -4780 -15515 -21659 -21447 -14654 -4184 7101 16641 21582 20348 13366 2309 -9340 -17950
1382a7950l395K888P663J0622J0742Q031K651l736r128j1130r911o389j032M470
$$ -17950 -21345 -18457 -10794 -172 10570 18601 21252 17516 8388 -2742 -12653 -19042 -20074 -15604
1396a5604Q777J1103R596N605j9o235r000j0342q731m524P97O711R768J0527P491
$$ -15604 -6827 4276 13872 19477 19458 13223 4223 -6119 -14850 -19374 -18577 -11866 -2098 8429 15920
1411A5920L114k038o842j0060r917p363k032L656P930J0103Q848N601J487m053
$$ 15920 19034 16996 10154 94 -9823 -17186 -19218 -15562 -7632 2471 11319 16920 18407 14354
1425A4354q242j0368r102m737P41N325Q261R539P645M857r11o146r978r784o523
$$ 14354 6112 -4256 -13358 -18095 -17354 -12029 -3768 5771 13416 18273 17362 11216 1238 -8546 -15069
1440a5069k349K105N846R028R514P659J757l853q178r268p965n114j212L321P742
$$ -15069 -17418 -15313 -9467 -439 9075 16734 18491 14638 6460 -2808 -10773 -15887 -17099 -13778 -6036
1455f036R887R042M606j230n437p713q268p174m686L61N980R264R577O290J801
$$ -6036 3851 12893 17499 16269 10832 3119 -5149 -12323 -17009 -16648 -10668 -1404 8173 14463 16264
1470A6264k649n591p439q690o617k587L608P733Q938P039M036P24k756o561q522
$$ 16264 13615 8024 585 -8105 -14722 -17309 -13701 -5968 2970 10009 14045 14769 12013 5452 -3070
1485c070q582m429J129N461P219P593N766L358j80m545q202r172n973j139K801
$$ -3070 -11652 -16081 -14952 -9491 -2272 5321 11087 14445 14265 9720 1518 -7654 -13627 -14766 -11965
1500a1965N387O565P175N865K461k783p168q606o873l716L83L017N321P622P647
$$ -11965 -6578 -13 7162 13027 15488 12705 5537 -3069 -9942 -13658 -13275 -10258 -4937 2685 10332
1515A0332M510m97m845p594p259n046k816J79L839P253Q244O199J637k324n739
$$ 10332 14842 14345 9500 1906 -5353 -10399 -13215 -13036 -9197 -1944 6300 12499 14136 11812 6073
1530F073o360o377n116k068J771N966Q015O999L954k84k862n426o742o303m402
$$ 6073 -287 -6664 -11780 -13848 -12077 -6111 1904 8903 12857 12573 9711 4285 -2457 -8760 -13162
1545a3162m13M220O922P168N298K122m73l738o180p050n626k209J550N742O444
$$ -13162 -13575 -9355 -2433 4735 10033 12155 11682 7944 1764 -5286 -10912 -13121 -11571 -5829 615
1560F15O140M011J346j829m897o626o735l611p67L380N571O330N684L156p7l585
$$ 615 6755 10766 12112 10283 5386 -1240 -7975 -11586 -12353 -8973 -3402 2928 8612 11768 11691 8106
1576H106n846o807n131k162R84M244O217N673M770J737j448m589o313o083m311
$$ 8106 2260 -4547 -9678 -11840 -10856 -6612 -395 5278 10048 11785 10337 5748 -565 -6648 -10959
1591a0959p46K543M824N884N781L385N74k848m836o375n570k685N51L313N101
$$ -10959 -11705 -9162 -4338 1546 7327 10712 11286 8438 3602 -2773 -8343 -11028 -10477 -7164 -2063
1606b063N500N025K638p36l490o020n956m074j448J635L763N138N485M367J182
$$ -2063 3437 8462 11100 10364 6874 854 -5102 -9176 -10624 -8989 -5226 -88 5397 9764 10946
1621A0946j990m859n583n009k762m89J865M408N622N118K894kl687m948n011m081
$$ 10946 8956 4097 -1486 -6495 -9257 -9746 -7881 -3473 2149 7267 10161 10159 6472 1524 -3487 -7568
1637g568k107M43L061N103N481M497Q31j722l495m552m737l640j355J448M699
$$ -7568 -9675 -9232 -6171 -1068 4413 8910 9741 8019 4524 -28 -4765 -8405 -9760 -8312 -3613
1652c613N043M960K535K82k311m141m772m766k934J22L333M946M847L599K110
$$ -3613 1430 6390 8925 9207 6896 2755 -2017 -6783 -9717 -9595 -6262 -1316 3531 7130 9240
1667I240o50k686m715n648l995j404J803L822M553M335L093J515j186m255n364
$$ 9240 8590 5904 1189 -4459 -8454 -9858 -8055 -4233 320 4655 7748 9263 8077 3822 -1542
1682a542m851k361M09K181L318M423M467K814K86l068m818n032k953j412N08K503
$$ -1542 -6393 -8754 -8345 -6164 -2846 1577 6044 8858 9144 6076 1258 -3774 -6727 -8139 -7631 -5128
1698e128L861M721M151J554j946l797m229l436k527j183J158K943N113M562K199
$$ -5128 -1267 3454 7605 9159 7213 3416 -813 -4249 -6776 -7959 -6801 -3858 1255 5817 8016
1713H016r2k859l331l383l129k843o24K413M751M752L166O27j090k183l303l822
$$ 8016 7924 5065 1734 -1649 -4778 -7621 -8245 -5832 -1081 3671 6837 7464 6374 4191 888 -2934
1729b934l799j620J282L466M675L541J894N54j192k258m226m472k748j68K899
$$ -2934 -6733 -8353 -7071 -3605 1070 4611 6505 7059 5867 3609 -617 -5089 -7837 -8005 -5106
1744e106L713L443K935J750M37j472l782m714l573j508J355K711L308L185K953
$$ -5106 -1393 2050 4985 6735 7172 5700 1918 -2796 -6369 -7877 -6522 -3811 -503 2682 5635
1759E635J790n79k856m517l731k325j45J219K447L514L553K827N50j955l729l664
$$ 5635 7425 6846 3990 -527 -4258 -6583 -6728 -5509 -3062 452 4005 6832 7382 5427 1698 -1966
1775a966l036j280j64J726L238L899L264J636j226k419l522l413k369r78R88K241
$$ -1966 -5002 -6282 -6446 -4720 -1482 2417 5681 7317 6091 3672 150 -3263 -5632 -6610 -5622 -3381
1791c381L847L653K138O2j374k624l622k931j963l16J637L331L567K763J671m39
$$ -3381 466 4119 6257 6319 4945 2321 -1301 -4232 -6195 -6511 -4874 -1543 2024 4787 6458 6019
1807F019j869l400l292k868q21M41K354L215L170K668O26q52k587l347k924j995
$$ 6019 4150 750 -2542 -5410 -6231 -5790 -3436 -221 2949 5617 6243 5391 2804 -543 -3467 -5462
1823e462m13J071K603L222L273J547j3j638k884k950k375j588k04J626L263L437
$$ -5462 -5875 -4804 -2201 1021 4294 5841 5828 4190 1306 -1644 -4019 -5607 -5811 -4185 -922 2515
1839B515K406R18p67j813k942k890k277j127R55K610K914K767J580L69j008k233
$$ 2515 4921 5839 5072 3259 317 -2573 -4850 -5977 -5022 -2412 502 3269 4849 5218 4210 1977
1855A977k634k851j958J79J566K600K522K191J350L01j847k696k767k463p60Q38
$$ 1977 -657 -3508 -5466 -5287 -3721 -1121 1401 3592 4942 5243 3396 700 -2067 -4530 -5290 -4452
1871d452J748K417K781J960J105j013k222k658k755j567n66J228K183K578K795
$$ -4452 -2704 -287 2494 4454 5559 4546 2324 -334 -3089 -4656 -5222 -3994 -1811 767 3562
1886C562J531L8j445k653k652j899j244m09J725K521L035K306N47r94j287k331
$$ 3562 5093 5131 3686 1033 -1619 -3518 -4762 -5171 -3446 -925 2110 4416 4963 3969 2682 351
1902C51k118k348j075O27K383K818K596J037K08r13j503k565k508k118K28J860
$$ 351 -1767 -4115 -5190 -4563 -2180 638 3234 4271 4479 3566 2063 -502 -3010 -5128 -4900 -3040
1918c040K303K282J599J251j18j191k087k960k262n73Q27J971J889K121J513J067
$$ -3040 -737 1545 3144 4395 4277 3086 999 -1961 -4223 -4796 -3969 -1998 -109 2012 3525 4592
1934D592m21k015k694k640r62P2Q81J807J917K263J505K26j327k497k347j492
$$ 4592 4171 2156 -538 -3178 -4140 -4068 -3187 -1380 537 2800 4305 4531 3204 707 -1640 -3132
1950c132q86M40R86J686K507K045R36m75k290k245j574j603o21K03J953K145K448
$$ -3132 -4018 -3578 -2592 -906 1601 3646 4582 4107 1817 -428 -2002 -3605 -4226 -4023 -2070 75 2523
1967B523J645J90j212j998j846j867j077m33P40J860K743J711R89l67j177j713
$$ 2523 4168 4358 3146 1148 -698 -2565 -3642 -4075 -3335 -1475 1268 2979 3968 3601 2424 711
1983G11k196j463j286K42J573K330K228J059N76l77j402j966k109j658l51R78
$$ 711 -1485 -2948 -4234 -3992 -2419 -89 2139 3198 3774 3397 1995 29 -2080 -3738 -4089 -3111
1999c111J648K099J876J173j1q41j693k009j961p88m7J273J886J823J651N79m02
$$ -3111 -1463 636 2512 3685 3674 2833 1140 -869 -2830 -3618 -3665 -2392 -506 1317 2968 3547 3145
2016C145j354j414k345j319m92O81J475J915J821R67M59o87j319j983j926j253
$$ 3145 1791 377 -1968 -3287 -3779 -3098 -1623 292 2113 3080 3539 2852 1533 -450 -2376 -3629
2032c629K35P41J557J954J502J182l6q85k157j980j436o37N25J161J328J897J558
$$ -3629 -3394 -2653 -1096 858 2360 3542 3506 2621 464 -1516 -2952 -3589 -3064 -1903 -575 1322 2880
2049B880Q33m53j578j905j582j091m83O00J147K016J682J316N9j103j570j803
$$ 2880 3713 3260 1682 -223 -1805 -2896 -3379 -2779 -1632 384 2066 3382 3441 2338 768 -1035
2065a035j037p60j86N98J589J949J564O18l82j256j467j648p03q87nJ306J656
$$ -1035 -2072 -2832 -3018 -2420 -831 1118 2682 3300 2918 1662 195 -1453 -2156 -3043 -3048 -1742 -86
2082h6J833J243j32n25j198j167j777j211m46P79J743J610J356R70k45n88r78
$$ -86 1747 2990 2858 2333 1135 -32 -1809 -3020 -3466 -2687 -944 666 2022 2992 2747 2159 1181
2099A181j985j636q93K24J112J650J464J173P02k87q92j589j733j378l38Q49J434
$$ 1181 -804 -2440 -3333 -3109 -1997 -347 1117 2290 2992 2705 1813 224 -1509 -2887 -3225 -2376 -942
2116i42J140J207J196M19o83j313j594j427q64L2P12J275J433J377J018o1p64
$$ -942 198 1405 2601 3020 2337 1024 -570 -1997 -2861 -2829 -2117 -842 591 1968 2986 2925 2161
2133B161j966j473j037k14K9P44J352J852J273J88n49j016j668j209q10m33M67
$$ 2161 195 -1278 -2315 -2529 -2500 -1756 -404 1448 2721 2909 2360 1344 -324 -1533 -2343 -2776 -2309
2150b309J200J474J632N53j75n35j154j407j060p17l9O40J491J546P68N31r1o60
$$ -2309 -1109 365 1997 2550 2375 1840 686 -721 -1781 -2498 -2537 -1897 -406 1140 1908 2439 2348 1688
2168A688j286j574j160n16L06J294J735Q86Q67M82m16j184j486j191r57j20O47
$$ 1688 402 -1172 -2332 -2848 -2542 -1248 487 1373 2240 2722 2306 1122 -364 -1555 -2512 -2632 -1985
2185a985J182J362J255N05K15n04j411j506j107o63J63P55J352J241J226M56k13
$$ -1985 -803 559 1814 2319 2534 2030 619 -887 -1994 -2657 -2494 -1739 -387 854 2080 2536 2323
2202B323r94j266j330q04n83M86R53J162J763N74L13m59j216j490q60r91P6Q42
$$ 2323 1329 63 -1267 -2071 -2654 -2168 -1215 -53 1710 2284 2597 2138 922 -568 -1428 -2419 -2343 -1501
2220a501P75J444J233L69K29j179j175j217p81l22j86J090J228J046J233L26n93
$$ -1501 -726 718 1951 2320 2549 1370 195 -1022 -1803 -2125 -2311 -1221 7 1053 2286 2612 2019
2237B019q63j260j282p90J24J48J147J014J313P99o8o60j215j132j083l14j20
$$ 2019 1156 -104 -1386 -2176 -2052 -1904 -757 257 1570 2369 2301 1641 426 -706 -1789 -2103 -2223
2254b223N96J174J184J380J54j30j250q25r83p86n96l4J136J376J362N30J86n81
$$ -2223 -1627 -453 731 2111 2265 2135 885 60 -923 -1709 -2305 -2339 -1203 173 1535 2065 2251 1670
2272A670p94j218r58o56p39R35J402R44P10P28r2k22j093j160j080o51KJ233J028
$$ 1670 876 -342 -1300 -1956 -2695 -1760 -358 586 1296 2024 1932 1710 617 -543 -1623 -2274 -2272 -1039 -11
2291a1R45O37N53k67k22j818j329m35m4M54O35J107J035R32J06o44o77j511j083
$$ -11 934 1571 2124 1857 1635 -183 -1512 -1947 -1991 -1537 -902 205 1240 2172 2278 1634 957 -554 -1637
2310a637m80o0P77R63J241Q06O38j1j139j205q69p27n2j43P39J234R12R81J95
$$ -1637 -2117 -2177 -1400 -437 804 1610 2248 2237 1098 -107 -976 -1703 -1755 -1898 -1159 75 987 1968 2163
2329B163k94r92j124q58o78l58M10R39J208Q35Q44j14o94q03j036j234m01K40
$$ 2163 1869 877 -247 -1105 -1783 -2141 -1731 -792 416 1251 2095 1981 1287 484 -552 -1786 -2187 -1947
2347a947P40J004J138O74L44j93l41j244j275j003j17L73R78R78J093N99J26k59
$$ -1947 -1207 -203 935 1609 1953 1760 1419 175 -1100 -2103 -2220 -1847 -869 109 1202 1801 1927 1668
2365A668p28j492p74n06j39P06P71R28J179M97k02p40r46q56r07k56J74N76J038
$$ 1668 940 -552 -1326 -1832 -1971 -1265 -494 434 1613 2110 1908 1168 222 -634 -1541 -1797 -1623 -1047 -9
2384iR59J085j18k50r08j170o43n53l79M30O47R47J384M09L9l87q42j109r89n78
$$ -9 950 2035 1917 1667 759 -411 -1054 -1607 -1986 -1556 -909 38 1422 1831 1870 1483 641 -468 -1457 -2035
2404b035P3P29J193J011O46M46m97n34r12r76p81l13M13N43J237O68P28K33k26
$$ -2035 -1962 -1233 -40 971 1617 2063 1566 1032 120 -856 -1637 -1950 -1537 -994 243 911 1639 1872 1646
2423A646p52j202j048p54L63M41N18J298Q65M25m1m03j016j221o44k07N0O63J016
$$ 1646 894 -308 -1356 -2110 -1747 -1306 -788 510 1375 1800 1759 1356 340 -881 -1525 -1732 -1682 -1019 -3
2442cO27J074L10j62p68j174j136n41j89N42Q68R68Q02M47l4l17q74r96r60l70
$$ -3 624 1698 2008 1846 1078 -96 -1232 -1773 -1962 -1420 -552 416 1218 1665 1631 1314 440 -556 -1516 -1886
2462a886L62O49N80J251O38M9J52p64r12r67r09k7K49Q37Q66P40N14M20l15r01
$$ -1886 -1524 -875 -295 956 1594 1643 1795 1031 119 -848 -1757 -1784 -1535 -698 168 908 1422 1842 1527 626
2482F26q51r54l04j99P10O74N40J046L80P3k88j218j061l63l12J86L86O28J192
$$ 626 -225 -1179 -1483 -1682 -972 -298 242 1288 1668 1741 1453 235 -826 -1189 -1501 -1315 -929 -301 891
2501H91M68N14m81o67o82j096k48m08M14M93Q38J401K01m5l92q53r14p48k33k24
$$ 891 1359 1873 1392 725 43 -1053 -1301 -1709 -1295 -802 36 1437 1638 1593 1201 348 -566 -1314 -1547 -1771
2521a771P67Q32P52P39K43Kp48r10o53q56m3PP88J164P68J83K76j87p84q75r02
$$ -1771 -1004 -172 580 1319 1562 1564 816 -94 -747 -1603 -1646 -1639 -851 313 1081 1264 1540 1353 569 -306 -1208
2542a208m83J23M58O30J110O01L19M2l35r87r83r06N6L09M11O63J320J58K42n3
$$ -1208 -1691 -1568 -1110 -480 630 1231 1550 1592 1257 270 -713 -1619 -1563 -1254 -843 -180 1140 1298 1540 1487
2562A487p94q88q75n58l6N18P58N41R27M81O3m70r64o20o88k84j27N52O36R05
$$ 1487 693 -195 -1070 -1628 -1664 -1146 -388 153 1080 1561 1624 1154 190 -430 -1118 -1402 -1529 -977 -341 564
2582E64N98M91l63n87o83q92k81m28L36N27Q66Q17N22j90j38o37o47p87n07j2
$$ 564 1162 1653 1290 703 20 -872 -1153 -1581 -1245 -718 148 965 1487 1297 1159 522 -125 -912 -1419 -1431
2602a431M48N29R85P03M6Jl54q66o71n80l36j2Q42P10O67O17M29l52n36j046o51
$$ -1431 -983 -454 531 1234 1280 1281 927 61 -610 -1190 -1526 -1538 -696 14 681 1298 1727 1375 839 -207 -858
2623h58l57j66K79O81P63O04N79k03k24p59p38p44j01l2M42P11N69Q32O3k32l36
$$ -858 -1215 -1381 -1102 -421 342 946 1525 1322 1098 339 -399 -1143 -1244 -1276 -834 -123 446 1278 1341 1109 773
2644G73m92q22o14j44J46M99Q69O38K49K01l34l60q90p35l64p5L27N14R36O28
$$ 773 281 -541 -1155 -1299 -1153 -654 215 853 1102 1303 969 609 -281 -1016 -1380 -1455 -1128 -614 322 950
2664I50L23R0l38q57q21l91l81L20M62O86M21P79J19m84j26r80o50l89R9L5P96
$$ 950 1273 1363 1025 168 -653 -1044 -1425 -1105 -643 43 464 1243 1362 878 752 -228 -878 -1267 -1168 -1133 -337
2685c37N59O15M77j69l68k84r65n37j49L8J62Q97P51K69K95j07p29l09n07q35
$$ -337 222 837 1314 1145 777 493 -472 -1009 -1158 -1120 -958 -61 690 959 1254 1147 418 109 -398 -1233
2705a233r8J13N65Q01N61M02j94j45j60o73p69o34K28L67O98M92N35O9M1p4n55
$$ -1233 -1331 -1218 -653 148 709 1111 917 772 612 -61 -830 -1464 -1236 -869 -171 321 856 925 966 892 337
2726C37r02p06o5K24O66M96M07M48J10J44n40o63o31k91m9K36M42L08P44J94K25
$$ 337 -565 -1271 -1336 -1112 -446 50 457 905 1015 1159 619 -44 -675 -966 -1015 -779 -337 -29 715 909 1134
2747A134j86o81q42l13J06j01J11O36N80N28k6N8m13q30n74k34J01j04P53K85
$$ 1134 948 267 -575 -888 -782 -883 -772 -136 444 972 946 1004 591 -239 -813 -1047 -946 -1050 -297 -12
2767a2O59M32J99n83l33l95o23m31L06Q2N91K83P40K46j59k01n45p14l53k65J87
$$ -12 647 1079 1278 695 362 -33 -656 -1087 -781 -699 -108 175 915 1161 1002 801 256 -458 -811 -1076 -889
2788h89K69N20N28M06M45l93p62j04p38l67K34J02L09N05O13J80K24n43j81o59
$$ -889 -620 -100 428 834 1279 886 124 20 -718 -1085 -851 -749 -440 65 678 858 1082 539 358 -301
2808c01m50j46P9L79J98N66L49L02k02l06m00l56l69k78J64L76N94K76N93j95
$$ -301 -751 -897 -818 -439 -241 325 674 976 774 468 68 -288 -657 -935 -771 -395 199 475 1068 873
2828H73k44l37l03l29n53Q0K82J12K95P90P6O4l91j25m50l53l5k08M23J47N07
$$ 873 629 292 -11 -340 -893 -813 -531 -419 -124 666 742 806 415 290 -160 -513 -548 -756 -333 -186 321
2849C21L79r1J86m26k59n35l51o2J18N28J43M62N4K20M8o04l43m15j19j48K84
$$ 321 700 609 795 369 110 -425 -776 -838 -720 -192 -49 413 467 687 735 131 -212 -627 -746 -894 -610
2870f10N09K33P51o9J93o66l31m11j19j91K7K20M50M12M00p9k32j83k99k25n94
$$ -610 -101 132 883 814 1007 341 10 -401 -520 -711 -684 -464 -14 398 798 719 487 304 5 -220 -814
2891h14j54J72M49O77K89O3j4j07l24m00n25j39J56K78J57N65M74o0J58n69k44
$$ -814 -968 -796 -347 330 619 682 668 561 237 -163 -688 -827 -671 -393 -236 329 803 743 901 332 88
2912H8o63K9j86M85j3M48K7L07M14m09j51q5o93j80J25J21L97j54O72L9Q3l45
$$ 88 -575 -546 -732 -247 -260 188 215 522 936 527 376 291 -402 -582 -457 -336 61 -93 579 618 701 356
2934C56m23M9n49j5J19m4L28L12L96K29o8n75p7m59k0q2Jp4N66N11J27k7l10r4
$$ 356 -67 -18 -567 -582 -463 -507 -179 133 529 758 690 115 38 -421 -441 -523 -522 -596 -30 481 608 581 271 177
2958A77k53Nn19J46k31M74O45K13j35r0j5j84l27m69n9j2L73N07j6J91L74l14
$$ 177 -76 -71 -590 -444 -675 -201 444 657 522 432 417 233 -94 -563 -622 -634 -261 246 230 421 795 481
2980D81r7l17m91k41k8J20L34N28J23j02M77k30l22j31o69k10N1L82K73M3O21
$$ 481 384 67 -424 -665 -693 -573 -239 289 412 310 787 557 235 104 -565 -775 -724 -342 -69 -26 595
3001E95K6P0k84m87k73Q4l11Q9K39K78M4L59RK2m06j12nm98j09K33K17J65N28
$$ 595 621 691 407 -80 -353 -269 -580 -491 -252 26 70 429 438 460 54 -58 -63 -561 -670 -437 -220 -55 473
3024D73P6j20l9n59m1m0m1m7j09L05M11K60j10J9l04k9m38j0KP3KK21N23j82Q1
$$ 473 549 429 390 -169 -210 -250 -291 -338 -447 -142 269 529 419 438 134 105 -333 -343 -341 -268 -266 -45 478 296 377
3049C77m5j65j49l86j21r8K46m5L90M04j51K67J4l19l87k85J9KJ54J19L72K25
$$ 377 332 167 18 -368 -489 -587 -341 -386 4 408 257 524 538 219 -168 -453 -434 -432 -278 -159 213 438
3071D38j9mOl84l75nj56K57J14k5L70J47r7j33m8l16o2p0L4o6K88K01J93J66m7
$$ 438 419 415 421 37 -338 -343 -499 -242 -128 -153 217 364 267 134 86 -230 -292 -362 -328 -394 -106 95 288 454 407
3096D07j53k80j26k95K11J73j99K52K02L5J07K20k69m62j82K23o41N22j3J89L60
$$ 407 254 -26 -152 -447 -236 -63 -262 -10 192 227 334 554 285 -177 -359 -136 -777 -255 -268 -79 281
3117B81K23N9n03K0k47j75j02J9n7L33J42K97Q6j09j06J91k08n45q5L40p2j3K26
$$ 281 504 563 60 80 -167 -342 -444 -425 -482 -149 -7 290 376 267 161 352 144 -401 -486 -146 -218 -231 -5
3140eL13mP1k26j49k57M3k57K54J66JN35j41j81o0l8k30O5k12oK6K23p5J15L19
$$ -5 308 304 375 149 0 -257 -214 -471 -217 -51 -50 485 344 163 103 65 -165 -100 -312 -318 -292 -69 -144 -29 290
3165B90j7J01m30j05k22jL06OJ74N1K29Mo2k20j77p4mk67J81J76j69M65K42l06
$$ 290 273 374 -56 -161 -383 -384 -78 -72 102 153 382 386 324 104 -73 -147 -151 -418 -237 -61 -230 235 477 171
3189A71n7j50j79j44J35l38N74l13O94k54K49Q4l70%m88K43Q3j19p8M46p3J71
$$ 171 114 -36 -215 -359 -224 -562 12 -301 393 139 388 472 102 102 -386 -143 -60 -179 -257 189 116 287
3211B87L48j84l15k20j2j07q8j03L26K38m4P3N9P0m47Q4k44K2j00L24J20J68q7
$$ 287 635 451 136 -84 -96 -203 -291 -394 -68 170 126 199 258 328 -119 -35 -279 -257 -357 -33 87 255 168
3234A68K09j72o5j41k46J80j74J22J94j55M36Q5ql9r6n29J20J01n69L66J69J04
$$ 168 377 205 140 -1 -247 -67 -241 -119 75 -80 356 441 433 394 298 -231 -111 -10 -579 -213 -44 60
3256F0k4K30K0j38n7m78j0J29j34K72p3K00K46p6o4P7k49k17j14JK19R1K99p6
$$ 60 36 266 286 148 91 -387 -397 -268 -402 -130 -203 -3 243 167 103 180 -69 -286 -400 -399 -180 -89 210 134
3280A34K70k05Q0l00o6k09k1K19l0J95N0R0j24J81k07K0k86P4J20k94J8K99J05
$$ 134 404 199 279 -21 -87 -296 -317 -98 -128 67 117 207 83 264 57 77 -209 -135 -15 -309 -291 8 113
3303A13kM9J09k17j45j03j52O3K60j49N5J93N6K45j53L6m69Q8j39J9nJ84K06J05
$$ 113 111 160 269 52 -93 -196 -348 -285 -25 -174 -119 74 130 375 222 258 -211 -123 -262 -243 -248 -64 142 247
3327B47j13O6p6j68R1p3j21q8M6L84k11K88J06m12J30%j63j37r3J21J13J90n9
$$ 247 134 200 124 -44 47 -26 -147 -235 -189 195 -16 272 378 -34 96 96 -67 -204 -297 -176 -63 127 68
3350F8j21K43J5n8r5l38J17l8j25L51J81k74J60k15M24j17j55k74pj17K84L9R4
$$ 68 -53 190 205 147 52 -286 -169 -207 -332 19 200 -74 86 -129 295 178 23 -251 -258 -375 -91 -52 42
3373D2O4j39K2J73k00n4m6j53L84q3j0P8J58O7j18j18k18K48l78N0J34J7M23l02
$$ 42 106 -33 -11 162 -38 -92 -138 -291 93 10 0 78 236 303 185 67 -151 97 -281 -231 -97 -80 343 41
3397D1J90j5rj31k15J76j52J70k02lP5O5J74j92j10J30j38Mj07j00L01L1L6P8
$$ 41 231 216 207 76 -139 37 -115 55 -147 -150 -75 -10 164 -28 -138 -8 -146 -142 -249 -349 -48 -17 19 97
3421I7J4r1j94O9J33r0k45J12J50J29q9J57L93n40J97m85K55k46P6R8o5J66J37
$$ 97 111 20 -174 -105 28 -62 -307 -195 -45 84 -5 152 545 5 202 -283 -28 -274 -198 -100 -165 1 138
3444A38N5J28J0k52j46m8j71kL05J7J22m2J61J3l8K8m42J76l78R9J68J11O7O1
$$ 138 193 321 331 79 -67 -115 -286 -288 17 34 156 114 275 288 250 278 -164 12 -366 -267 -99 12 79 140
3468A40J36k06o6J19l99q6M98l64K82Jl3J42rj32N6j05J2j53j99L74O6q9K73Q
$$ 140 276 70 4 123 -276 -362 136 -228 54 55 22 164 155 23 79 -26 -14 -167 -366 8 74 -15 258 266
3492B66q0K20l87j86R2n1q1J11J48M9L7K6j55K78m93O4q1r3L54J0m3L46j81l81
$$ 266 186 406 19 -167 -75 -126 -207 -96 52 101 138 164 9 287 -206 -142 -223 -316 38 48 5 351 170 -211
3516b11N05j14k63k73K9QJ81J96K3J91L2J25l04j23r3j47m5J32j9m6L65J65k09
$$ -211 294 180 -83 -356 -327 -319 -138 58 81 272 304 429 125 2 -91 -238 -283 -151 -170 -216 149 314 105
3539A05J52l16j59K36q0j76l1J11J6L76j97K16k11J19k10Jk73J25J49j9L03R7
$$ 105 257 -59 -218 18 -62 -238 -269 -158 -142 234 37 253 42 161 -49 -48 -321 -196 -47 -66 237 334
3561C34k81J19k26J5J64n38K52k3R5K2K27J3L8j48K08k54j28j82J80j0Q2J99j25
$$ 334 53 172 -54 -39 125 -413 -161 -184 -89 -67 160 173 211 63 271 17 -111 -293 -113 -123 -41 158 33
3584C3L33j73J07l50j68k7n3K2o6K55J90R9K29jk42j45k73O9k04K13l5J75J94
$$ 33 366 193 300 -50 -218 -245 -298 -276 -342 -87 103 202 431 430 188 43 -230 -161 -365 -152 -187 -12 182
3607A82J09J20k39K7l54j75n8M3J63R6J73L01r3j01k6k04l2j53J96l12K53J74
$$ 182 291 411 172 199 -155 -330 -388 -345 -182 -86 87 388 295 194 168 -36 -68 -221 -25 -337 -84 90
3629I0K32l5k9j88J43k7k66l14K12r0R6L70j10K35j20R2j48k98n2k05j0L44J68
$$ 90 322 287 258 70 213 186 -80 -394 -182 -272 -176 194 84 319 199 291 143 -155 -207 -412 -422 -78 90
3652I0K26k12J26rm5j78j39l71L8K21j08K48M76j94J29j76j12L2k42k98K09jM03
$$ 90 316 104 230 221 176 -2 -141 -512 -474 -253 -361 -113 363 169 298 122 10 42 -200 -498 -289 -290 113
3675A13J13m2R1K1j88l02R1j75q5oJ89J93L30R0K9k12l41k8Mj09j02N1J57L16
$$ 113 226 184 275 296 108 -194 -103 -278 -363 -369 -180 13 343 433 462 250 -91 -119 -115 -224 -326 -275 -118 198
3699A98P4J45j4l32O9l25k0J93k82O7J34L41L0J34q0j91j6k77l16p7K82M10o3
$$ 198 272 417 403 71 140 -185 -205 -12 -294 -227 -93 248 278 412 332 141 125 -152 -468 -545 -263 147 84
3722H4K88m5j35lj70J02l59r6j83K18L87PQ1J08M7j59p6k92k38K0J01J37J06L06
$$ 84 372 327 192 189 19 121 -238 -334 -517 -299 88 95 176 284 331 172 96 -196 -434 -414 -313 -176 -70 236
3746B36j82Q4L38k66j17m28J97l29M20j2K86K26Qj12l85M3m82P1k54L33L24K11
$$ 236 54 138 476 210 93 -335 -138 -467 -47 -59 227 453 461 349 -36 7 -475 -404 -658 -325 -1 210
3768B10M9J80l9j22j68k27k00R9l32R6L13M69j00L80j96l87j6k50j4P1k76K14
$$ 210 259 439 400 278 110 -117 -317 -218 -550 -454 -141 328 228 608 412 25 9 -241 -255 -184 -460 -246
3790b46K51L34r6j4L7Nl99k2k15L1j00K63L08L26J20l53N0j26k49m67N08k27o4
$$ -246 5 339 243 229 266 271 -128 -150 -365 -334 -434 -171 137 463 583 230 280 154 -95 -562 -54 -281 -345
3813c45L71m3N13J33l47j19o5j21k74j45J97O0K08M08m1J46k54o6l86j67k00J33
$$ -345 26 -17 496 629 282 163 98 -23 -297 -442 -245 -185 23 431 390 536 282 216 -170 -337 -537 -404
3835d04J31L25J99N0Q4Nk7k95n36O9j63L52L0K94K51K7J51J01m37k52k35j02K19
$$ -404 -273 52 251 301 385 390 363 68 -468 -399 -562 -210 -180 114 365 392 543 644 207 -45 -280 -382 -163
3858a63l7J55J19L04M6P9j59j87j42m32Q0j85K67L8J57L53M7n5K09m29n08J15
$$ -163 -200 -45 74 378 424 503 344 157 15 -417 -337 -522 -255 -217 -60 293 340 285 494 65 -443 -328
3880c28j22p5L53N9N10j82K78K3n70J41m58k48K97K66K1M16R9J11j84j66k39j71
$$ -328 -450 -525 -172 -113 397 215 493 516 -54 87 -371 -619 -322 -56 -35 381 480 591 407 241 2 -169
3902a69j25Rk2R5M47Q4M36j91j72n30j47j66K22j21K27j28K14L54J72j36j41k33
$$ -169 -294 -285 -307 -212 235 319 755 564 392 -138 -285 -451 -229 -350 -123 -251 -37 317 489 353 212 -21
3924b1j86k16J43k38K74J52Q5N59l77J40j89j21k31j94l7J93N24N8J10M6j11j29
$$ -21 -207 -423 -280 -518 -244 -92 -7 552 175 315 126 5 -226 -420 -457 -264 260 318 428 474 363 234
3946B34p1k27k83l41K34K67K05R1K50l0q2k0k83j37k52K1J1K36P4M67j50K78k0
$$ 234 163 -64 -347 -688 -454 -187 18 109 359 329 247 227 -56 -193 -445 -424 -413 -177 -103 364 214 492 472
3969D72j16n76l3k60J3L52J46K01kJ58J94l98k31M5l63K11j34Q8K97L85n1L0l0
$$ 472 356 -220 -253 -513 -500 -148 -2 199 197 355 549 151 -80 -35 -398 -187 -321 -233 64 449 398 428 398
3992C98k39k80l16J40p8L8N13j70M65j39J72l54L0j45m14K0l2M7L27K40K83j8
$$ 398 159 -121 -437 -297 -375 -337 176 6 471 332 504 150 180 35 -379 -359 -391 -344 -17 223 506 488
4014D88j51j46k54J7m47J9J17L53J90o6O15l13o3l02L5l85j64k1L30P8L15J70
$$ 488 337 191 -63 -46 -493 -474 -357 -4 186 120 735 422 359 57 92 -293 -457 -478 -148 -70 245 415
4036D15n6O5ll52n48J0O8K17r9J03M18J58M15n55j05j13l66q9l0J04L13KM77j7
$$ 415 359 424 421 69 -479 -469 -401 -184 -283 -180 238 396 811 256 151 38 -328 -417 -447 -343 -30 -28 449 432
4060D32m4l58q5j05l40J68j42J39L45J70J35K16k09k17j43j64m28J38J00L55L66
$$ 432 388 30 -55 -160 -500 -332 -474 -335 10 180 315 531 322 105 -38 -202 -630 -492 -392 -37 329
4081C29r3K1L86n82j28k28J48j24j28L9K14L62Q5L35m05R1l07k24j9j71k1N42
$$ 329 236 257 643 61 -67 -295 -147 -271 -399 -360 -146 216 301 636 231 322 15 -209 -228 -399 -420 122
4103A22k90Q11m1j08R9p10K15l29k10J91rL48J95J89K41l23k90n8k38k38q4J38
$$ 122 -168 643 602 494 593 -117 98 -231 -441 -250 -259 89 284 473 714 391 101 43 -195 -433 -517 -379
4125c79J82M56j0J15r6K02k37l97j55k38L28m8J28O9J24L09K53q2m48k38k93P4
$$ -379 -197 259 249 364 268 470 233 -164 -319 -557 -229 -277 -149 -80 44 353 606 524 76 -162 -455 -381
4147c81k45M57q0N01J83J35j18j58m29Ql84J33K6K38K63J76K97k49K2j96j81k71
$$ -381 -626 -169 -249 252 435 570 452 294 -135 -127 -511 -378 -352 -114 149 325 622 373 395 199 18 -253
4169b53m3j81K17J03L50L2K11j23m4l41j96Oj60L9K5M33J67o6L17j50k15j40k23
$$ -253 -296 -477 -260 -157 193 225 436 313 269 -72 -268 -262 -422 -383 -358 75 242 176 493 343 128 -12 -235
4192b35j04k24L24L15J02J73j24J35P2l36n65J54q0p4N09Q9K71P5P7n1k11m13
$$ -235 -339 -563 -239 76 178 351 227 362 434 98 -467 -313 -393 -467 42 131 402 477 554 503 292 -121
4214a21k88K00l20J85L45J10J82K04j45o5j99k57O8l57m5J44M19J76K10k9L5p4
$$ -121 -409 -209 -529 -344 1 111 293 497 352 287 88 -169 -101 -458 -503 -359 60 236 446 417 452 378
4236C78l56j50k84k18K97P8L61N8L01j00J67m11j58k93k33m0M41N4L07K77j25
$$ 378 22 -128 -412 -630 -333 -255 106 164 465 365 532 121 -37 -330 -563 -603 -162 -108 199 476 351
4257C51J71j06l78j78j63k40J74Q1L50j09L88K2L4j52l57j58J6k31L31j25M9M09
$$ 351 522 416 38 -140 -303 -543 -369 -288 62 -47 341 363 397 245 -112 -270 -254 -485 -154 -279 -230 179
4279A79J84J7j33j94l98K29l27j53K44J48M82J22q7q0J98n01M2n29k8N5N31J9
$$ 179 363 380 247 53 -345 -116 -443 -596 -352 -204 278 400 313 233 431 -70 -28 -557 -585 -530 1 20
4301B0J92L74m65K55l01k27l27J34q4K01L04k7J67k2PJ76m48l41J65p4n0K57N2
$$ 20 212 586 121 376 75 -152 -479 -345 -429 -228 76 49 216 194 201 377 -71 -412 -247 -321 -371 -114 -62
4324f2L55J0J08j9J6l70k43l03M35k14j34N05K54P6j39m3k66P2l42j55pQ2J73
$$ -62 293 303 411 392 408 38 -205 -508 -73 -287 -421 84 338 414 275 232 -34 38 -304 -459 -466 -384 -211
4347b11L33K41J21M3l60m33J15j04l41K71R3J58K21J24K53j58j42l01j73m7k0
$$ -211 122 363 484 527 167 -266 -151 -255 -596 -325 -232 -74 147 271 524 366 224 -77 -250 -297 -317
4368c17n1K47L68K05k19K7K03k53m52n39M80j65M78k40K11K19L96k37Kk25m70
$$ -317 -368 -121 247 452 233 260 463 210 -242 -781 -301 -466 12 -228 -17 202 598 361 363 138 -332
4389c32l8j49L55Q2L48j89L11J69m17J52n21j91q1o3M82J7J51J27L45j16k14m9
$$ -332 -370 -519 -164 -82 266 77 388 557 140 292 -229 -420 -501 -564 -82 -65 86 213 558 442 228 179
4411A79l87l79L36j13M69J32M1M9J47j51l18j80j93j2ML13q9M50k2J68k03j47
$$ 179 -208 -587 -251 -364 105 237 278 327 474 323 5 -175 -368 -380 -376 -63 -152 298 276 444 241 94
4433I4o0l22J40o3j84K71K23M1J13P2K39k40l35l70J17l82J1M78N1K65J90K7L2
$$ 94 34 -288 -148 -211 -395 -124 99 140 253 325 564 324 -11 -381 -264 -646 -635 -157 -106 159 349 376 408
4456D08j15m20k63o9J18J58O8Q1L60M7k02P1k26k8l78J02j28J24K29M28M2M7j40
$$ 408 293 -127 -390 -459 -341 -183 -115 -34 326 373 171 242 16 -12 -390 -288 -416 -292 -63 365 407 454 314
4479C14m72J25k13k20ON01K1mL11j0j87l6l02J5l57K48k77M31m1K18L98j13k13
$$ 314 -158 -33 -246 -466 -460 41 62 58 369 359 172 136 -166 -151 -508 -260 -537 -106 -147 71 469 356 143
4502A43K12m51o8l15K24O0J30K74J37J0Q3j07j88l58j76o2L25n9J75K12K18k65
$$ 143 355 -96 -164 -479 -255 -195 -65 209 346 356 439 332 144 -214 -390 -452 -127 -186 -11 201 419 154
4524A54L95l94k94o3k50j34L04P2J72J66K33Q3lm00l30r3Ql5O0M41j09J64K58
$$ 154 549 155 -139 -202 -452 -586 -282 -210 -38 128 361 444 441 41 -289 -382 -374 -409 -349 92 -17 147 405
4547D05j58k38k23J38l81J47J56J22J50J74K20j53m1k79k60j11j27j16M3M48L58
$$ 405 247 9 -214 -76 -457 -310 -154 -32 118 292 512 359 318 39 -221 -332 -459 -575 -532 -84 274
4568B74J58O4j06k60j34l10J38k51M2K98J56R4J62j29j04J11l43j84Q5j92J61
$$ 274 432 496 390 130 -4 -314 -176 -427 -385 -87 69 163 325 196 92 203 -140 -324 -239 -431 -270
4589b70K33p2L41k0M73m52Ql31j16n4NK12l21O15L08l6m36M1k53j45j22J51J43
$$ -270 -37 -109 232 212 685 233 241 -90 -206 -260 -255 -43 -364 251 559 523 87 128 -125 -270 -392 -241 -98
4612i8j96K12L36R5q9P9j89l94r1J3P7J44m1K89J20l6lR1l61l0l70K68j56K75
$$ -98 -294 -82 254 349 260 339 150 -244 -335 -322 -245 -101 -142 147 267 231 228 319 -42 -72 -442 -174 -330 -55
4636e5L47l2L9j25j45Q1l10Qk33K53J65k6Q4L27j01k9j5j43j32j49j83J55J87
$$ -55 292 260 299 174 29 110 -200 -192 -425 -172 -7 -33 51 378 277 248 233 90 -42 -191 -374 -219 -32
4659c2j0N0J17K54Ll47o9K64n26jK23l4J88K38K08o5j07l80O0l90j32K41L9J95
$$ -32 -42 8 125 379 382 35 -34 230 -296 -297 -74 -108 80 318 526 461 354 -26 34 -356 -488 -247 -208 -13
4683a3K46O0k4l8n4l57J12m60L25jK33o9J56J48O9k90J22l52J38k43N7j26J06
$$ -13 233 293 269 231 177 -180 -68 -528 -203 -204 29 -40 116 264 333 43 165 -187 -49 -292 -235 -361 -255
4706b55M45J00J59o5J12l94k86J58j63l87N92m1N5M13r6k33j55m9j67j07R5K66
$$ -255 190 290 449 384 496 102 -184 -26 -189 -576 16 -25 30 443 347 114 -41 -90 -257 -364 -269 -3
4728cP7O5K86k08L07l47k23J99m84K72j74J6N23N9J38k71j64K14k78l31m2j93
$$ -3 74 139 425 217 524 177 -46 153 -331 -59 -233 -217 306 365 503 232 68 282 4 -327 -369 -562
4750e62L26L69j11j00L57j05m6k4m79J93k19j5K97L6J71J4L66m38K1J23l51n8
$$ -562 -236 133 22 -78 279 174 128 104 -375 -182 -401 -416 -119 -83 88 102 468 30 51 174 -177 -235
4772b35O4j8K14k5J25M2J22n9k00M9j48j01q9L54O0K2PJ90k24Rl03K4j73k5J66
$$ -235 -171 -189 25 0 125 167 289 230 30 79 -69 -170 -259 95 155 177 184 374 150 159 -144 -120 -293 -318 -152
4797a52J05J36P1J52L07k34k00m17J07o9j69J98R3J55j21K58m7j48M5k20p5P9
$$ -152 -47 89 160 312 619 385 185 -232 -125 -194 -363 -165 -72 83 -38 220 173 25 70 -150 -225 -146
4819a46J21k8J51J10r0L19l47j15Pj72j45j19K37qL64k24L08P9o9j07lk25l05
$$ -146 -25 -53 98 208 118 437 90 -25 -18 -190 -335 -454 -217 -225 139 -85 223 302 233 126 123 -102 -407
4842d07J39J85K71j87K55J93k07j02l10j3Q3l15K16L5K7M73q2j61P0k76K4j57
$$ -407 -268 -83 188 1 256 449 242 140 -170 -183 -100 -415 -199 -164 -137 336 254 93 163 -113 -89 -246
4864b46K2r4L41o9K21j98L06R0l88j09N4l9K9j36p9M03P5J39L1k17k26J92k82
$$ -246 -224 -318 23 -46 175 -23 283 373 -15 -124 -70 -109 -80 -216 -295 108 183 322 353 136 -90 102 -180
4887a80m5j5J00K35l09L25J03PJ24m19Rj93p6M9J59K53k36K89j69J79j24l3K9
$$ -180 -225 -240 -140 95 -214 111 214 221 345 -74 -65 -258 -334 -285 -126 127 -109 180 11 190 66 33 62
4910F2k10l30L90m0m1L50r0J15p0j45l57J54q9K9J65J57P6J93k91n4J98k94j42
$$ 62 -148 -478 -88 -128 -169 181 91 206 136 -9 -366 -212 -301 -272 -107 50 126 319 28 -26 172 -122 -264
4933b64L6j77Q5L44L9L7J8ml4L8k01Q8j91k4J33Q4RL1K22J8j35J2k49N9j89k0
$$ -264 -228 -405 -320 24 63 100 118 114 80 118 -83 5 -186 -210 -77 7 16 47 269 287 152 164 -85 -26 -215 -235
4959b35J63Q4k7L01m0K7k46o4j59m1O9J0J2J01R3j95M40k30r5k60L13k66NQ2J14
$$ -235 -72 12 -15 286 246 273 27 -37 -196 -237 -168 -158 -146 -45 48 -147 293 63 -32 -292 21 -245 -240 -158 -44
4984d4J65J62%rj54k03K4J4k01J1J98J91J24k22n8J63P3l29k13O3J37o2J82J88
$$ -44 121 283 283 274 120 -83 -59 -45 -246 -235 -37 154 278 56 -2 161 234 -95 -308 -245 -108 -170 12 200
5008B00Ll18K00J14k02j48J71o5j40L95J03j85K27k27J07q3l01n1J74l28K95Q0
$$ 200 203 -115 85 199 -3 -151 20 -45 -185 210 313 128 355 128 235 152 -149 -200 -26 -354 -59 21
5030B1J11K2J68J03k13j99j08j15Nl3j09L29O2K20p9P2L8j68l19j41lL58p7%P9
$$ 21 132 154 322 425 212 13 -95 -210 -205 -238 -347 -18 44 264 185 257 295 127 -192 -333 -336 22 -55 -55 24
5055B4O2L04k23j28j34m9N5k79J61K05R6J78P9k14J61l39n5j44P9j23K1M95q8
$$ 24 86 390 167 39 -95 -144 -89 -368 -207 -2 94 272 351 137 298 -41 -96 -240 -161 -284 -263 232 144
5078A44K53j45J72j74j72l86N7K70j19O7j50K39L34j17o9j59k59K0n3k6J70J53
$$ 144 397 252 424 250 78 -308 -251 19 -100 -33 -183 56 390 273 204 45 -214 -194 -247 -273 -103 50
5100E0N9J71Qk93p9J48j24l62K60J06J23J50j14R7j22J26j40O2m08P7j69K92J88
$$ 50 109 280 288 -5 -84 64 -60 -422 -162 -56 67 217 103 200 78 204 64 126 -282 -205 -374 -82 106
5123A06j28K36L3j9k50j10K45m46K95k10J10R1M6L10k96J68q6k43J17j39K4o3
$$ 106 -22 214 247 228 -22 -132 113 -333 -38 -248 -138 -47 -1 309 13 181 95 -148 -31 -170 -146 -209
5145b09j42K60J53K46j77jJ09k91r6J08k08m2M80m7L11l38R8j39m02L08q6l0j85
$$ -209 -351 -91 62 308 131 130 239 -52 -148 -40 -248 -290 190 143 454 116 214 75 -327 -19 -105 -135 -320
5168c20R2K73K8J27L1n3n2j27m1k62J28k7q1L40P1J23j90P0k50j15J49P9n8j18
$$ -320 -228 45 73 200 231 178 126 -1 -42 -304 -176 -203 -284 56 127 250 60 130 -120 -235 -86 -7 -65 -183
5192a83L20m3J17k04J91j64M7k37N4j13K23J5J43q3J03J60j67l61oR7k2J90j13
$$ -183 137 94 211 7 198 34 81 -156 -102 -215 8 23 166 83 186 346 179 -182 -188 -91 -113 77 -36
5215c6J16K54k24J26m9p6p3k09P8j24J44q9J43K37j29J64j29k89K66n26K41j22
$$ -36 80 334 110 236 187 111 38 -171 -93 -217 -73 -162 -19 218 89 253 124 -165 101 -425 -184 -306
5237c06K19J12j02M23o0q3l76J20q6p6j20K41J01K44j73K54k20k5j78M0j03o9
$$ -306 -87 25 -77 346 286 203 -173 -53 -139 -215 -335 -94 7 251 78 332 112 87 -91 -51 -154 -223
5259b23J83j35J84J53Q3kj81l4P9k91o5J01r7K40J47k73M96l19R2k35j58J2L2
$$ -223 -40 -175 9 162 245 243 62 28 107 -184 -249 -148 -245 -5 142 -131 365 46 138 -97 -255 -243 -211
5282b11P3j46K50M4J62j5o1j32N5j23j61J07lL02r2K19j93J28m09Q5o1p9O5j70
$$ -211 -138 -284 -34 10 172 157 96 -36 19 -104 -265 -158 -161 141 49 268 75 203 -206 -121 -182 -261 -196 -366
5306c66N4M53k38M38k70M9Q1k86K25k82j22J44j24K37J39Q2Q1j43j65q2q3j3o
$$ -366 -312 141 -97 341 71 120 201 -85 140 -142 -264 -120 -244 -7 132 214 295 152 -13 -95 -178 -191 -197
5329a97p3NM19K27j13J2k06k79J61l66K30R3j92M58o0J95r9J16j61P0m41K49m0
$$ -197 -270 -265 154 381 268 280 74 -205 -44 -410 -180 -87 -279 179 119 314 215 331 170 240 -201 48 8
5352Hk28KJ44Q4K88j27k32L39k61j73n8J66q4J57K5N1o7K7k5J78k79k18j17L92
$$ 8 -220 -218 -74 10 298 171 -61 278 17 -156 -214 -48 -132 25 50 101 34 61 36 214 -65 -283 -400 -8
5376hON45o49P4J50j5j68k7j74J13j89K85J24M6lo5K02k2n2k02k03P5j70K81P4
$$ -8 -2 543 -106 -32 118 103 -65 -92 -266 -153 -342 -57 67 113 110 45 247 225 173 -29 -232 -157 -327 -46 28
5401B8k48M89l7j27j19N1j12k06O6J38K55k44K49P2k6j52j71p2j07J84k09k0M17
$$ 28 -220 269 232 105 -14 37 -75 -281 -215 -77 178 -66 183 255 229 77 -94 -166 -273 -89 -298 -318 99
5424I9l51K44J38J02k15R9j31l25R9J02K4K11j30K49r3J0J08n83L58o8j26J36
$$ 99 -252 -8 130 232 17 116 -15 -340 -241 -139 -115 96 -34 215 122 132 240 -343 15 -53 -179 -43
5446d3L8L64l87O1J37pk18k48M52l39J78j74O1K94n8J76l9m9j89j25j82m3J64
$$ -43 -5 359 -28 33 170 163 -55 -303 149 -190 -12 -186 -125 169 111 287 248 199 10 -115 -297 -340 -176
5469a76N8J14J85N2l9J9k76j67Pj7Pl3Q2J77J42j1M8k16m7r8J06j74J67K44J62
$$ -176 -118 -4 181 233 194 213 -63 -230 -223 -240 -233 -266 -184 -7 135 124 172 -44 -91 -189 -83 -257 -90 154 316
5494C16k09j16Q9L4M4k50j35nJ51l1J08L26j66J36N2l17L7j94n9l51K74n9M12
$$ 316 107 -9 80 114 158 -92 -227 -232 -81 -112 -4 322 156 292 344 27 64 -130 -189 -540 -266 -325 87
5517H7j08P3N5l32O3J02j75o1J62j55L01j16K65K28l04j24J9o5j34J21o1K3K27
$$ 87 -21 52 107 -225 -162 -60 -235 -296 -134 -289 12 -104 161 389 85 -39 -20 -85 -219 -98 -159 -136 91
5540I1n6J52k12J27k3j15n0l42J83j9L82m7M9n4N6P4l03R9j38r4K28l03L75N3
$$ 91 35 187 -25 102 79 -36 -86 -428 -245 -264 118 71 120 66 122 196 -107 -8 -146 -240 -12 -315 60 113
5564A13j19J51l0j36R3l29L45k42J9q6M51j77J05qJ8l14J08r3J09k22K36J23L1
$$ 113 -6 145 115 -21 72 -257 88 -154 -135 -221 230 53 158 150 168 -146 -38 -131 -22 -244 -8 115 146
5587A46j49K07R9k28K05l81K06k88P7l9J33J85j09M2j9l81L09j94k9J11J20M5
$$ 146 -3 204 303 75 280 -101 105 -183 -106 -145 -12 173 64 106 87 -294 15 -179 -208 -97 23 68
5609F8K29k10O3Q9j16K2j58j5j54j24K06J54J3o9R2RJ22j81j13J8M2j39k29K73
$$ 68 297 87 150 239 123 145 -13 -28 -182 -306 -100 54 67 -2 90 99 221 40 -73 -55 -13 -152 -381 -108
5633a08J3L56r2K69l66k48r5K8J37J00j23K34J04j50L38j57k04j60j05j11J54
$$ -108 -95 261 169 438 72 -176 -271 -243 -106 -6 -129 105 209 59 397 240 36 -124 -229 -340 -186
5654a86j61K66J88mMJ32j83k0l0j52O4k35k9M12N8J03nj91j8j57J04Rj25j78L82
$$ -186 -347 -81 107 103 107 239 56 36 6 -146 -82 -317 -346 66 124 227 222 31 13 -144 -40 -31 -156 -334 48
5679D8J49j19J27o3m20K54l69L25q1N4l7K63p4O5R1n8k02j3Q2k69p7J95L55j38
$$ 48 197 78 205 142 -278 -24 -393 -68 -149 -95 -132 131 57 122 213 155 -47 -60 22 -247 -324 -129 226 88
5703H8J66k1J27k71j70L6j23j51O1M19k2jm6L1j0q0o3k33M9J07J56j90L63k20
$$ 88 254 233 360 89 -81 -45 -168 -319 -258 161 139 138 92 123 113 33 -30 -263 -214 -107 49 -141 222 2
5727BJ64K3o1j94r9K8n9k6K75M8j33J43J12J4l17j80Q1J01j67J97K47k58N9O5
$$ 2 166 189 128 -66 -165 -137 -196 -222 53 101 -32 111 223 237 -80 -260 -179 -78 -245 -48 199 -59 0 65
5751F5J48j8o1o0Ol52K86N9j30K23q8M2R8l6j89%j64l2J50N2q6M81l08L9q1k2
$$ 65 213 195 134 74 80 -272 14 73 -57 166 78 120 218 182 -7 -7 -171 -203 -53 -1 -87 394 86 125 44 22
5777B2K8n6J47k90P0k2K28q3J92m60M08k96L5J39j65J1j20L13j9J29J17j73j98
$$ 22 50 -6 141 -149 -79 -101 127 44 236 -224 184 -112 -77 62 -103 -92 -212 101 82 211 328 155 -43
5800d3m9Q6j35L6j46K22K31k93L76j4r6m15K12k97K85k23K44Q1J69j88R0Q1j45
$$ -43 -92 -6 -141 -105 -251 -29 202 -91 285 271 175 -240 -28 -325 -40 -263 -19 62 231 43 133 214 69
5823F9L0r7j8j52K88m7K34k58q9R2J13P2k24qj00P9j12K83l0j27J36O9j62R4j21
$$ 69 99 2 -16 -168 120 73 307 49 -40 52 165 237 13 5 -95 -16 -128 155 125 -2 134 203 41 135 14
5848A4k30J78J94j60J27j40K70j63K65l86j61M3j14K82J15j39j1Qr8J83j55p3
$$ 14 -216 -38 156 -4 123 -17 253 90 355 -31 -192 -149 -263 19 134 -5 -16 -8 -106 77 -78 -151
5870a51j03n3K06J30j69O8J50m7R7K1l22J51J3j3k5j47J99P9j2j3M58o62J01r4
$$ -151 -254 -307 -101 29 -140 -72 78 31 128 149 -173 -22 -9 -22 -47 -194 5 84 72 59 517 -145 -44 -138
5894a38J04k03J17P2J08O9j0J54k28j9n4j7m6L9M7j30J55J28K8j96M9M7j46j99
$$ -138 -34 -237 -120 -48 60 129 119 273 45 26 -28 -45 -91 -52 -5 -135 20 148 176 -20 29 76 -70 -269
5918b69K74l44K95J11K24o4k99K65j15N0j1k53j22K11k3q4M12q2k28Q4j06p6J36
$$ -269 5 -339 -44 67 291 227 -72 193 78 128 117 -136 -258 -47 -70 -154 258 176 -52 32 -74 -150 -14
5941a4l5q2K49p9j30L52j03k12P5n8j35m8J10M3J43j77P2l6K68j31j81J69j63
$$ -14 -49 -131 118 39 -91 261 158 -54 21 -37 -172 -220 -110 -67 76 -101 -29 -65 203 72 -109 60 -103
5964a03j7J92j09j25K94q7J09qk04O5k12J99j28M5M9k7M1J34j44P6k15r6J87R0
$$ -103 -120 72 -37 -162 132 45 154 146 -58 7 -205 -6 -134 -89 -40 -67 -26 108 -36 40 -175 -271 -84 6
5988Fk36L13p7m5O9mR0m0j00j99K22k05M62k53J39k05M0r1K0K30k49N0j69J13
$$ 6 -230 83 6 -39 30 26 116 76 -24 -223 -1 -206 256 3 142 -63 -23 -114 -94 136 -113 -63 -232 -119
6012a19M9j85K49O8J61P9l35o7RN1j96K36O8j40J66n4k12K37n8J9K03j3l22J25
$$ -119 -70 -255 -6 62 223 302 -33 -100 -91 -40 -236 0 68 -72 94 40 -172 65 7 26 229 216 -106 19
6036A9k5j33K81J6p5J35l00j27K46q0j3k9J86j8o3J33J38j34k1j76p4j20q7K52
$$ 19 -6 -139 142 158 83 218 -82 -209 37 -43 -56 -85 101 83 20 153 291 157 136 -40 -114 -234 -321 -69
6060f9j3K95L4J5k16R2k37j47J04j68N12k17P1m7R3j48K38q1p0m54K80l0J82K19
$$ -69 -82 213 247 262 46 138 -99 -246 -142 -310 202 -15 56 9 102 -46 192 111 41 -413 -133 -163 19 238
6084B38l90K78j98J24J48m41J82q5n9K91j17N5k4K97m08QJ26k2j06n7n4L22j19
$$ 238 -152 126 -72 52 200 -241 -59 -144 -203 88 -29 26 2 299 -109 -101 25 3 -103 -160 -214 108 -11
6107a1O7j67K23J29l26j6O5j2JJ47j21R8j45L21k39n7K13l67n4R3J4P0N4J95l05
$$ -11 56 -111 112 241 -85 -101 -36 -48 -47 100 -21 77 -68 253 14 -43 170 -197 -251 -158 -144 -74 -20 175 -130
6132a30J82K32k28j61L01k93r3r1L30J0O9kj24J51l41j92K77l7Q2J2j12J25J45
$$ -130 52 284 56 -105 196 -97 -190 -281 49 59 128 126 2 153 -188 -380 -103 -140 -58 -46 -158 -33 112
6155A12Ok78M3q5J6J90j01L42m28J71P2r8J16j32N4N2j40k27K01K92j32J39k83
$$ 112 118 -160 -117 -202 -186 4 -97 245 -183 -12 60 -38 78 -54 0 52 -88 -315 -114 178 46 185 -98
6178i8L35j29L9M4l66K40r0M1j34J98j33L00j18n9J38k54l16K82n7J76q7K84j57
$$ -98 237 108 147 191 -175 65 -25 16 -118 80 -53 247 129 70 208 -46 -362 -80 -137 39 -48 236 79
6201G9K1K03l40P9L7k29j46L12p7m4J04%L30l76Q6j12j25J76j10K6J79r7J15n9
$$ 79 100 303 -37 42 79 -150 -296 16 -61 -105 -1 -1 329 -47 39 -73 -198 -22 -132 -106 73 -24 91 32
6225C2RJ9j12l4j79L61j90J13r5J48J5J15L7l27o7L23j58j27p9P4J27J23j02J65
$$ 32 41 60 -52 -86 -265 96 -94 19 -76 72 87 202 239 -88 -155 168 10 -117 -196 -122 5 128 26 191
6249A91j64N2j52L5J43j92P7K02j81K12k03J20R3l32J47p5k88K67j3L6Q1R8j03
$$ 191 27 79 -73 -38 105 -87 -10 192 11 223 20 140 233 -99 48 -27 -315 -48 -61 -25 56 154 51
6272E1q9k48K71k63K47J20j49M9J07K89m91K34j81m5J75Pr2k3j2o6K37k44j12
$$ 51 -38 -286 -15 -278 -31 89 -60 -11 96 385 -106 128 -53 -98 77 84 -8 -31 -43 -109 128 -116 -228
6295b28O2K20j13p7J50j80Q5J09m6J57p4j20K63j60l40K10o1j2J89K1j7k76M47
$$ -228 -166 54 -59 -136 14 -166 -81 28 -18 139 65 -55 208 48 -292 -82 -143 -155 34 55 38 -238 209
6318B09j94J15k47j7J8K96m07L4M81j56j10LJ29j60m9K85k49J83l9n1L7l63L43
$$ 209 15 130 -117 -134 -116 180 -227 -193 288 132 22 25 154 -6 -55 230 -19 164 125 74 111 -252 91
6341I1l9k72l1J86j2j55K7J68K30n1l13K11M3j03J8J19mk4r7K82j78k50J43j44
$$ 91 52 -220 -251 -65 -77 -232 -205 -37 193 142 -171 40 83 -20 -2 117 113 89 -8 274 96 -154 -11 -155
6365a55L52k73J0K9N6j28J47j0r8K72l5m37J15P9m7M8k7M35l01n8J36M8m7j03
$$ -155 197 -76 -66 -37 19 -109 38 28 -70 202 167 -270 -155 -76 -123 -75 -102 333 32 -26 110 158 111 8
6389Hr7P7m6J27Q8j84K79j98j6J86k84J24K4k16L2J73O2M7j78L14l37P9J01l1
$$ 8 -89 -12 -58 69 157 -27 252 54 38 224 -60 64 88 -128 -96 77 139 186 8 322 -15 64 165 134
6413A34j22j14k59J37L22r0J56j4L0k35nL2J6l22M6K14J9R4L7K07j50j44j41J00
$$ 134 12 -102 -361 -224 98 8 164 150 180 -55 -60 -28 -12 -334 -288 -74 -55 39 76 283 133 -11 -152 -52
6437e2J16l61M16l30K36J25j69L99m15n4j14R4J62j72l7J77J77l1l05L43l13K02
$$ -52 64 -297 119 -211 25 150 -19 380 -35 -89 -203 -109 53 -119 -156 21 198 167 -138 205 -108 94
6459I4m2p8j94L22M5m40L99k4r1K07k49j52J62k17PJ67O4j53K15K07N4j31j2k17
$$ 94 52 -26 -220 102 147 -293 106 82 -9 198 -51 -203 -41 -258 -251 -84 -20 -173 42 249 303 172 160 -57
6483e7j91K43j61J21J00K7j26L5K28k2l51l0L10J0r0l1J93l83L4L26P9l86K83
$$ -57 -248 -5 -166 -45 55 82 -44 -9 219 197 -154 -184 126 136 46 15 208 -175 -141 185 264 -122 161
6506A61j82J7N0J45k14p8J59N0j75o9R6j6J38j13n7k4r9L19r1J28O2l68N3M9q0
$$ 161 -21 -4 46 191 -23 -101 58 108 -67 -136 -40 -56 82 -31 -88 -112 -211 108 17 145 207 -161 -108 -59 -139
6531a39J28j31J30J16o2j96J32j53R3L14k51R7j38kJ95j06n9L31k35m7k58J09
$$ -139 -11 -142 -12 104 42 -154 -22 -175 -82 232 -19 78 -60 -62 133 27 -32 299 64 17 -241 -132
6553a32J20j05K7L7l2J76p5J12j84J55j79j74J77j29L24J08k59L2J02j0Jj87J52
$$ -132 -12 -117 -90 -53 -85 91 16 128 -56 99 -80 -254 -77 -206 118 226 -33 -1 101 91 92 -95 57
6576E7j87J35k30J63k6K10O9j68M6M9l59L16m9k32J81M6K2k32J20J54k46J5N5
$$ 57 -130 5 -225 -62 -88 122 191 23 69 118 -241 75 26 -206 -25 21 43 -189 -69 85 -161 -146 -91
6599i1m3J41J23j28R4j9NK0k88J64O1K5l59J85J82P6j89j11K45Nk7k11K30j70
$$ -91 -134 7 130 2 96 77 82 102 -186 -22 39 64 -295 -110 72 148 -41 -152 93 98 71 -140 90 -80
6623h0Q5K8j40K42q6K11n8k00J19p9j7O9j08K35k5k70R0j43J2rJ97l60K60r7O
$$ -80 5 33 -107 135 49 260 202 2 121 42 25 94 -14 221 196 -74 16 -127 -115 -124 73 -287 -27 -124 -118
6648a18K66K93m92J32J90j07M6k89P5j82L05k17j61K78Rj3J52n6k0r1p2K05j65
$$ -118 148 441 -51 81 271 164 210 -79 -4 -186 119 -98 -259 19 28 15 167 111 91 0 -72 133 -32
6671c2K3J1p8P7J82j21j39j10L2J27J36J8k05J31o2j39J09M2KJ05j72K15k00n9
$$ -32 -9 2 -76 1 183 62 -77 -187 -155 -28 108 126 -79 52 -10 -149 -40 2 4 109 -63 152 -48 -107
6695a07J28q6L35k87k9l0n1OQl6J59j86J57K77j30k15J30m18J19K09O5r5J11o1
$$ -107 21 -65 270 -17 -46 -76 -127 -121 -113 -149 10 -176 -19 258 128 -87 43 -375 -256 -47 18 -77 34 -27
6719b7L75l83J33Ll20L05k16j84M23l18J40J21L2L6J91l18j23J10j46J44L3k58
$$ -27 348 -35 98 101 -219 86 -130 -314 109 -209 -69 52 84 120 311 -7 -130 -20 -166 -22 11 -247
6741b47J92j7J46M7j43P4L04l95K7m8R8K35j26J9k51K20j49O4j5j20p4k0K72j27
$$ -247 -55 -72 74 121 -22 52 356 -39 -12 -60 38 273 147 166 -85 135 -14 50 35 -85 -159 -179 93 -34
6765c4k1O6N5r6n6R9n6R2j46k1j11L24o4m3K41k39j4%m47M31M5M8p9n8O3q3R0
$$ -34 -55 11 66 -30 -86 13 -43 49 -97 -118 -229 95 31 -12 229 -10 -24 -24 -471 -40 5 53 -26 -84 -21 -104 -14
6792a4j50K30Nm21K18J77n34M62J88l09J49J09j98l4Q9K06k46j43Q8K70k62J38
$$ -14 -164 66 71 -350 -132 45 -489 -27 161 -148 1 110 -88 -122 -33 173 -73 -216 -128 142 -120 18
6814A8l6K39j02j40J96m75K55N0J1K41o4l57P5M7K3o7R0K61m16r2L73n6R0N8q1
$$ 18 -18 221 119 -21 175 -300 -45 5 16 257 193 -164 -89 -42 -19 -86 4 265 -151 -243 130 74 164 222 141
6839A41K20n09K0J09k9oJ43j96K94M7r4j97j89K23o8q2J03j43L03l64M34j80J74
$$ 141 361 -148 -128 -19 -48 -54 89 -107 187 234 140 -57 -246 -23 -91 -173 -70 -213 90 -274 160 -20 154
6862A54m8J19k56n6Q8J6M7P4R7l42o2R4R7Jo3o6N2J03j42K40j19j05P9qk66J29
$$ 154 106 225 -31 -87 1 17 64 138 235 -107 -169 -75 22 23 -40 -106 -54 49 -93 147 28 -77 2 -6 -272 -143
6888a43J10j56K33N4O7k36L07k88k3K75j80L2J86k19k63J90J20j3k34K74l45J91
$$ -143 -33 -189 44 98 165 -71 236 -52 -75 200 20 52 238 19 -244 -54 66 53 -181 93 -252 -61
6910f1o4j16J11J59J1j51QJ87R3k61J76l40R5K83l63K13J61j9l0l83N46k37Q7
$$ -61 -125 -241 -130 29 40 -111 -103 84 177 -84 92 -248 -153 130 -233 -20 141 122 92 -291 255 18 105
6933A05l82J39J25J17k62J41k8L05k64n1P7r2J78k85J10oR7J5O9o7o8R2j81J44
$$ 105 -277 -138 -13 104 -158 -17 -45 260 -4 -55 22 -70 108 -177 -67 -73 24 39 108 41 -27 65 -116 28
6957B8j12j7K26n6n0k08J33M07l49l3j2R9J0l7j64k47K80K21n3j2K0k16L8K90
$$ 28 -84 -101 125 69 19 -189 -56 351 2 -31 -43 56 66 29 -135 -382 -102 119 66 54 74 -142 -104 186
6981A86k24L6J61j33m2J54j93Q9l10M07k52m8K92r2J35l05L39j63p5jm5n9L42
$$ 186 -38 -2 159 26 -16 138 -55 34 -276 131 -121 -169 123 31 166 -139 200 37 -38 -39 -84 -143 199
7004A99J3k69P3j9l57L56j87M73l32J12L3k48j07J90N7p3J04J28J18k29k3J19
$$ 199 212 -57 16 -3 -360 -4 -191 282 -50 62 95 -153 -260 -70 -13 -86 18 146 264 35 12 131
7026A31j47J72j28p5P8K3N4r6K44k46n9m9J66k08K31q6j64m5K33j12K05j97k33
$$ 131 -16 156 28 -47 31 54 108 12 256 10 -49 -98 68 -140 91 5 -159 -204 29 -83 122 -75 -308
7049c08J99J36K4m1k65M84k41J1P2k47L00k86J50k16J69P7J01k50K15L1j14j15
$$ -308 -109 27 51 10 -255 229 -12 -1 71 -176 124 -162 -12 -228 -59 18 119 -131 84 115 1 -114
7071a14l8K32j63J01j49J92J1lk67K29Q2rr0p4j30K51p9m0p9Q0q7k8L76j61rJ55
$$ -114 -152 80 -83 18 -131 61 72 69 -198 31 113 104 14 -60 -190 61 -18 -58 -137 -57 -144 -172 204 43 34 189
7097A89o9m0k51J74Q6k70J64p3K2l9L5NO2j05J66Q2j17J12j29J68k82QK02j87
$$ 189 120 80 -171 3 89 -181 -17 -90 -68 -107 -72 -67 -5 -110 56 138 21 133 4 172 -110 -102 100 -87
7121h7J43j9j64N3K76q7R3j81J38k78q2K99M8k04K75o2o7M7j63N8l89K25K01q6
$$ -87 56 37 -127 -74 202 115 208 27 165 -113 -195 104 152 -52 223 161 94 141 -22 36 -353 -128 73 -13
7145a3J84Rj42nR1j50L74n71J61P5M8k9r5O2K14k09R1p4j48J17j19M4k65K69k4
$$ -13 171 180 38 33 124 -26 348 -223 -62 13 61 32 -63 -1 213 4 95 21 -127 -10 -129 -85 -350 -81 -105
7170a05J43MP4M1l04K05k32K89k29R1pP8K56l22j43J94j10J6k02k1J44O1K58j3
$$ -105 38 42 116 157 -147 58 -174 115 -114 -23 -30 48 304 -18 -161 33 -77 -61 -263 -284 -140 -79 179 166
7194A66l28J86r6J0K67m6k60Pr4M4p6L72k31Q3K2p3k2K60m20J66J14J96m56R7
$$ 166 -162 24 -72 -62 205 159 -101 -94 -188 -144 -220 152 -79 4 26 -47 -69 191 -229 -63 51 247 -209 -112
7218a12K96n0J5J30n17M43k52R3Q2J17k58k13L55j9l4k62J04J94k53K66p9j07
$$ -112 184 134 149 279 -238 205 -47 46 128 245 -13 -226 129 110 76 -186 -82 112 -141 125 46 -61
7240f1J26l9J43k28J07j53K14j83k6k09K96K16k57J8Q6k22K72J84j60l56J74L00
$$ -61 65 26 169 -59 48 -105 109 -74 -100 -309 -13 203 -54 -36 50 -172 100 284 124 -232 -58 242
7262B42j02j93J9J12n9o4k8L32m87J0L44j37J62R0q7k50j4J81o8M0o4J66l6r0
$$ 242 140 -53 -34 78 19 -45 -73 259 -228 -218 126 -11 151 241 154 -96 -110 71 3 43 -21 145 109 19
7286A9L2K9k25L52j57Q9k79Q6J8K24k27jj6J40q6l01L11m1j1j59K30L5J04k01
$$ 19 51 80 -145 207 50 139 -140 -54 -36 188 -39 -40 -56 84 -2 -303 8 -33 -44 -203 27 62 166 -35
7310c5q3M03l75J39k5N4J2k9m0n8n3j93N1l6L45o4J2j70J66N8L8K0k91Q0K77j93
$$ -35 -118 285 -90 49 24 78 90 61 21 -37 -90 -283 -232 -268 77 13 25 -145 21 79 117 137 -154 -74 203 10
7336A0q7K56j27rk12J38r5o4K76j42J26q8m7j29L41n09K76J07q9K86j97m1m7P0
$$ 10 -77 179 52 43 -169 -31 -126 -190 86 -56 70 -18 -65 -194 147 -362 -86 21 -68 218 21 -20 -67 3
7360Co0O2J04N1r6j82K62p1k01J21J20j67O6J05j31J30j51J10j84J16K79j83j63
$$ 3 -57 5 109 160 64 -118 144 73 -128 -7 113 -54 12 117 -14 116 -35 75 -109 7 286 103 -60
7383f0J77K4l9p3j7K76j58k39J9J58O5n8pp8p2q4M6J21j03J30q9M0J5j5r3r0L7
$$ -60 117 141 102 29 12 288 130 -109 -90 68 133 75 68 -10 -82 -166 -120 1 -102 28 -61 -21 -6 -21 -114 -204 -167
7410a67R8J29p4j34J24m3J95j60q0R2q5L6n5J43O5r0p0O7J21k00K58Qr0r2Q2l9
$$ -167 -69 60 -14 -148 -24 -67 128 -32 -112 -20 -105 -69 -124 19 84 -6 -76 -9 112 -88 170 178 88 -4 78 39
7436C9J93r1K8j68p2M5J8j36O2J12n3J14J09l34N5J45l6J2K2M9p9k02K10O0p6
$$ 39 232 141 169 1 -71 -26 -8 -144 -82 30 -23 91 200 -134 -79 66 30 42 64 113 34 -168 42 102 26
7461B6Lj2M4j30J9j70K32J30k82kK69k80J32k1j24J26J73j6l51K15k44L05j55
$$ 26 29 17 61 -69 -50 -220 12 142 -140 -142 127 -153 -21 -42 -166 -40 133 117 -234 -19 -263 42 -113
7484a13l6L49j96N7m7Q5k68L01k58N7n8r3K69o8K17l50j09K42J52k54rN51m25
$$ -113 -149 200 4 61 14 99 -169 132 -126 -69 -127 -220 49 -19 198 -152 -261 -19 133 -121 -130 421 -4
7507dL02j94k02K59k67J91j81m5J49j56K62L2m7j88R4LP0k54P4r6J32j06K52j37
$$ -4 298 104 -98 161 -106 85 -96 -141 8 -148 114 146 99 -89 5 8 78 -176 -102 -198 -66 -172 80 -57
7531e7M0n1pK82k35j75j62O32j61j77k42N16q0k69L8q2R4P8o7J17K22j51L4m13
$$ -57 -17 -68 -75 207 -28 -203 -365 267 106 -71 -313 203 123 -146 -108 -190 -96 -18 -85 32 254 103 137 -276
7555b76J16N1J75Kp8P0r1p4K91k67J52N7J16k19K0r2K9O5J06j86NR4J33l71L56
$$ -276 -160 -109 66 68 -10 60 -31 -105 186 -81 71 128 244 25 45 -47 -18 47 153 -33 -28 66 199 -172 184
7580A84l54K34j52k5K53r1m4r7K88k38J67o3q6p4J53Kl08L72j01qq1j08K58j19
$$ 184 -170 64 -88 -113 140 49 5 -92 196 -42 125 62 -24 -98 55 57 -251 121 20 12 -69 -177 81 -38
7604c8R1K2j32J83J10l22N4J71k89M48j55k75qJ82mj12n9K06J96j42k20J96j42
$$ -38 53 75 -57 126 236 -86 -32 139 -150 298 143 -132 -140 42 38 -74 -133 73 269 127 -93 103 -39
7627c9j2J6M0p2K6J34o2j07Qn3J49o0J03k9m21M13j78K12j65J89k19J16J81j56
$$ -39 -51 -35 5 -67 -41 93 31 -76 -68 -121 28 -32 71 42 -379 34 -144 68 -97 92 -127 -11 170 14
7651A4j87J7R5j2K56p9p8L9k56L00k82N9J87k72L10p3j78N5J62J3m0K1j91m3L6
$$ 14 -173 -156 -61 -73 183 104 26 65 -191 109 -173 -114 73 -199 111 38 -140 -85 77 90 50 71 -120 -163 -127
7676a27L33n7k45J2J12j48K67Mr3J9p8j79J58j64K16N0m2J76K2l15K30k28J55
$$ -127 206 149 -96 -84 28 -120 147 151 58 77 -1 -180 -22 -186 30 80 38 214 236 -79 151 -77 78
7699G8k14L86j46o7k8J3K3o5L5mn3J16Pm5J9l2j4n3K70j82r4J53j48k21L76M4
$$ 78 -136 250 104 37 9 22 45 -20 15 11 -42 74 81 36 55 23 9 -44 226 44 -50 103 -45 -266 110 154
7725A54J3k08J12L0j82j09K3Q9J50k02J86n5K20l05LL16m15K15O1o6o6j30P3K0
$$ 154 167 -41 71 101 -81 -190 -167 -78 72 -130 56 1 221 -84 -81 235 -180 35 96 30 -36 -166 -93 -73
7749g3O7K9O6k75M52l54o8K56k39L16j66o9K08r3J01j06m6r6l1j3O1K84j70Q6
$$ -73 -6 23 89 -186 266 -88 -156 100 -139 177 11 -58 150 57 158 52 6 -90 -121 -134 -73 211 41 127
7773A27k27R1j17o2L8J91o8O5K10k26o1J60j13p8j9P6J96k69p5J04M2J71k78J95
$$ 127 -100 -9 -126 -188 -150 41 -27 38 248 22 -39 121 8 -70 -89 -13 183 -86 -161 -57 -15 156 -122 73
7797G3M5j6n7j87J36J50k88J24K4K53j80j23j01K56j67J37J49j66n6P6j4NL5j09
$$ 73 118 102 45 -142 -6 144 -144 -20 4 257 77 -46 -147 109 -58 79 228 62 6 82 68 73 108 -1
7821aj44J09K37l33Rk26M44j96K54k97J31J41J9r6M8j02nj25K57rp1o3L4j24r
$$ -1 -145 -36 201 -132 -123 -349 95 -101 153 -144 -13 128 147 51 99 -3 -8 -133 124 115 44 -19 15 -109 -118
7846a18K47j12Q6L0n7l01L39o8p9J90j97j53K07Q6j45k1j74K77j10M3K7P7l23
$$ -118 129 17 103 133 76 -225 114 46 -33 157 -40 -193 14 100 -45 -66 -240 37 -73 -30 -3 74 -249
7869b49J85o4Q8j5J2J7l0P0J4P3m8j18K64j74j41L02l0j37n7n2K46o3K0k36K72
$$ -249 -64 -128 -40 -55 -43 -26 -56 14 28 101 53 -65 199 25 -116 186 156 19 -38 -90 156 93 113 -123 149
7894A49k28K57r1K78j85k77J99q3j9j28J55j11K30qP9j80j35P6l7O7K2j5k9Q6
$$ 149 -79 178 87 365 180 -97 102 19 0 -128 27 -84 146 138 217 37 -98 -22 -59 8 30 15 -14 72
7918G2j56K38k29J1J83r8j63K93j95r0N8J51P3P9k48M9J03j43R0j76J64L7p7k09
$$ 72 -84 154 -75 -64 119 21 -142 151 -44 -134 -76 75 148 227 -21 28 131 -12 78 -98 66 103 26 -183
7942a83m3J63J15j53K12j58J95J49l05J63l17K33k32K46k76k4L76qj55r5K39k89
$$ -183 -226 -63 52 -101 111 -47 148 297 -8 155 -162 71 -161 85 -191 -215 161 153 -2 -97 142 -147
7964a47J95k0n1Q7j24N9L39m25L4j10J50J14K7p8j18J82m9j80J22l5k7L15j80
$$ -147 48 28 -23 64 -60 -1 338 -87 -53 -163 -13 101 128 50 -68 114 65 -115 7 -28 -55 260 80
7987H0l00J84J22k01K35j35Q4L3l34J75J87k59N6K93m07P5K66p9n3r4J03K9o8
$$ 80 -220 -36 86 -115 120 -15 69 102 -232 -57 130 -129 -73 220 -187 -112 154 75 22 -72 31 60 -8
8010hJ10j11N5j36J44j58K28j05j17K16j71O5L3pJ6j20p3J35j73K33K%o5K22j31
$$ -8 102 -9 46 -90 54 -104 124 19 -98 118 -53 12 45 38 54 -66 -139 -4 -177 56 58 58 -7 215 84
8035H4k41O8N3J01LJ45k68J06p5j14p7MK47n2k51N97m73K28K59l16k5J90l19J78
$$ 84 -157 -89 -36 65 68 213 -55 51 -24 -138 -215 -211 36 -16 -267 330 -143 85 344 28 3 193 -126 52
8059E2L1O2m13M72o2j86J07j77n2J69k2R8J22j99K59m45J65M1o5j21K46l00m0
$$ 52 83 145 -268 204 142 -44 63 -114 -166 3 -19 79 201 2 261 -184 -19 22 -43 -164 82 -218 -258
8082b58K40k8Q1j09P3k5P1p5n6N9J23j06M6n2p2p5J41O3m18K48l7M16o4j05p7
$$ -258 -18 -46 35 -74 -1 -26 45 -30 -86 -27 96 -10 36 -16 -88 -163 -22 41 -377 -129 -166 250 186 81 4
8107Dj25M41n10J63J60k69K07p1nj47O2O4K27j29j93J50J32l50J69j24K16j8q0
$$ 4 -121 320 -190 -27 133 -136 71 0 -5 -152 -90 -26 201 72 -121 29 161 -189 -20 -144 72 54 -26
8130b6n1K38k43P6k35J8L09o0j39J85Pp7j12J5m4L46j15P1l77L49l16J60l8r8
$$ -26 -77 161 -82 -6 -241 -223 86 26 -113 72 79 2 -110 -95 -139 207 92 163 -214 135 -181 -21 -59 -157
8154a57J59l1M3p1K14j19n8j66J11J08n9p3P9rN1j24rL01k58j90L74j81J97k29
$$ -157 2 -29 14 -57 157 38 -20 -186 -75 33 -26 -99 -20 -29 22 -102 -111 190 -68 -258 116 -65 132 -97
8178i7r1J74Ml5k02Q4K75k40p2L32p4j48P5
$$ -97 -188 -14 -10 -45 -247 -163 112 -128 -200 132 58 -90 -15
8191a5
$$ Imaginary data points
##PAGE= N=2
##DATA TABLE= (X++(I..I)), XYDATA
0@%%%%%%LlQj6J6j6J6k4L2m0N6o4P4r0J12j36J56j88K19k54K97l42L97m55N20
$$ 0 0 0 0 0 0 0 3 0 8 -8 8 -8 8 -16 16 -24 32 -32 42 -48 64 -72 84 -104 115 -139 158 -184 213 -242 278
31B78n93O75p68Q65r76J096j228J376j532J708j900K108k337K585k855L151l479
$$ 278 -315 360 -408 457 -519 577 -651 725 -807 901 -999 1109 -1228 1357 -1498 1653 -1826
48a826L836m225M652n123N650o233O886p620Q450r406J0510j1811J3361j5253
$$ -1826 2010 -2215 2437 -2686 2964 -3269 3617 -4003 4447 -4959 5551 -6260 7101 -8152
62h152J7632k0706K4870l0858M0279n7405R8664l90454n80117K07465K61384L96870
$$ -8152 9480 -11226 13644 -17214 23065 -34340 64324 -326130 -906247 -698782 -437398 -40528
74d0528L00477K99367J52632Q790k52650m10079m65283k84119m3419J85369K66135
$$ -40528 259949 559316 711948 720738 468088 58009 -407274 -691393 -734812 -549443 -283308
85b83308L15908L22317K89023J10773j33427l59125m25121l46123j57242K6126
$$ -283308 32600 354917 643940 754713 621286 262161 -162960 -509083 -666325 -640199
95f40199J73038K68556L45760L46373K21450k4896k58473l73843l46783k42498
$$ -640199 -467161 -198605 147155 493528 714978 690082 431609 57766 -289017 -531515
105e31515j01120N1218K07502L28479L66664K80697Q6766j38059k91789l34109
$$ -531515 -632635 -581417 -373915 -45436 321228 601925 688691 550632 258843 -75266
115g5266k93548k02928o1782J16562K82967L63066L21414J76279j4123j85975
$$ -75266 -368814 -571742 -633524 -516962 -233995 129071 450485 626764 612641 426666
125D26666k92806l20249k72689j53432K2731K05220L24416L35648K45711R3395
$$ 426666 133860 -186389 -459078 -612510 -589779 -384559 -60143 275505 521216 614611
135F14611p6121k24594l12473l13814k25815p1007J06161K52234L21489K94601
$$ 614611 538490 313896 1423 -312391 -538206 -609213 -503052 -250818 70671 365272
145C65272J85368K7423j38208k65767l17109k74951j54693P341J66496K79094
$$ 365272 550640 578063 439855 174088 -143021 -417972 -572665 -565324 -398828 -119734
155a19734L12387K53561J20697m5328j94777k84829k93749k20600q6421P3689
$$ -119734 192653 446214 566911 521583 326806 41977 -251772 -472372 -558793 -485104
165d85104K15086K94615K84859J90896M4303j09603k29905k86425k64293j64632
$$ -485104 -270018 24597 309456 500352 544655 435052 205147 -81278 -345571 -510203
175e10203j6627J36165K47987K85735K40416J28725j7496j58358k54953k78258
$$ -510203 -526830 -390665 -142678 143057 383473 512198 494702 336344 81391 -196867
185a96867k20020r6679N3035J83029K59283K63809J95749O9908p9255k06389k69716
$$ -196867 -416887 -513566 -460531 -277502 -18219 245590 441339 511247 431992 225603 -44113
196d4113k49390j61122l2165J00911K09350K63299K42894J46357J629j39089k31938
$$ -44113 -293503 -454625 -486790 -385879 -176529 86770 329664 476021 477650 338561 106623
207A06623k51757k05241j09958J3920J42303K38583K64460K04478P8499o5012
$$ 106623 -145134 -350375 -460333 -446413 -304110 -65527 198933 403411 481910 416898
217D16898j75901k30311k28177j74586p1985O3887J91849K59083K36046J38116
$$ 416898 240997 10686 -217491 -392077 -464062 -400175 -208326 50757 286803 424919
227D24919J1090j03456j85627k26066k16356j42746j2439J31676K29110K43385
$$ 424919 436009 332553 146926 -79140 -295496 -438242 -450681 -319005 -89895 153490
237A53490J81245Q0274k6217j23946k01951k34561j95239q2680O3561J80807K26916
$$ 153490 334735 415009 388792 264846 62895 -171666 -366905 -449585 -386024 -205217 21699
248B1699K02636J35597M7070n6519j61786k32307k27434j38530m181J17912J89782
$$ 21699 224335 359932 407002 350483 188697 -43610 -271044 -409574 -413755 -295843 -106061
259a06061K04544J75568J10074J0623j07875k05955k36086j80933o7525N0397
$$ -106061 98483 274051 384125 394748 286873 80918 -155168 -336101 -403626 -353229
269c53229J37834J86588J96558J61801P4682m7218j63368k23589k04246j22566
$$ -353229 -215395 -28807 167751 329552 404234 357016 193648 -29941 -234187 -356753
279c56753j8494P6292J50275J95860J94550J29665J4171j07493j88278k04765
$$ -356753 -375247 -298955 -148680 47180 241730 371395 385566 278073 89795 -114970
289a14970j61362q1040J2066J02462J74055K04686J70627P4764m4997j39826j84747
$$ -114970 -276332 -357372 -345306 -242844 -68789 135897 306524 381288 336291 196465 11718
300A1718j79105j32743n3277M5154J37553J93068J88228J21797J8369q1775j50292
$$ 11718 -167387 -300130 -353407 -308253 -170700 22368 210596 332393 350762 268987 118695
311A18695j78129j63822j06238j2643R1104J66376J88303J52279P5101j9021j03581
$$ 118695 -59434 -223256 -329494 -342137 -251033 -84657 103646 255925 331026 312005 208424
322B08424j60032j75691j44502o5924L7018J26727J72322J66488J17582M1030
$$ 208424 48392 -127299 -271801 -337725 -300707 -173980 -1658 164830 282412 323442
332C23442m8969j29308j73660j66548j07775j7578P5359J42189J67132J48429
$$ 323442 274473 145165 -28495 -195043 -302818 -320396 -245037 -102848 64284 212713
342B12713R1036N983q5189j54084j73128j39448o6730K0741R9265J50958J62606
$$ 212713 303749 309732 224543 70459 -102669 -242117 -308847 -288106 -188841 -37883 124723
353A24723J29990N7723l4970j18531j62882j57198j07011l2382M9278J19878J59906
$$ 124723 254713 312436 277466 158935 -3947 -161145 -268156 -300538 -251260 -131382 28524
364B8524J53965R9852J5558p2445j35841j58158j35911p8225N5P9390J39267J59603
$$ 28524 182489 282341 297899 225454 89613 -68545 -204456 -282681 -282626 -203236 -63969 95634
376I5634J31397O2518k2657r8141j42852j47601j12739m6503L4048J05805J48180
$$ 95634 227031 289549 266892 168751 25899 -121702 -234441 -280944 -246896 -141091 7089
387G089J45721J00065K5347n4320j17067j45276j32583q4845j1560O4437J23577
$$ 7089 152810 252875 278222 223902 106835 -38441 -171024 -255869 -267429 -202992 -79415
398g9415J47417J27414O8468j0374q2350j28009j37544j11519n4938J9961R0665
$$ -79415 68002 195416 263884 253510 171160 43151 -94393 -205912 -260850 -240889 -150224
409a50224J36201J39918J00583L2043m1907j00102j29755j26970r0939k6095N0612
$$ -150224 -14023 125895 226478 258521 216614 116512 -13243 -140213 -231152 -257247 -206635
420b06635J13839J40077J21749O8723J016o1939j09047j30221j17793o6889Q144
$$ -206635 -92796 47281 169030 237753 238769 176830 67783 -62438 -180231 -247120 -238976
431b38976Q2542J25629J28433R5841M2694j9429p9319j21928j30973r7429l1341
$$ -238976 -156434 -30805 97628 193469 236163 216734 137415 15487 -115486 -212915 -244256
442b44256M2965R8316J21426J12329P7747K3445m2493j01691j30621j16442o4488
$$ -244256 -201291 -102975 18451 130780 208527 231972 189479 87788 -42833 -159275 -223763
453b23763K523O2338J01848J17122J03914O0791o270p3850j17065j20737q8611
$$ -223763 -221240 -158902 -57054 60068 163982 224773 218503 144653 27588 -93149 -181760
464a81760l6302K1956P4932J11560J18650Q8353K7779m1500r2844j13521j03468
$$ -181760 -218062 -196106 -121174 -9614 109036 197389 225168 183668 90824 -22697 -126165
475a26165o9364j8678M2263R6093J21934J06461N6311o130o0472r5352j08363
$$ -126165 -195529 -214207 -171944 -75851 46083 152544 208855 202725 142253 46901 -61462
486f1462r6161n5188R010P4195J13547J12225P7919K8480k2799o9113j03789j12859
$$ -61462 -157623 -212811 -203801 -129606 -16059 96166 174085 202565 179766 110653 6864 -105995
498a05995q4439k3938M5017R3284J06193R1635N9339J5806l6743q8430j17253
$$ -105995 -190434 -214372 -169355 -76071 30122 121757 181096 196902 160159 71729 -45524
509d5524j04063n2039J2942O3651Q9719R4773Q3955N1375l518o6476j09479j10535
$$ -45524 -149587 -201626 -188684 -125033 -35314 59459 143414 194789 191271 124795 15316 -95219
521i5219p3607j9175K9290O5116Q8867R7221P8564K8249l8518r0542j05629q5803
$$ -95219 -168826 -188001 -158711 -93595 -4728 92493 171057 199306 160788 70246 -35383 -121186
533a21186m7198n214L5602P4747J00752R6391N3923q214o3860r1139r0027o9805
$$ -121186 -168384 -173598 -137996 -63249 37503 133894 187817 179603 115743 24604 -65423 -135228
545a35228l7700O048N5458R3844J02549P4212K1681l1519o9514q6930q5047o2889
$$ -135228 -172928 -166880 -111422 -17578 84971 159183 180864 149345 79831 -7099 -92146 -155035
557a55035k2244L0520P7474R8598Q7172M9260J446m2750p5356r0553q1555m7139
$$ -155035 -177279 -146759 -69285 29313 116485 165745 167191 124441 49085 -41468 -123023 -170162
569a70162L275N3092Q5369R1387P2408L3995j3841n7810q6260q9514o6243k4396
$$ -170162 -166887 -113795 -28426 62961 135369 169364 155523 97713 11453 -78061 -144304 -168700
581a68700K3540O3800Q7843Q6639O0029J4219l4897p1679q7075p7849m9414p344
$$ -168700 -145160 -81360 6483 93122 153151 167370 132473 60794 -26281 -104130 -153544 -160888
593a60888L7948P5500R0983P8010L9018r199n0332p4518q0761o9090l6578J0000
$$ -160888 -122940 -47440 43543 121553 160571 151372 101040 26522 -54239 -123329 -159907 -149907
605a49907N7896Q6387Q5129N7100J6235k3935n6555p6868q0307n9531j5576L5550
$$ -149907 -92011 -5624 79505 136605 152840 128905 72350 -4518 -84825 -144356 -159932 -124382
617a24382P3478Q3909O8918L8809L337l4097o6603q3454p5409l8659J0753N3698
$$ -124382 -50904 33005 101923 140732 144069 109972 43369 -40085 -115494 -154153 -143400 -89702
629h9702P4541P3580N7459K8940r172n0601p9659q2419n6550j4020K8424N8325
$$ -89702 -15161 58419 115878 144818 135646 85045 5386 -77033 -133583 -147603 -119179 -60854
641f0854P2258P0205N0836J4716l0334o7111q1171o8567l7057J277L6986O3189
$$ -60854 11404 81609 132445 147161 116827 49716 -31455 -100022 -137079 -135802 -98816 -35627
653c5627P5107O6372L5892p098m7479p1072p2780n5625k5075J2013M8954P2490
$$ -35627 39480 105852 141744 134646 87167 16095 -56685 -112310 -137385 -125372 -76418 -3928
665c928P3948N2116J5361k3552n3965p0070o8153m7285j0598L0217O1548P2785
$$ -3928 70020 122136 137497 113945 59980 -10090 -78243 -125528 -136126 -105909 -44361 28424
677B8424O1864L5305J410l2586o0178p2394o2853l1889R592M5460O4880O5173
$$ 28424 90288 125593 127003 94417 34239 -38155 -101008 -132897 -123305 -77845 -12965 52208
689E2208N0823K4717r349m5700p0250p2015m8205j0432K5529N1072O2308O1596
$$ 52208 103031 127748 118399 72699 2449 -69566 -117771 -128203 -102674 -51602 10706 72302
701G2302M4775J2732k7562o1279p3050n9394k9129M477L2580N3640O5320N9658
$$ 72302 117077 129809 102247 40968 -32082 -91476 -120605 -116128 -83548 -29908 35412 95070
713I5070L3814p560m6859o7736o3785m3944j7137J1022L9961O2715O8585N0031
$$ 95070 128884 121324 74465 6729 -57056 -101000 -118137 -107115 -67154 -4439 64146 114177
725A14177J2914k7556n5050o2590n3775l5501r896K2285N3041O9185O1218L1005
$$ 114177 127091 99535 44485 -18105 -71880 -107381 -117277 -94992 -41951 27234 88452 119457
737A19457o940l7691n4313n7203m9228k8786L060L8846O3116O5167M4819J3039
$$ 119457 112517 74826 20513 -36690 -85918 -114704 -111644 -72798 -9682 55485 100304 113343
749A13343j7653m1245n4620n6670m4164j4994K1557N1218O2428N3786L0436J782
$$ 113343 95690 54445 -175 -56845 -101009 -116003 -94446 -43228 19200 72986 103422 105204
761A05204k4942m6870n8481n3714l0903L120L5460N5094N7087M3435K0449o753
$$ 105204 80262 33392 -25089 -78803 -109706 -106586 -71126 -16032 41055 84490 104939 98186
773I8186l5231n4410n8646m3432j5168J7073M2849N4762N2749L6315J0083j9840
$$ 98186 62955 8545 -50101 -93533 -108701 -91628 -48779 5983 58732 95047 105130 85290
785H5290m4864n7255n2304l1884j771K6966M8346N4961M8040K6180k789l1140
$$ 85290 40426 -16829 -69133 -101017 -102788 -75822 -27476 27485 75525 101705 98916 67776
797F7776n0667n5369m3590k0636Q586L6061N2310N3274L9236J4050j4330l8811
$$ 67776 17109 -38260 -81850 -102486 -93900 -57839 -5529 47745 86981 101031 86701 47890
809D7890n2640n1765l5455q401K1084M3631N2869M7401K8830K674k4414m5331
$$ 47890 -4750 -56515 -91970 -100371 -79287 -35656 17213 64614 93444 96118 71704 26373
821B6373n3401m5651k3930N045L1210M7334M9857L9966J8353q365l4378n0060
$$ 26373 -27028 -72679 -96609 -91564 -60354 -13020 36837 76803 95156 86791 52413 2353
833B353n0416l5476j0268J5922L6973M8583M7051L2037O743k1419m2462n0058
$$ 2353 -48063 -83539 -93807 -77885 -40912 7671 54722 86759 93502 72083 29621 -20437
845b0437m2748k4966k73K4724M3084M9888M1013K0454o650l0424m4947m6667l6164
$$ -20437 -63185 -88151 -88424 -63700 -20616 29272 70285 90739 84089 53665 8718 -37949 -74113
858g4113j5807R715L4064M8157M6331L1126P805j5654l4715m6171m4389k9591
$$ -74113 -89920 -80205 -46141 2016 48347 79473 87278 71624 36909 -9262 -53651 -83242
870h3242m489K1784M0981M6013L8771K1807M74k2168m0710m7419l9658j7650Q198
$$ -83242 -87731 -65947 -24966 21047 59818 81625 82099 59931 19221 -28198 -67856 -85506 -77308
883g7308K9826M0976M1172L3054J5178p602l1838m5908m4334k8058n006J6119
$$ -77308 -47482 -6506 34666 67720 82898 75296 43458 -2450 -46784 -74842 -79848 -63729
895f3729L1439L9989M0267K8573N741k0533l9875m4275l4574j7434J681J9749
$$ -63729 -32290 7699 47966 76539 82280 61747 21872 -22403 -56977 -74411 -72730 -52981
907e2981L5419M3351L7564J8103q659l0698m0152l7291k7837j2039P290K8151
$$ -52981 -17562 25789 63353 81456 72797 42099 1947 -35344 -63181 -75220 -67930 -39779
919c9779M2019M3271K7358L413j8044l2376l7461l4751k4427n435J8680L7468
$$ -39779 2240 45511 72869 76282 58238 25862 -11599 -46350 -70777 -76212 -57532 -20064
931b0064M3334L4066J5826m479k2046l4225l8952l3204j6679P279K9160L9841
$$ -20064 23270 57336 73162 68683 46637 12412 -26540 -59744 -76423 -69144 -39984 -143
943a43L7183K5589R064j0020k7229l8589l8505k5663m478J7860L1871L6731L2728
$$ -143 37040 62629 71693 61673 34444 -4145 -42650 -68313 -72791 -54931 -23060 13671 46399
956D6399K0614K528j8309l4257l9087l1657j4979M608K1860L3644L5742K9102
$$ 46399 67013 69541 51232 16975 -22112 -53769 -68748 -64140 -42280 -8636 27106 56208
968E6208J3101p529k6457l6201l4594k2981p569J0333K6761L5691L4176K1388
$$ 56208 69309 61780 35323 -878 -35472 -58453 -66022 -55689 -28928 6763 40939 62327
980F2327K813j6459k9165l4040l0019j8145R7J8414L1757L5031K7691J2581m818
$$ 62327 65140 48681 19516 -14524 -44543 -62688 -62591 -44177 -12420 22611 50302 62883 58065
993E8065k0770l1725l3488k5845r915Q818K4586L2690L1195K1752O785j1425k6137
$$ 58065 37295 5570 -27918 -53763 -63678 -54860 -30274 2416 33611 55363 62148 50723 24586
1006B4586l3655l0877j8226j245J4817K6985L1940K8852J6899r52j9249l0598
$$ 24586 -9069 -39946 -58172 -59417 -44600 -17615 14325 43177 60076 59124 39875 9277
1018I277l1791k4223j1044L341J8710K9939L3243K4914P871j0367k3771k9460
$$ 9277 -22514 -46737 -57781 -54440 -35730 -5791 27452 52366 60237 49870 26099 -3361
1030c361k7099k0103p463R437K5565L3351K9451J5617j729j5033k3504k8003k6134
$$ -3361 -30460 -50563 -58026 -48589 -23024 10327 39778 55395 53666 38633 15129 -12874 -39008
1043c9008j7243M8J8960L0934L0723K0391P408n235j5941k5755l0463k4334q518
$$ -39008 -56251 -56203 -37243 -6309 24414 44805 52213 46978 31037 5282 -25181 -49515 -58033
1056e8033J1651K5766K8584K3595J4480M784p560k1965l1491k9319j5395L863
$$ -58033 -46382 -20616 7968 31563 46043 50827 43267 21302 -10189 -39508 -54903 -51040
1068e1040J8513K4274K3942K0757J3397J406j6285k9510l1173k0667m320R557
$$ -51040 -32527 -8253 15689 36446 49843 51249 34964 5454 -25719 -46386 -50706 -41149
1080d1149J7550K2508K4336K1281R047r003k4555k9998k3927j1768L23J0059J8321
$$ -41149 -23599 -1091 23245 44526 53573 44570 20015 -9983 -33910 -45678 -45355 -35296 -16975
1093a6975K5313K6244J6304j411j7468k5926k4459j7441r016J631J3113K3539
$$ -16975 8338 34582 50886 49475 32007 6081 -18378 -35819 -44835 -43204 -30091 -6552
1105f552K7839K1054O166q751j9359k2977k1136j5881o052O662J9471K6561K3629
$$ -6552 21287 42341 48507 39756 20397 -2580 -23716 -39597 -45649 -38987 -19516 7045 30674
1118C0674J3257n95j2066j9312k2388k0406j2620jJ3648K2998K4189J7755P542
$$ 30674 43931 43336 31270 11958 -10430 -30836 -43456 -43457 -29809 -6811 17378 35133 42675
1131D2675m042j4374k1333k2808j7544o519O825J7890K2665K1117J4215L214q481
$$ 42675 38633 24259 2926 -19882 -37426 -43945 -37120 -19230 3435 24552 38767 41981 33500
1144C3500j8357k2401k1034j2413k49J1305J9559K2533J8801R894j940j3303k0621
$$ 33500 15143 -7258 -28292 -40705 -40954 -29649 -10090 12443 31244 41138 39198 25895 5274
1157E274k1790j6983p599M219J4892K1444K1285J5296M324o748j6402k0956j9644
$$ 5274 -16516 -33499 -41098 -36879 -21987 -543 20742 36038 40362 33614 17212 -3744 -23388
1170b3388j3456l178R123J8047K1469J8600J0674l77j0855j7976k0618j7598r217
$$ -23388 -36844 -40022 -30899 -12852 8617 27217 37891 37514 26659 8683 -11935 -29533 -38750
1183c8750K913J3208J9363J9722J4741O124m441j3869j9314j9424j3697l561P401
$$ -38750 -35837 -22629 -3266 16456 31197 37321 32880 19011 -303 -19727 -33424 -36985 -29584
1196b9584J5502J8897J7561J1400J755q730j6554j9244j6682q923J156J0517J6570
$$ -29584 -14082 4815 22376 33776 35531 26801 10247 -8997 -25679 -34602 -33446 -22929 -6359
1209f359J8973J5021P435l360j2376j7771j7739j2647n433M312J3655J8193J7572
$$ -6359 12614 27635 35070 31710 19334 1563 -16176 -28823 -34256 -29944 -16289 1904 19476
1222A9476J1740K080p095j4086j6998j6232j0494j487Q435J6182J8260J4690P001
$$ 19476 31216 33296 26201 12115 -4883 -21115 -31609 -33096 -24661 -8479 9781 24471 31472
1235C1472j684q676j4907j7509j4689p165K934J2859J6983J5949J0398M087l054
$$ 31472 29788 21112 6205 -11304 -25993 -33158 -30224 -17365 -382 15567 25965 30052 26998
1248B6998j0839j7031j7007j2166j650Q267J4024J4806J2888R153K502o588j4333
$$ 26998 16159 -872 -17879 -30045 -31695 -23428 -9404 5402 18290 27443 29945 23357 9024
1261I024j8303j4757o034L199R820J2920J3779J2869P687j587j1718j7537j5559
$$ 9024 -9279 -24036 -30070 -26871 -17051 -4131 9648 22517 30204 28617 16899 -638 -16197
1274a6197r899j201M884R585J3547J4991J1829K676p444j5034j5757j1496n691
$$ -16197 -26096 -27297 -22413 -12828 719 15710 27539 30215 22771 7737 -8020 -19516 -25207
1287b5207k81N706J1926J6073J4534O873l524j1152j4201j2236r672n045J235
$$ -25207 -25488 -19782 -7856 8217 22751 29624 26100 14948 747 -11489 -21161 -26206 -24971
1300b4971R206J5654J6033J0008J062o513j0944j2467j1881r268l340O065J3456
$$ -24971 -15765 -111 15922 25930 26992 20479 9535 -2932 -14813 -24081 -27421 -21356 -7900
1313g900J5295J2335N117j258p000j0920j2932j2421o693K062R548J3922J2620
$$ -7900 7395 19730 24847 23589 16589 5669 -7263 -19684 -26377 -24315 -14767 -845 11775
1326A1775Q516L360j991q605j2549j3592r555k328N619J0566J2429J0799O974
$$ 11775 20291 23651 21660 13055 506 -13086 -22641 -24969 -19350 -8784 3645 14444 21418
1339B1418J909n043j1047j3251j1171n790J125O692J1069J1746J0220N200j598
$$ 21418 23327 18284 7237 -6014 -17185 -22975 -21850 -15158 -4089 7657 17877 23077 21479
1352B1479q487j1575j1812q579l487K776Q547J1889J1832P898J995m844r441j1669
$$ 21479 12992 1417 -10395 -18974 -22461 -19685 -11138 751 12583 20481 22476 17632 8191 -3478
1366c478j0524p021q84N465J0408J2212R939M982l87o418j0294j1716r407m669
$$ -3478 -14002 -21023 -21907 -16442 -6034 6178 16117 21099 20712 14294 4000 -7716 -17123 -21792
1380b1792J755P962J1175J0987P768L362k768p982j1179j1166p544j476M364Q593
$$ -21792 -20037 -12075 -900 10087 17855 21217 18449 10467 -712 -11878 -19422 -20898 -16534 -7941
1394g941J0978R899O804O19n186r646j1063r285m457L61N845R762J0656Q524M156
$$ -7941 3037 12936 19740 20359 15173 5527 -5536 -14821 -19278 -18917 -13072 -3310 7346 15870 20026
1409B0026k342o917r906j0348o982k985K600Q102J0363R606O260J199l952p908
$$ 20026 17684 10767 861 -9487 -16469 -19454 -16854 -8752 1611 11217 17477 18676 14724 6816
1423F816r759r593n422m55N314R217R621P883L994n41n339q850j0064q047l111
$$ 6816 -2943 -12536 -17958 -18413 -13099 -3882 5739 13622 17616 17075 11736 2886 -7178 -15225 -18336
1438a8336K541O738Q716Q751O277L032j995p372j0141r206n412k06L710O685Q654
$$ -18336 -15795 -9057 -341 8410 14687 17719 15724 8352 -1789 -10995 -16407 -16613 -12903 -6218 2436
1453B436Q292O020R49n218q623r340o708l597P01M108P422R301Q090L598k493
$$ 2436 10728 16748 17697 12479 3856 -5484 -12192 -15789 -15088 -10980 -3558 5743 13833 17431 14938
1468A4938o559q405p366n741k882J480N944R417Q991N456N18m296o091p460p187
$$ 14938 8379 -26 -7392 -13133 -16015 -14535 -8591 826 9817 15273 15791 11495 5404 -2056 -9243
1483i243n407j681M377Q027R374O573K622p99m433o394q146p431l629J894O449
$$ -9243 -14650 -16331 -11954 -3927 5447 12020 14642 13843 9410 3016 -5130 -12561 -16190 -14296 -7847
1498g847Q443O965M883J471j209n114q193q824n631o2M393O535O959O384M636
$$ -7847 596 7561 12444 13915 12706 7592 -601 -9425 -15056 -15118 -10725 -4190 2769 9153 13789
1513A3789O99l386p369q918o630k571J572M359O306O937O275L698j051n924q082
$$ 13789 14488 11102 3733 -5185 -11815 -14386 -12814 -8455 -2149 4788 11063 14761 13710 7786 -296
1528b96p211m777q89J811M802O905P453N364J071l501o695p057n797l294o03K840
$$ -296 -7507 -12284 -13173 -11362 -6560 345 7798 13162 14233 10732 4037 -3020 -8817 -12111 -12714 -9874
1544i874O065P508O649L103j279m735n987o142n176k788O86M386P130P098M306
$$ -9874 -3809 3699 10348 13451 12172 7437 1450 -4692 -9868 -12656 -11970 -7584 -454 6644 10950
1559A0950J229j908m772o155n825m766j335K768N701O831N630K757J80l101n108
$$ 10950 12179 10271 5499 -656 -6481 -11247 -12582 -9814 -4113 2718 8348 11105 11285 8184 3076
1574C076o181n599l244M89M252N971O312M509J973j178l997n930o179m577j683
$$ 3076 -3105 -8704 -11948 -11459 -7207 -1236 5076 9585 11558 10380 6383 453 -5726 -10303 -11986
1589a1986K114M998N944N633L869Q11k596m663o124n468l702l74L597N379O016
$$ -11986 -9872 -4874 1070 6703 10572 11383 8787 4124 -2000 -7468 -11170 -11544 -7947 -2568 3448
1604C448M768K617l62l122n255o433n100j772J392M301N161N336M030J840j561
$$ 3448 8216 10833 10471 7349 2094 -4339 -9439 -11211 -9819 -5518 -357 4979 9009 10849 9288
1619I288m198n903n561l677l08K259M535N201M948L493K93k755n232o130m228
$$ 9288 5090 -813 -6374 -10051 -10359 -8100 -3565 1636 6584 10077 10370 7615 2383 -3747 -7975
1634g975j728N47L338M085N286M719K188j117m397n427m966l056q32J276L647
$$ -7975 -9703 -9156 -5818 -1733 3553 8272 10460 9343 4946 -481 -5447 -8503 -9335 -8059 -4412
1649d412M907N188L654M85k594m447m888m214k519o24K694M232N911M552J551
$$ -4412 495 5683 9337 9822 7228 2781 -2107 -6321 -8840 -9464 -6770 -2538 3373 7925 9476
1664I476r30l175m221m429m111k197R53L622N124M770K894Q59j299l296m144n121
$$ 9476 8546 5371 1150 -3279 -7390 -9587 -8634 -5012 112 4882 7776 8635 7336 4040 -104 -5225
$$ [...]
8191c6
##END NTUPLES=NMR FID
##END=
