##TITLE=1H_PR164_pH1
 D2O, 8 sc, 
 5.2.2020
##JCAMPDX= 6.0         $$ Bruker NMR JCAMP-DX V2.0
##DATA TYPE= NMR FID
##DATA CLASS= NTUPLES
##ORIGIN= UXNMR, Bruker Analytische Messtechnik GmbH
##OWNER= root
$$ XWIN-NMR		Version 3.5
$$ Wed Feb  5 14:15:49 2020 Russian Standard Time (UT+4h)  she@DPX200
##.OBSERVE FREQUENCY= 200.1315
##.OBSERVE NUCLEUS= ^1H
##.DELAY= (6, 6)
##.ACQUISITION MODE= SIMULTANEOUS
##.ACQUISITION SCHEME= undefined
##.AVERAGES= 8
##.DIGITISER RES= 18
##SPECTROMETER/DATA SYSTEM= spect
##.PULSE SEQUENCE= zg30
##.SOLVENT NAME= D2O
##.SHIFT REFERENCE= (INTERNAL, D2O, 0, 15.7039)
##AUDIT TRAIL= $$ (NUMBER, WHEN, WHO, WHERE, WHAT)
$$ ##TITLE= Audit trail, XWIN-NMR		Version 3.5
$$ ##JCAMPDX= 5.01
$$ ##ORIGIN= Bruker BioSpin GmbH
$$ ##OWNER= she
$$ F:/spectra/data/she/nmr/H-F/1/audita.txt
$$ ##AUDIT TRAIL=  $$ (NUMBER, WHEN, WHO, WHERE, WHAT)
(   1,<2020-02-05 14:14:48.50 +0400>,<she>,<DPX200>,
      <created by zg, POWCHK disabled, PULCHK disabled
       configuration hash MD5:
       00 E9 B6 7A A2 85 ED C7 34 08 36 98 17 FE 4E 26
       data hash MD5: 16K
       1B A3 7C 5A D9 D8 47 12 0E 61 83 88 E4 48 B4 83>)
$$ ##END=
$$ 
$$ hash MD5
$$ 76 4B 1E FE 0A 8D 57 16 A9 1D 8B EE 58 21 7C E6
##$RELAX= 
##$RELAX= 
##$RELAX= 
##$RELAX= 
##$RELAX= 
##$RELAX= 
$$ Bruker specific parameters
$$ --------------------------
##$DU= <F:/spectra>
##$EXPNO= 1
##$NAME= <H-F>
##$PROCNO= 1
##$TYPE= <nmr>
##$USER= <she>
##$AMP= (0..31)
100 100 100 100 100 100 100 100 100 100 100 100 100 100 100 100 100 100 
100 100 100 100 100 100 100 100 100 100 100 100 100 100 
##$AQSEQ= 0
##$AQ_mod= 1
##$AUNM= <au_zg>
##$AUTOPOS= <>
##$BF1= 200.13
##$BF2= 200.13
##$BF3= 200.13
##$BF4= 200.13
##$BF5= 200.13
##$BF6= 200.13
##$BF7= 200.13
##$BF8= 200.13
##$BYTORDA= 1
##$CFDGTYP= 0
##$CFRGTYP= 5
##$CHEMSTR= <none>
##$CNST= (0..31)
1 1 145 1 1 1 1 1 1 1 1 1 1 1 1 1 1 1 1 1 1 1 1 1 1 1 1 1 1 1 1 1 
##$CPDPRG= <>
##$CPDPRG1= <>
##$CPDPRG2= <>
##$CPDPRG3= <>
##$CPDPRG4= <mlev>
##$CPDPRG5= <mlev>
##$CPDPRG6= <mlev>
##$CPDPRG7= <mlev>
##$CPDPRG8= <mlev>
##$CPDPRGB= <>
##$CPDPRGT= <>
##$D= (0..31)
0 1.2 0 0 0 0 0 0 0 0.06 0 0.03 0 0 0 0 0.0002 0 0 0 0 0 0 0 0 0 0 0 0 
0 0 0 
##$DATE= 1580897687
##$DBL= (0..7)
120 120 120 120 120 120 120 120 
##$DBP= (0..7)
150 150 150 150 150 150 150 150 
##$DBP07= 0
##$DBPNAM0= <>
##$DBPNAM1= <>
##$DBPNAM2= <>
##$DBPNAM3= <>
##$DBPNAM4= <>
##$DBPNAM5= <>
##$DBPNAM6= <>
##$DBPNAM7= <>
##$DBPOAL= (0..7)
0.5 0.5 0.5 0.5 0.5 0.5 0.5 0.5 
##$DBPOFFS= (0..7)
0 0 0 0 0 0 0 0 
##$DE= 6
##$DECBNUC= <off>
##$DECIM= 24
##$DECNUC= <off>
##$DECSTAT= 4
##$DIGMOD= 1
##$DIGTYP= 9
##$DL= (0..7)
0 120 120 120 120 120 120 120 
##$DP= (0..7)
150 150 150 150 150 150 150 150 
##$DP07= 0
##$DPNAME0= <>
##$DPNAME1= <>
##$DPNAME2= <>
##$DPNAME3= <>
##$DPNAME4= <>
##$DPNAME5= <>
##$DPNAME6= <>
##$DPNAME7= <>
##$DPOAL= (0..7)
0.5 0.5 0.5 0.5 0.5 0.5 0.5 0.5 
##$DPOFFS= (0..7)
0 0 0 0 0 0 0 0 
##$DQDMODE= 0
##$DR= 18
##$DS= 0
##$DSLIST= <SSSSSSSSSSSSSSS>
##$DSPFIRM= 0
$$ [...]
##$SUBNAM2= <"">
##$SUBNAM3= <"">
##$SUBNAM4= <"">
##$SUBNAM5= <"">
##$SUBNAM6= <"">
##$SUBNAM7= <"">
##$SUBNAM8= <"">
##$SUBNAM9= <"">
##$SW= 24.9337058887773
##$SWIBOX= (0..15)
0 0 2 0 0 0 0 0 0 0 0 0 0 0 0 0 
##$SW_h= 4990.01996007984
##$TD= 16384
##$TD0= 1
##$TE= 0
##$TE2= 300
##$TE3= 300
##$TEG= 300
##$TL= (0..7)
0 120 120 120 120 120 120 120 
##$TP= (0..7)
150 150 150 150 150 150 150 150 
##$TP07= 0
##$TPNAME0= <>
##$TPNAME1= <>
##$TPNAME2= <>
##$TPNAME3= <>
##$TPNAME4= <>
##$TPNAME5= <>
##$TPNAME6= <>
##$TPNAME7= <>
##$TPOAL= (0..7)
0.5 0.5 0.5 0.5 0.5 0.5 0.5 0.5 
##$TPOFFS= (0..7)
0 0 0 0 0 0 0 0 
##$TUNHIN= 0
##$TUNHOUT= 0
##$TUNXOUT= 0
##$USERA1= <user>
##$USERA2= <user>
##$USERA3= <user>
##$USERA4= <user>
##$USERA5= <user>
##$V9= 5
##$VALIST= <valist>
##$VCLIST= <CCCCCCCCCCCCCCC>
##$VD= 0
##$VDLIST= <DDDDDDDDDDDDDDD>
##$VPLIST= <PPPPPPPPPPPPPPP>
##$VTLIST= <TTTTTTTTTTTTTTT>
##$WBST= 1024
##$WBSW= 4
##$XGAIN= (0..3)
0 0 0 0 
##$XL= 0
##$YL= 0
##$YMAX_a= 275420
##$YMIN_a= -235312
##$ZGOPTNS= <>
##$ZL1= 120
##$ZL2= 120
##$ZL3= 120
##$ZL4= 120
##$ABSF1= 10
##$ABSF2= 0
##$ABSG= 5
##$ABSL= 3
##$ALPHA= 0
##$AQORDER= 0
##$ASSFAC= 0
##$ASSFACI= 0
##$ASSFACX= 0
##$ASSWID= 0
##$AUNMP= <proc_1d>
##$AZFE= 0.1
##$AZFW= 0.1
##$BCFW= 1
##$BC_mod= 2
##$BYTORDP= 1
##$COROFFS= 0
##$CY= 11.3945322036743
##$DATMOD= 1
##$DC= 2
##$DFILT= <>
##$DTYPP= 0
##$F1P= 16.9975609425685
##$F2P= -3.02152046262296
##$FCOR= 0.5
##$FTSIZE= 0
##$FT_mod= 4
##$GAMMA= 1
##$GB= 0.15
##$INTBC= 1
##$INTSCL= 1
##$ISEN= 128
##$LB= 0.24
##$LEV0= 0
##$LPBIN= 0
##$MAXI= 10000
##$MC2= 0
##$MEAN= 0
##$ME_mod= 0
##$MI= 1.114404
##$NCOEF= 0
##$NC_proc= 0
##$NLEV= 6
##$NOISF1= 3.799351
##$NOISF2= 2.8
##$NSP= 1
##$NTH_PI= 0
##$NZP= 0
##$OFFSET= 15.70392
##$PC= 1
##$PHC0= -9793.246
##$PHC1= 19.00081
##$PH_mod= 1
##$PKNL= yes
##$PPARMOD= 0
##$PSCAL= 0
##$PSIGN= 0
##$REVERSE= no
##$SF= 200.130013532006
##$SI= 16384
##$SIGF1= 3
##$SIGF2= 2
##$SINO= 400
##$SIOLD= 16384
##$SREGLST= <1H.CDCl3>
##$SSB= 0
##$STSI= 0
##$STSR= 0
##$SW_p= 3612.71676300578
##$SYMM= 0
##$S_DEV= 0
##$TDeff= 0
##$TDoff= 0
##$TI= <>
##$TILT= no
##$TM1= 0
##$TM2= 0
##$TOPLEV= 0
##$USERP1= <user>
##$USERP2= <user>
##$USERP3= <user>
##$USERP4= <user>
##$USERP5= <user>
##$WDW= 1
##$XDIM= 8192
##$YMAX_p= 0
##$YMIN_p= 0
$$ End of Bruker specific parameters
$$ ---------------------------------
##NTUPLES= NMR FID
##VAR_NAME=  TIME,          FID/REAL,        FID/IMAG
##SYMBOL=    X,             R,               I
##VAR_TYPE=  INDEPENDENT,   DEPENDENT,       DEPENDENT
##VAR_FORM=  AFFN,          ASDF,            ASDF
##VAR_DIM=   8192,          8192,            8192
##UNITS=     SECONDS,       ARBITRARY UNITS, ARBITRARY UNITS
##FACTOR=    0.0002004,     1,               1
##FIRST=     0,             0,               0
##LAST=      1.6414764,     0,               0
##MIN=       0,             -235312,         0
##MAX=       1.6414764,     275420,          0
$$ Real data points
##PAGE= N=1
##DATA TABLE= (X++(R..R)), XYDATA
0@%%%%%%%%%Qj6J6j6J6k4L2l6M4n5O6p5Q8j04J20j38J58j80K06k34K64k99L37
$$ 0 0 0 0 0 0 0 0 0 0 8 -8 8 -8 8 -16 16 -20 24 -31 35 -40 48 -56 64 -74 84 -96 110 -124 140 -159 178
32A78l78M23m71N27n89O54p25Q03q92R88j094J212j343J489j650J836k048K290
$$ 178 -200 223 -248 279 -310 344 -381 422 -470 518 -576 636 -707 782 -868 968 -1080 1210
50A210k576K915l322L830m478N337o546Q386j1562J8573o3890N8400J57390K2324
$$ 1210 -1366 1549 -1773 2057 -2421 2916 -3630 4756 -6806 11767 -52123 6277 163667 185991
64A85991m2443j10070j20145j16026l2619P0928J55995J43531P1712k7873r1801
$$ 185991 143548 33478 -86667 -202693 -235312 -164384 -8389 135142 206854 178981 87180
75H7180j24197j03497m1241N3674J24127J35938P6862j1480r1710j28681j13942
$$ 87180 -37017 -140514 -181755 -128081 -3954 131984 208846 197366 105656 -23025 -136967
86a36967m4732M1704J03599J09539O9802L139o7825j18652j13032m3591N0538
$$ -136967 -181699 -139995 -36396 73143 142945 146084 78259 -40393 -153425 -197016 -146478
97a46478J05585J03830O4575J3796m6810r9781j07073m4618M8903J07248J01090
$$ -146478 -40893 62937 127512 141308 94498 -5283 -112356 -156974 -108071 -823 100267
108A00267N4663k32n2557r5368j03761n4368L2177R8497J02307N3615r026o2908
$$ 100267 154930 154698 102141 6773 -96988 -151356 -119179 -20682 81625 135240 126214 63306
120F3306r6071r7235m9982L0557R8032J12077P2153N610n9910j00325r5638m1943
$$ 63306 -32765 -130000 -179982 -149425 -51393 60684 132837 138447 78537 -21788 -117426 -159369
132a59369L4033R3727J11973Q4339J9873n8020j13242j12067n5573K3757Q3727
$$ -159369 -125336 -31609 80364 164703 184576 126556 13314 -98753 -154326 -130569 -46842
143d6842J04305Q4072K8008m8591j12717j24765p1861J3387Q3205J08459R1810
$$ -46842 57463 141535 169543 120952 8235 -116530 -188391 -175004 -91799 16660 108470
154A08470M3265k6598r3464j19096q0230J659P7270J11402R9403N2321j5078q1902
$$ 108470 151735 125137 31673 -87423 -167653 -165994 -88724 22678 122081 174402 159324 77422
166G7422j13582q9544k0742N4043R8485R6631N3241j3617p6045j07071q9325l3007
$$ 77422 -36160 -125704 -146446 -92403 6082 102713 155954 142337 66292 -40779 -130104 -163111
178a63111L6822Q7020R7019O2097j520o3105r2192p7409k7782L3089P9733R3403
$$ -163111 -126289 -39269 57750 119847 118327 55222 -36970 -114379 -142161 -109072 -29339 64064
190F4064O6690P070n4291q7016p4576k8995K5977O7790Q0504N7505L598n5565
$$ 64064 130754 137824 83533 -3483 -78059 -107054 -81077 -13287 67217 124722 128320 72755
202G2755q8904p8350l2374K4005O6254P7308N4503M488n0146q2074p3567k8589
$$ 72755 -16149 -94499 -126873 -102868 -36614 40694 95197 99685 49539 -32535 -106102 -134691
214a34691K9179P3842Q5489O1171Q636m6887q0919p5821l4350K5421P2664Q7906
$$ -134691 -105512 -31670 53819 114990 123626 76739 -4180 -80001 -114351 -88930 -16266 71640
226G1640O1999P233n2358q8500q6444m6149J3846O8049Q9423O8860J5770m5618
$$ 71640 133639 140872 88514 14 -86430 -132579 -118733 -50684 38739 107599 123369 77751
238G7751q7297q9408n1877J0219O8164R6499Q3124L2404l2067p9985r0336n9118
$$ 77751 -9546 -98954 -150831 -140612 -72448 24051 107175 139579 107512 27527 -62809 -121927
250a21927k94N9437R2852Q5419L8791k4311p6862r5237p1856j7723M3645Q3182
$$ -121927 -122221 -62784 30068 115487 154278 129967 53105 -42132 -113988 -131711 -88066 -4884
262d884Q2736M4579j4016o6933q9891p3030k2863L6552P8844Q5344N4099L55n1762
$$ -4884 77852 122431 108415 41482 -48409 -121439 -144302 -107750 -28906 56438 110537 110892 59130
275E9130p8808o7399k5377K9507P0608P9743N2985L250m7441p6159o9306l1420
$$ 59130 -19678 -87077 -112454 -82947 -12339 67404 120389 123639 76198 39 -69267 -100687
287a00687J9843N8742O9690M6128K216m5115p2226o6280k9300J9935N8899O9925
$$ -100687 -80844 -22102 47588 93716 95932 50817 -21409 -87689 -116989 -97054 -38155 31770
299C1770M9260O779l8667o5545o0208k4737K3636O2012P2041N0178N788m1440
$$ 31770 81030 87809 49142 -16403 -76611 -101348 -77712 -15700 56341 106519 112307 70867
311G0867o9180o4674l0520J8401N7809P0323M9122L415m5086p4497p1940l6399
$$ 70867 1687 -62987 -93507 -75106 -17297 53026 102148 105563 60477 -14020 -85960 -122359
323a22359J5291O0302P6641N7943J3468l8479p1881p2935l8682J4308O1609Q3103
$$ -122359 -107068 -46766 29875 87818 101286 62807 -9074 -82009 -120691 -106383 -44774 38329
335C8329O7925K3501l1943p1216p8801n0168J617N1788P8912O9830K7979k7261
$$ 38329 106254 129755 97812 26596 -52205 -102373 -100756 -48968 29944 99774 127753 100492
347A00492p1411q3787o0370j0439M1987P6269P3639L7895j4171n9592p7526o0117
$$ 100492 29081 -54706 -115076 -125515 -83528 -7259 66380 104275 90104 30512 -47014 -107131
359a07131j4926L7410P3308P6870M7075l101m8788p2266o2067k2246K6922O2419
$$ -107131 -122057 -84647 -11339 65531 112606 109505 60717 -11549 -73616 -95862 -68940 -6521
371f521O9041M3972o33m5968p0356o3366k8848J8136N4246O3232M3285K773l8295
$$ -6521 62520 106492 105859 59891 -10465 -73831 -102679 -84543 -30297 32935 76220 78993 40698
384D0698o2295n6613k4817J9948N4500O4602M5044O591l3383n6826n3113k2778
$$ 40698 -21597 -78210 -103027 -83079 -28579 36023 81067 87658 54275 -2551 -55664 -78442
396g8442J8152N2131O0807M1166K389l7902o1784n7226k7449J4740M9694N9942
$$ -78442 -60290 -8159 52648 93814 96203 58301 -3483 -60709 -88158 -73418 -23724 36218
408C6218M1145K360l8590o2820n8549k6893J7087N4691O7444M9935J0469l3608
$$ 36218 77363 79723 41133 -21687 -80236 -107129 -90042 -35351 32093 82028 92497 58889
420E8889o1242o0985l0352J4767N4294P0520N4959J4324l3146o5932o9710m2119
$$ 58889 -2353 -63338 -93690 -78923 -24629 45891 100850 115174 82028 16096 -53614 -95733
432i5733M081M7314O8409N7368K0257k7993o4266p2285m8619k810M3685P0469
$$ -95733 -91652 -44338 24071 81439 101696 73703 9437 -62848 -111467 -114277 -70592 -123
444a23O5921L2653j5331n4386o8378n0957q905L7793O7319O7440L7481p721m8961
$$ -123 65798 98451 83120 28734 -39644 -90601 -99506 -61713 5606 73046 110527 102806 53845
457E3845o8291n6526k0272K5637N7133O1282L6849l864m3485o4024n7264k3653
$$ 53845 -14446 -70972 -91244 -65607 -8474 52808 89657 85793 42308 -21716 -78980 -102633
469a02633J9590N2903O0558M0240L356l4117n4189m9263k1395J8269N0667N9088
$$ -102633 -83043 -30140 30418 70658 74014 39897 -14292 -63555 -84950 -66681 -16014 43074
481D3074L9815M189l1355n2214m8755k3502J3312M4288N2716L4776Q10l4942n4231
$$ 43074 82889 87078 55723 3509 -45246 -68748 -55436 -11148 41568 76344 77154 42212 -12019
494a2019n0598k3013J3683M3913N3198L7009L791l1525n2562m8654k0168J8281
$$ -12019 -62617 -85630 -71947 -28034 25164 62173 65964 34439 -18123 -66777 -86945 -68664
506f8664M9106N7651M1712P462k9512n4487n3875k6335J4378M8060N8000M1688
$$ -68664 -19558 38093 79805 87267 57755 3268 -50607 -76942 -62564 -14504 43496 85184
518H5184P442l0861n8699o1303l6462P321M5897O1196M7851J4044k5430n4765
$$ 85184 92626 61765 3066 -58237 -94699 -87378 -41481 19715 67566 81610 56180 1415
530A415o0913l9641K649M5108O5936N7060K4416j6853n0358o1109m3424o496L5610
$$ 1415 -59498 -99139 -96490 -51382 14554 71614 96030 79177 28819 -32290 -75714 -82210 -46600
543d6600O0459N7960K9061j3175m9536o3666m9800j4755K4357N2614N5915L4018
$$ -46600 13859 71819 100880 87705 38169 -25497 -75297 -90052 -65695 -13081 42834 76852
555G6852m480m2322n9134m8216j5774K2338M9394N5945L8254M762l1577n2813
$$ 76852 72372 30050 -29084 -77300 -93074 -70736 -21342 34603 72857 77619 46042 -6771
567f771m6674j7355J9042M4699M9535L4499M403l0138n1043m8276k1470J3135
$$ -6771 -53445 -70800 -51758 -7059 42476 76975 81378 51240 197 -48079 -69549 -56414
579e6414L8983M5314L0705J840k8802m6936m4509k0320J3595M1639M9371L3768
$$ -56414 -17431 27883 58588 60428 31626 -15310 -59819 -80139 -66544 -24905 24466 58234
591E8234L903k6375m4134m0140j7856J4750M1919N0746L5531L431l0011m9346
$$ 58234 62137 35762 -8372 -48512 -66368 -51618 -9699 41047 76578 80009 49998 652
603F52m5725k1921J0676L8324M9688L6883M822l1270n2935n0545k5391R214M0553
$$ 652 -45073 -66994 -56318 -17994 31694 68577 73399 42129 -10806 -61351 -86742 -77528 -36975
616c6975N4346M3841J2860k3913m9377n2087k9460O862M1641N7073M8602J8922
$$ -36975 17371 61212 74072 50159 782 -51305 -80765 -73903 -32262 24811 73413 92335
628I2335j8928m8572n6105l9252k938L3685N3687M8250K1502j4943m5956n7684
$$ 92335 73407 24835 -31270 -70522 -73460 -39775 13912 62162 83664 68721 22765 -34919
640c4919m4193j0786K7200N1660N2332K8498o299l6825n1218m2598j3659K3274
$$ -34919 -79112 -89898 -62698 -11038 41294 69792 63493 26668 -24550 -67148 -80807 -57533
652e7533M9637N2604L2350K13l1514m8134m3591j8373J6180M0899M5604K9655
$$ -57533 -7896 44708 77058 77271 45757 -2377 -45968 -64341 -48161 -7262 38342 67997
664F7997M39k8971m6890m4317k0575J2606L6570M3120K8921L908k4367m1404l8875
$$ 67997 68436 39465 -7425 -51742 -72317 -59711 -23141 19979 48900 52808 28441 -12963 -51838
677e1838j7267J4513L8753M3942L0223M706k2242l9848l8300j7335J3112L6559
$$ -51838 -69105 -54592 -15839 28103 58326 63032 40790 942 -37358 -54693 -41581 -5022
689e022M1397K7791K180k6073m4462m2658k0026J1280L5869M2079K9669M619k4882
$$ -5022 36375 64166 66346 40273 -4189 -46847 -66873 -55593 -19724 22355 52024 56643 31761
702C1761m4705m4561k0032J3478L9702M7624L6061J0693k0338m4036m7048k5237
$$ 31761 -12944 -57505 -77537 -64059 -24357 23267 59328 70021 49683 5647 -41401 -66638
714f6638R603L8460M8497L8218J2813j8828m6193n3486l3977R98L2847M7129M1362
$$ -66638 -57035 -18575 29922 68140 80953 62125 15932 -37554 -71531 -70533 -37686 9443 50805
727E0805J7715j3877m3189n2055l6679m239K9659M7919M7542K6784o042l6585
$$ 50805 68520 54643 11454 -40601 -77280 -81519 -51860 -3941 43601 70385 64343 27758
739B7758m8572l6527q701K2386M3688M6564K9911k024l4353m8519m0134j4047
$$ 27758 -20814 -57341 -66042 -43656 32 46596 76507 74483 40130 -8389 -48523 -62570
751f2570J4001L4908M1732K9527K056l0171m6086l8700j3868J3280L2889M0089
$$ -62570 -48569 -13661 28071 57598 59654 29483 -16603 -55303 -69171 -55891 -23002 17087
763A7087L1168P226k2957m0001l5193j2332J3763L2300L8000K8782N329k1867
$$ 17087 48255 55481 32524 -7477 -42670 -55002 -41239 -8939 29061 57843 63172 41305
775D1305l9227l5858j5706R772K9956L5700K5591J082k4448l9445l5301j6249
$$ 41305 2078 -33780 -49486 -39714 -9758 25942 51533 52615 28167 -11278 -46579 -62828
787f2828R191L1033L9729K9699L817k3490l8177l3835j4640J0781L2979M3320
$$ -62828 -53637 -22604 17125 46824 50641 27151 -11026 -44861 -59501 -48720 -15741 27579
799B7579L4365P029k3718m1755l8658j8770O580L0181M1712L4928R821k3346m5140
$$ 27579 61944 68973 45255 3500 -35158 -53928 -47348 -17167 24545 59473 69294 45948 808
812H08m4248k5523L176K8516M3417L9160J6199j5532m0325m4260k8829K44K8474
$$ 808 -43440 -68963 -65787 -37271 6146 45306 61505 45973 5648 -38612 -67441 -67197 -38723
825c8723M5116M3081K2300r027l5402m4258l3762p997K1350M1359M1973K2558
$$ -38723 6393 49474 71774 62747 27345 -16913 -50675 -58672 -37322 4037 46010 68568
837F8568o956l2577m4138l7176j4588J4344L6834M1456K5461j796k6420l8675
$$ 68568 61612 29035 -15103 -52279 -66867 -52523 -15689 25767 51228 49432 23012 -15663
849a5663l3632j4262J2498L4879M1292K8218L130k1837l4780l1270j5101R329
$$ -15663 -49295 -63557 -51059 -16180 25112 53330 56460 34623 -157 -31427 -46528 -37199
861c7199K9772L6246K5458J799k1792l5727l3059j6026P350K6426L3466K3460
$$ -37199 -7427 28819 54277 56076 34284 -1443 -34502 -50528 -43178 -16752 16714 40174
873D0174K175k0781l3619l0916j3977R785K9819L5936K5974M379j8861l2820l0569
$$ 40174 42349 21568 -12051 -42967 -56944 -47159 -17340 18596 44570 48949 30088 -2732 -33301
886c3301j4448J0590L0274L6897K6036L479k0997l6571l6007j8945O400K8409
$$ -33301 -47749 -37159 -6885 30012 56048 59527 38530 1959 -34048 -52993 -46593 -18184
898a8184L7106K8519N460k0761l7631l8242k1257M984K9409M1265L4349J2183
$$ -18184 18922 47441 52901 32140 -5491 -43733 -64990 -60006 -30597 10668 45017 57200
910E7200j4717l5138l8668k4458J616K7635M1457L7236J6189j1510l4275m1922
$$ 57200 42483 7345 -31323 -55781 -54165 -26530 14927 52163 68352 56842 22567 -19355
922a9355l0539o137K0725L7606L6772J8931q216l1601m1045l2500j0163J6807
$$ -19355 -49894 -56031 -35306 2300 39072 58003 49787 18186 -22859 -55359 -65522 -48715
934d8715L5657L9059K3748j202k4533l6118l0830j1119J3904L2602L7551K5486
$$ -48715 -13058 26001 49749 48547 24014 -12104 -42934 -54053 -40149 -7547 30004 55490
946E5490K005k1904l4595l1796j3795Q237K7276L1978K2788J367k0332l3754l0756
$$ 55490 57495 35591 996 -30800 -44595 -36358 -9082 22896 45684 47051 26719 -7035 -37791
959c7791j4198P535K5480L1263K2617L681j7041k9542k7483j1915R762K7604L2181
$$ -37791 -51989 -44454 -18974 12289 34906 38587 21546 -7996 -35479 -47394 -37632 -10028 22153
972B2153K2875L574j7113k9463k8547j3383Q194K5831L1145K1481J266j9742l2702
$$ 22153 45028 48602 31489 2026 -26521 -39904 -31710 -5879 25266 46747 48013 28271 -4431
985d431l1239j6053O234K5937L3600K5026M291j8159l2506l1542j6428O603K7999
$$ -4431 -35670 -51723 -45489 -19552 14048 39074 43365 25206 -7300 -38842 -55270 -48667 -20668
998b0668L7556K9789R921j5742l2338l4613k0749K655K5237L6174L1361J1655
$$ -20668 16888 46677 56598 40856 8518 -26095 -46844 -44189 -18952 17222 48583 60238
1010F0238j3667l3162l9307k6812k726K1150L4481L2840J6156p918k9379l7386
$$ 60238 46571 13409 -25898 -52710 -55436 -34286 195 33035 49191 41273 11894 -25492
1022b5492k7914n572J9094L4692L5697K1000j566k3780l4809k8581r308J4189
$$ -25492 -53406 -58978 -39884 -5192 30505 51505 49939 26159 -8650 -37231 -46539 -32350
1034c2350L0289L3446K1239L2k2399l3597l0433j3354Q295K5851L0045K0974J617
$$ -32350 -2061 31385 52624 52656 30257 -3340 -33773 -47127 -38832 -12981 17064 38038 39655
1047C9655j8863l0673k7859j2175Q454K4781L0290K2466L907j4989k7125k4678
$$ 39655 20792 -9881 -37740 -49915 -41461 -16680 13610 36076 39983 24994 -2131 -26809
1059b6809j0770Q203K3611K8519K0630K614j6609k8439k6738j2007O354K1712
$$ -26809 -37579 -29376 -5765 22754 43384 45998 29389 950 -25788 -37795 -31441 -9729
1071i729K6731J9001J755j8116k8905k6988j2307P525K3988K9890K2595M675j5767
$$ -9729 17002 36003 37758 19642 -9263 -36251 -48558 -41033 -17045 12845 35440 40115 24348
1084B4348k8504k6778j3047P674K5184L2515K5070O414j5716l0573l1239j8113
$$ 24348 -4156 -30934 -43981 -36307 -11123 21392 46462 52876 37160 6587 -24652 -42765
1096d2765K830K2989L1571K6308Q192j4216l0951l4461k2097k44K1408L2549L0561
$$ -42765 -39935 -16946 14625 40933 49125 34909 3958 -30503 -52600 -52844 -31436 1113 31674
1109C1674J4096q618k7322l2769k3229k862J9393L2541L2585J7848m497k3996
$$ 31674 45770 37152 9830 -22939 -46168 -49030 -29637 2904 35489 53337 48840 24844
1121B4844l2977k6629q315J3035K8297L0145J8169k611k2107l2279k7651j1346
$$ 24844 -8133 -34762 -43077 -30042 -1745 28400 46569 43958 21851 -10428 -38079 -49425
1133d9425R708K4920K9465J9776J833j7381k7469k4413j0207Q209K4057K8998
$$ -49425 -39717 -14797 14668 34444 36277 18896 -8573 -32986 -43193 -34984 -10927 18071
1145A8071K0927L561j4902k5578k3742j1118O526K0422K5342J8428J550j6070
$$ 18071 38998 42559 27657 2079 -21663 -32781 -26255 -5833 19509 37937 39487 23417
1157B3417k6186k4409j1658N376J9529K4932J7598K340j4907k4848k2807j0068
$$ 23417 -2769 -27178 -38836 -33460 -13931 11001 28599 30939 16032 -8816 -31623 -41691
1169d1691Q173K1880K6450K0758M490j4447k5471k4191j1013O811K2070K7339
$$ -41691 -33518 -11638 14812 35570 40060 25613 142 -24049 -35062 -28251 -6181 21158
1181B1158K0440L841j5736k8528k7598j5601L370K1004K8476K2588O217j4051
$$ 21158 41598 45439 29703 1175 -26423 -42024 -38654 -17650 10826 33414 39631 25580
1193B5580k7684k8945j7211K099K1138L1419K7500J1543r728k5259k9248j9694
$$ 25580 -2104 -31049 -48260 -46161 -25023 6396 33896 45439 35711 10452 -18796 -38490
1205c8490j132J7504L0220K9193J4004p737k5025l1023k3538o855J2305K6214
$$ -38490 -39622 -22118 8102 37295 51299 43562 18537 -12486 -36024 -42879 -30574 -4360
1217d360K8701J6432m223k2536k9482k3240q642J0376K4727K8725K0335R50j6850
$$ -4360 24341 40773 36550 14014 -15468 -38708 -47350 -36974 -12247 16478 36813 37763 20913
1230B0913k6391k2370q770Q482K2411K6290J9093K174j5096k5239k3193j1522
$$ 20913 -5478 -27848 -36618 -28136 -5725 20565 39658 41832 26736 1497 -21696 -33218
1242c3218N700J8746K3225J5878J314j4127k3178k2324j0965N179J9460K4186
$$ -33218 -27518 -8772 14453 30331 31645 17518 -5660 -27984 -38949 -33770 -14310 9876
1254I876J6608K352j2269k0779j9296r503N918K0249K5157J7910J806j4087k2522
$$ 9876 26484 28836 16567 -4212 -23508 -33011 -27093 -6844 18313 36223 38029 23942 1420
1267A420k0644j0899L888J8414K4411J8169J620j5902k5109k3753j2233L949J8738
$$ 1420 -19224 -30123 -26235 -7821 16590 34759 36379 20477 -4632 -28385 -40618 -36669 -17931
1280a7931K6110K1049N558j2426k5041k4669j3757M707K0191K7941K3919R061
$$ -17931 8179 29228 34786 22360 -2681 -27350 -41107 -36400 -16209 11732 35651 44712
1292D4712j0255k3741k7470j8175o9J7618K6989K4027R821q555k2988k9255k2114
$$ 44712 34457 10716 -16754 -34929 -34998 -17380 9609 33636 43457 34902 11914 -17341 -39455
1305c9455n150J4701K6755K5334J2855m403j8849k6128k1942o753J2022K6195
$$ -39455 -44605 -29904 -3149 22185 35040 30637 11788 -14340 -36282 -43035 -31013 -4818
1317d818K7368J6347n43j6503k3977k1521r196P444K1331K4953J6390k04j5650
$$ -4818 22550 38897 38354 21851 -2126 -23647 -32843 -25399 -4068 20885 37275 37071 21421
1330B1421k4202k1912j0342M736J7837K2400J5758K178j2969k1946j9642q606
$$ 21421 -2781 -24693 -35035 -30299 -12462 9938 25696 27874 14905 -7041 -26683 -35289
1342c5289O099J7838K1790J6941L860j0714k0246j8934q742O424J8031K0313J4305
$$ -35289 -29190 -11352 10438 27379 31239 20525 279 -18655 -27397 -20973 -2942 17371 31676
1355C1676K380j2374k1253k0536j0777M484J7325K0760J4360J412j2820k1294
$$ 31676 34056 21682 429 -20107 -30884 -26400 -9075 11685 26045 27457 14637 -6657
1367f657k0599j0610N387J8703K4170J8246M017j1280k1021k1159j1390L781J8430
$$ -6657 -27256 -37866 -32479 -13776 10394 28640 32657 21377 356 -20803 -32193 -28412 -9982
1380i982K5210K0428N719j1493k3233k4534j5097n1J5488K4270K1501Q352r406
$$ -9982 15228 35656 41375 29882 6649 -17885 -32982 -33033 -17545 6725 28226 36578 27172
1393B7172k3079k5803j7661j764J4483K4490K4424J2884m324j8797k4741j8552
$$ 27172 4093 -21710 -39371 -41135 -26652 -2162 22262 35146 30822 12025 -12716 -31268
1405c1268m449J2701K3703K4359J4545j515j7006k4482k0787q485P691K0150K2531
$$ -31268 -35717 -23016 687 25046 39591 38076 21070 -3412 -24199 -32684 -24993 -4843 17688
1418A7688J4120o24j4838k2773k0568j0170N838J8390K2439J5560J910j1622j9104
$$ 17688 31808 31184 16346 -6427 -26995 -37165 -31327 -12937 9502 25062 26972 15350 -3754
1431c754j7907q464N113J7920K1339J5368J894j0416j8490j7690r201L789J5316
$$ -3754 -21661 -30125 -25012 -7092 14247 29615 31509 21093 2603 -15087 -24288 -20499 -5183
1444e183J9118J3115O73j1649j9139j8511r449M295J5343J8959J4163K045j1148
$$ -5183 13935 27050 27723 16074 -3065 -21576 -31025 -26730 -11387 7572 21735 23780 12632
1457A2632j8381j7087q442N665J7259K1489J6012L149j0619j9346j9157j0457
$$ 12632 -5749 -22836 -31278 -25613 -8354 13135 29147 32296 21677 2331 -16826 -27283
1469b7283L905J6549K1952J5987L046j0987k1237k2578j3704J837J5712K2186
$$ -27283 -23378 -6829 15123 31110 34156 23169 1932 -20646 -34350 -32513 -16801 5385
1481E385J8232O579q762k0002k2753j4773N37J5148K3840K2115J0333n515j8105
$$ 5385 23617 30196 21434 1432 -21321 -36094 -35557 -20409 3431 25546 35879 30364 12259
1494A2259k2712j6999k874J1956K2458K1216J1821l664j7376k3817j9626o956
$$ 12259 -10453 -27452 -30326 -18370 4088 25304 37125 33461 16085 -7732 -27358 -34314
1506c4314Q808J9154K0462J3320r01j4120k1239j8815p488P066J8679K1233J5280
$$ -34314 -25506 -6352 14110 27430 26529 12409 -8830 -27645 -35133 -28067 -9388 11845 27125
1519B7125K195j1392j8387j7620p531N189J6009J9277J3632J869j0547j8472j7537
$$ 27125 29320 17928 -459 -18079 -25610 -20421 -4412 14865 28497 30366 19819 1347 -16190
1532a6190r263L506J3768J6942J2548J345j0282j7753j6353p715M213J4493J8185
$$ -16190 -25453 -21947 -8179 8763 21311 22656 12374 -5379 -21732 -29447 -25234 -10741 7444
1545G444J3753K297r312j5860j5626o660M752J4966J8430J4087K446j0990j8095
$$ 7444 21197 23494 14182 -1678 -17304 -23964 -19212 -4246 14184 28271 30717 19727 1632
1558A632j7497r069L018J4456J8420J4110K353j1029j9533j9330j0226K376J5234
$$ 1632 -15865 -24934 -21916 -7460 10960 25070 27423 16394 -3139 -22469 -32695 -30319 -15085
1571a5085K0557J6889N687q348j8127j9837j1744J709J5006K1647J8984P871o539
$$ -15085 5472 22361 28048 19700 1573 -18264 -30008 -28299 -13293 8354 27338 35209 28670
1584B8670j8184k1296j4959k554J1771K0399J9110Q918n071j7373k1761j7351
$$ 28670 10486 -10810 -25769 -28323 -16552 3847 22957 31875 26804 9431 -12330 -29681
1596b9681n217R869J9267K0150J1696j141j3923j9171j6453o024P642J8065K1056
$$ -29681 -34898 -25029 -5762 14388 26084 24943 11020 -8151 -24604 -30628 -22986 -4921 16135
1609A6135J3526N90j1347j8253j6561q099M786J4696J8143J2362M75j0524j8160
$$ 16135 29661 30251 18904 651 -15910 -24009 -19223 -4527 13616 25978 26453 15929 -2231
1622b231j6408q499L063J3491J6505J2347J914q851j5625j4568p081M946J3740
$$ -2231 -18639 -27138 -24075 -10584 5921 18268 20182 11331 -4294 -18862 -25943 -20997 -7257
1635g257J6937J2430K462p919j4674j5028p361M387J3206J5923J1060J450r920
$$ -7257 9680 22110 24572 16653 1979 -13049 -20410 -16023 -2817 13106 24166 25616 15696
1648A5696j6188j6197q854K987J3404J7065J2229J642r770j6427j6126q547L350
$$ 15696 -492 -16689 -25543 -22556 -9152 7913 20142 21784 12014 -4413 -20539 -29086 -25736
1661b5736J4693J9260J5247M100q196j6651j7285r843K056J3502J9125J6620N065
$$ -25736 -11043 8217 23464 27564 19368 2717 -14568 -24411 -22355 -8853 10272 26892 31957
1674C1957p318j8112j9825j3223j204J1194J8005J7661P689n116j6673k0283j4371
$$ 31957 24639 6527 -13298 -26521 -27725 -16531 1474 19135 26824 21708 5035 -15248 -29619
1687b9619k313J0451J8943J8773J0632j373j3231j8802j5006m351Q273J7105J8271
$$ -29619 -31932 -21481 -2538 16235 26867 25494 12263 -6539 -21545 -25896 -17623 -518 17753
1700A7753J1489m76j1833j8347j6522p204M816J4543J6300J1277L62j0199j6527
$$ 17753 29242 28766 16933 -1414 -17936 -25140 -20324 -5781 10519 21796 22158 11959 -4568
1713d568j5542p411M028J3356J6611J2279J881q065j3965j3204o478M004J2466
$$ -4568 -20110 -27521 -23493 -10137 6474 18753 20634 12569 -1396 -14600 -21078 -17074 -4608
1726d608J6087J1597J444q293j4508j3591p150K813J1512J4023J0049J280r234
$$ -4608 11479 23076 24520 16227 1719 -11872 -19022 -16209 -4697 9326 19375 20655 11421
1739A1421j5193j3862p239L220J2360J5148J1370K360q337j4598j3723o907M480
$$ 11421 -3772 -17634 -24873 -21653 -9293 5855 17225 19585 11248 -3350 -17073 -23980 -19500
1752a9500J3406J6842J2804L234p916j5817j5861r319K537J2408J7139J3476L311
$$ -19500 -6094 10748 23552 26786 18870 3053 -12808 -22127 -19590 -7182 9957 23433 26744
1765B6744q176j6710j8246j1457J19J1866J7857J5626O133n612j4664j7414j2448
$$ 26744 18568 1858 -16388 -27845 -27726 -15860 1997 17623 23756 18144 3480 -13934 -26382
1778b6382j136J1044J8342J7818R061l425j3223j7612j4029l858P611J6493J6873
$$ -26382 -27518 -16474 1868 19686 28747 25322 12099 -5513 -19542 -23400 -15789 704 17577
1791A7577R809k151j2796j7734j5048o298M928J4458J6083J0764O07j0381j5290
$$ 17577 27386 25235 12439 -5295 -20343 -26641 -21713 -7255 8828 19592 20199 9818 -5472
1804e472j4114o066N158J3310J5867J2010K370p947j3864j3167o467L308J1627
$$ -5472 -19586 -25652 -20494 -7184 8683 20693 23063 15116 1252 -11915 -18382 -15074 -3447
1817c447J4238J0323J603q328j4084j3494o948K441J0324J3342R532J295q178
$$ -3447 10791 21114 22717 14389 305 -13189 -20137 -17696 -7372 5970 15502 16797 8619
1830H619j2708j2382o412L556J1872J4528J0796J571p053j2862j1846o271L610
$$ 8619 -4089 -16471 -22883 -19327 -7455 7073 17869 19440 12387 -475 -12321 -18592 -14982
1843a4982J2036J4606J0931J836q611j4527j4138q396K163J1263J4960J1605K659
$$ -14982 -2946 11660 22591 24427 15816 1289 -12849 -21245 -19082 -7819 7141 18746 21405
1856B1405q306j5197j5069r123J189J1925J6955J4399N088n255j4199j5684j0421
$$ 21405 13099 -2098 -17167 -26290 -25101 -13176 3779 18178 23266 18011 3812 -11872 -22293
1869b2293K9J0833J6928J5525O892m221j3672j6730j3388l244Q272J5009J4948
$$ -22293 -22264 -11431 5497 21022 27914 23693 10021 -6709 -20097 -23341 -15069 -60 14888
1882A4888Q208k615j2238j6707j4069m774O641J4678J5554J0084L42r023j4512
$$ 14888 23096 20481 8243 -8464 -22533 -27307 -20666 -5988 9566 19650 19992 10969 -3543
1895c543j3378n666N747J3387J5032J0591J283p852j3571j3381o852L065J0859
$$ -3543 -16921 -22587 -16840 -3453 11579 22170 23453 15601 2030 -11351 -18203 -15138 -4279
1908d279J2915R137J130p566j2856j3071p003K747J0184J3072R269J724o044j1697
$$ -4279 8636 17773 18903 11337 -1519 -14590 -21593 -18846 -8662 4410 13679 15403 9359 -2338
1922b338j1371n398L581J0862J3244R725J700o466j1910j1674o172L191J0449
$$ -2338 -13709 -19107 -15526 -4664 8580 18305 20005 13539 1629 -10045 -16217 -13026 -2577
1935b577J2557Q887Q71p777j3160j3274p165K627J0685J3393J0476K305o905j2994
$$ -2577 9980 18867 19738 11961 -1199 -14473 -21638 -19011 -8326 5067 15543 17848 10943 -2051
1949b051j4039p317K903J1921J5440J1928M385n254j3436j4776r030J239J0075
$$ -2051 -16090 -23407 -20504 -8583 6857 18785 23170 17916 4480 -10296 -19326 -18087 -8012
1962h012J5011J2643N425m860j3819j6853j1341j516Q258J4521J3491P181k701
$$ -8012 6999 19642 25067 20207 6388 -10465 -21806 -23322 -15064 -543 12948 20129 17428
1975A7428j1800j5592j2150k518O965J4836J5108R566q25r426j4218j2118m289
$$ 17428 5628 -9964 -22114 -24632 -17667 -2831 12277 21843 21018 11592 -2626 -14744 -19033
1988a9033N223J2498J3731R625Q6r043j3928j2528o149K592J0453J2764Q922R38
$$ -19033 -13810 -1312 12419 22044 22130 13087 -841 -13369 -19518 -16926 -6473 6291 15213 16151
2002A6151p604j2486j1210n490L181R704J2561R516K491n906j1249j0141m770
$$ 16151 8547 -3939 -15149 -20639 -17458 -7754 4807 14323 16814 10908 -341 -10482 -15252
2015a5252L374R427J1468Q646J676o650j1660j1033n814K420R070J1165Q035O24
$$ -15252 -11878 -2451 9017 17663 19339 12689 1029 -10004 -15818 -13398 -4328 6837 14872 15496
2029A5496p254j1707j1612n359K793R809J2838R918J737o506j1284j1415n647
$$ 15496 8242 -3465 -15077 -20436 -17643 -7834 5004 14922 16659 10153 -1131 -12546 -18193
2042a8193K801J0367J3761J0738L031o578j2812j3190p429O88R344J3296J1495
$$ -18193 -15392 -5025 8736 19474 22505 15927 3115 -10075 -17504 -16816 -7472 5824 17319
2055A7319L573o105j3052j4465r458m65Q706J3833J2947O563l528j1407j3662
$$ 17319 20892 14787 1735 -12730 -22188 -22653 -13947 -114 12833 19396 15868 4461 -9201
2068i201j0259j333Q030J3836J3539Q039j246j0200j3958j1657l990N478J2014
$$ -9201 -19460 -20793 -12763 1073 14612 22651 21405 11205 -2753 -14410 -18400 -12922 -908
2081i08J2562P753m78r085j3644j1945n285L542J0570J2652Q751O24o628j1573
$$ -908 11654 19407 18929 9844 -3800 -15745 -21030 -17488 -6918 5734 14485 15109 8481 -3092
2095c092j0523m617L252J0072J2110R238J727o004j0578j0158m907K609Q044J0831
$$ -3092 -13615 -18232 -14980 -4908 7202 16440 18167 12163 1585 -8573 -13480 -10871 -2827 8004
2109H004P756R17o138j1403j0595n030J962Q296J0378P446J244o098j0365r781
$$ 8004 15760 16677 10539 -864 -11459 -16489 -14527 -6231 4147 11593 12837 6739 -3626 -13407
2123a3407m332L005R556J1614Q678J799n887j0282j0367n488L071R207J2028Q625
$$ -13407 -17739 -14734 -5178 6436 15114 16913 11026 744 -9623 -15111 -12040 -2833 9195 17820
2137A7820J334o213j2096j2023o896J155Q983J2128R780K962o023j1801j2109
$$ 17820 19154 12941 845 -11178 -18074 -16919 -7936 4192 13972 16934 10911 -890 -12999
2150a2999p688O95Q907J3230J2265N345l827j0835j2744q654j111P737J3030J2207
$$ -12999 -20687 -19992 -11085 2145 14410 19755 15928 5093 -7651 -16305 -17416 -9679 3351 15558
2164A5558O639k837j0510j3621j1171l197N716J1202J2130P090j237q826j2816
$$ 15558 22197 19360 8850 -4771 -15942 -19139 -13423 -2221 9909 16999 15762 6936 -5880
2177e880j0992m284M707J0870J2623Q301R42o840j0646j0401m323L326J0064J1553
$$ -5880 -16872 -21156 -16449 -5579 7044 15345 16287 9447 -1199 -11600 -15923 -12597 -2533 9020
2191I020Q128P21o153j0043j0090n537J658Q002R970P051O67n962r653r555n018
$$ 9020 17148 17869 11716 1673 -8417 -13954 -12296 -4294 5676 12727 13394 7432 -2221 -11776 -16794
2206a6794K170Q090R989P635J844n697q940q932l494K752Q893J0431P416J339
$$ -16794 -14624 -6534 3455 11090 12934 7237 -1703 -10635 -14129 -11377 -2484 7947 15363 16702
2220A6702n779r579r817m659K265Q170J0134P379P67o371j0976j0919n691J940
$$ 16702 10923 1344 -8473 -13132 -10867 -2697 7437 14816 15583 9212 -1764 -12683 -18374 -16434
2234a6434Q899J1291Q543K294n229j0270j0887o446J902R067J2695J0309L450
$$ -16434 -7535 3756 12299 14593 9364 -906 -11793 -18239 -16337 -7270 5425 15734 19184
2247A9184l771j0427j1894q097j88P591J1877J0452M560l937j0103j3190r554
$$ 19184 15413 4986 -6908 -15005 -15193 -7602 4275 14727 19287 15350 5247 -7943 -17497
2260a7497k238O471J1391J1117O055j189q613j2270r268k654N216J0876J1941
$$ -17497 -19735 -13264 -1873 9244 15299 14110 5497 -6773 -16041 -18695 -13479 -2603 9338
2273I338P491P56p366j0762r831l790L508Q951J0530P122P17o604j1056r810m869
$$ 9338 16829 17585 10219 -543 -10374 -14164 -10656 -1705 8825 15947 16664 10060 -996 -10806 -15675
2288a5675K179P576R723O874J323n290r475q689m433K797Q297R075P673J660m325
$$ -15675 -13496 -5920 3803 10677 12000 6710 -2765 -11454 -15887 -13090 -4793 4282 11955 13615 9290
2303I290q820q282m010K958P582Q656O674R36n418r357r047m878K410P248R232
$$ 9290 470 -7812 -11822 -8864 -1282 7374 14048 14984 9566 209 -8838 -13716 -11306 -4058 5174
2318E174O032Q29n433r469r675m370K795P997J0588P963J994m522r803r651m946
$$ 5174 11206 12035 6602 -2867 -12542 -16912 -14117 -6120 4468 12431 14425 9903 100 -9551 -14497
2333a4497J967Q687J0556R045K831m895j0450j1279o645qP139J0547R622L658
$$ -14497 -12530 -3843 6713 15758 18589 13694 3244 -8035 -14680 -14688 -7549 2998 12620 16278
2347A6278m294j0103j1610q056o81O410J0831J1005N957j796q807j0882q168j825
$$ 16278 11984 1881 -9729 -17785 -18466 -12056 -1225 9780 15737 13941 5134 -5748 -13916 -15741
2361a5741N708J0124J0926P153r68p270j1365r379l769L639Q398J0029O530O7
$$ -15741 -10033 91 11017 18170 17202 9932 -1433 -10812 -14581 -10942 -2544 7485 14015 14082
2375A4082o709j0521r068m485L130P816R613P096J028n067q183q355l839K764
$$ 14082 7373 -3148 -12216 -16701 -13571 -5755 3858 10954 11982 6915 -1268 -9623 -13462 -10698
2389a0698P393R607O791J263m881q042p918l896J347O946P972O381K22n532q579
$$ -10698 -3305 6302 13093 14356 9475 1433 -6485 -10381 -9034 -2088 5884 12265 12487 6955 -1624
2404a624p864m165J807O854P907O500J115n032q301p836l092K530P575R744O968
$$ -1624 -9488 -13653 -11846 -4992 2915 9415 10530 5498 -2803 -10639 -13731 -11201 -3626 6118 13086
2419A3086J323m452q903r180m202K515P260R446P004J681n165r654j0339n982
$$ 13086 14409 9957 1054 -8126 -12328 -9813 -2553 6893 13897 15578 10413 759 -9580 -15562
2433a5562P51P175J0526P893K810l867r213j0265o604K43O891J0814J0181M611
$$ -15562 -14811 -7636 2890 10783 13593 9726 513 -9752 -16356 -16113 -9222 1592 11773 16384
2447A6384k340q463j0409p267j708N521J0197R809N286j827p950j0792q795l090
$$ 16384 14044 5581 -4828 -12095 -13803 -8282 1915 11724 17010 15183 7233 -3559 -12354 -15444
2461a5444L743Q432R654O088m56o525r869q154l243L047Q236R508P083J112n140
$$ -15444 -11701 -3269 6385 12473 12017 5492 -4377 -12531 -15774 -12727 -4491 5017 12100 13212 8072
2476H072q333p883l432K695P332Q260O310R44m782q187q357m012J813N929P525
$$ 8072 -261 -8144 -11576 -8881 -1549 6711 13021 13965 9183 996 -7361 -11373 -9560 -3631 3894
2491C894N486O67m600q049p398l503K011O828Q144N908P51l896p194o867l373
$$ 3894 9380 10047 5447 -2602 -10000 -13503 -11492 -4664 3480 9388 10139 6243 -951 -7818 -11191
2506a1191K650P117Q237O165R05n234p979q077m119K111O266Q316O522Q07n454
$$ -11191 -8541 -1424 6813 12978 13883 8649 670 -7407 -11526 -9415 -3149 5167 11689 12496 7042
2521G042r127q588m751J782P036R011P804K562m115q594q924m738R68P062R728
$$ 7042 -2085 -10673 -15424 -13642 -6606 2405 10209 12771 8656 62 -8862 -13600 -12632 -5570 4158
2536D158Q866L464k832q954j0242o565n60N311R284Q520M180k245q365r784q086
$$ 4158 13024 16488 13656 4702 -5540 -12105 -12665 -7354 1930 10450 14630 12385 4020 -5764 -13850
2551a3850k159M495Q883Q982N290l06o198q894p495k905L677Q185J0051N593O61
$$ -13850 -16009 -11514 -2631 6351 11641 11335 5137 -3757 -11252 -14157 -10480 -2295 7756 13349 14010
2566A4010n297q473p580l404J963O935P914N797M56n244q326p381l333R43O186
$$ 14010 8713 240 -7340 -10744 -8781 -1846 6068 11865 12321 7077 -1249 -8630 -11963 -11020 -4834
2581d834P665N528L88l855p335o438k697K067N952P707O026J021l654o769o869
$$ -4834 2831 8359 8747 4892 -2443 -8881 -11578 -9511 -3559 4148 10174 11195 7541 772 -6097
2596f097k859J954O092P334M905K32m659p951o860l613J376O273P402N675O26
$$ -6097 -8956 -7002 -910 6424 11329 11561 6902 -1049 -7909 -11522 -10146 -3873 3529 9204 9830
2611I830m722p676p532l507J891O929Q926P069J546m105p746p727m289R64O374
$$ 9830 5108 -2568 -10100 -13607 -11716 -4787 4139 11208 12754 8649 903 -6824 -11113 -10149 -3775
2626c775R097P322K371l884q370r029o346k83N096Q967P897L914l122p769r471
$$ -3775 5322 12644 15015 11131 2761 -6268 -12614 -12897 -7801 1166 9063 12977 9855 2086 -7385
2641g385o565r23M692R030Q954M856j221o219q340o986j738L776Q129Q492N266
$$ -7385 -13950 -14873 -10181 -1151 7803 12659 11438 5219 -3121 -10107 -11845 -8069 60 8552 13818
2656A3818l58n516q576p663l398K278P042P366M980K95m986p414p681l123K225
$$ 13818 13460 7944 -632 -8295 -11693 -9415 -2373 4993 9973 10268 5282 -2132 -9813 -12936 -10711
2671a0711O259P314N581R08l686o422o173k540J828N961P376N032M71l509o834
$$ -10711 -4452 2862 8443 9351 5665 -757 -6930 -9470 -7642 -1681 5695 10727 11198 7689 855
2686H55o138l406J547N175O446M637J58m500o861o493l090J597N975O865N326
$$ 855 -5283 -8689 -7142 -1967 4479 9116 9274 4774 -2087 -8580 -11670 -10073 -4098 2767 8093
2701H093Q67m208o863o088k995K176O721P813N730J139l934p460p033m127R17
$$ 8093 8960 4752 -2111 -8199 -11194 -9018 -2297 5516 11246 12385 8451 991 -6042 -10169 -9252
2716i252O491Q069N773J356m439p564q690n058N51N671Q311O981K965k893p220
$$ -9252 -2761 5308 11081 12437 7998 434 -8256 -13314 -12763 -7092 1219 8200 11165 8272 1052
2731A052p885n714k23N726P877Q778M063j656o223q511o554j857M278P716P326
$$ 1052 -6833 -12547 -12770 -7044 833 9611 13674 12018 5795 -2716 -9270 -11127 -6849 867 8193
2746H193M619r76n982q393p299k977L085O383P458N077J49m805p406o458k270
$$ 8193 12812 11836 5854 -2539 -9838 -12815 -9730 -3347 4111 9188 9337 4532 -2874 -9332 -11602
2761a1602K195O068P846N063J096m046o055o409k610J907N630O529M306M90m134
$$ -11602 -9407 -3339 4507 9570 10666 6620 565 -5844 -8454 -6547 -917 5612 9918 10408 6274
2776F274o047o453l169J241M967O059M282J10l514o590n381k574J866N706O792
$$ 6274 227 -6226 -9395 -8154 -3187 2872 7154 7264 3750 -2840 -8221 -10795 -8929 -3223 3569
2791C569M485O22l416n789n842k843K566N996O567M693P62m189o786o916l518
$$ 3569 8054 8676 5260 -529 -6371 -9214 -6648 -652 5915 10608 11370 7181 395 -6521 -10039
2806a0039J543N582O919M883Q66l932p395p045l674M83N986P836O588K328l036
$$ -10039 -8496 -2914 4005 8888 9754 5822 -1573 -8618 -12292 -11809 -5823 2013 8601 10929 7893
2821G893o758p336m542O03N380P767P303L373k398o838q282n630j248M079O897
$$ 7893 1135 -6201 -10743 -10140 -4760 3007 10310 13683 11285 4447 -3835 -9465 -10713 -6634 263
2836B63O784L942j423n966q133o308k305L455P023P224M589J80m634o905n872
$$ 263 7047 10989 9566 3600 -4533 -10841 -13146 -9691 -2668 4556 9145 9325 4691 -2214 -8086
2851h086k417K695O733O975M654O15l881o472o401k668J788M721O057M335K53
$$ -8086 -10503 -7808 -1075 5900 10554 11169 7288 816 -5585 -8253 -6465 -1744 4313 8648 8901
2866H901l810o338n726l027J146N052N917M261O73l707n092n116j675J841M871
$$ 8901 5091 -1247 -6973 -10000 -8854 -3802 2115 6376 7049 3342 -1750 -6866 -8541 -6700 -1829
2881a829O380M079J001l614n624n904j655J652M861N646M100J07m122o005o494
$$ -1829 4551 8630 9631 6017 393 -5511 -7166 -5514 -653 4993 9093 9200 5078 -927 -7421
2896g421k999J737N466O246L972P12l320o011o579k883J635O081P187N611J534
$$ -7421 -10420 -8683 -3217 3029 7001 7713 4393 -1618 -8197 -11080 -9445 -3364 3823 9434 10968
2911A0968l269o029o821m051N18N421P032O446J867l003o706p724n036m63L860
$$ 10968 7699 1670 -5151 -9202 -8684 -3263 3769 10215 12082 9079 2373 -5351 -10387 -10850 -6990
2926f990O992O464L428k313n979p206m949j088L688O690P406M348m18n195o618
$$ -6990 2 6466 9894 7581 1602 -5604 -10553 -11641 -7953 -1263 6143 10491 10073 4878 -1740
2941a740n775j413K834N926O246M618J7m418o970n901k491J490M779O042L950
$$ -1740 -7515 -8928 -6094 -168 6078 10696 10713 6295 -675 -6576 -9067 -7577 -2798 3244 7194
2956G194L02l676o226n231k237J571N013N706M262J117l140m928m988j873J647
$$ 7194 7496 3820 -2406 -7637 -9874 -8303 -3290 2416 6678 7795 4655 -273 -5261 -7134 -5487
2971e487M509O030L566L19l496n153n066k515J326M655M917L683l09l637n649
$$ -5487 -978 5052 8618 8937 5441 288 -4778 -7293 -5967 -1312 3605 7288 6979 3342 -2307
2986b307n361k116J686M662O323M292Q66l764n659n350j994J943M950O701N000
$$ -2307 -7668 -9784 -8098 -3436 2887 7179 8045 4281 -1378 -6728 -8722 -6779 -1829 4872 9872
3001I872R47l541o388o068l440J008M859O128N220R32k965o589o761m304J2M837
$$ 9872 10819 7278 890 -5178 -8618 -7610 -2751 3377 8597 9529 6564 -25 -6786 -11090 -11078 -6241
3017f241O867O072K441k034n487o767m448n84M267P040O496L761j694m959o557
$$ -6241 626 6698 9139 7105 1618 -5149 -9597 -10181 -5914 1126 7622 11383 9689 4730 -1827
3032a827n183j459K554N865O394L480q73m529o919n499k016K052M939O074L795
$$ -1827 -7010 -8469 -5915 -50 6344 9824 8951 4422 -2497 -7996 -10012 -7960 -3021 3053 6848
3047F848K94l582n406m909k280K191M662O154M045J35k740m941m553k322J716
$$ 6848 7142 3560 -1846 -6755 -9035 -6844 -2182 3972 8017 8152 5412 471 -4082 -6404 -4688
3062d688M031N037L312J21l191n437n028j918J207L814N481K831Q7l151m884m526
$$ -4688 -657 4380 7692 7813 4622 -815 -5843 -7761 -6554 -2740 2741 5572 5659 2508 -2376 -6902
3078f902j536J617N051N266L627O68l162n190m619j638J348M757N979L714L26
$$ -6902 -8438 -6821 -1770 3496 7123 7791 4629 -561 -5180 -6818 -5470 -713 5266 8980 9306
3093I306l647n907n459l010R71M646N794M435P34l431n464o169l076O79M648O627
$$ 9306 5659 -248 -5707 -8717 -7746 -3100 2694 7129 7863 4432 -1032 -7201 -10277 -9598 -4950 1677
3109A677N574K197k616n068n829m164k7M252O350N905K582j930m808o953m909
$$ 1677 7251 9448 6832 1764 -4065 -8229 -8256 -4004 2346 8251 10833 8903 4095 -2858 -7767
3124g767j222K977N553N583L178j214m513o128n040j741K551N574O047L460k3
$$ -7767 -8989 -6012 -459 5124 8302 7088 2575 -3553 -8593 -10334 -7783 -2209 3838 7298 7275
3139G275l384n360m539j530J914M821N438L958R7k741n638m654k335J267L907
$$ 7275 3891 -1469 -6008 -7538 -5624 -803 4635 8593 8690 5949 311 -4343 -6678 -5411 -1504
3154a504N110L081m91l178m501m792j821J523L887M774L461k5k507m512l973j308
$$ -1504 3606 6687 6196 3018 -1483 -6275 -8096 -6573 -2686 2088 5549 5524 3017 -1495 -5468 -6776
3170f776J720M440N123L132K1k747m990m374j886J505M509M774L124k62l459n651
$$ -6776 -5056 -616 4507 7639 7660 4913 -77 -4451 -6337 -4832 -323 4451 7575 7313 3854 -1797
3186a797m838k075J244M315N543L719O41k845n146n190k482J606M294O350M606
$$ -1797 -6635 -8710 -7466 -3151 2392 6111 6752 3907 -1239 -6429 -8911 -7305 -3011 3339 7945
3201G945J468k477n180n877l113L53L687N971N221J633k593n178o045m541o28
$$ 7945 9413 6936 1756 -4121 -7234 -6881 -3194 2777 7998 9631 7038 1860 -4185 -8726 -9354
3216i354L141N888N242K596r28m544n927m482p89L056N419N574L533l42l752m806
$$ -9354 -6213 -325 4917 7513 6585 2041 -3886 -8368 -9157 -6101 -682 4892 8425 8083 4331 -475
3232d75m481k279K368M752M983L256k71l261n464m475j941J111L913M301L674
$$ -475 -4956 -7235 -4867 -115 4868 8124 7853 4592 -872 -5347 -7288 -6177 -2264 2037 5711
3247E711j88l138m321m015j399J349L804M699L352M26k293m239l383j777J631
$$ 5711 5523 2385 -1936 -5951 -7350 -6001 -2197 2502 5854 6280 3987 -252 -3635 -5412 -3781
3262c781L716M488K948k62l023m510m290j829J622L678L984K782M3l196m799l859
$$ -3781 -65 4423 7371 7109 4086 -424 -4714 -6543 -4921 -1243 2741 5523 5566 2370 -2429 -6288
3278f288k096J678M428M857L449P28k722m912m503j693J315M349N567M190P28
$$ -6288 -8384 -6706 -2278 2579 6028 6756 4034 -878 -5381 -7074 -5759 -1410 4157 8347 9075
3293I075l117n061n034l073N71L980M843M596J023k355n561n403l663o2L957N489
$$ 9075 5958 897 -4137 -7210 -6639 -2659 2184 6780 7803 5448 -113 -5516 -9179 -9241 -5284 205
3309B05N151K183j532m302m940l916n20L136N250N334K916o63m106n490m049j344
$$ 205 5356 7539 6007 1705 -3235 -7151 -7671 -4535 715 6049 8965 8302 4196 -1294 -5343 -6687
3325f687J793M602M674K839l81l763m924m871j281J452M254M383L174J67k589
$$ -6687 -4894 -292 4382 7221 6840 3077 -1847 -6718 -7999 -6547 -2293 2090 5264 5431 2842
3340B842m010l869j291J150M134M348K960O05k505l929l829j512J070L497L804
$$ 2842 -1168 -5037 -6328 -5178 -1044 3304 6264 6869 4364 435 -3394 -4906 -3836 -339 3465
3355C465K495k06k745m447m188q62J062L561M152K335j03k512m258l525j060J715
$$ 3465 5960 5754 3009 -1438 -5626 -6488 -5426 -1865 2287 4622 4519 2007 -2251 -5776 -6836 -5121
3371e121M098M428K922O20l060m407l609j732J580L821M791K941J80k815m957
$$ -5121 -1023 3405 6327 6947 3887 -520 -4129 -5861 -4281 -460 4331 7272 7452 4637 -320
3386c20n180k099N36L882N251L442R88k470m950m330k898K13M067N231M819K003
$$ -320 -5500 -7599 -7063 -3181 2070 5512 6500 4030 -920 -5250 -8148 -7935 -3868 1363 6182 8185
3402H185j793m224n306l184J19L219M836M556K148j241m117n301m347r20K200
$$ 8185 6392 2168 -3138 -6322 -6203 -2984 1852 6408 8556 7315 3198 -2103 -6450 -7370 -5170
3417e170M499M287K657p27l758m573l950j236K070M182M550L192k85k326m109
$$ -5170 -671 3616 6273 5546 1788 -2785 -6735 -7971 -5901 -1719 2831 6023 5738 3412 -697
3432f97l531j361J685L763M034K945n4k906l838l924j380P97L291L273K451J15
$$ -697 -4228 -5589 -3904 -141 3893 6838 6784 3878 40 -3884 -5264 -4467 -1176 2097 4548 4663
3448D663k852l717l342j318J534L253L786K398L17k212l855k816j103J273M025
$$ 4663 1811 -1906 -5248 -6566 -5032 -1779 2007 4405 4722 2510 -1345 -4161 -5264 -3991 34
3463C4M295K096M79l053m262l598j302R73L585M098K639j22l037m191m373j993
$$ 34 4329 6425 6904 3851 -411 -4009 -5311 -4338 -753 3345 5984 5862 2825 -1366 -5739 -7732
3479g732J398L594M641L242P90k093m638m108k201Q27L931M990M258J093j779
$$ -7732 -6334 -2740 1901 5143 5933 3840 -798 -4906 -7107 -6280 -2349 2641 6899 7992 6213
3494F213m554m999k650J47K770M824M108J534j772m102n133l551n14K360M744
$$ 6213 1659 -3340 -5990 -5843 -3073 1751 5859 7393 5621 1519 -3614 -7165 -7679 -5319 -575
3509e75M378K129o29l459m259l741p22K245M477M109K903j37l094l968l666j121
$$ -575 3803 5932 5303 1844 -2415 -6156 -6878 -4633 -156 3953 6856 6719 3625 -343 -4009 -5130
3525e130J643L194M089K614q24k729l664l999j369J005L648L220K206J53k125
$$ -5130 -3487 -293 3796 6410 5586 2857 -807 -4806 -6175 -5170 -1522 1698 3904 4057 1932
3540A932l663k962j134J167L753L675K398q2k284l046l130q37J503K757L567K168
$$ 1932 -1731 -4693 -5827 -4660 -907 2768 5166 5084 2800 -246 -3376 -4213 -2710 47 3614 5782
3556E782k75k510m114l150j561J592L035L624K258k26k881l791l404j582J688
$$ 5782 5507 2997 -1117 -4267 -5828 -4236 -1201 2423 4681 4455 1574 -2217 -5621 -7203 -5515
3571e515L863M147L275J42k417l977l612j918J353L676M519L307N51k208m463
$$ -5515 -1652 2495 5770 5912 3495 -482 -4094 -6012 -4659 -983 3536 6843 7394 5186 723
3586G23m749k518O18L026M399L327J544j900m248m471k777l42L045M303M293K022
$$ 723 -4026 -6544 -5926 -2900 1499 4826 6370 4470 222 -4249 -7026 -7368 -4323 -20 4273 6295
3602F295j046l415m010l369q4K361M022L900K284l66l421m170l386q90J330L350
$$ 6295 5249 1834 -2176 -5545 -5629 -3268 754 4654 6938 6572 3151 -1019 -4405 -5295 -3965 -615
3618f15L649K041l21k842l772l097j212J083L385L487K317K12k221l164k580q35
$$ -615 3034 5075 4754 1912 -1860 -4957 -6169 -5086 -1701 1786 4103 4315 2094 -1070 -3650 -4485
3634d485R76L358L421K024Jk142l441k710r48Q92L021K875K115p17k627l475k629
$$ -4485 -3509 -151 3270 5294 5295 3153 -288 -2998 -3946 -3054 -33 2842 4957 4240 1613 -1862 -4491
3651d491j188J267L035L289J929m5k010l529k961p05J230L565M202K522Ok676
$$ -4491 -5679 -4412 -1377 1912 3841 3796 1786 -1743 -4704 -5409 -4179 -614 3588 6110 6116 3440
3667C440l662l533j132J109L120M136K788k00k544m307l870k088P33L241M099
$$ 3440 -222 -3755 -4887 -3778 -658 3478 6266 6066 3522 -785 -4655 -6743 -6010 -2769 1330
3682A330L133Q15j701l596m509k418O15L106M542L805J789j399l469m170k683
$$ 1330 4463 5278 3577 -19 -4528 -6946 -6331 -3225 1317 5122 6911 5512 2043 -2127 -4810
3697d810q4K326L968L624J342p64l348m107l294j068J813L700L258K431n04k830
$$ -4810 -4894 -2568 1400 5024 6366 5602 2254 -1853 -5147 -6215 -4402 -702 2556 4987 4483 1653
3713A653m133k799p96J644L181M082K263O6k461l393k530j088J595K828L406J730
$$ 1653 -2480 -5279 -6075 -4431 -1250 2832 5095 5161 2700 -693 -3223 -4311 -2716 112 3518 5248
3729E248l37k308k950k943j247J032K618K938J691m09k117l265k413p69J311K750
$$ 5248 4911 2603 -347 -3290 -4537 -3505 -887 2051 3742 3333 1216 -2049 -4462 -5231 -3920 -1170
3745a170L254K186Q0k621k879k324q19J724K863L633J686k04k497l302l196j468
$$ -1170 2084 4270 4350 1729 -1150 -3474 -4293 -2569 294 3927 5613 5409 2912 -390 -3586 -5054
3761e054J183K849L683K272J10l150l226l716j419R55L471L972K692O71k158l371
$$ -5054 -3871 -1022 2661 4933 5043 1893 -1333 -5049 -6468 -5513 -2042 1930 4622 5293 3135 -236
3777b36l744j351M26L202M112L352J225j841l611m158k535M7K422M059K926J534
$$ -236 -3980 -5331 -4905 -1703 2409 5761 6986 5145 1534 -2624 -5159 -5112 -2690 1369 4295 5829
3793E829j194l818l752k912n85K145L497L693J926n94k629l697k518n95J718L573
$$ 5829 4635 817 -2935 -5847 -6432 -4287 -790 2903 4829 4235 1606 -2091 -4609 -5204 -3486 87
3809H7L493J705J97k209l367k784r08P45K864K974J708j84k303l386k761q71J230
$$ 87 3580 5285 5482 3273 -94 -2878 -3786 -3041 -177 2797 4505 4321 2018 -1368 -4129 -5000 -3770
3826c770K335K857J727n0k037k809j867q88J262K964K899J785J04k068k738k591
$$ -3770 -1435 1422 3149 3099 1062 -1747 -3614 -4502 -3240 -276 2623 4408 4512 2444 -294 -2885
3842b885n67J384K782K640J334l06k227l379k803j383J548L010K896K049l62k215
$$ -2885 -3452 -2068 714 3354 4688 4382 2155 -1224 -4027 -5410 -3862 -852 2044 4093 3731 1516
3858A516l356l035q13J585K960L639K469J89j862l434l108j335P44K825L709K921
$$ 1516 -1840 -4875 -5688 -4103 -1143 2496 4965 5154 3292 -142 -3250 -4585 -3841 -1016 2693 5614
3874E614N74j969l659l762k523O86K142L474L212J187j586l497l213k675j6K658
$$ 5614 6188 4219 560 -3202 -5725 -5039 -2897 577 3789 4976 3390 -107 -3320 -5995 -6011 -3353
3890c353L253L729J694q79k437l648k421m11K094K839L325J830p22k371l375k714
$$ -3353 -100 3629 5323 4444 2007 -1641 -4062 -4473 -2379 460 3785 5615 4893 2522 -853 -3567
3906c567r41J316K349L121J592m36k008l036k655q71J033L191K649J598K58j925
$$ -3567 -4508 -3192 -843 2278 3870 3434 1426 -1610 -4265 -5136 -4103 -912 1737 3335 3593 1668
3922A668k494k469k68J327K391K988J522n57j817k667k631o49J122K675K401J252
$$ 1668 -826 -3295 -3563 -2236 155 3143 4665 4108 2291 -376 -3007 -3656 -2534 141 2542 3794
3938C794m83k184k934k354n03J192K709K843J864m53k040l135k476k93J077L429
$$ 3794 3311 1127 -1807 -4161 -4664 -3472 -763 2080 3944 3491 1451 -1684 -4160 -4453 -3376 53
3954E3K902K404q7k294l415k851j248J401K494L158K444J65k318l366l460j694
$$ 53 2955 5359 5272 2978 -437 -3288 -4536 -3135 -641 2517 4961 5126 2808 -558 -4018 -5712
3970e712N89K753L311K867P21j387l347l253j954P20K463L343L413J161r16l018
$$ -5712 -5123 -2370 941 3808 4529 3142 -205 -3458 -5412 -4692 -2229 1114 4527 5688 4772 1754
3986A754l297k256m86J846L328K553J514o35k742l288k524o32J510K301L488J178
$$ 1754 -1543 -3799 -4285 -2439 889 3442 4956 4321 1579 -1709 -4233 -4865 -3355 -1054 2434 3612
4002C612k49k318k738k255l30J050K861K562J618L49j935k534k337m03J255K165
$$ 3612 3363 1045 -1693 -3948 -4278 -3228 -367 2195 3813 4162 2227 -307 -2644 -3047 -1792 373
4018C73K155J605k20k212k316k393r29J263K065K603J009l45k018k611k017m21
$$ 373 2528 4133 3913 1701 -615 -3008 -3937 -2674 -609 1994 3003 2658 640 -1971 -3988 -4409
4034d409J488K217K982J713l56j859k625k239n87J572K509K857J706n89j968l415
$$ -4409 -2921 -704 2278 3991 3635 1776 -849 -3088 -3675 -2103 406 3263 4969 4380 2412 -1003
4050a003k297q33R02K212L114J769o7j894l241k949j422R16K788L562K792M1j122
$$ -1003 -3300 -4133 -3231 -1019 2095 3864 3797 1903 -1338 -4287 -5709 -4793 -2005 1557 4349 4390 3268
4067C268l322k849j434N87K354L466K366J514j694l058l168k461J48J637L128
$$ 3268 -54 -2903 -4337 -3750 -1396 2070 4436 5950 4256 1198 -1970 -4431 -4283 -2646 482
4082D82K782Q80q14k989k894k159l11J491K751L174J387l18k172k785j908l66
$$ 482 3264 4144 3330 341 -2553 -4712 -5023 -3532 -781 2393 3780 3462 1290 -1495 -3403 -3769
4098c769J356K859K318J611K7k131k477k199q31J087J957K587P39k65j916k320
$$ -3769 -2413 446 2764 4375 4402 2271 -206 -2405 -3236 -2149 -192 2395 3134 2869 953 -1367
4114a367k108m67R48K097K266J335k38j620k432j560k93J429K383K126J551n13
$$ -1367 -3475 -3942 -2994 -897 1369 2704 2466 846 -1586 -3146 -3439 -2010 373 2499 4050 3537
4130C537j698k267k273l84J285K187K730O26j85k094l018k135p23J155K279K824
$$ 3537 1839 -428 -2701 -3085 -1800 387 3117 3743 3558 1464 -1554 -3689 -4412 -3257 -978 1846
4146A846J456J28k037k933k545q13J284K720K963K210M02j727k874k712j193N62
$$ 1846 3302 3430 1393 -1540 -4085 -4898 -3614 -894 2069 4279 4681 2954 80 -2632 -3825 -3263
4162c263K509L067K130N34j625l077l433j726N70K001K676K545R69r20l211k420
$$ -3263 -754 2313 4443 4977 3352 275 -3158 -4884 -4314 -2313 363 2908 3877 2957 -254 -2674
4178b674k017Q2J889L163K612R57n07j889k878j773n79J560K637K356J419p06
$$ -2674 -4691 -4609 -2720 443 3055 4012 3505 1616 -1262 -3035 -3614 -2054 583 2939 4358 3652
4194C652j880k660k049q49J093J983K684J121p55j722k185j897o41J272K441K073
$$ 3652 1772 -888 -2937 -3786 -2693 -710 1974 3095 2340 618 -1567 -3464 -4105 -2833 -392 1681
4210A681J506k20j962k031j319n51J247K371K034R00k65j859k242k043j97R25
$$ 1681 3187 2967 1005 -1026 -2345 -2896 -1649 722 2756 3656 3391 1532 -710 -2753 -2950 -2025
4226b025K016K242R72p14j935k379j853n06J413K317K355J500l61j781k488j984
$$ -2025 -9 2233 3205 2491 556 -1823 -3676 -4182 -2769 -452 1903 3403 3042 1261 -1227 -3211
4242c211l71J132K415K906J688m3j868k944k394q17J56K807K429K143J84j865
$$ -3211 -3582 -2450 -35 2871 4559 4516 2648 -296 -2690 -3507 -3351 -544 1885 4028 4212 2347
4258B347l075k647j542P14K048K944K158O41p62k862k410j579K59J975K812K424
$$ 2347 -728 -3375 -4917 -4203 -2155 789 2947 3588 2826 -36 -2446 -4025 -3766 -1791 1021 3445
4274C445J178r72k039k948j750n15J732K386K247R11n30k091k674k036m53J197
$$ 3445 4623 3651 1612 -1336 -3086 -3601 -1869 517 2764 3675 3145 1054 -1620 -3656 -4109 -2912
4290b912J946K472J434o56j376k291j916r6J259K279J963J337k01j856j850j498
$$ -2912 -966 1506 2940 2284 908 -1383 -3299 -3395 -2136 143 2106 3443 3242 1386 -464 -1962
4306a962j42J011J733J548J148n22j760k080k017m12J229K113J527J449j025j601
$$ -1962 -2104 -1093 640 2188 3336 2814 1054 -1026 -3043 -3455 -2226 -113 1414 2863 1838 237
4322B37j800j964K23J469J898K118J177Kj811k511j319p04J107K544K045J280
$$ 237 -1563 -3527 -3304 -1835 63 2181 3358 3360 1549 -962 -2281 -2985 -1878 666 2711 3991
4338C991k96k245k384k294r51J104K109K483J464K86j746k861k122q25P66J922
$$ 3991 3695 1450 -934 -3228 -4179 -3075 -966 1517 2981 3267 1521 -1340 -3462 -4287 -3521 -1599
4354a599L114K124L36j322k499k632r96K72K402K520K183P03j352k451k666j337
$$ -1599 1515 3639 3975 2653 154 -2478 -3474 -3202 -800 1720 3903 4606 3254 803 -1863 -3200
4370c200m38J820K252J851R46o38k352k362j600k76J720J885K194J289m48j731
$$ -3200 -3638 -1818 434 2285 3231 2593 241 -2121 -3721 -3997 -2277 -392 1802 3091 2643 912
4386I12j992j353n83J638J862J746J177l87j683j844j612l86J014J537K017M68
$$ 912 -1080 -2433 -3016 -1378 484 2230 3407 3020 1337 -507 -2119 -2505 -1491 46 2063 2531
4402B531m73j739j986j243m47J471J601J898J046q87j144j708j550jJ113K036
$$ 2531 2058 319 -1667 -2910 -3357 -1886 -285 1613 2659 1772 628 -1080 -2630 -2631 -1518 518
4418E18K399M08m32j291k293k055J14J361J767J851R66o95j621k606j761n17R99
$$ 518 2917 3325 2893 1602 -691 -2746 -2632 -1271 496 2347 3313 2618 997 -1609 -3370 -3887 -2888
4435b888K217K118J563r9j951k194k088k78P63K496K574J591J04j609k390k047
$$ -2888 -671 1447 3010 2911 960 -1234 -3322 -3600 -2837 -341 2233 3824 3928 2319 -71 -2118
4451b118r56M82J790K682J637J11j315k297k274j511J1J446K763J842Q21j084
$$ -2118 -3074 -2592 -802 1880 3517 3628 2313 16 -2258 -3769 -3758 -2312 451 2293 3114 2030
4467B030j866k036j820M44J356K509K082Q04o83j708j750j784mJ466J400J988
$$ 2030 164 -1872 -3692 -3248 -1892 617 2699 3503 2820 1112 -638 -2422 -2426 -960 440 2428
4483B428Q33n53j901j748j452n47Q23J856J629J094o87j743j812j121R4J216J358
$$ 2428 3261 2708 807 -941 -2393 -2940 -2117 -261 1368 2462 1775 32 -1780 -2901 -2807 -1591 -233
4500b33K100N96m78j178j488j644L50Q52J999J679Q71p18j693k119j480k49J164
$$ -233 1867 2463 1985 807 -681 -2325 -1975 -1123 876 2555 3426 2708 1015 -1104 -2584 -2833 -1669
4517a669J534J995P15p29j855j669j507l15J520J969J882J153j16j806k234j760
$$ -1669 -135 1860 2575 1846 -9 -1678 -3185 -3500 -1980 -11 1871 3024 2908 1102 -1132 -2892
4533b892j24J089K192K477J006j08j685k482j898q29Q42J686K184J547K53j607
$$ -2892 -3016 -1927 265 2742 3748 3640 1955 -527 -2425 -3254 -2412 -726 1458 3005 3258 1651
4549A651k587j977j248O47J933K165J976N53r81k082k026j046J13J840K282J878
$$ 1651 -936 -2913 -4161 -3514 -1581 584 2560 3113 2132 50 -1976 -3022 -2909 -1069 1213 3091
4565C091O30p26j940k238j487m3J418J611K011M34n09j724j962j559j52J102J903
$$ 3091 3721 2995 1055 -1183 -2670 -2713 -1295 316 2327 2761 2252 528 -1434 -2993 -3145 -2043 -140
4582a40J403R49m56j461j527j305L39J069J581J724Q30p63q86j795j350k98J351
$$ -140 1263 2212 1756 295 -1232 -2537 -2198 -1129 452 2176 3006 2243 1357 -438 -1788 -2086 -735
4599g35J333J391N70p24j349k027j078k52J140J970J446L33k09j774j553j625
$$ -735 598 1989 2559 1835 486 -1541 -2619 -2871 -1731 239 1685 2018 1809 35 -1518 -3143
4615c143L07J229J989J829R21l24j607j894j554k50J214J642J795J206m49j924
$$ -3143 -2836 -1607 382 2211 3132 2808 1201 -693 -2247 -2497 -1283 359 2154 3360 2911 987
4631I87k008j737o27P20J975J933J440K07j777k161j707r68R48K122K021J809
$$ 987 -1021 -2758 -3385 -2665 -690 1243 2683 2890 1113 -1048 -2755 -3723 -2775 -653 1368 3177
4647C177N5j085k015j870j122N82J719K107J512M24r47k084k162j150N9J282K074
$$ 3177 3232 2147 132 -1738 -2860 -2278 -559 1548 3060 3484 2537 453 -1709 -2859 -2800 -1518 556
4664E56J217O75p42j462j973j236M2J091K001J572J091p81j170j767j142J66R07
$$ 556 1773 2448 1706 244 -1729 -2965 -2923 -1832 169 1741 2832 2051 881 -886 -2028 -1862 -955
4681i55J983J082L62kj506j815j135n09J221J592J421L71p47j282j937p55J59
$$ -955 1028 2110 2472 2470 964 -851 -1986 -2495 -1274 318 1739 2110 1363 81 -1856 -2611 -2452
4698b452J049J526J354P62n38j410j366j342K37J167J882J460O83o46j473j732
$$ -2452 -1403 123 1477 2239 1701 291 -1075 -2417 -2180 -1013 869 2329 3012 2366 893 -839
4714h39j466k62J192J868J425J113o19j743k200j615p4P99K016J913J264l65j544
$$ -839 -2305 -2567 -1375 493 1918 3031 2412 669 -1531 -3146 -3220 -2421 -405 1508 2772 2407 863
4731H63j985j621k76J115J656K007J435J23j163k161k131p05O88J695J793J377
$$ 863 -1122 -2743 -3019 -1904 -248 1759 3194 3317 2154 -7 -2138 -2843 -2155 -460 1333 2710
4747B710K94j367j760j926j086K82J187K113J460O36q75j491j866j180K45J562
$$ 2710 3004 1637 -123 -2049 -3135 -2853 -1666 447 1907 2543 1668 177 -1689 -2869 -2624 -1062
4763a062J609J885R18r51j580k030r90L85Q18J602J740O9q64r80j926r18j57R87
$$ -1062 547 2432 3350 2399 819 -1211 -2201 -1816 -998 604 2344 2413 1549 569 -1357 -2275 -2432 -1445
4781a445J518J409J77m02j132j422r81j10J119J745J287N11n43j018j619r18K21
$$ -1445 73 1482 1659 1257 125 -1297 -2278 -2388 -1269 476 1763 2274 1731 713 -906 -1824 -1603
4798a603R41J590J497L76q53j664j465j239J23Q79J586J640N21o50j457k000j123
$$ -1603 -662 928 2425 2801 1948 284 -1181 -2420 -2297 -1418 168 1808 2329 1679 222 -1778 -2901
4815b901j53J260J691K223N72j94j529k059j157j07P48J897J711J265l30j535
$$ -2901 -3054 -1794 -103 2120 2692 2498 969 -1090 -2247 -2354 -1606 291 2002 3267 2937 1402
4831A402j885j780n19O03J623K025Q35M74j610j890k063m68O29J436J964J617
$$ 1402 -483 -2263 -2782 -2179 -556 1469 2304 2778 1168 -722 -2785 -3253 -2624 -1188 776 2393
4847B393J72q78j480j743p65K50J466J721R89N37n73j577j543j182J05J050J455
$$ 2393 2565 1687 207 -1536 -2301 -2051 -585 1136 2125 2662 2089 512 -1031 -2213 -2108 -1058 397
4864C97J461J23o81j163j337j473l06J629J338J692j2k54j238j376p20N4J335
$$ 397 1858 1981 1300 137 -1200 -2673 -2979 -1350 -12 1680 1668 1414 176 -1200 -1920 -1866 -531
4881e31J443J039K36k86j469j302p71J53Q82J305J055J19l42j688j192p86P4J033
$$ -531 912 1951 2187 1901 432 -870 -1641 -1488 -606 699 1754 1873 1531 -157 -1349 -2135 -2061 -1028
4899a028J024J556M15n59j328j905o44P4J138J540J739Q17p39j075j966j329K9
$$ -1028 -4 1552 1967 1408 80 -1825 -2469 -2395 -1257 283 2022 2839 2100 1025 -941 -2270 -2241
4916b241J043J562J717J038q58j439k072j298m4N50J336K136P61k28q19j924j602
$$ -2241 -1198 364 2081 3119 2261 822 -1250 -2548 -2592 -2042 -706 1430 2191 1963 1144 -780 -2382
4933b382m30O04J348K135J254J67j285j425j125r61K57J207J565J412M03j091
$$ -2382 -2812 -2208 -860 1275 2529 2696 1411 -14 -1139 -2100 -1843 -636 929 2341 2744 1653
4949A653j505j777r25M00P96J786J569k06o30j443j086j131J96J229J421J103
$$ 1653 148 -1629 -2554 -2154 -1358 428 1997 1791 1161 -282 -1368 -2499 -2303 -1074 347 1450
4965A450O90n46j384j076q58L19R60J445R86M12o03j416j188r99j50J019J609
$$ 1450 2140 1594 210 -866 -1724 -1405 -445 1000 1986 2398 1795 379 -809 -1808 -1958 -939 670
4982F70O51N13p35j377j246p95L03P75J706J196O04p48j512j163p69M46Q01J579
$$ 670 1321 1834 1099 -278 -1524 -2319 -2016 -1241 465 1661 2265 1517 5 -1158 -1927 -1481 -680 899
5000H99J598j09n84j339j678j045J72J003J644J253N10p39j496j803j154N1R08
$$ 899 2497 2388 1804 465 -1213 -2258 -2086 -1083 561 1814 2324 1585 89 -1714 -2868 -2817 -1909
5017a909J872J354J145n13j021j786j316n43J253J346J868J121l30q56j682j248
$$ -1909 -37 1317 2462 1949 928 -858 -2174 -2717 -1464 -118 1750 2871 2541 1685 3 -1245
5033a245r37O69J367J317J203q3r73j333j960m55K08J069J703J025L95n86j372
$$ -1245 -2182 -1513 -146 1171 2374 2291 1318 -15 -1975 -2430 -2222 -1153 550 1575 1970 1384 12
5050A2j272r37M91J135J436Q61O29o75j511j059p46L15P63J210J154o3n53r46
$$ 12 -1260 -2197 -1706 -571 865 1726 2355 1680 169 -890 -1636 -1321 -558 652 1806 1743 1190 244
5068B44j542q02J16J250P66J204N38m62j480j222q24K52J392J453Q30K88o98j106
$$ 244 -1298 -2100 -1984 -734 32 1236 1774 1312 -168 -1390 -2214 -1962 -570 883 1713 2001 1303 197
5086A97j156q19L59R93J233J131L60o84j402j684p16R8Q74J632J367L0k18j382
$$ 197 -959 -1778 -1419 -426 807 1938 2298 1614 212 -1472 -2188 -2090 -1216 416 1783 1813 1595 213
5104B13j978n73J41Q68J836J250N82l46j137j792r89j31R86J545J156J005l81
$$ 213 -1765 -2338 -2197 -1329 507 1757 2339 1993 856 -936 -1925 -2056 -1070 475 1631 2636 2255
5121B255j104j677j642j72M85J355J483J071j91j014j459j409l14J64J254J955
$$ 2255 1151 -526 -2168 -2340 -1855 -500 983 2054 1863 849 -610 -2019 -2333 -2169 -915 1040
5137A040O49K94p13j168j288o20J82J252J246J010N95p15j350j548m72J80R67
$$ 1040 1689 1983 1270 102 -1186 -1806 -1624 -372 874 1884 2479 1764 414 -1134 -1606 -1426 -459
5154d59J041Q20j42k72j173j200p10M10P22J446R15J23n71j048j167m15M55R39
$$ -459 582 1402 1260 988 -185 -1385 -2095 -1685 -963 483 1398 1521 950 -98 -1265 -1680 -1225 -286
5172b86J240Q70J60m16j486j192n89K32Q97J210J061l29q1j662r91q58K25Q31
$$ -286 954 1824 1984 1568 82 -1110 -1699 -1467 -570 640 1701 1372 1291 -371 -1362 -2220 -1995 -1164
5190a164J469R52L15l78j296j648j41N6J090J439R68R25o71j294j410q51k70J058
$$ -1164 305 1257 1572 1194 -102 -1750 -1891 -1835 -745 694 1662 2587 1916 622 -788 -1639 -1909 -851
5208h51Q97J652P48o29j278j619j199j10O58J630J389M25O1j110j483j095l71
$$ -851 46 1698 2446 1817 539 -1080 -2279 -2389 -1731 -101 1288 1713 1774 664 -819 -1914 -2285
5225b285O78J473J154J178J00j018j231j417k95M41Q14J511Q71L02j227j084j298
$$ -2285 -1607 -134 1020 2198 2298 1280 49 -1368 -1663 -1222 -408 1103 1974 2276 1049 -35 -1333
5242a333n65M41N64J207J123q8o47j140q97n32M33O77J273J002L29k61j356j041
$$ -1333 -1898 -1457 -893 314 1437 1349 702 -438 -1335 -1867 -1434 -757 516 1518 1847 1586 230 -811
5260h11o38L29J060Q26Q20K5n68j373n04r10R2R37J218P88l6n94j417p52n19K20
$$ -811 -1449 -1120 -60 766 1586 1611 1043 -330 -834 -1744 -1652 -715 503 1291 1255 661 -756 -1508 -2027 -1807
5280a807Q71J571P30J06l92r71j283m57J25J028J583O36K61n07j224j258r71J42
$$ -1807 -936 635 1365 1471 1079 108 -1175 -1632 -1507 -479 1104 1740 2001 1494 270 -988 -1959 -1817
5298a817N99J812R08M55n69j064j837o75J20O89J415J180L98N15j346j397q54
$$ -1817 -1218 594 1502 1957 1388 324 -1513 -2188 -2068 -1379 36 1216 1614 2129 783 -614 -1468
5315a468m02N68J366J819J99o3q35j502j371l4M65R29J259O08K34j031j145j135
$$ -1468 -1870 -1302 64 1883 2082 2019 1184 -318 -1689 -1723 -1258 -329 930 1538 1772 741 -404 -1539
5333a539n68K71J100J002J055K93q21j106p43p84N44J192R95Q47J36p15j246p29
$$ -1539 -2107 -1836 -736 266 1321 1614 793 -313 -1056 -1840 -1296 -104 891 1738 1874 1159 -87 -816
5351h16m46L93Q05Q95N45q9n59r90j101j60K7J181Q66N30L09o51j108j155j25
$$ -816 -1262 -869 -64 831 1376 1287 728 -262 -1363 -1523 -1496 -315 551 1081 1390 739 -369 -1524 -1649
5370a649N30R76R74R43j85n28j118j257j07L06P23J265Q96R4r17q09j329j032
$$ -1649 -1119 -143 831 1774 1589 1061 -57 -1314 -1421 -1115 -392 873 1769 1863 946 137 -1192 -2224
5388b224O67J146R50R78L08j132q77j204l92j08P20J498J191L65P9j573j281q49
$$ -2224 -1557 -411 539 1517 1825 693 -184 -1388 -1780 -1888 -1168 330 1521 1886 1965 392 -889 -1738
5406a738J60R20J118J139P13p57q54j281j052l59N86J351J082O52l16r05j286
$$ -1738 -1578 -658 460 1599 2312 1555 701 -580 -1632 -1991 -1405 -54 1028 1680 1364 459 -827
5423h27p68m23L51J366J326L46J66n69j045j067l16L23J115P94J091l09o77j054
$$ -827 -1595 -2018 -1667 -301 1025 1371 1537 968 -77 -1144 -1460 -1137 -22 772 1863 1554 877 -177
5441a77j010l19K59J087P98N29m4m43j015p54l03%R15J043M05K83l85r97j047
$$ -177 -1187 -1506 -1247 -160 638 1167 1123 680 -335 -1089 -1392 -1392 -477 566 971 1254 869 -128 -1175
5460a175k14M48J119N60P95K52p81j009j120m71L77R47R02J004k86l69j568j052
$$ -1175 -1389 -941 178 738 1533 1785 1004 -5 -1125 -1596 -1219 -272 630 1634 1348 979 -589 -1641
5478a641m40N21J222R72Q74j74l04j025j079n07K57Q97J145R52M38l69j415j121
$$ -1641 -2081 -1560 -338 634 1508 1334 1030 5 -1074 -1581 -1324 -427 718 1670 2108 1739 324 -797
5496g97r21J36R04J073R29L43l71r83j265q34j47Q00J026J204R3K88j005r68j255
$$ -797 -1718 -1582 -678 395 1324 1667 1296 313 -952 -1786 -1933 -1133 -107 1097 1190 1478 473 -495 -1750
5515a750P1N40R89J475M48j28q07q90j123j61M00P82R16Q09j42r35o93r71k46
$$ -1750 -1679 -1139 -150 1325 1773 1645 838 -52 -1175 -1336 -936 -154 762 1571 1429 494 -199 -1170 -1416
5534a416j1R49J292J28Lm87q47r54J13R5J022J012L20L12p13r21o74l16J14J027
$$ -1416 -1427 -478 814 942 945 458 -389 -1343 -1230 -1135 -113 899 1219 1531 818 -103 -777 -1093 -979 48
5554D8J051N12k7j071p66p17m01K31P96N40R00n2m82r52j081k41L52Q64J110O71
$$ 48 1099 1611 1584 513 -253 -970 -1371 -1140 -344 196 1096 1044 562 -390 -1471 -1712 -1360 -496 614 1285
5574A285J81p43q67q73m02M45P49J127O17M74o81j458r59q25M50O89J087P28L92
$$ 1285 1466 723 -144 -1017 -1419 -974 -225 902 1519 1993 1312 -146 -1105 -1930 -1480 -791 296 1024 1416
5593A416m26j019j365m58NJ000Q96J238M20o5j073j080j203K04O26J040J150N34
$$ 1416 990 -29 -1394 -1852 -1847 -847 49 1287 1707 1642 569 -511 -1714 -1510 -884 156 1306 1840
5611A840n08n33j195j071k58P12R90J086M28n29l39p19j185o02P87N77P64P99
$$ 1840 1332 799 -396 -1467 -1725 -1013 -23 1063 1491 962 623 -96 -1281 -1883 -1096 -519 245 1044
5629A044j60k47j188m63k89L70Q57R92M97M5o25q60p54m43J22R20R99O17o36m53
$$ 1044 884 637 -551 -1014 -1303 -933 -76 916 1413 1458 833 -27 -781 -1224 -1102 -182 817 1434 798 345
5649C45n98j160J68L02Q95P54L12L20q14j157n87p6K54R77O28N43L20n08j067
$$ 345 -253 -1413 -1245 -943 -48 706 1018 1338 524 -633 -1220 -1296 -1042 -65 563 1106 1426 918 -149
5668a49o90p04O02P00R55J044k68r84o38j088l74L4J038R37P64K27l36j002j108
$$ -149 -839 -1543 -941 -241 714 1758 1490 506 -132 -1220 -1594 -1560 -522 415 1179 1406 1070 68 -1040
5687a040o73K22O22J238J242J46n16r34j119l00q2L90J121Q12M34L9j349q42p21
$$ -1040 -1713 -1491 -869 369 1611 1757 1241 307 -812 -1112 -1194 -804 317 1129 1563 1602 253 -589 -1310
5706a310l34N75Q89P77P56l90p87j051l99k01N42R32R15L17K09p18j136m19k85
$$ -1310 -1644 -1069 -180 597 1353 963 176 -875 -1274 -1475 -933 -1 914 1231 1440 722 -414 -833 -1118
5725a118N30M04J091N66k72m11j092q36J82j4Q62R93K73l75p26m56p22j53P4J020
$$ -1118 -588 -184 907 1473 1201 790 -302 -1138 -956 -970 -108 885 1158 783 57 -399 -1121 -1274 -1200 -180
5745a80P62N96j73p57n66o68P5K09J058O37N95l81n16q40p00o23K99J202P07R6
$$ -180 582 1178 1005 248 -318 -986 -911 -702 356 993 1588 1207 691 -149 -849 -1472 -1173 29 736 832
5765H32J85p65o40r61l10R6R40J131R04j80n07r39q47l95K24J192P06J018l4o88
$$ 832 1017 252 -388 -1349 -1659 -1563 -623 508 1412 1232 725 -214 -1061 -1456 -1232 -40 666 1684 1650 962
5785I62o20j014p81K73L73J163O98M07p55p98p11p96J65M84R95R36L97j19j151
$$ 962 342 -672 -1453 -1180 -807 356 1054 1461 706 -92 -803 -1599 -1434 -950 45 981 1378 1259 108
5804A08m71p49j35K18J150O76O76j27o14p26j134R7M71O86N50N55q8q05q31p28
$$ 108 -363 -1112 -1247 -1029 121 797 1473 1346 732 6 -1128 -1031 -560 126 676 1231 1143 338 -493 -1221
5824a221j79J69R32J101J15K53q63p62p32o9N54P87M44Q11k36n74p82p09N4K44
$$ -1221 -1400 -1231 -299 802 917 1170 307 -455 -1187 -1256 -702 85 529 1340 1104 530 -252 -961 -907 -663
5844f63Q58O95N21m81n57q69p86J44K53Q88P80J44J74r22n52j077R1M70O52J002
$$ -663 195 890 1411 930 373 -496 -1282 -1138 -885 3 783 927 1101 179 -373 -1450 -1359 -889 -237 765
5864G65N28R7o87p21p55l39J12J022P78N73J48q16o36r44o33L40P75J024O22J27
$$ 765 1293 1390 703 -18 -773 -1112 -1000 22 800 1373 1521 705 69 -875 -1508 -1168 -393 631 1253 1380
5884A380p39o33p56r55L09R62P18Q44L96m27r12q15m40m0N58Q93N66N34J06q93
$$ 1380 641 8 -748 -1703 -1394 -432 286 1130 1526 1099 187 -628 -1068 -1108 -550 343 909 1443 1549 656
5904F56j160q83J89K12J093O15N20r4j094p71k73o11O19O38O80N33J90q93l59
$$ 656 -504 -1387 -1198 -986 107 722 1242 1148 54 -717 -990 -1601 -982 -344 336 869 1059 166 -193
5923a93q00o0N05R10M43L86k21o01p74n46Q4K95Q76N18K53k10q15q73k50k06L87
$$ -193 -993 -1053 -548 362 805 1191 970 369 -405 -951 -867 -572 304 822 1075 865 50 -823 -1073 -1279 -892
5944h92N32J140K82l02n21m90p64l8L20O49J289j17K47r01q03n84l56L06J056
$$ -892 -360 780 1062 760 239 -251 -1015 -1053 -733 -84 1205 1088 1335 434 -369 -953 -1309 -1003 53
5963E3Q32N5M29n67j238q36m10L02Q00J137N63L8k41j039j102l33L23R68R17Q09
$$ 53 885 940 1369 802 -436 -1272 -1682 -1380 -580 557 1120 1158 917 -122 -1224 -1557 -1234 -266 651 1460
5983A460j80l56p21q66l74J94M97O91R27K15n14p82q86o93L0L24J237N14M57m06
$$ 1460 1280 924 203 -663 -1037 -843 -346 345 1272 1487 973 191 -695 -1388 -1358 -1034 203 717 1174 768
6003G68m27r18m60j46L16P73J162R5k20n51p11n00j72M92Q68O93O2j58o46p67
$$ 768 341 -577 -1037 -1183 -867 -94 1068 1163 943 392 -319 -819 -991 -499 369 1062 1124 966 320 -447
6023d47p68JP67K80J035J03p0p59j043k58R1P07K95Q99L31r0n09p18o74q9N19
$$ -447 -1215 -1214 -447 -167 868 971 901 142 -901 -1159 -1068 -361 -66 833 1164 1074 565 -153 -827 -916 -397
6044c97Q12N23K09J79q12p33p92k24N52M13J011J5J64o23j193l30j90M63Q67P40
$$ -397 415 938 1147 1326 514 -219 -1011 -1235 -683 -270 741 756 920 297 -896 -1226 -1416 -953 -86 654
6064F54P89k36m74r69o80m29K76P33R92P10P4m37j035q48l52J90O46R20O01K30
$$ 654 1443 1207 733 -236 -916 -1345 -1069 -336 656 1366 1440 1003 -32 -880 -1232 -1042 -396 524 1125 1355
6084A355p12p69p61n27J70L73R14P74K21l97o61k93q64N1O69Q79L36L66k05o18
$$ 1355 643 -126 -887 -1414 -1244 -871 43 817 1038 641 -20 -313 -1177 -1126 -457 422 758 1124 919 301
6104C01p54k40l93K04R96M36M14l92k72r05n38j1N79N33M34L46p0q11l86l34K13
$$ 301 -453 -693 -1086 -882 114 550 964 572 300 -605 -1143 -1154 -575 -42 392 738 668 -143 -529 -863 -650
6125f50lQ23Q59O7k04o91k95p00M3J26Q62J000k94l57j87j038n40K15L70N61P58
$$ -650 -653 170 1029 1096 892 201 -94 -794 -751 -625 237 1237 943 586 399 -639 -1179 -964 -594 -33 725
6146G25K93k20o72o97m96p7M75N34J085K00k72n26o24n75r5K12Q93O68M15k00
$$ 725 1018 798 126 -571 -1067 -1144 -669 -135 950 1150 878 352 -272 -847 -942 -730 163 831 1246 1046
6166A046p89l03q05k33P3O58O47P78j68l68n00j076k47J41R05O03M24M22k36o51
$$ 1046 257 -46 -851 -1084 -1011 -353 294 1072 904 536 36 -1040 -1287 -1146 -241 362 786 1208 972 321
6186C21p44q19O00L56Q20M66oM5j092m23m66j29O81O42M30l1J55q99p61M4j80
$$ 321 -423 -1242 -642 -286 534 1000 994 1039 -53 -476 -942 -1071 -390 252 682 651 806 -93 -854 -810 -990
6207i90L47P52L74M26k94l03q91l47L76j35R75N65%J82o42p60o11N7J69J050K33
$$ -990 -643 109 483 909 615 312 -579 -926 -550 -685 290 855 855 1037 395 -365 -976 -919 -750 300 533
6228E33M64l95q32l39m46j03L36N68Q93Qk58k56m80q03J40N60N85O78L22j8p39
$$ 533 997 602 -230 -569 -1015 -1118 -782 -214 679 687 429 173 -307 -1110 -970 -410 175 853 1175 1157 418
6249D18q00p21J25M38N60P64K90J34q00q07q52o2K04R72P07J88K54o73p73m81
$$ 418 -382 -1103 -978 -540 20 784 1074 1208 408 -399 -1251 -1313 -1109 -137 570 758 1012 339 -434 -915
6269i15j94K64P42N22N62M82l94p62r13l72j45P35O20O09L93k72j013p71j84o9
$$ -915 -1109 -845 -103 419 981 1463 1069 307 -606 -978 -1123 -388 232 841 1234 962 -51 -822 -1006 -1075
6289a075P37Q48L12K52m52o48l45m42lK50O88O05R4L19q04m72o94K00J74P18L49
$$ -1075 -338 510 822 1074 622 -26 -371 -813 -816 -566 122 727 821 1140 336 -136 -830 -630 -456 262 611
6310F11M61m39m00n63n55K16J40O86O71k97j29m48n61k51j71O38P42M77p8Np79
$$ 611 1072 633 233 -330 -885 -669 -529 157 828 531 402 -46 -607 -858 -1029 -391 351 828 750 755 -24
6331b4m89l54J26L33R59M84N5j36o75p07l61o2K22M95Q84K18j2p33n11q03k29
$$ -24 -513 -867 -741 -408 551 1035 1090 954 279 -428 -789 -851 -629 -134 750 968 956 223 -288 -1091 -1320
6352a320M85O57Q99K97k6m90m68j016j36K74Q66N65O90J94o97q02m82n48J83K62
$$ -1320 -835 -178 721 1018 992 502 34 -982 -1118 -844 22 587 1277 1471 774 -28 -510 -1058 -875 -613
6372f13J013N76J37o43n37q47l20K07L49R42N27K58m81o16m32n46K96M37P69O21
$$ -613 400 976 1113 470 -67 -914 -1234 -1027 -678 264 791 1049 568 -48 -480 -1026 -730 -293 476 1097
6392A097m59j07k28n41m27j05L58O39N62J17j91p03o91j35r5M31N75M80L96m28
$$ 1097 638 531 303 -238 -665 -770 -412 227 789 906 715 12 -679 -814 -909 -478 97 577 973 545
6412E45l03r09j04K1L72R30M76m36J61l68j071r9O6N47O94L16J90m42o24o97m34
$$ 545 242 -667 -771 -750 -378 552 1028 592 753 385 -686 -785 -719 -172 522 838 1028 586 -38 -735 -1169
6433a169q2L83R58K57P53l48o14p37l82m2N66Q09P05j35J46n61p58n50R5k4O43
$$ -1169 -1251 -868 90 347 1100 752 138 -599 -981 -1023 -457 352 1057 922 1068 507 -251 -801 -706 -730 -87
6454h7R15K69r3o81p16p28l8L24K28J057N03J22r84m23k45l57J08L95P70M15M22
$$ -87 828 1097 1004 323 -393 -1121 -1159 -835 -607 450 953 1075 91 -332 -577 -934 -826 -431 339 754 1176
6475A176o42l44r28l3JK20J063M92L8L9q74q30l58N6O47N07N65k91k25m93n77
$$ 1176 534 190 -738 -771 -770 -550 513 1005 1043 1082 208 -622 -980 -924 -277 230 795 504 279 -214 -791
6496g91j02M4K41R19M72K70n33j55r41m0M8N42K90M85Q7k13p58k49n18L63L62
$$ -791 -893 -849 -608 311 783 1053 520 365 -576 -616 -568 -26 264 749 836 623 -135 -384 -902 -539 -177
6517a77L13N04OJ08n84r35m66J19N87Q95n9Q50l67l74j096m42L21K82P57N04L40
$$ -177 136 640 646 754 170 -765 -1231 -1112 -525 370 311 1161 794 420 -676 -1118 -797 -515 242 746 1086
6538A086k26n31p52o24J0M55N97P49L45l75o27m93m32o06L79R22N69J03L5j1o78
$$ 1086 860 329 -423 -1047 -1037 -582 15 764 1109 734 107 -386 -818 -1424 -1045 -123 446 549 584 573 -105
6559a05n79m51L57N97P20K57K96o62m36o28j64L1M35N26L53N55n50k66j213l8
$$ -105 -684 -1135 -778 -181 539 796 1092 430 -6 -634 -798 -767 -332 194 547 1102 552 286 -927 -965
6579i65N1O22P36K26p3k36k29o06l02m2N13L11P16p4O7o95l92p9j13N42N38M48
$$ -965 -914 -292 444 670 597 361 132 -474 -776 -818 -305 6 722 648 715 20 -372 -451 -564 -22 516 964
6601I64k04j26o59n11k79L8K98N92L20L67m04k81n81m23J91K74N64O62J07m54
$$ 964 760 634 -25 -536 -815 -777 -479 113 433 800 396 115 -466 -889 -698 -424 140 802 909 455
6621D55r5q40j48k18N74O61Q8L74k7q19m66m16J77K51O17K85O94l97n73n50o22
$$ 455 360 -480 -628 -846 -272 389 477 851 824 5 -461 -877 -700 -449 168 453 1147 750 177 -373 -995
6642i95j05M76Q05M58M02j20m55o79l82k82L41M42Q72L94j51m54n94q71l4%O37
$$ -995 -1100 -624 181 639 1041 921 466 -213 -595 -877 -536 -94 778 1172 1021 567 -27 -898 -932 -932 -295
6663b95Q43L29j18m72p09o57j9J61M61O50N92J10m85l54m02o67M41N44O46R1L56
$$ -295 548 877 759 287 -422 -1079 -1098 -937 -476 174 766 876 391 37 -365 -1032 -591 -47 599 690 1046
6684A046k00o72p47J8p4O6P65L77Q1j48l35o60l71k91R45N90J0Q0J53n22k92n43
$$ 1046 846 174 -573 -555 -629 -563 202 579 660 512 177 -483 -854 -1145 -200 390 400 480 633 111 -181 -724
6706g24J32M78J95P71K67l18p24n17m33OL99Q28K63L33m13p83k22n17j74N00P24
$$ -724 -592 -114 81 852 1119 801 77 -440 -873 -867 -468 360 623 956 543 -240 -462 -979 -1153 -653 71
6727G1M85L90j43j026k09m82l5M46Q45N21L73n32r1j093j24l10J50Q68N64N91
$$ 71 556 946 803 -223 -432 -914 -949 -503 342 863 1236 704 613 -480 -604 -914 -764 104 668 1259
6747A259m81k82p19o97l45N87L48Q49J57L24n38o81l72m29J95N50N26L27L14k77
$$ 1259 778 496 -223 -920 -1265 -678 -330 519 676 1000 462 -219 -591 -1020 -825 -275 251 578 892 615
6767F15q52k28n3k32P81L9L88K69j93p85k36m09K38K03P17M93lm49n23l23m47
$$ 615 -237 -465 -518 -750 31 70 458 727 534 -251 -487 -896 -658 -455 262 755 752 303 -220 -543 -990
6788i90L08J87O49N40q2k60l04l65l49J03N47J32O54r4k35n62n04k58L88J78O39
$$ -990 -682 -495 154 694 612 352 48 -317 -666 -563 -16 116 770 676 441 -121 -625 -883 -495 -317 322
6809C22K96J28j35q48o43L2K44K09P58N68O3l42o47j36r52M39J73R25N25K32k91
$$ 322 618 746 611 -237 -880 -848 -604 -395 363 931 994 652 5 -131 -1083 -644 -471 454 979 1211 920
6830I20p72m94l09m07K86N71P80M85k15p06o73q26L25O10NJ020K46j58m04n93
$$ 920 148 -346 -655 -1062 -776 -205 575 1060 845 139 -534 -1360 -1035 -425 -420 600 846 688 284 -309
6850c09l74j01R6O90L99P72j50p38m25m51k35K56L84Q45j13L11k50o11o50k07
$$ -309 -683 -784 -688 2 401 1173 1023 285 -140 -591 -826 -570 -186 659 546 857 607 -4 -654 -861
6870h61L09M45N5P10J04l28o09n93j18J23L31R35J76L9k23k96n25m71L75J27P29
$$ -861 -552 -107 -52 658 762 434 -175 -768 -886 -763 -432 503 679 718 495 199 -326 -797 -422 -295 434
6891D34N13Nm94o44o50q8M64M88J08L89J66l17q05n27K65k13N95N63L65Q3j45
$$ 434 947 952 458 -186 -836 -924 -460 28 136 525 691 374 -431 -958 -693 -906 -311 252 617 700 555
6912E55l72n45k96J46J81Q40L6L65l63o16p03l51K6P46M02P84j69J46n73n72m38
$$ 555 183 -362 -658 -512 -331 509 545 910 547 -69 -772 -1123 -1097 -351 51 835 666 812 239 -333 -771
6933g71j46L58O21O55J44J00m92n62n09r0L22L24O13M35q5o18l96p39R2K4M44
$$ -771 -917 -559 62 717 861 961 469 -93 -602 -692 -370 -46 567 1002 917 299 -97 -836 -744 -720 -276
6954b76M92L86L1j78m52o48k99K00M64K14R48j29m14l90n77j13J26M73N89L28
$$ -276 216 602 633 455 3 -645 -944 -744 -280 -66 882 753 339 -51 -628 -741 -615 -142 447 775
6974G75k16k6n80m41l99L14O84K39J03l2r8m99l84j3n5O48J77N11j88m70m83n1
$$ 775 559 533 -47 -488 -887 -573 111 350 453 421 323 -176 -560 -573 -628 20 197 708 520 50 -433 -484
6996d84k47J80L04R41K43j00j27q23j61o15K53L58O24L36J04l4r94j96m90l7M12
$$ -484 -731 -551 -247 694 937 837 710 -113 -274 -889 -636 -278 346 682 786 752 -242 -438 -928 -965 -553
7017e53J019L25k26K8k95n82m93j03O62L93O24J77k39l47p86j33r6P8L35Q30K92
$$ -553 466 791 565 593 298 -284 -777 -880 -218 175 799 976 737 390 -396 -529 -625 -547 -212 618 910
7038I10j38m98n36p25j45L27L39O60L05J43j80n55o10K9J23L27O02L61l5m8p38
$$ 910 772 274 -262 -987 -1132 -805 -466 194 499 642 462 -93 -703 -674 -551 -224 378 739 704 656 -82
7059h2k19m52M98L02L29N23j25l25m90m76k31P0O00M6R29k37k74m86l69k85M90
$$ -82 -301 -753 -255 47 376 899 774 449 -41 -517 -748 -678 -78 -32 897 660 386 -100 -469 -754 -264
7080b64K19O42J70l17K42p60n13j01J88M38K99P47M4o58m20n56k83L69M08L45
$$ -264 -45 597 767 450 692 -68 -581 -682 -494 -56 243 990 1034 376 -44 -600 -883 -514 -106 239
7100B39K28K09k62o27o50J52m33R22K85M36N36m99p95j50l29j32P30N69M22K8
$$ 239 467 676 414 -213 -863 -711 -1144 -222 63 499 1035 536 -259 -409 -738 -870 -140 429 851 879
7120H79L9p43p26j66j49L56L04P93k15M68m65q13l93K60j00O06M18N86j68n14
$$ 879 918 175 -551 -717 -866 -510 -206 587 372 840 375 -438 -831 -571 -671 -65 353 939 771 257
7140B57n31m65O6J81Q19J98M33j54m72k73n13k67L62L49K21N12l57K66n77j008
$$ 257 -274 -739 -673 -492 327 525 958 804 332 59 -454 -721 -359 -10 211 723 366 632 55 -953
7160i53J91R6J44P68O19l45J22o93n93Q1J73J9N24L79K49m04m08j23m40L02M76
$$ -953 -762 -666 -522 246 865 520 642 -51 -644 -563 -390 -371 153 532 781 377 -31 -154 -594 -292 184
7181A84Q8O96k93n18m62j20j69q4L83K34M62L18o16l90n42J61J85J76M87N60m5
$$ 184 272 968 675 157 -305 -425 -594 -678 -295 -61 401 719 103 -287 -829 -668 -483 -307 180 740 695
7202F95j91l31q73j50P2N98M53L91L09l07p99o17Mk79Q03N20J44L11N3q73m28
$$ 695 504 173 -700 -850 -778 -180 273 664 973 666 -133 -750 -746 -1025 -222 298 442 753 806 -67 -495
7223d95l97L15K06P51J98L00M0p68l61l06L5qN91L65P96m82j55p60l84l41J91
$$ -495 -892 -577 -371 380 578 878 918 150 -211 -517 -482 -490 101 466 1262 780 625 -135 -519 -860 -669
7244f69M74N64K70J77n83o78k67k11K17L22O68N82m2m28m28l06J46k86M87L84
$$ -669 -195 369 639 816 233 -445 -712 -923 -706 -384 284 866 824 396 -32 -338 -192 -478 9 393
7264C93J45J46m69k76m70L2N6M3L34K42O4R6n97l84k61N56K13J70M56%j0m55o43
$$ 393 538 684 215 -61 -531 -499 -443 -400 -66 176 240 336 -261 -645 -906 -350 -137 33 489 489 479 24 -619
7287f19J00J62J07O54M13J91n01n45l87m20L10L46N52K98K17m47p02k97l51Q6
$$ -619 -519 -357 -250 404 817 1008 507 -38 -425 -845 -535 -189 363 661 878 431 -271 -568 -919 -833
7307h33L88N41N63K10n33n28j10n99q7N92O29M75L32lp33m13m32j83K67N22K44
$$ -833 -445 96 659 869 336 -192 -302 -901 -988 -396 233 708 1040 1037 304 -109 -541 -724 -457 65 309
7328C09O52r9o17l14m42j70K28M67J86L44J18l08p58q7l66K82P37J96M20q3j76
$$ 309 961 862 245 -69 -511 -681 -453 14 200 544 662 354 -404 -491 -857 -575 162 358 778 695 519
7349E19n35k94l63pP70R9N42k36j13m49k29m31J06M53M33L64l39L2m89n35QL65
$$ 519 -16 -310 -673 -680 90 189 731 495 382 -67 -296 -727 -621 -168 265 629 290 322 -167 -702 -694 -329
7371c29K94L18M66m38l5m88n8j37J89K67O87r5R3j54q47o1m51J57L08R19K15l57
$$ -329 -35 283 749 311 276 -212 -270 -407 -218 49 736 641 734 580 -267 -328 -779 -622 -314 605 820 463
7393D63rp18l24m71J38N21N41Q46j26n35n9n69n70J36M88N96L86Q6k00k29o34
$$ 463 454 -264 -588 -1059 -921 -400 141 987 861 326 267 -302 -872 -736 -248 348 734 820 620 391 -243
7414b43o69J26L83L54Q50m8k50l55k76o05J07k86R65M10K68k45j37m47n64L1K48
$$ -243 -912 -786 -403 -49 801 753 503 148 -128 -733 -626 -912 53 463 731 486 349 -98 -662 -631 -383
7435c83O19M00J62j47k33m71l06o28M66M14L71P9M61m54n33l10m09K08M49M73
$$ -383 236 636 798 651 418 -53 -359 -987 -521 -107 264 343 804 350 -183 -493 -902 -694 -245 228
7455B28J97n5K22o59m53r3L73K64N58K3o7o7m55o18J3J33L30P10M4k3l88k82n97
$$ 228 425 370 592 -67 -520 -613 -240 24 582 605 538 471 16 -602 -589 -456 -126 584 628 605 217 -65 -662
7478f62l36J28N10O81J08j6j24n62k20j35N5L10J052J50l5k78p19n59J99l26P42
$$ -662 -998 -870 -360 321 429 413 289 -273 -493 -628 -573 -263 789 939 904 626 -93 -652 -453 -779 -37
7499c7O36j00K44l46n00p14K35j28K71M03N65J03j90m50p63p5J15K88M78M26K35
$$ -37 599 499 743 397 -103 -817 -582 -710 -439 -36 529 632 442 -8 -771 -846 -731 -443 35 461 696
7520F96K06p83n45J1l06J19N85P20m6p5l32l82o39Q0l5P53L69J99l25p9m19k56
$$ 696 902 119 -426 -415 -721 -602 -17 703 657 582 250 -132 -771 -691 -726 27 396 595 270 191 -228 -484
7542d84k70K04J99R08K48l17O7p48J9k52j83N27N29N0J66m35j41l27o17N38qN00
$$ -484 -754 -550 -351 557 805 488 555 -193 -174 -426 -609 -82 447 497 663 228 87 -240 -857 -319 -327 173
7564A73N00m36k9o78k98L1K97J19K64R67k36l63j71n02j0k34M56N21K37K48o74
$$ 173 673 237 208 -470 -768 -737 -440 -321 -57 910 674 311 140 -362 -372 -606 -150 371 608 856 182
7585A82k35l63m98J79P77M19P5Qk40m46k13m36J95K02M63N48P4k20k94o43j03
$$ 182 -53 -416 -914 -735 42 461 536 544 304 -142 -355 -791 -596 -394 69 617 691 471 177 -466 -569
7606e69NM89M04M56Kj44m17m89r3m26L57M69O19j57N3k12p20k58j39J65O92K63
$$ -569 -564 -75 329 785 787 643 226 -263 -356 -782 -425 44 663 506 559 347 -373 -631 -770 -605 87 350
7628C50J99M4m59m81j86m5K76K13K33M68J79m35l45k35n02K39O70J56J25j57J23
$$ 350 549 593 134 -347 -533 -578 -302 -89 144 612 791 356 11 -224 -726 -487 183 339 464 307 430
7649D30k22q03m4K49K4N98J21J62j52p31N0n70M89L85Q3M36J07k42m63l18l21
$$ 430 208 -595 -639 -390 -366 232 353 515 363 -368 -318 -888 -399 -14 69 505 612 370 -93 -411 -732
7670g32M24L91L57J66Pl59n30l90q7K98N73J42L29k51Qm99n15j90K22M30N75K26
$$ -732 -308 83 440 606 613 254 -276 -666 -753 -455 118 260 589 338 346 -153 -668 -858 -636 -206 369 595
7692E95J79j76k97p53n9J49M8O76K68J44k71l81l43k69k98J89P65M01r7j1k72
$$ 595 774 598 301 -452 -511 -362 -314 362 630 774 503 122 -221 -490 -788 -599 166 567 470 459 187
7713A87m45l21r0M7N98N58M41n66j74l91m45J95J08O30K12j35M63o58n39k01N4
$$ 187 -258 -579 -669 -622 -24 534 975 409 235 -156 -601 -406 -298 332 544 409 872 214 -325 -526 -472
7734d72K20J5L27O31l01l51l36j90k85L00M57L99j28K85k81k81o08J02L36RM53
$$ -472 -252 -237 90 721 420 69 -267 -457 -742 -442 15 414 286 571 290 9 -599 -497 -161 -152 301
7755C01K52K52o60m9m15j37q8J009J21K9l80l7m46l13r0m2O62M02r7O78o70k92
$$ 301 553 805 145 96 -319 -456 -544 465 586 615 235 198 -248 -561 -651 -693 -31 371 274 952 282 -10
7777a0m98L0J43L31J90L37K55k39n42n34R7R9K08L83J01N53m45k09j009q6J07
$$ -10 -508 -478 -335 -4 186 523 778 539 -3 -537 -440 -341 -133 250 351 904 459 250 -759 -845 -738
7798g38K98P44NL61j81n41l70Ll51K36P01K50N06j30p06k09l43%M5N73O24q5K52
$$ -738 -440 304 309 670 489 -52 -422 -419 -770 -534 167 417 923 793 87 -122 -465 -465 -420 153 777 692 944
7821I44o56o52j16j32J05M06O62j9K4l03o06k19j01L85N1N42L31o9n11k26p1l74
$$ 944 288 -364 -480 -612 -507 -101 561 542 566 263 -343 -562 -663 -278 -227 315 646 577 66 -160 -231 -605
7843f05M25K84M45K37j84k06n84k81r8R8N61J34L77r5m87o50J12j44L86L96K71
$$ -605 -180 104 549 786 602 396 -188 -469 -567 -469 92 226 603 508 21 -629 -517 -661 -275 121 392
7864C92O7J22k59k91l04k87L65K58N37J33q1l28k67m39l69N0N79Q51j38p1o7p15
$$ 392 459 581 322 31 -273 -560 -195 63 600 733 652 324 57 -382 -751 -701 -122 729 591 520 453 -262
7886b62k36m41L05L57K95O97K34m60m84m56Nk05L41P25J28J36M46j236k73m20
$$ -262 -498 -939 -634 -277 18 715 949 489 5 -451 -446 -651 -310 415 543 679 1125 -111 -384 -804
7906h04K59K52L24L52J29L8l44m51m45Q0q9L65O00J06j13m4j36n26j02J19L43
$$ -804 -545 -293 31 383 512 550 206 -245 -690 -610 -699 -334 266 372 259 215 79 -447 -549 -430 -87
7927h7O26j46K10k40k62m86R3m4N34K83p4q7Pn51n37M85k47N42K07L32k51k26
$$ -87 539 393 603 363 101 -385 -292 -336 198 481 407 320 327 -224 -761 -276 -523 19 226 558 307 81
7949H1k81m15K36N2K25O30N1K31l86p37R8o2j8K30K15M17M1m09l67n63j99O61
$$ 81 -200 -615 -379 -327 -102 528 579 810 424 -313 -215 -277 -295 -65 150 567 608 199 -168 -731 -930 -269
7971b69r8O18K36j52n9m21k88p4N2L35L98L61ro5m60n73j56K89L42J49O13j33
$$ -269 -367 251 487 335 276 -145 -433 -507 -455 -120 278 639 630 565 105 -468 -624 -335 7 156 769 636
7993F36l2l90p17k17j01M51N00K08K01k28K37r47m1n48P65K97M49r9j36J75o32
$$ 636 604 214 -503 -720 -821 -370 130 338 539 311 548 -399 -440 -988 -223 74 523 424 288 463 -169
8014a69l06Q7K68K17K98K75N7m44m16k39l23L19K4P66N27p14j66l81l6m07L74
$$ -169 -475 -388 -120 97 395 670 727 283 -133 -372 -695 -376 -352 414 941 227 61 -320 -356 -763 -389
8035c89L38Q4M08O6k37l34l09j11J47N60J77K98J3k22o72m99K64K56Q1N37k31
$$ -389 -51 33 441 507 270 -64 -373 -484 -337 223 400 698 711 489 -183 -682 -418 -162 -81 456 225
8056B25J87P4o26m97k65N06M82K58L70n0m24n63k98O6J79K58M78M66j3m25m08
$$ 225 412 486 -140 -637 -902 -396 86 344 714 664 240 -323 -621 -555 -376 -118 360 826 813 388 -20
8077b0k36J4r8k4L86M63J19m10n64l0j50j44K22L56O54j56m2l29l92k19J01m5
$$ -20 -256 -242 -340 -364 22 485 604 194 -370 -400 -550 -694 -472 -116 538 382 340 11 -381 -600 -499 -544
8099e44O72L13L70k67m86k15k78j78J82N22K74L86j83o02m32J7k06L85o9P06o
$$ -544 128 441 811 544 58 -157 -435 -613 -431 91 365 751 568 -34 -466 -449 -655 -270 -339 367 361
8120C61Q3k48m77k22j0K2L10M06O50l52l75l86k74M45p5K34K04J57ql71n70O8
$$ 361 444 196 -281 -503 -513 -491 -181 225 875 523 148 -238 -512 -67 -142 92 296 453 445 74 -496 -428
8142d28p2K31J97N02q3j09j19l06l75N4K77rR90m8L1n23j74k3l56p7N49M80j53
$$ -428 -500 -269 -72 430 347 238 119 -187 -562 -508 -231 -240 750 702 733 210 36 13 -343 -420 129 609 456
8165D56K94n08j13q50L03M2J74M71K49Q5j54m86m31j93rK33O28M89p0n0m28k55
$$ 456 750 242 129 -721 -418 -376 -202 269 518 603 449 -37 -468 -661 -670 -437 191 680 610 560 132 -123
8187a23m16K34L8P42
$$ -123 -539 -305 -267 475
8191D75
$$ Imaginary data points
##PAGE= N=2
##DATA TABLE= (X++(I..I)), XYDATA
0@%%%%%%Qj6J6j6J6k4L2l3M1n2O1p3Q8j05J22j45J70j95K26k58K96l38L80m30
$$ 0 0 0 0 0 0 0 8 -8 8 -8 8 -16 16 -17 24 -28 33 -40 48 -57 65 -80 90 -105 121 -137 159 -179 201 -229
30b29M86n46O13o86P67q56R52j058J173j301J443j596J767j958K170k406K671
$$ -229 257 -289 324 -362 405 -451 501 -557 616 -685 758 -838 929 -1029 1141 -1265 1406
47A406k973L318l717M188m747N428o283P386q877J1011j4353K0394l4796J33042
$$ 1406 -1567 1751 -1966 2222 -2525 2903 -3380 4006 -4871 6140 -8213 12181 -22615 110427
61A10427J64993j28809j28065j41380o3632j6872Q1090J33240J42183M6898n6808
$$ 110427 275420 146611 18546 -122834 -186466 -203338 -122248 10992 153175 200073 143265
72A43265j34294j28435q4016l516P1567J33144J31428P1621k9782j04848j27803
$$ 143265 8971 -119464 -203480 -206996 -135429 -2285 129143 200764 170982 66134 -61669
83f1669q8415j5993O9166J20607J16750N4882k5297q9217j15653j00153l6874
$$ -61669 -150084 -166077 -96911 23696 140446 195328 170031 80814 -34839 -134992 -171866
94a71866N0731J14520J07872M3504k9702p5949r6903q8815l8626M7142J16786
$$ -171866 -121135 -6615 101257 144761 115059 39110 -57793 -146608 -185234 -138092 -21306
105b1306J16256N0670k6880p3469q4469p1503k8529M2301J05777J14445N6206
$$ -21306 94950 145620 118740 45271 -39198 -110701 -139230 -96929 8848 123293 179499
116A79499k8997q5593r7601p5693k8708L6339R3887J05296N6333k3065q6782j09323
$$ 179499 150502 64909 -32692 -108385 -137093 -100754 -6867 98429 154762 131697 44915 -64408
128f4408q6932k8115M6309J01593J08322O5251m316p0027j07703r6349l4623M8986
$$ -64408 -151340 -179455 -133146 -31553 76769 142020 137704 67677 -40026 -136375 -170998 -122012
140a22012J09167J14951P0922K709o2783j07643j09611n8451K8340J00334J16064
$$ -122012 -12845 102106 173028 175737 112954 5311 -104300 -162751 -134411 -34077 81987
151H1987P4100N209n9128j03513j12877p2190R916Q9374J20650Q9976K4122m3538
$$ 81987 156087 161296 102168 -1345 -114222 -186412 -176496 -87122 33528 123504 147626 104088
163A04088r0707j03366p0647P18P6804J15899R8928M0291l0564q5388j02475p3650
$$ 104088 13381 -89985 -160632 -159914 -83110 32789 131717 172008 141444 56056 -46419 -120069
175a20069j2211N5167R5543R0771M3306k3837q1079j02197p6923j7383M5678Q4184
$$ -120069 -132280 -77113 18430 109201 152507 128670 47591 -54606 -131529 -148912 -103234 -19050
187a9050Q4199M7670j0308o5303r0250o9407j3138M7219Q3375Q1988M8215m452
$$ -19050 65149 112819 102511 37208 -53042 -122449 -135587 -88368 -4993 76995 125210 120758
199A20758n6986q4111o8709j7214M1543P7783P5461L9375j3570o1679q6018p1317
$$ 120758 63772 -20339 -89048 -106262 -64719 13064 88525 127900 114330 52651 -33367 -104684
211a04684k2426L6985P5784P6784M2315j1814o1209q3823o7925j8792M0533Q2640
$$ -104684 -127110 -90125 -14341 62443 104758 92944 31735 -52088 -120013 -138805 -98272 -15632
223a5632Q8233N3689m398n9725q5780p1508k3773L5497Q0429Q9616N7265j668
$$ -15632 72601 126290 121892 62167 -23613 -95121 -118894 -83397 -2968 86648 143913 142245
235A42245o1344r4610q4876l8695K3459P4621R0627O4886Q423n3199r1899q8589
$$ 142245 80901 -13709 -98585 -137280 -113821 -39200 51427 116313 124736 71537 -20362 -108951
247a08951m5703J7846P3999R7182P7498K4957l7872q2263q7615n2526O272O3878
$$ -108951 -154654 -136808 -62809 34373 111871 136828 98956 16693 -70922 -123448 -117176 -53298
259e3298R2906Q0087L1037l0356p8496r1045o4118r746M8363Q1746P6128L5061
$$ -53298 39608 119695 150732 120376 41880 -49165 -113283 -123029 -74666 7080 83208 118269
271A18269k1885o8777q5102o3872j3532M1869P7710P7892M3737r285n5407p4444
$$ 118269 96384 27607 -57495 -121367 -134899 -93030 -15320 62572 106309 97024 41617 -32827
283c2827n8326j3874L7713P1959P2820M1076q342n2955p2661n9672j9831K9322
$$ -32827 -91153 -105027 -67314 4645 77465 118541 110199 57244 -15417 -75089 -94920 -65598
295f5598O3263O4647L4836j0762n3043p1860n8555j7798L0716O4811O7653L9409
$$ -65598 -2335 62312 97148 86386 33343 -38517 -97072 -114870 -84154 -19343 48310 87719
307H7719o586m9031o7364n4780j3311L4132O9037P2358M2970n509n1590p2955
$$ 87719 81133 32102 -35262 -90042 -103353 -69221 -184 72174 115144 109635 58045 -14910
319a4910o1249k1649K8635O5654P2235M4186n860n4816p9332p0338k9755K4259
$$ -14910 -76159 -97808 -69173 -3519 68716 112902 107042 52226 -27106 -97444 -127199 -102940
331a02940O6535P8869N4169N179m5675p6607p1683l3358K1183O7175Q4353O4907
$$ -102940 -36405 42464 96633 101812 56137 -20470 -92153 -125511 -104328 -37153 47200 112107
343A12107J7158l7431p5118p7051m4447P892N6749P9099O5733K1497l2655p3171
$$ 112107 129265 91834 16716 -60335 -104782 -96890 -40141 38958 104691 126188 93533 20362
355B0362q1152n3943m141M6144P4761O8266L0673k0123o1222p4298n3197p584
$$ 20362 -60790 -114733 -118874 -72730 2031 70297 100970 80847 19625 -54673 -107870 -115454
367a15454M1809P3097P0712L7983j0014n2133o7702n2873j3814L2723O2953O3499
$$ -115454 -73645 -548 70164 108147 98133 46000 -21702 -74575 -88389 -55666 7287 70786
379G0786L3807r670n0228o6894n5026j8636K5671N5969N8826L3067q322m5352
$$ 70786 104593 94923 44695 -22199 -77225 -95861 -70190 -14221 44605 77672 69350 23998
391B3998o1286m8543j3337K8071N8369O1409L6455m663m1963n8446m6406j2509
$$ 23998 -37288 -85831 -99168 -71097 -12728 48681 85136 80473 38510 -19936 -66342 -78851
403g8851K8112N7662O0063L4382p916m7278o4689n3656j8528K4871N5751O0645
$$ -78851 -50739 6923 66986 101368 93452 46174 -18515 -72171 -90699 -65828 -10077 50568
415E0568L5605o186m7499o7228n6578k0983K6049O1150O8749M6460L019m1580
$$ 50568 86173 79987 32488 -34740 -91318 -112301 -86252 -25102 43647 90107 93126 51546
427E1546o5636n9548k5664K2234O0032P2368N1772Q937l9165o9045o8501l7687
$$ 51546 -14090 -73638 -99302 -77068 -17036 55332 107104 116041 76876 7831 -60670 -98357
439i8357R598N1589O9703N4625J4621l3133o6475p0600m4264K772M6696P0687
$$ -98357 -88759 -37170 32533 87158 101779 68646 2171 -68429 -112693 -109921 -63225 7462
451G462O2177K5961k0452n5980o5165m4855k893M0742O6869O2688L0918j4286
$$ 7462 69639 95600 75148 19168 -45997 -90852 -93745 -53003 13866 76554 107472 93186
463I3186n0786o3955m9272j2715K8826N6810N7050K9838j2511m7603o1014m8228
$$ 93186 42400 -21555 -70827 -83542 -54716 2094 59144 88982 76471 28868 -32146 -80374
475h0374j4592K4524N2604N6042L2646n925l9655n3270m1670j0844K5792N1725
$$ -80374 -94966 -70442 -17838 38204 70850 64925 25270 -28000 -69670 -80514 -54722 -2997
487b997N5132L2729m424l9050n3014m2618j2799K2803M8224M9874K7593q556m1585
$$ -2997 52135 84864 80440 41390 -11624 -54242 -67041 -44238 3986 53860 81453 72897 31312
500C1312n6707m6745j5005K2932M9923N3210L0596o007l9241n4783m6064j5172
$$ 31312 -25395 -72140 -87145 -64213 -14290 38920 69516 63509 24268 -30515 -76579 -91751
512i1751K5333N6398O0823L7612k236l7482n6550n0975k1645J8995N3109O2461
$$ -91751 -66418 -10020 50803 88415 86179 48697 -7853 -58828 -80473 -61478 -8369 54092
524E4092M0802R0m0016o1431n8155l0887J0388M8226O3395M8213Q947l2854n8488
$$ 54092 94894 94984 54968 -6463 -64618 -95505 -85117 -36891 26504 74717 83664 50810 -7678
537g678n8591l3621P232M6300O5281N5348K1298k1725n3280n9766l8574O81L8830
$$ -7678 -66269 -99890 -92658 -46358 18923 74271 95569 73844 20564 -39202 -77776 -77095 -38265
550c8265N9211N2604K4351j6393n0279o1879m5699q601L0249N2551M9471K5273
$$ -38265 20946 73550 97901 81508 31229 -30650 -76349 -84950 -54701 -2150 47321 72594
562G2594j0034m1859n5379m3799j1248K8379N2030N1160K8538m642l3315m7727
$$ 72594 62560 20701 -34678 -78477 -89725 -61346 -9316 41844 70382 65740 32425 -15302
574a5302m0249j1298K3733M7827M8453K5758o838l5211m8275l9757j4459J7806
$$ -15302 -55551 -66849 -43116 4711 53164 78922 72084 36873 -11402 -51159 -65618 -47812
586d7812M2398M4762K4633p772l7003m8301l8580j1259K1111M4243M7909K9558
$$ -47812 -5414 39348 63981 56209 19206 -29095 -67675 -78934 -57823 -13580 34329 63887
598F3887l649l3908m8209l8126r425K3772M6748M9430L1233k101l4991n3758m5964
$$ 63887 60238 26330 -21879 -60005 -69430 -45658 1090 50520 81753 79652 44661 -9097 -55061
611e5061j6874J9260M4881N0285L2056o20l6174n5434n0984k3202J5245M6447
$$ -55061 -71935 -52675 -7794 42491 74547 73927 37753 -17681 -68665 -91867 -76622 -30175
623c0175N6323M0424P395k9055n0988n0422k7249J0670M4879N9131M7162J3725
$$ -30175 26148 66572 73967 44912 -6076 -56498 -83747 -73077 -28198 30933 78095 91820
635I1820k3928n0162n3736l4485N74L5279N4005M6701J7828k0623m8163n4801
$$ 91820 67892 17730 -36006 -70491 -69917 -34638 19367 66068 83896 63273 15110 -39691
647c9691l8352o300K8152N1363M8890K3991j1452l9706m8603l6285p252K5861
$$ -39691 -78043 -84343 -56191 -4828 44062 68053 56601 16895 -31708 -67993 -75245 -49384
659d9384M8804M9040K6434n980l3963m5150l7320j1712J9922M2105M2967K2665
$$ -49384 -580 48460 74894 68914 34951 -10199 -47519 -59231 -39309 2796 45763 68428
671F8428p235l3442m4802l7639j3216J6366L9646M1286K2996o468k9683m0220
$$ 68428 61193 27751 -17051 -54690 -67906 -51540 -11894 29392 52388 45920 16237 -23983
683b3983l3414j0224J9788M2063M3499K4969l969k9096m0248l4496j1078J9871
$$ -23983 -57397 -67621 -47833 -5770 37729 62698 58729 29633 -10615 -45111 -56189 -36318
695c6318M1103M2882K3163o225l2512m5031m0975j6204J6815M2157M4951K5621
$$ -36318 4785 47667 70830 64605 32093 -12938 -53913 -70117 -53302 -11145 33806 59427
707E9427l654l0907m5354m2416j8694J6893M5536N2139L3305K979k6184m4174
$$ 59427 55773 24866 -20488 -62904 -81598 -64705 -19169 32970 66275 69254 43070 -1104
719a104m4426k4036J1526M2763N2228L7504O909k4371m7048m9803l1700K768L5008
$$ -1104 -45530 -69566 -58040 -15277 36951 74455 81364 56993 9945 -39858 -71558 -68790 -33782
732c3782M9036L9977J3214j8612m4081n0135l3341m96L1993M8176M3331K1780
$$ -33782 15254 55231 68445 49833 5752 -44383 -77724 -78220 -46227 1949 45280 67060
744F7060r058l6195m7106l4166l626K7623M4045M0912K2607n256l2414m7066l8054
$$ 67060 58002 21807 -25299 -59465 -63091 -35468 8577 49489 72096 66840 34426 -12640 -50694
$$ [...]
8191F19
##END NTUPLES=NMR FID
##END=
