##TITLE=1H_PR164_chr
 D2O, 108 sc, 
 4.2.2020
##JCAMPDX= 6.0         $$ Bruker NMR JCAMP-DX V2.0
##DATA TYPE= NMR FID
##DATA CLASS= NTUPLES
##ORIGIN= UXNMR, Bruker Analytische Messtechnik GmbH
##OWNER= root
$$ XWIN-NMR		Version 3.5
$$ Tue Feb  4 14:13:33 2020 Russian Standard Time (UT+4h)  she@DPX200
##.OBSERVE FREQUENCY= 200.1315
##.OBSERVE NUCLEUS= ^1H
##.DELAY= (6, 6)
##.ACQUISITION MODE= SIMULTANEOUS
##.ACQUISITION SCHEME= undefined
##.AVERAGES= 108
##.DIGITISER RES= 18
##SPECTROMETER/DATA SYSTEM= spect
##.PULSE SEQUENCE= zg30
##.SOLVENT NAME= D2O
##.SHIFT REFERENCE= (INTERNAL, D2O, 0, 15.7039)
##AUDIT TRAIL= $$ (NUMBER, WHEN, WHO, WHERE, WHAT)
$$ ##TITLE= Audit trail, XWIN-NMR		Version 3.5
$$ ##JCAMPDX= 5.01
$$ ##ORIGIN= Bruker BioSpin GmbH
$$ ##OWNER= she
$$ F:/spectra/data/she/nmr/H-F/1/audita.txt
$$ ##AUDIT TRAIL=  $$ (NUMBER, WHEN, WHO, WHERE, WHAT)
(   1,<2020-02-04 14:12:05.14 +0400>,<she>,<DPX200>,
      <continue with go, POWCHK disabled, PULCHK disabled
       configuration hash MD5:
       00 E9 B6 7A A2 85 ED C7 34 08 36 98 17 FE 4E 26
       data hash MD5: 16K
       25 CC 29 E1 0B 61 A6 8F 49 A6 69 EC 9F D9 BA 21>)
$$ ##END=
$$ 
$$ hash MD5
$$ F7 6B E2 C4 95 D1 5A C7 3B DC 71 B4 E3 3E 57 F1
##$RELAX= 
##$RELAX= 
##$RELAX= 
##$RELAX= 
##$RELAX= 
##$RELAX= 
$$ Bruker specific parameters
$$ --------------------------
##$DU= <F:/spectra>
##$EXPNO= 1
##$NAME= <H-F>
##$PROCNO= 1
##$TYPE= <nmr>
##$USER= <she>
##$AMP= (0..31)
100 100 100 100 100 100 100 100 100 100 100 100 100 100 100 100 100 100 
100 100 100 100 100 100 100 100 100 100 100 100 100 100 
##$AQSEQ= 0
##$AQ_mod= 1
##$AUNM= <au_zg>
##$AUTOPOS= <>
##$BF1= 200.13
##$BF2= 200.13
##$BF3= 200.13
##$BF4= 200.13
##$BF5= 200.13
##$BF6= 200.13
##$BF7= 200.13
##$BF8= 200.13
##$BYTORDA= 1
##$CFDGTYP= 0
##$CFRGTYP= 5
##$CHEMSTR= <none>
##$CNST= (0..31)
1 1 145 1 1 1 1 1 1 1 1 1 1 1 1 1 1 1 1 1 1 1 1 1 1 1 1 1 1 1 1 1 
##$CPDPRG= <>
##$CPDPRG1= <>
##$CPDPRG2= <>
##$CPDPRG3= <>
##$CPDPRG4= <mlev>
##$CPDPRG5= <mlev>
##$CPDPRG6= <mlev>
##$CPDPRG7= <mlev>
##$CPDPRG8= <mlev>
##$CPDPRGB= <>
##$CPDPRGT= <>
##$D= (0..31)
0 1.2 0 0 0 0 0 0 0 0.06 0 0.03 0 0 0 0 0.0002 0 0 0 0 0 0 0 0 0 0 0 0 
0 0 0 
##$DATE= 1580810802
##$DBL= (0..7)
120 120 120 120 120 120 120 120 
##$DBP= (0..7)
150 150 150 150 150 150 150 150 
##$DBP07= 0
##$DBPNAM0= <>
##$DBPNAM1= <>
##$DBPNAM2= <>
##$DBPNAM3= <>
##$DBPNAM4= <>
##$DBPNAM5= <>
##$DBPNAM6= <>
##$DBPNAM7= <>
##$DBPOAL= (0..7)
0.5 0.5 0.5 0.5 0.5 0.5 0.5 0.5 
##$DBPOFFS= (0..7)
0 0 0 0 0 0 0 0 
##$DE= 6
##$DECBNUC= <off>
##$DECIM= 24
##$DECNUC= <off>
##$DECSTAT= 4
##$DIGMOD= 1
##$DIGTYP= 9
##$DL= (0..7)
0 120 120 120 120 120 120 120 
##$DP= (0..7)
150 150 150 150 150 150 150 150 
##$DP07= 0
##$DPNAME0= <>
##$DPNAME1= <>
##$DPNAME2= <>
##$DPNAME3= <>
##$DPNAME4= <>
##$DPNAME5= <>
##$DPNAME6= <>
##$DPNAME7= <>
##$DPOAL= (0..7)
0.5 0.5 0.5 0.5 0.5 0.5 0.5 0.5 
##$DPOFFS= (0..7)
0 0 0 0 0 0 0 0 
##$DQDMODE= 0
##$DR= 18
##$DS= 0
##$DSLIST= <SSSSSSSSSSSSSSS>
$$ [...]
##$SUBNAM2= <"">
##$SUBNAM3= <"">
##$SUBNAM4= <"">
##$SUBNAM5= <"">
##$SUBNAM6= <"">
##$SUBNAM7= <"">
##$SUBNAM8= <"">
##$SUBNAM9= <"">
##$SW= 24.9337058887773
##$SWIBOX= (0..15)
0 0 2 0 0 0 0 0 0 0 0 0 0 0 0 0 
##$SW_h= 4990.01996007984
##$TD= 16384
##$TD0= 1
##$TE= 0
##$TE2= 300
##$TE3= 300
##$TEG= 300
##$TL= (0..7)
0 120 120 120 120 120 120 120 
##$TP= (0..7)
150 150 150 150 150 150 150 150 
##$TP07= 0
##$TPNAME0= <>
##$TPNAME1= <>
##$TPNAME2= <>
##$TPNAME3= <>
##$TPNAME4= <>
##$TPNAME5= <>
##$TPNAME6= <>
##$TPNAME7= <>
##$TPOAL= (0..7)
0.5 0.5 0.5 0.5 0.5 0.5 0.5 0.5 
##$TPOFFS= (0..7)
0 0 0 0 0 0 0 0 
##$TUNHIN= 0
##$TUNHOUT= 0
##$TUNXOUT= 0
##$USERA1= <user>
##$USERA2= <user>
##$USERA3= <user>
##$USERA4= <user>
##$USERA5= <user>
##$V9= 5
##$VALIST= <valist>
##$VCLIST= <CCCCCCCCCCCCCCC>
##$VD= 0
##$VDLIST= <DDDDDDDDDDDDDDD>
##$VPLIST= <PPPPPPPPPPPPPPP>
##$VTLIST= <TTTTTTTTTTTTTTT>
##$WBST= 1024
##$WBSW= 4
##$XGAIN= (0..3)
0 0 0 0 
##$XL= 0
##$YL= 0
##$YMAX_a= 689818
##$YMIN_a= -553077
##$ZGOPTNS= <>
##$ZL1= 120
##$ZL2= 120
##$ZL3= 120
##$ZL4= 120
##$ABSF1= 10
##$ABSF2= 0
##$ABSG= 5
##$ABSL= 3
##$ALPHA= 0
##$AQORDER= 0
##$ASSFAC= 0
##$ASSFACI= 0
##$ASSFACX= 0
##$ASSWID= 0
##$AUNMP= <proc_1d>
##$AZFE= 0.1
##$AZFW= 0.1
##$BCFW= 1
##$BC_mod= 2
##$BYTORDP= 1
##$COROFFS= 0
##$CY= 11.3945322036743
##$DATMOD= 1
##$DC= 2
##$DFILT= <>
##$DTYPP= 0
##$F1P= 16.9975609425685
##$F2P= -3.02152046262296
##$FCOR= 0.5
##$FTSIZE= 0
##$FT_mod= 4
##$GAMMA= 1
##$GB= 0.15
##$INTBC= 1
##$INTSCL= 1
##$ISEN= 128
##$LB= 0.24
##$LEV0= 0
##$LPBIN= 0
##$MAXI= 10000
##$MC2= 0
##$MEAN= 0
##$ME_mod= 0
##$MI= 1.114404
##$NCOEF= 0
##$NC_proc= 0
##$NLEV= 6
##$NOISF1= 3.799351
##$NOISF2= 2.8
##$NSP= 1
##$NTH_PI= 0
##$NZP= 0
##$OFFSET= 15.70392
##$PC= 1
##$PHC0= -9806.948
##$PHC1= 39.80081
##$PH_mod= 1
##$PKNL= yes
##$PPARMOD= 0
##$PSCAL= 0
##$PSIGN= 0
##$REVERSE= no
##$SF= 200.130013532006
##$SI= 16384
##$SIGF1= 3
##$SIGF2= 2
##$SINO= 400
##$SIOLD= 16384
##$SREGLST= <1H.CDCl3>
##$SSB= 0
##$STSI= 0
##$STSR= 0
##$SW_p= 3612.71676300578
##$SYMM= 0
##$S_DEV= 0
##$TDeff= 0
##$TDoff= 0
##$TI= <>
##$TILT= no
##$TM1= 0
##$TM2= 0
##$TOPLEV= 0
##$USERP1= <user>
##$USERP2= <user>
##$USERP3= <user>
##$USERP4= <user>
##$USERP5= <user>
##$WDW= 1
##$XDIM= 8192
##$YMAX_p= 0
##$YMIN_p= 0
$$ End of Bruker specific parameters
$$ ---------------------------------
##NTUPLES= NMR FID
##VAR_NAME=  TIME,          FID/REAL,        FID/IMAG
##SYMBOL=    X,             R,               I
##VAR_TYPE=  INDEPENDENT,   DEPENDENT,       DEPENDENT
##VAR_FORM=  AFFN,          ASDF,            ASDF
##VAR_DIM=   8192,          8192,            8192
##UNITS=     SECONDS,       ARBITRARY UNITS, ARBITRARY UNITS
##FACTOR=    0.0002004,     1,               1
##FIRST=     0,             0,               0
##LAST=      1.6414764,     0,               0
##MIN=       0,             -553077,         0
##MAX=       1.6414764,     689818,          0
$$ Real data points
##PAGE= N=1
##DATA TABLE= (X++(R..R)), XYDATA
0@%%%%%%%%%%%%%%jL7j33K05k16K16k16K20k89L91m31M51n29O24o92P85q89J000
32E33j124J256j404J574j756J940k154K390k654K946l259L610l994M422m909N460
48B877o093O823p666Q671r885J1394j3326J5887j9493K4982l4533N5917k28194
61a92639K34724M33542Q2200j08064l51994l61373k70709P038K38776L86846L19586
72D17933J38852j31281l22985l83541k40227K397K53952L67522L24558J19624
82E46804j37498l35653l62852k24217K1915K46964L60878L05654J07327j46006
92C83316l22367l50105k12658K3211K50729L59360K92961Q8034j52929l16173
102D3379l34952k01233L2950K53339L47753K76878P8128j53225l11339l27198
$$ y = [0, 0, 0, 0, 0, 0, 0, 0, 0, 0, 0, 0, 0, 0, 0, -1, 36, -97, 108, -108, 108, -108, 112, -177, 214, -217, 234, -295, 329, -363, 422, -467, 533, -591, 665, -739, 835, -921, 1019, -1135, 1255, -1399, 1547, -1712, 1898, -2096, 2326, -2583, 2877, -3216, 3607, -4059, 4612, -5273, 6121, -7205, 8682, -10811, 14171, -20362, 35555, -192639, 42085, 475627, 557827, 449763, 97769, -263604, -534313, -527275, -288499, 98347, 417933, 556785, 425504, 102519, -281022, -521249, -518852, -264900, 102622, 427180, 546804, 409306, 73653, -289199, -513416, -491501, -244537, 116341, 421995, 529322, 383316, 60949, -289156, -501814, -478603, -227874, 131486, 424447, 512481, 359552, 43379, -291573, -492806, -459856, -206517, 141236, 418114, 496242, 343017, 31678, -295520]
112b95520j87023M1310K52651L36404K64415P0756j55413l10641l16348j73197
122d72606N1587K47156L25542K54660O2930j59425l05440l04856j60432N5220
132d05664K45700L19133K43786N1559j63715k96709k92100j52249N9889K45297
142a45073L11862K31804M2485j64831k91149k84347j43467O4813K44358L06023
152A72478K19952L6038j64781k87441k76473j34216P1920K42325K95028K12159
162C86989L0885j64556k85416k69070j24678P7024K39822K87505K04213K5364
172D08082j69064k80296k58875j16880Q0334K35892K83837J96314J6513j69455
182B26402k74509k51241j09496Q1425K36547K78137J87678J0349j69997k70079
$$ y = [-295520, -482543, -441233, -188582, 147822, 412237, 482993, 327580, 16939, -299409, -472606, -421019, -173863, 151679, 406339, 469269, 309844, 4404, -300452, -460884, -405664, -159964, 159169, 402955, 454514, 290799, -5910, -298010, -450259, -390370, -145073, 166789, 398593, 441078, 276247, -14902, -299249, -442716, -377903, -133545, 172478, 392430, 428468, 263687, -23754, -300227, -434443, -362523, -120198, 174830, 386989, 417874, 253318, -32098, -301168, -425846, -348822, -109000, 178505, 382718, 408082, 239018, -41278, -300153, -417033, -336699, -100807, 183030, 379344, 395857, 226402, -48107, -299348, -408844, -327419, -90872, 187265, 374943, 385292, 215295, -54784]
192e4784k43161j01808Q4707K34978K71452J78362N991j71096k66142k37128r5556
203c94185R1858K32776K63578J72637l30j72699k62940k28728q8487R4648K31316
214f0556K57641J65512o761j71724k58851k23890q1187R7742K30126K54007J57188
225C59247j1860j74711k53487k16843p4138J00340K28197K47293J51422j7354
235C38106j74402k52248k09076o7973J03302K27097K42209J44351k2310j76155
245A52901k47001k02540o1695J05256K26092K36594J37920k5905j78964k42605
255i9947j96257n6093J10477K24509K31202J30273l0253j79118k40435j90714
265b96356n1690J14468K23717K25307J24731l5326j79113k38693j84158m3905
$$ y = [-54784, -297945, -399753, -315046, -80068, 191384, 369746, 375737, 204641, -61501, -298629, -394185, -302327, -69551, 194027, 366664, 366334, 193635, -69305, -298033, -386520, -291872, -60556, 197085, 362597, 355836, 184112, -74739, -298629, -379816, -282074, -51948, 202059, 359247, 347387, 172676, -80811, -297654, -371792, -271452, -43255, 204038, 355460, 338106, 163704, -88544, -297620, -365593, -262291, -35194, 207015, 351366, 329056, 152901, -94100, -296640, -358335, -253079, -26987, 209607, 347527, 321622, 142658, -99947, -296204, -352297, -241820, -17311, 213891, 344164, 313911, 134793, -105642, -296356, -348046, -233578, -9861, 215446, 340177, 304851, 125738, -112955, -297113, -341018]
275c41018J17339K20813K21815J17846l9427j80924k34032j78344l7989J19847
285b14074K19036K16231J13408m5741j81972k30138j71332l3197J20847K18620
295A1688K12074J07360n1302j81498k26288j66208k8960J25443K18148K06508
305B26965R8771n3192j81279k25323j59776k1601J27485K14349K03094R4019n7951
316B65561j82892k22417j54393j5736J30181K12739J97617Q9560o2669j83717
326G3834k17375j49629j1267J32445K12117J92965Q4342o7953j84412k12842j44708
337b92483p647J36029K10812J88403P7563p0525j85021k10274j37819r69J35967
348a55964K09038J84118P1485p3425j84676k07626j32713K734J38676K07585J79072
$$ y = [-341018, -223679, -2866, 218949, 336795, 297368, 116444, -117588, -295932, -333921, -214074, 4962, 221193, 334601, 288860, 106888, -123250, -294582, -327779, -206932, 11688, 223762, 331122, 279820, 98322, -127966, -294174, -323134, -197691, 20457, 226965, 325736, 272544, 91265, -134058, -293834, -315435, -187950, 26399, 229493, 323512, 265561, 82669, -139748, -294141, -309877, -179696, 33043, 230660, 320220, 257551, 73834, -143541, -293170, -304437, -171992, 40125, 233090, 317432, 249479, 65067, -147775, -292483, -300130, -164101, 46711, 235114, 312677, 242152, 57131, -153143, -290962, -291931, -155964, 53074, 237192, 308677, 235252, 50576, -157050, -289763, -287029, -148353, 59232, 238304]
359B38304O6622p7523j83876k03890j28866R395J39742K05697J74325O0841q1379
370B19392j84894k00256j22492J3084J43281K04046J69515N6420q5519j84431
380B8146j95639j18162J6911J44164K01854J65044N1238q8333j83990j93119j12785
391b84671K2397J45638J98986J61678M4533r0879j82410j90326j08026K7010J47453
402a08617J96480J55384M0730r3199j83476j86805r9939L0401J45941J95975J51919
413B44794L5501r7095j81646j82997r6976L3683J50178J93003J45707L1918r9707
424A76363j81602j80000r1126L8667J50694J91046J41805K6052j02022j80676
434a0799j76531q6372M1383J51788J87691J38930K1262j03834j80821j70961q2705
$$ y = [238304, 304926, 227403, 43527, -160363, -289229, -279834, -140092, 65605, 239930, 300771, 219392, 34498, -165758, -288250, -275166, -131885, 72161, 241676, 298096, 212577, 28146, -167493, -285655, -268744, -124580, 77274, 242318, 293556, 205223, 21233, -171886, -284671, -262274, -116636, 82350, 244028, 288561, 197682, 15272, -175054, -283080, -256070, -108617, 87863, 243247, 283977, 190778, 7302, -179503, -279442, -249041, -103100, 92875, 244794, 280295, 183200, 1554, -181443, -278419, -244736, -94558, 98445, 244152, 276070, 176363, -5239, -185239, -276365, -237698, -87004, 104042, 245847, 271899, 169877, -10799, -187330, -273702, -232319, -80531, 107160, 246090, 267352, 163518, -17303, -188264, -270969]
445b70969M4843J51973J84799J34897J7291j06621j78590j69015p8092N0272J52297
456f6915J82509J29075J2840j08603j77890j64447p2982N3144J52803J80474J23967
467B43975Q458j09962j76752j60818o8709N6622J52570J78833J19529N030j13347
478A35429j75851j56747o3394N9770J52662J75959J14853J571j15729j74239j52766
489a98482n9702O2152J54585J73140J10690l713j15879j72808j49002n5297O3685
500a90631J55502J70089J05172o665j16814j71622j45171n1212O7798J53915J66576
511A36937J01865j0163j19255j70351j39635m7359P2007J52876J63610R8208j5051
522B23689j20335j69205j37149m1095P4015J52377J61280R5336k0069j21690j66243
$$ y = [-270969, -226126, -74153, 110646, 245543, 262834, 156213, -22377, -191392, -269484, -219212, -66915, 115594, 244669, 257509, 148906, -28984, -193431, -266413, -213269, -60466, 120008, 243975, 252433, 142471, -34281, -195099, -263808, -207186, -54616, 124217, 243746, 248776, 135429, -40422, -197169, -260563, -200793, -48131, 127828, 242681, 244252, 128523, -45716, -198482, -258184, -196032, -41447, 131693, 242383, 238670, 122791, -50017, -199019, -254316, -190631, -35129, 134960, 240132, 233467, 116653, -54969, -200140, -251352, -183554, -29639, 136937, 238802, 228639, 109384, -60967, -200602, -247961, -175954, -23078, 140532, 238740, 223689, 103354, -65851, -203000, -244095, -170080, -17703, 143577, 238913, 218844, 97154, -69089]
533f9089j34036l8149P6452J53602J57978R0142k3690j21717j65683j29099l4842
544b38131P8120J53011J55561Q5418k4941j22999j63822j26800l0322Q2322J51945
555f38J51561Q1689k8634j23809j61673j23303k6651Q3831J52355J48901P6612
566B30241l1424j25283j58848j19081k2814Q4660J51178J47854P1882l4845j25368
577F8152j58194j15402j8971Q8660J50154J43421O9319l7690j27661j55879j10539
588b04630j4865Q9299J48876J41205O5498m1465j28222j53120j07258j1182R0180
599a25684J49009J37606O2463m3376j27273j53488j03697q114R3147J46485J35589
610A62667N8053m7743j25405j49489j01766m896R3631J47091J32053N4782m9022
$$ y = [-69089, -203125, -241274, -164822, -11220, 146758, 236900, 213210, 91493, -74190, -203289, -238131, -160011, -7000, 148561, 233979, 209038, 86039, -77783, -204583, -234905, -152583, -638, 150923, 232612, 203978, 80169, -81504, -204807, -231458, -147627, 4728, 153629, 230241, 198817, 73534, -85314, -204395, -227209, -142549, 8629, 156483, 228365, 193520, 68152, -90042, -205444, -224415, -135755, 14399, 157820, 227139, 189449, 61788, -94091, -204630, -219495, -130196, 18680, 159885, 225383, 183918, 55696, -97424, -204682, -215864, -125684, 23325, 160931, 223394, 180018, 52745, -100743, -204440, -212554, -119407, 27078, 162667, 220720, 172977, 47572, -101917, -203683, -208579, -114948, 32143, 164196, 218978, 169956]
621A69956j28759j47732r6175j84R4503J44147J29240N0442n1233j28610j45358
632a09763r3388L559R5751J44792J25625M6435n3183j29963j42028q8972N862
643a95273R7550J43905J21848M3782n8142j27455j40057q7415P521R9362J43986
654D9612J19983L7690n7739j27146j39802q3421J1756J00017J41918J16613L4993
665B04474n9412j27661j37164p8932J4096J01060J39912J12173L6325o4175j28769
676A1927j33529p6115J7727J00901J39010J12750K6999o3770j27339j31786p2955
687a96180J8477J03370J38631J08124K5465o6973j27532j28010p1029K1012J05815
698f8830J36876J03466K3430o8140j26366j28211o7262K5243J06335J32913J01872
$$ y = [169956, 41197, -106535, -202710, -202894, -108391, 35756, 164996, 215438, 164205, 35595, -109763, -203151, -199592, -103841, 40951, 166576, 213011, 159828, 29865, -112163, -201135, -195273, -97723, 46182, 168030, 211812, 153670, 26215, -113842, -201257, -193736, -94374, 49612, 169595, 207285, 149546, 22400, -117402, -200823, -189067, -89050, 52868, 169481, 204474, 145062, 17401, -119763, -198695, -184599, -83539, 56373, 168546, 204871, 140696, 11927, -121602, -197717, -179990, -79089, 59921, 172671, 199670, 135900, 8561, -123225, -196180, -177703, -74333, 64298, 172422, 197887, 130914, 3382, -124628, -195657, -174645, -68830, 68046, 171512, 194942, 126802, 436, -127775, -195037, -169794, -63459, 69454, 171326]
709A71326K0892o9192j29061j23231o4121K9158J03630J32889R8837J8326p1809
720A17644j27575j21629o0149L1174J04885J31454R7330J3498p3928j26216j18382
731a31894n6803L0576J07655J29869R3660R665p3841j26327j15890n5411L4241
742a54500J08300J29582Q7717Q533p5167j24601j14803n2698L9012J06925J25889
753H4189Q7599P204p8540j24665j13373m7453L9928J06863J24848Q4593M313p9338
765I6168j23903j10948m3148M0537J07724J22730Q2607J064q2061j22515j07534
776a39279m2352M3509J08162J23127P7912k771q2142j21625j05281m0458M7436
787a33762J08748J20124P4934n351q1592j22206j04096l5558N0126J07822J16241
$$ y = [171326, 192218, 123026, -6035, -129266, -193387, -164229, -60599, 72290, 171127, 189453, 117644, -9931, -131560, -191709, -160535, -55650, 75804, 173134, 186632, 112704, -13512, -131894, -188697, -158121, -50466, 79403, 173063, 182728, 108887, -17440, -133330, -188741, -154500, -46200, 83382, 171099, 179632, 104465, -20136, -134939, -187637, -148625, -41700, 84189, 171788, 178992, 100452, -24213, -137586, -185039, -145111, -38248, 86600, 171193, 175506, 96168, -27735, -138683, -181831, -141294, -33570, 89160, 171767, 172831, 90770, -31745, -139279, -181631, -138122, -29960, 93167, 171079, 168308, 86166, -35459, -140740, -181198, -133762, -25014, 95110, 170044, 164693, 83101, -39105, -143201, -178759, -128633, -20811, 95430]
798I5430P3630n559q5074j20718j00242l4690N1436J08392J15761P0615r228q6002
810G3751j20209r6847k8916M9995J08738J14734O7832j2034q7479j16918r6290
821a43643k8837N3755J08422J13423O5480j5071q6682j17503r3186k6199N5382
832a14659J09524J09933O1210j6262q6941j16289r2562k1576N7110J08690J08241
843A06419N9123j8269q9007j15809q6631k1469N8436J08442J07447N8685k3640
854A43727q9382j14015q7310j5856N9470J08171J05738N3529k4013q9302j13703
865f2946q4479j3772O0959J07865J03966N0928k4973q9863j13292q0500j3437
876a59544O3729J07802J01757M8201k7834r1210j10743p8462j1292O5383J06452
$$ y = [95430, 169060, 163501, 78427, -42291, -142533, -177223, -125787, -17395, 98366, 168981, 159753, 73751, -46458, -143305, -172221, -122226, -13488, 101246, 169078, 157044, 69565, -47353, -143643, -172480, -118725, -10303, 103120, 168600, 153529, 66847, -50656, -143842, -170041, -114659, -5135, 104798, 166008, 149746, 62805, -53484, -146046, -167622, -110512, -1822, 106419, 165542, 147273, 58266, -57543, -144174, -165643, -107207, 1235, 108682, 167367, 143727, 54345, -59670, -146980, -162836, -103366, 4805, 110543, 164072, 140059, 50757, -62946, -147425, -161197, -100238, 7627, 111593, 162521, 137548, 47685, -65607, -146107, -159544, -95815, 11987, 113744, 161945, 134111, 42901, -67842, -146304, -157596, -92213, 14239]
887A4239J01604M4673k9532r1713j09423p7062o088O4261J07316R7684M3016l2422
899A26553r1109j07511p4313n093O7273J05404R5517M0005l2853r0726j08816
910g5669p0935j836O7380J04936R4824L7886l6563r2374j05526o9080N90O8471
922g7896J05692R2083L5518l7675r3693j03694o6024J853O9818J03419R0452L4278
934A54131m0174r2707j01790o4537L800P1554J02914Q8211L0466m1204r3262r9216
946h1814o4360O779P3021J03225Q4765K8717m2788r2989r9586n9691R950P1924
958f2847J01488Q3395K6826m5133r3411r7718n6265J0879P2653J01696Q1224K4191
970A46978m5885r3165r6111n4698J2458P4146J00585P9992K1031m6886r3421r5446
$$ y = [14239, 115843, 160516, 130984, 39271, -70152, -147214, -153302, -89041, 18275, 115959, 158975, 126553, 35444, -72067, -146380, -151473, -84200, 21204, 116721, 156726, 123873, 33147, -75669, -146604, -148440, -81060, 23876, 118700, 156586, 120023, 27649, -77877, -146957, -146367, -77896, 27796, 119879, 155397, 117722, 24029, -79665, -145689, -143836, -74018, 29401, 119853, 154131, 113957, 21250, -80540, -145077, -141277, -69723, 33191, 121402, 151868, 110664, 17402, -81814, -146174, -139395, -66374, 36851, 121616, 150333, 107545, 14556, -85030, -144721, -134771, -62847, 38641, 122036, 148862, 103729, 10318, -87400, -143665, -132786, -60133, 41563, 122787, 146978, 101093, 7928, -88183, -142881, -130423, -56277, 44308, 124300, 145331, 98445, 5024, -90422]
982i0422n1417J4312P4291J00771P5456J9068m7717r2724r3328m9933J5955P7438
994d8250R7522P4692J7402n0223r2479r1447m7572J8737P4866R7954P2949J4989
1006A39140n2549r1213r0035m4805K0658P6511R6734P0323J2064n3362r1612q6850
1018i4996m3844K2468P7568R5810O9084R161n3879r0595q8284m1030K4311P8676
1030c5550R5031O5197Q856n6338r1225q4238l9108K6855P7435R2855O5889O319
1042A31978n6412r2026q3809l5063K6662P8859R2564O1655N008n7868r0983q0307
1054i9742l3642K7927P9502R0235O1056M42n6187r1666p8968l0831K8691P9185
1066b3998R0497N7716j211n8090q9064p8188l0947L2837Q0250Q8580N5563k005
$$ y = [-90422, -141839, -127527, -53236, 47535, 122991, 142059, 94342, 1618, -91710, -141643, -125688, -48250, 49272, 123964, 141366, 91143, -1336, -92783, -140355, -121618, -46752, 51202, 124151, 139140, 86591, -4622, -94657, -139462, -118804, -42293, 54441, 124764, 136828, 83466, -8146, -94996, -138840, -116372, -38804, 57006, 126090, 135251, 81372, -9223, -97507, -138537, -114226, -35550, 59481, 124678, 133534, 77196, -14029, -98267, -137375, -110520, -33085, 59770, 125659, 131978, 75566, -16460, -100269, -135332, -108670, -29811, 62753, 124408, 129416, 71548, -19435, -99742, -133384, -105457, -25955, 64280, 125336, 125778, 69591, -22075, -101043, -131874, -103183, -23998, 66499, 124215, 123004, 64914, -24150, -102338, -133285, -100448, -20198, 68382, 123945, 121940]
1078A21940n9693q9369p6421k7567L4064P9954Q6684N4591m604n9808q7994p4925
1090a03148k6179L5761P8501Q7177N0697n689n9785q9597p2493k3452L6624P9766
1102a1817Q4487M9872o429o2841q7352p0148k1858L8213P9258Q3732M7737r226
1114A13628o3800q6516o9011j8717L8006Q0026Q2105M6285j1994o2400q5556o6490
1126a04434j7406L8561Q0152Q0441M4317j3868o3597q4348o6175j5337M2194P9451
1138d9P7867M3698j4839o5862q3568o3878j3744M3702P8811P7482M0430j6723
1150A03327o2796q5222o2055j1143M3328P8602P7424L8672j8662o5689q1561o0573
1162a06348r602M4277P8378P5626L6891j9507o7090q0878n9243p993M6420P9085
$$ y = [121940, 62247, -27122, -103543, -131110, -97046, -17092, 69592, 124183, 119579, 59771, -28223, -103148, -129327, -93566, -15065, 72112, 122809, 117120, 57335, -32262, -104755, -128207, -91583, -11817, 72670, 122542, 116113, 53272, -34080, -104228, -126086, -87873, -8615, 75117, 122854, 113628, 49828, -36688, -105699, -124416, -86410, -6384, 75721, 122006, 110012, 47612, -37944, -104434, -121840, -83279, -3127, 77314, 121631, 107763, 44166, -40182, -106357, -121694, -79500, -49, 77818, 121516, 106677, 40815, -42753, -106631, -120375, -76673, 2138, 79620, 120050, 103327, 40531, -44691, -106746, -117889, -74561, 4041, 81465, 120137, 101475, 35786, -45775, -106348, -115950, -71673, 6705, 82331, 119222, 99715, 32625, -48253, -107496, -115489, -69069, 10016]
1174A0016P2739L5146k0661o7099q0504n6760n904M6223P8936P2513L2945k2479
1186I5111o7812q0052n4182o157M9145P7496P1659L0194k2918o6983p9986n2052
1198a06537k801M8215P7753O9372K9252k5453o6749p8078n1062k486M9731P6869
1210A8026O9526K6286k6170o8259p6119n0787J554N0183P7526O6016K5330k7441
1222H5671o8140p5134m9515K702N0978P6417O5771K2876k8487o8778p4254m5810
1234a05703L294N2847P3823O4520K1768k9196o8654p4322m4544M571N3800P5160
1246B7364O2384K0846l1880o8303p3444m2265N615N4548P3400O2324J8079l3019
1258G5649o7951p1388m2521Q966N4083P3423O0142J6685l2027o8979p0619l9568
$$ y = [10016, 82755, 117901, 97240, 30141, -50363, -107123, -113027, -66804, 12132, 84645, 117590, 95111, 27299, -52753, -106935, -113092, -63947, 13549, 85208, 115402, 92484, 25501, -54485, -106537, -109338, -61123, 16630, 86002, 115254, 89801, 23052, -55026, -106088, -108574, -58843, 18026, 87552, 113838, 87668, 19409, -56710, -107497, -105943, -55760, 21766, 87782, 113112, 85671, 17531, -57603, -107118, -104416, -53438, 22979, 88750, 111626, 83139, 14361, -59893, -105703, -102409, -49562, 24261, 88781, 110549, 81353, 12699, -61623, -106167, -101596, -47796, 27364, 89748, 110594, 78714, 10411, -63033, -105298, -99683, -45135, 28265, 90589, 108668, 75649, 7698, -63690, -106211, -97245, -43162, 30261, 90403, 107088, 75061, 6082, -64537, -104105]
1270a04105Q289N4845P4074N8695J5034l5883o7544p0546l7056J0817N4683P2993
1282C4296N5997J4603l5783o8318o8508l6328J1429N7454P1407N4519J2165l6112
1294F6821o7712o7181l5809J4818N5422P1721N3831J1244l8438o9113o6240l1292
1306a01928J4384N5685P1197N2722Q605l8924o7102o5720l1106J6572N5520P1414
1318D1319N2616N701m0121o6431o4300l0791J8390N7043O9876N0270M996m1208
1330E7360o7348o2772k8726J9094N8732O7897M7609M276m0481o7800o1908k6818
1342a00885K0848N8379O8183M5435K499m1401o8277n9608k4544K2213N6979O8186
1354D8007M4843J835m3782o7658n8482k3196K2185N8971O6435M3705r75m3920
$$ y = [-104105, -95816, -40971, 33103, 91798, 106832, 70949, 3405, -67141, -104197, -93380, -38697, 34296, 90293, 104896, 69113, 795, -67713, -104041, -92612, -35158, 36249, 90768, 102933, 66821, -891, -68072, -103881, -89063, -33641, 38080, 91911, 103155, 64717, -4396, -70636, -101928, -87544, -31859, 39338, 92060, 100665, 61741, -5361, -71081, -102187, -85615, -30095, 41319, 93935, 99636, 59515, -6916, -71216, -102007, -83617, -26574, 43302, 93572, 98568, 57360, -9988, -72760, -101486, -82392, -23660, 44237, 91846, 96122, 55641, -12159, -74067, -100885, -80037, -21658, 46525, 91960, 94459, 53058, -15219, -74827, -99371, -77158, -20179, 48007, 92850, 94685, 50903, -16755, -75237, -98433, -76248, -17277, 49158, 92863, 91888, 47968]
1366D7968o5487n8037k2420K3887N8772O5928M2033k266m4078o7282n5027k0807
1378i6816K6094N7315O5279L9647k743m4898o6107n4946j8990K7462N8010O4140
1390E3447L9031m817m5891o6254n3558j6500K7930N8211O2715L7718o007m7412
1402C8613o4688n1626j5367K6856N9116O3302L5238p089m7307o4129n1115j4325
1414i2521K8468N8696O2757L2455p691m7307o3727m9786j3497L1136N9074N8699
1426E6756L2490q260m8650o2743m8666j1170L0770N9042N8837L0847r985m7631
1438C1637o4635m7040q800L2449N8331N7354L1016j2455m9109o2325m4471r782
1450h7830L2148N8193N7834K9091j4404m8737o0918m4508q859L4815N9114N5585
$$ y = [47968, -17519, -75556, -97976, -74089, -15317, 50611, 92644, 90378, 46300, -20982, -76009, -96816, -70722, -13407, 51872, 91519, 88776, 43878, -22229, -77175, -96165, -68703, -10693, 53447, 92478, 87661, 41770, -24484, -78042, -94542, -66612, -8401, 54314, 92032, 86025, 38613, -26075, -77701, -93068, -66212, -7096, 56206, 91444, 84355, 37048, -27081, -78196, -92521, -64053, -5357, 57400, 89855, 82164, 34857, -28870, -78656, -92153, -61017, -1943, 56756, 89246, 80986, 32336, -30407, -79073, -90243, -59473, -431, 58406, 89253, 79268, 31637, -32998, -80038, -88838, -56389, 1942, 59296, 90312, 77857, 28748, -33577, -78048, -87830, -55682, 2511, 60345, 89436, 75032, 26295, -34623, -79131, -87990, -53175, 5939, 61524]
1462F1524K7271j5441m8708o2336m1843o224L4925N7847N5213K6086j5658n0219
1474B2437o0868m1170n357L4880N9877N3991K4014j8187m9535n9345m1432l039
1486h3734L6161N8640N3946K2095j8664n0337n9266l8775q79L5437N7740N2587
1498F4951K0888j8984n0457n7865l8497j418L7909N8890M9327K0471k0359n0152
1510A4704n8354l6113j484L9754N8007M9329J8941k1885n0600n6825l6610K454
1522g8682L8762N8037M9076J6339k1920n1624n4750l4517K129L8807N7812M7788
1534F7257J5537k2509n2187n4430l4000M940M0224N8192M4786J3656k3558n1480
1546F428n5201l1513O213L9943N6201M6344J3236k5206n1182n4836k9869P158
$$ y = [61524, 88795, 73354, 24646, -37690, -79533, -85757, -50832, 7015, 62228, 88314, 72656, 22437, -38431, -79601, -84958, -50078, 9799, 63790, 87804, 69617, 20082, -39263, -80695, -83734, -47573, 11067, 65013, 87108, 68444, 18107, -41159, -79934, -80813, -45376, 12364, 64951, 85839, 66855, 16398, -41467, -79964, -81382, -43473, 15417, 64744, 85215, 64856, 14704, -43650, -79763, -81247, -41493, 16514, 65843, 84784, 62899, 12299, -44526, -81136, -78682, -39920, 18117, 67193, 83532, 61612, 9988, -44762, -79279, -77150, -38343, 19469, 67257, 82794, 60285, 8098, -46332, -80332, -75392, -35168, 23024, 67810, 81466, 57908, 6428, -48773, -80286, -74073, -34130, 22071, 68415, 81651, 56445, 5263, -49573, -79442, -72284]
1558g2284L9730N6804M4271J1908k5087n3011n2695k9270Q637M0721N6473M2589
1570F8786J1090k6999n1229n1788k9332R902M0459N5581M2762R317k8134n0454
1582c9n1264k7439J1107M1370N5732M0993P437k8115n2744m8596k6459J1276M2105
1595b4636N4158L9324Q124k9726n1916m8239k5119J2063M2735N4809L8290N916
1607G5783k8745n2966m9303k1955J3707M1895N4679L6847M901l0155n1203m8411
1619e4926k2141J4137M3814N3014L7265L033l1578n1924m6133k1522J6490M3304
1631a7167N1962L5774J547l0819n1972m5350j9339J5801M3009N2189L4837M53
1643G0925l1324n0583m5812j8406J6653M4355N1099L3769r13l2456n0398m4055
$$ y = [-72284, -32554, 24250, 68521, 80429, 55342, 2331, -50364, -79634, -70997, -30276, 26197, 68786, 79876, 52877, 1648, -50140, -79472, -69570, -29111, 26470, 69232, 78549, 50415, -39, -51303, -78742, -67635, -26265, 29467, 70460, 77897, 49782, -2962, -51558, -78017, -66741, -24636, 29522, 68846, 76970, 47244, -4672, -52911, -78030, -65967, -23232, 31577, 69867, 75783, 47038, -5928, -55231, -77186, -63479, -21584, 33095, 69942, 74843, 44688, -6515, -54926, -77067, -62930, -19116, 33898, 71163, 74196, 42618, -9306, -55439, -76961, -60471, -17167, 34795, 70569, 72116, 41297, -10675, -56025, -75364, -59563, -16554, 35635, 70472, 70925, 39601, -10982, -56794, -75200, -58547, -14192, 36907, 70676, 69763, 37307, -13091, -57146]
1655e7146j8212J9142M3639N1624L1127m26l3627n1063m4339j4484J8192M5898
1667i675M8211L0623j087l4128n0110m2853j3967J8665M5167M9733K9823m284
1679F6118l2553n0658m1642j3610K0249M4488M9021K8449l694l4794n0418m0688
1691e9732j2560K0498M5747M8046K8224n059l6234m8576l9066j2413K0801M5448
1703d876M6694K6861m823l6466m8773l9118q882K1609M5020M6540K5105n634l7621
1716B5636m8245l8753q474K2588M4918M6826K5152q553l6250m9006l6003q643
1728f8807K4726M5142M4620K2820p183l8626m6889l6262r023K4769M6719M4828
1740D6834K2467r607l8753m7300l4729n474K4750M4710M3900K1095j0353l7052
$$ y = [-57146, -75358, -56216, -12577, 39047, 70174, 69748, 36121, -14942, -59281, -73765, -55573, -9675, 38536, 69159, 68072, 33944, -16166, -59019, -72986, -54321, -9154, 40579, 70402, 66118, 33565, -17093, -58735, -72345, -52096, -7608, 41413, 69862, 66168, 31374, -19044, -59732, -72292, -51794, -6047, 41999, 70223, 65164, 28930, -19646, -58712, -71125, -50324, -4876, 41818, 68679, 63856, 27390, -21383, -60501, -69383, -47774, -2754, 43786, 68891, 63257, 25636, -22609, -61362, -69836, -47248, -2330, 44496, 69648, 61095, 24845, -24161, -60164, -68807, -44081, 1061, 45681, 68501, 61318, 22692, -24197, -60459, -69482, -44713, 2006, 46834, 69301, 59694, 20941, -26359, -61088, -66562, -41812, 2898, 46798, 67893, 57540, 20488]
1752B0488m7444l4307n349K6435M6506M0853K0158j0437l8037m6494l3822m380
1764f5830K6466M5277M4158J6348j1467l8932m6627l0209m048K7252M5829M0358
1776D8575J8072j2715l8519m6455l0838j687K7381M4419M1189J7207j3774l9592
1788A3263m5387k9362j662K7899M5549L9298J6356j5101l8695m5787k8135P2K9476
1801c2216M3899L9307J4205j5396l8439m5421k7697K024K8607M3446L8809J3767
1813F4895j6763l8720m4243k7377J765L0659M4350L7330J2376j7074l9465m5073
1825c7340k4494L355K9546M4602L6049J1116j7799l8080m3804k5462M150L1267
1837b6894M2931L6593R204j7507l9989m2270k3397M925L1127M3604L4152R339
$$ y = [20488, -26956, -61263, -66612, -40177, 6329, 47182, 67340, 56903, 18866, -27628, -61450, -65830, -39364, 5913, 50071, 66419, 54952, 16020, -30607, -60816, -64864, -37612, 8217, 48575, 66647, 53932, 15413, -31042, -61880, -63567, -36186, 8233, 49422, 66629, 52855, 13263, -32124, -61486, -63148, -35249, 10300, 49598, 65954, 50853, 12158, -33629, -61764, -61692, -32216, 11683, 50990, 65195, 49799, 11360, -34061, -61758, -59734, -31127, 12319, 51128, 64895, 48132, 9412, -34831, -62208, -60443, -29784, 14566, 51896, 64272, 47198, 7733, -37340, -61834, -58479, -28933, 15669, 51718, 62834, 45035, 6955, -36849, -62311, -58161, -26894, 16037, 52630, 61834, 44327, 4338, -37932, -61329, -56404, -25277, 18327, 52479, 61818]
1849F1818j7947m0277m1812k3917P055L1103M2975L4477Q186j9807l9569m2074
1861c9789k1978O108L3406M2814L3799O501k0561l9973m2005k0083Q141L2504
1873b1116M2646L1379P844k1082m0213l9857k0941R012L3186M1798L1023P248
1885F0927k3002m0295l7917j9591Q790L2539M1247L2946L314k2368m0644l7694
1897d1748j8279R886L1980M2228K9623M178k2244m0903l7237j6810R452L4948
1909a4926M1003K8742K805k3554m0493l7673j5273J0935L3760M1852K8112J603
1921E6893k4295l9726l6691j4817J0861L4325M0594K7793J379k5091l9650l5631
1933d4056j4392J2831L5267L7536K8049j26k5844l8725l5920j2865J3261L5978
$$ y = [61818, 43871, 3594, -38218, -62135, -55080, -23977, 18998, 53475, 61661, 41854, 2285, -39789, -61767, -55659, -22253, 20561, 54360, 60861, 40300, 327, -41678, -61761, -53620, -21116, 21530, 52909, 60753, 39671, -542, -40399, -61340, -52328, -19142, 22656, 53679, 60927, 37925, -2370, -40287, -59878, -51088, -18549, 22698, 55644, 58958, 36590, -4054, -41748, -60027, -50141, -18161, 24067, 53690, 57868, 35624, -5279, -42516, -59326, -49874, -14926, 26077, 54819, 57624, 34070, -6423, -44096, -59369, -48434, -14674, 27178, 55290, 56893, 32598, -7128, -43819, -58636, -47775, -13450, 27144, 54937, 56316, 31225, -8425, -44056, -58448, -45617, -10350, 27186, 55235, 55109, 29265, -9460, -45380, -58245, -44984, -9006]
1945i006L8330K5973O26k7193m0543l3543j2432J4184L4361M0099K3589j025k6630
1958B6790l9605l2799j0967J4175L4317L9464K3734k352k6534l9650l1695j1510
1970e6632J4918L6361L6064K4440l205k7343l9475l1307r925J5848L5831L8020
1982C3595K1208l709k8150l8744l1120r929J7716L5915L6588K1755m465l0117
1994B0543l7254l0980p028J7490L5244L5901J9602m828k9054l9006k8703n612
2006e3685J7241L5762L5888J8802n361k9034l9918k6901o063J8213L5380L6319
2018C6643J7232p291k9325l6283k9823n282K1012L3660L5309J8463p865k9181
2030A7269l7728k7747m460J9093L6365L4348J7089r553l0878l5787k6936m106
$$ y = [-9006, 29324, 55297, 55923, 28730, -11813, -45356, -57788, -43604, -9243, 30856, 54445, 53420, 26790, -12815, -45614, -56581, -42406, -8089, 31375, 55109, 52757, 26223, -13427, -45122, -56632, -41714, -5353, 30711, 55151, 51946, 24603, -14872, -46179, -56104, -40256, -4425, 33595, 54803, 51094, 22944, -15800, -46920, -56849, -39133, -3218, 33370, 55125, 50660, 20543, -16711, -47691, -54719, -37229, -1985, 33916, 53518, 48690, 19636, -19370, -48073, -53685, -36444, -682, 35206, 54008, 48647, 19613, -20305, -47206, -53269, -35056, 324, 36643, 53875, 46584, 17259, -19024, -48847, -54129, -33117, 543, 35852, 54315, 46450, 17269, -20459, -48206, -52666, -33573, 2792, 37140, 54229, 44676, 13798, -21989, -48925, -53031]
2042e3031K1272L6040L3040J5436r090k9830l5440k6792l875K2112L5773L2609
2054C8224J4938r761l1044l6068k3864m001K2942L5033L2294J2854r706k9606
2066A2235l7032k3285k009K2518L4778L1497J3996j0352l1340l5770k4844R82
2078d8626K1611L4530L1675J2661j1320l1728l5082k1837k72K2365L5524L0546
2090D0047J0308j1652l1307l4429k1556J491K2704L5586L0285J0455j4266l0430
2102G236l5186k1457K502K4227L4818K9279R311j4247l0256l4279k0813L027K4276
2115b1562L3119K9666R152j5536l0138l3534j9275L161K3633L4498K8443R268
2127E0895j6096l1281l2504j8858K878K4914L4817K6052Q468j5425l1704l3027
$$ y = [-53031, -31759, 4281, 37321, 52757, 43667, 13837, -21603, -48395, -52270, -30158, 5615, 38224, 53162, 43401, 12357, -23711, -47575, -51576, -28634, 6399, 38693, 51547, 41841, 12235, -24797, -48082, -50091, -27573, 7205, 38702, 52698, 42346, 11006, -24764, -49608, -48626, -27015, 7515, 39190, 51851, 40531, 8803, -26279, -48116, -48388, -26023, 9501, 40047, 50355, 38703, 7396, -27033, -48589, -47098, -24394, 11192, 41477, 51932, 37666, 7236, -27950, -49407, -46905, -22678, 12140, 41419, 50730, 36483, 6227, -28052, -48865, -45838, -21562, 11557, 41223, 50375, 34839, 4701, -28833, -48108, -44947, -21314, 13184, 41627, 50895, 34799, 3518, -28986, -47844, -44966, -20052, 14765, 40817, 49285, 33860, 2156, -30871]
2139c0871j7744N174K4016L4988K5872O474j5131l0698l3114j7828N996K5390
2151a7476L3895K5725O491j7412l0896l2056j6787O347K5939L3259K4896N200
2163D7125j7527l0021l1583j4942N384K6349L4061K3927M600j7949l1243l0435
2175c2254j4754P553K5456L2614K4337M311j8379l2102k9865j3765Q072K6204
2187a2572L1409K4606K477j8881l1534k8661j4044Q788K6469L2252K3427M89j8113
2200B6112l0787k8790j3733R865K7056L1978K1738j002j7637l2505k7139j2861
2212d7705J0603K7245L1856K1322J318k0486l1888k6566j1716R328K8304L0478
2224B2093K1456p74k0014l0698k7022j1291J1608K7595L0982J9947p06k1421k9996
$$ y = [-30871, -48615, -43441, -19425, 15563, 41435, 47909, 32778, 2080, -31034, -48862, -42866, -17476, 16419, 42144, 48635, 31223, 327, -31729, -48516, -42169, -16230, 17029, 41925, 47125, 29598, -423, -32006, -46948, -41564, -15215, 18846, 42773, 47373, 29424, -1819, -32254, -47008, -39455, -13999, 18615, 42952, 47263, 28884, -3218, -33083, -46848, -38776, -12572, 18837, 43443, 45920, 27039, -4495, -33156, -47200, -38412, -11943, 20309, 43736, 44225, 26112, -4675, -33465, -47198, -37333, -10277, 21701, 43439, 42437, 24800, -7705, -34844, -47705, -37102, -9857, 21999, 43321, 44639, 24153, -7735, -34301, -46017, -36689, -8385, 22093, 43549, 42775, 22761, -7937, -34959, -46250, -34642, -7047, 23935, 43882, 43176, 21755, -8241]
2237h241k7089j0562J2694K6629L0820K0124k667k1581l0604k5287r881J3171
2249c2474K7433L0245J8157j373k1575l2138k4813p228J1631K7456K9922J7358
2261D2601j745k1873l0225k5624p861J3378K7833L0579J6187l447k2309l0544
2273a3050k3933p450J3986K7681K9139J7853m570k4329k8330k4057n876J4181
2285b8755K7193K9675J4907m690k3406k9660k2982m065J4958K6601K8738J4516
2297D3030n849k2837k9247k2966m788J5646K6981K8329J3805n915k3543k9097
2309a6451k0719l901J5895K7548K7662J3255p772k3994k8971k1517j782J5507
2321b5240K7812K7420J2475o566k5221k8055k0440k641J6861K7481K6694J0461
$$ y = [-8241, -35330, -45892, -33198, -6569, 24251, 44375, 41708, 20127, -10477, -35764, -45645, -32474, -5041, 25204, 43361, 41988, 20413, -11725, -36538, -43766, -32135, -4679, 25243, 42601, 40856, 18983, -11242, -36866, -44727, -31349, -3516, 27063, 43250, 39803, 17494, -13050, -36983, -44433, -30447, -2766, 26373, 44226, 39656, 15327, -13003, -37060, -42936, -28755, -1562, 28113, 43020, 38330, 14924, -14736, -37718, -41783, -26825, -224, 28514, 43030, 37181, 14344, -14903, -37869, -42657, -27011, -30, 28299, 42104, 36189, 12646, -16451, -37170, -41071, -25176, 2372, 30034, 43289, 35517, 11523, -17448, -38965, -40747, -25240, 2572, 29992, 42467, 35901, 10680, -17375, -37815, -40456, -23595, 3886, 30580, 41041]
2333D1041p116k3254k8948j9810p51J5352K8319K6281J1102r319k3644k8297j9856
2346c8900j018J7032K8134K6186R855q906k4416k9110j6046j914J7808K7927K4927
2359C1559R321r451k3561k8264j7883N49J7647K7163K4269R386j0001k4132k8327
2372b1725j6561N4J8323K7609K3247J0343j2374k4119k7310j6141J255K0015K5864
2385H480K4684O442j1016k4780k5876j5464P12J8610K7726K3421P784j2960k3834
2398C929k6917j6300M004J7321K8606K2671N345j1426k3861k6545j5557L328K0272
2411a5130K6185K2667N009j1749k4464k7193j4476N049J7966K8219K0904O653
2423C9640j5294k3235k4768j4889M279K0459K5632K1231N456j3620k5387k3699
$$ y = [41041, 33925, 10671, -18277, -38087, -38838, -23486, 4833, 31114, 42216, 32897, 9253, -19044, -38900, -39918, -22886, 5248, 31434, 41289, 32383, 7967, -21143, -37189, -39103, -21295, 6632, 31559, 40880, 31429, 7868, -20396, -38279, -37730, -20083, 7080, 31349, 40735, 30734, 6602, -21725, -38286, -38232, -19909, 7700, 30947, 41290, 28916, 4797, -22513, -38654, -37399, -17384, 8480, 33164, 39606, 28590, 3810, -22066, -37530, -36818, -18208, 9518, 32939, 40723, 27763, 3929, -22988, -39288, -35284, -17963, 10643, 33314, 38659, 27233, 3372, -23173, -38730, -35402, -15130, 11055, 33722, 38731, 26982, 2518, -24675, -39151, -34102, -16136, 12083, 32987, 39640, 24346, 1111, -23657, -38546, -34267, -13808, 11824, 33055, 38511, 24891, -496, -24195]
2435b4195j3081M639K0806K5134J9789M777j3635k5214k5018j1774N891J9518
2447a2363K6606J9818L186j3000k6131k3834j1127N628K0560K6001J8547K438
2459C6329j4448k5063k2864j0915O020K0476K5973J8552J916j4814k4944k2629
2471b6411j0508O610K1618K5277J7612J805j5599k5533k1469r950P922K0091K5827
2484A7292J6816J501j5342k5902k0949j0051P827K1816K5163J6078L10j5224k5181
2497e846k2465p683P130K2031K5385J5763k70j4468k6250k1064r083R864K0675
2510f281K5017J5558j027j5703k4148k1140p549Q529K1643K4074J4431m97j6471
2523A6436k4704j9591q255R941K2687K2612J6232k988j6762k4859k0112n429J0080
$$ y = [-24195, -37276, -32637, -11831, 13303, 33092, 37869, 24234, -980, -25998, -37772, -31881, -12363, 14243, 34061, 37247, 24247, -1884, -25718, -36845, -31217, -10657, 15344, 33891, 36329, 21881, -3182, -26046, -36961, -30941, -10465, 15508, 34060, 35976, 21162, -3782, -26411, -36919, -30309, -8691, 16586, 34198, 36003, 20404, -5129, -26598, -36548, -28626, -8535, 17292, 34108, 35609, 20267, -5635, -26584, -36635, -28808, -6992, 18171, 34249, 34559, 19335, -5846, -28311, -35994, -28864, -6833, 18552, 34315, 34045, 19577, -6673, -27737, -36820, -26956, -6281, 18736, 34294, 33267, 17564, -6584, -27724, -35273, -26744, -5101, 18973, 33404, 32907, 16436, -8268, -27859, -36114, -26173, -3486, 19126, 35358, 32370, 15608, -9251, -29363, -34792, -24712]
2536b4712K0828K5098J3509k843j6945k3777k0920n882J1384K2175K1479J3744
2548C3138j847j6696k4101j9913n166J1626K1232K3413J2224l410j7214k5112
2560a1826j7036n801J2474K1011K3339J1902l945j7069k4123j7578n947J2258
2572b2341K2222K1494J0839k892j7782k4361j6533l308J1204K3182K0724J0686
2584C3134m323j7094k5032j5523m362J2831K1832K1675J0197m967j8784k2709
2596a3125j7928j408J3538K1184K1309R397n405j8662k1862j6978k211J3368K0521
2609A738K1825R753o107j9024k2599j6226j177J4691K0745J8376J0372o154j8937
2622G276k1545j5660q05J2405K2198K1044P889p510j8704k2521j3795j358J3893
$$ y = [-24712, -3884, 21214, 34723, 31880, 14935, -8842, -29762, -35644, -24260, -2085, 19394, 33138, 31291, 14595, -9506, -29419, -34585, -22959, -1727, 21686, 33910, 30500, 13286, -11826, -28862, -34663, -22189, -1178, 22161, 34063, 30118, 13049, -11074, -28652, -34599, -22341, -119, 21375, 32214, 29322, 11540, -12821, -29354, -32662, -21458, 1724, 22448, 33134, 28811, 11717, -13315, -28838, -33200, -20369, 1463, 23138, 33335, 28368, 9584, -13125, -31053, -32461, -18923, 2261, 23570, 32967, 27562, 8900, -12962, -29940, -32151, -18783, 1738, 23563, 33316, 27209, 8185, -14414, -30640, -31817, -17126, 3619, 21995, 32367, 26213, 7276, -14269, -29929, -30734, -18329, 3869, 24913, 32802, 25292, 6588, -15933, -29728, -31086, -17193]
2635a7193K2165J8690Q006p106j8742k1938j4596J23J4616K2330J7426Q196p490
2648B4487j9470k2716j2398O68J3927K0788J9867P115r121j8590k1759j1933m27
2661b9562J4049K2268J8980N780q135j9630k1177j3040J722J4646K1694J6891
2673B4486O512q078j9919k0123j3079K611J4729K2097J6873M959r375j9137k0513
2686a7957j1374J932J4755K0894J8149L929q434k0760k0208j1382K836J5192K1893
2699I465J5681M656q566k1478j7734j1873K812J6443K0363J6551L657j0968j8910
2712I9j9645j0421M209J5114K1643J4763M105r843k0347j9358r711L033J6499
2725i860K0973J6166K035j1500j8440j9084j0290N352J5735J9353J6692O97j0071
$$ y = [-17193, 4972, 23662, 31668, 24562, 5820, -16118, -30714, -30591, -15975, 6355, 23781, 31977, 24487, 5017, -17699, -30097, -29429, -15502, 5286, 25153, 32268, 23147, 4557, -17202, -29135, -29562, -15513, 6755, 25735, 31515, 23380, 3750, -17427, -30467, -28745, -14099, 7595, 24486, 30998, 22920, 3001, -17122, -30201, -27590, -12861, 9236, 26109, 31068, 21693, 2556, -17957, -29331, -27399, -12644, 8250, 26399, 30328, 21894, 1134, -19074, -30456, -27620, -12428, 9465, 25146, 29802, 21236, -242, -17976, -29849, -27037, -10594, 9769, 26320, 29977, 19009, 99, -19546, -29967, -25758, -10644, 10999, 25762, 29867, 20024, -323, -19681, -29392, -26359, -9860, 11113, 27279, 29314, 17814, -626, -19710, -30000, -24648, -8913, 10440, 27132, 27829, 17758]
2738A7758k0037j9044q484O497J5588J9867J4824J055j1173j9129j8647q614O367
2751b3172J5603J9934J4349J610j1574k0857j6422r271O075J7591J9962J2762
2763B6590R47j1537k0076j6807p762N133J6930K0056J3960n0j2507j9123j7971
2776b2217o216O585J6888J8974J2947l12j3299j8798j6468n746O448J7569J8146
2789A4501J2400J02j3622k0013j6426n145O093J8392J9514J1785j802j3064j8078
2802e363j6918n712O839J8372J7839J0968o28j2888j8921j5556n875P977J7833
2815b033J7583J1709j618j3213k0994j3130o233P646J7847J8458J0468k176j3042
2828A1272j9591j4506l524P589J6527J8545R311N9j5370j8935j3766m729R369
$$ y = [17758, -2279, -21323, -29807, -23310, -7722, 12145, 26969, 28024, 16851, -2278, -20925, -29539, -23172, -7569, 12365, 26714, 28324, 16750, -4107, -20529, -29800, -23725, -6134, 13828, 26590, 27537, 16000, -4076, -20883, -28645, -23512, -6582, 13474, 27434, 27384, 14877, -4246, -22217, -28433, -21848, -4960, 14014, 26961, 26649, 13350, -5448, -21916, -27662, -21214, -3645, 14501, 26901, 27003, 13381, -6632, -23058, -28203, -22110, -3718, 15796, 27581, 25779, 12715, -5363, -22281, -27993, -21154, -2782, 15057, 26025, 25397, 12509, -6412, -21968, -27843, -19866, -2033, 15550, 27259, 25641, 12428, -8566, -21696, -27929, -20283, -2436, 16022, 26490, 24314, 11272, -8319, -22825, -26349, -18760, -2233, 16312, 25623, 25682, 10312, -8623, -22389, -27118, -17749]
2841a7749J6292J8820Q048k492j2350j9656j3825l250P920J8049J6724R927l319
2854B3139j4341j8702j3185l506J0063J6529J7729Q644l363j4012j8999j3376
2866b3380k365J0243J5553J7096R111m165j4146j8738j4117j926J0372J8280J6565
2879A8383P831m881j3961j8178j1785k670R697J6420J6875P942k843j6319j7583
2892a1072j1835k805J1678J6482J6697O506n119j4410j7930j1685k024J1618J7662
2905C763J6308N459n475j5100j7203j1415O14J1426J7230J4889N797p325j3817
2918E151j7049j1952P64R589J7947J4625O844o212j5295j7236j1027J280J0731
2931a1840J7415J3422N985o242j4552j7116j1342J315J1592J5575J5455M675n747
$$ y = [-17749, -1457, 17363, 25411, 22919, 10569, -9087, -22912, -26162, -18242, -193, 16531, 26458, 23139, 8798, -9904, -23089, -26595, -16532, -3, 17726, 26370, 23007, 8995, -10004, -23380, -25745, -15502, 51, 17147, 26258, 22093, 7947, -10791, -24908, -26834, -16462, 1818, 18383, 26214, 21333, 7372, -10806, -22591, -25261, -15564, 856, 17731, 25673, 22830, 6511, -11072, -22907, -25712, -14034, 2448, 19145, 25651, 20532, 6122, -11808, -23493, -25517, -13899, 3763, 20071, 25530, 20055, 4955, -12248, -23663, -23049, -11623, 5607, 20496, 26293, 18968, 5151, -11898, -23850, -23086, -13497, 4450, 19075, 25919, 19707, 4412, -12824, -23851, -22571, -11840, 5575, 18997, 24982, 18740, 4188, -12928, -24270, -22955, -11363, 4212, 19667, 24342, 18595]
2944A8595j4647j7033j0575J055J1862J6972J2407N182m906j5798j6930j0409
2956b4225J523J2459J6424J4195L690o705j5281j5993r638J455J3167J5386J2590
2969A9047N119p381j6379j4779q405Q12J2428J6631J3554L464p729j5848j4592
2982a4058r685K690J2753J5136J2132M364p833j5674j5252r269L478J2645J7041
2995H468J2263K304q898j4982j5401p687L569J2951J5742J1495K754q079j5743
3008a244j4157p854L419J3344J4780J2969J434q753j5509j4864p286M143J2745
3021f833J6235J1723J416q640j5786j4741o998M587J2396J6495J1529J186j0325
3034A2244j4972j3339p122M982J2906J5693J1318o77q292j6775j2106o179M135
$$ y = [18595, 3948, -13085, -23660, -22605, -10743, 6229, 18636, 23818, 18912, 3114, -13816, -24225, -22702, -10243, 6181, 20376, 24066, 17361, 2080, -13913, -23551, -22096, -8929, 6457, 19047, 24166, 16785, 406, -14373, -22778, -21966, -9538, 7093, 20647, 24111, 16382, 534, -14058, -23743, -21053, -8300, 6836, 18968, 23332, 15499, -175, -15427, -24696, -21218, -8573, 8468, 20731, 23035, 14137, -845, -16246, -23933, -20364, -7413, 8329, 19824, 22578, 14499, -1244, -15401, -23255, -19836, -6492, 8288, 21257, 22691, 13938, -1571, -16435, -23721, -19578, -6833, 9402, 21125, 22541, 13901, -1885, -16626, -23624, -19037, -6641, 9854, 21383, 22569, 12244, -2728, -16067, -23189, -18207, -5301, 10392, 21710, 21033, 12741, -4034, -16140, -22319, -18184]
3047a8184J3713J4353J0404J611r872j5102j3788n767N544J2800J5066R551K081
3060B2410r915j6000j2699o690O931J1833J5168J0106k22j0434j5408j2647n243
3073b2810N327J3440J4638R549M83j0180j5894j1469n562O749J1968J5233R529
3086B1001P18j0637j6905j1896m385O633J2460J5094Q218l41j0868j4163j2022
3099a7093m246N936J3650J5643O966j371r725j5657j2145l510O100J3392J5505
3112A3445Q068j877j1176j5610j1690k238O442J3278J4652P961k316j1140j4864
3125g065j0478l876O833J3482J4434Q035k352j0768j5872j0792k020P293J3055
3138i1J3701N741j174j0797j4674j1259k411P230J5394J1430P662k859j1817j3422
$$ y = [-18184, -4471, 9882, 20286, 21897, 12025, -3077, -16865, -22632, -17088, -4288, 10778, 20329, 22410, 12495, -3505, -16204, -22894, -15963, -4130, 11038, 21144, 20922, 10488, -4920, -17567, -22810, -17483, -4043, 10595, 20144, 20627, 10447, -5447, -16916, -22478, -15729, -3761, 11472, 21001, 21719, 11082, -5823, -17719, -22104, -15471, -3011, 12083, 20301, 19960, 9092, -5071, -17093, -21339, -15403, -1753, 13890, 20856, 19485, 9760, -5897, -18042, -21552, -15452, -2060, 13445, 21513, 19636, 8460, -7150, -18840, -21078, -14636, -1358, 13294, 21255, 18939, 7799, -7065, -17543, -21419, -14586, -1104, 13330, 21365, 19013, 8245, -7627, -18419, -20439, -13146, -91, 13610, 19351, 18177, 7380, -7294, -18553, -20964, -13734, 1660, 13090, 20752, 17893, 6076, -7346]
3152g346j1171k893Q291J3966J4124N192l070j1904j4119r789j892P916J4035
3165A340J2482O874l271j1776j4691j0368p56Q224J4997J2248M741l035j1200
3178E809j5203r596o56Q445J3627J1693O540l891j2060j3999r074j378Q722J4070
3192C049J1217O215l371j2690j3839q634p88R617J3013J2477M171m737j2052j4013
3206a0365p553j239Q809J4188J1549M790o673r700j4771q443J465P579J4352J1289
3220A5277M869n145j2982j3037r040K493Q818J3237J1340L389m346j2060j2045
3233i232r984J303R060J4256J0703L364o277j1801j3280n828J23R216J3424J1796
3247A6843L061n623j3702j3068o615J800R251J4507J0564J805o463j1795j2704
$$ y = [-7346, -18517, -21410, -13119, 847, 14971, 20163, 17093, 5189, -8930, -18719, -20611, -12695, 1340, 13822, 20696, 17425, 5649, -9042, -19410, -20166, -11942, 3055, 15303, 20044, 17009, 5809, -9394, -18990, -19646, -11201, 2426, 14119, 20659, 16768, 4708, -9291, -18365, -19743, -11021, 3049, 14266, 20481, 17110, 4420, -9419, -18053, -18841, -9224, 3789, 16266, 20437, 15700, 3648, -10365, -17918, -19157, -10348, 3840, 15389, 20179, 13506, 3806, -10965, -19408, -17943, -10364, 3988, 15277, 20146, 15001, 2019, -11018, -20058, -17565, -8747, 4490, 15830, 19219, 14873, 2813, -9232, -19216, -17913, -8853, 5403, 16106, 19470, 13193, 1392, -11888, -17716, -17593, -8377, 5047, 16843, 19904, 14281, 579, -12489, -19104, -17304, -8053, 6454, 17018, 18823, 12360, 565, -12139]
3260a2139p018K676R404J3136J0393K801p243j1078j3812o061L653P996J4145
3273F853R183K591o595j2484j2046o158L325R674J2724R722J500o191j2462j2549
3287a2913n824K685J0170J2282J0123J272o774j1522j1458o312K508J0488J3015
3300G740Q776Q90o785j2309j1554m521K814R729J3348P956J503o688j2525j1569
3314a3195m879L120J0966J2995O980K044q734j0936j1638n275L785J0975J2521
3327H729P125J622o548j3824j1062l897L187J1039J3205Q022n05p568j3492j0767
3341a4734l063L132J1310J3404P151R70q809j2463j0911m776N780J0162J2122
3354I275Q205j028q285j2686r723k997M241J0479J1138Q281q5r219j2349j0131
$$ y = [-12139, -19157, -16481, -7077, 6059, 16452, 19253, 12010, 932, -12880, -18941, -15288, -7292, 6853, 16036, 18627, 12032, -452, -12498, -18656, -15331, -5657, 7067, 16789, 18289, 12098, -364, -12913, -18737, -16052, -5882, 6400, 16523, 17795, 11021, -501, -11959, -18271, -15763, -5275, 7740, 16516, 17406, 10621, -1688, -13242, -17763, -14949, -5220, 8128, 16084, 17587, 10899, -1626, -13195, -18074, -14954, -3988, 9007, 15987, 18031, 9297, -1639, -13277, -18552, -14767, -3792, 8729, 15854, 17476, 10928, -2896, -13958, -17855, -14668, -3629, 9576, 17598, 17093, 9525, -3967, -14734, -17797, -14665, -3355, 10049, 17200, 18170, 9361, -3102, -14013, -18789, -13009, -2847, 9275, 17480, 16452, 8167, -4519, -14242, -17239, -12998, -2519, 8619, 16900, 16815, 7596, -4753, -14884]
3368a4884k957N517J0806J0137Q341r43q759j2168r482l448N076J0568J2659N871
3382A6334m18p542j3066j0002l187N875J0783J1321O721r58r339j1105j0001l068
3396a7652M801J2300J1770N751o93r847j2238q842k114M854J1167J1604M882q07
3410A4936q375j2431q540k728N872J1790J0072O008j252j0122j2180q051r56N613
3424a0344R416J0629O653k427r363j1334q779r62O179J0912J0345N551k906q457
3438E113j1407q918p78O693J0557J0709M867j685j0364j1823q108j39O124J0493
3452A334J1139L824l168r949j0976q347l00P456J0002J1030M265m112q104j2066
3466g972p655m14O375J2021R552M945m216r244j0836q293O7O311J1913R556L917
$$ y = [-14884, -17841, -12324, -1518, 8619, 16960, 16017, 7258, -4910, -14392, -17840, -12764, -2196, 10463, 16334, 15916, 8374, -4692, -14694, -17881, -12006, -1223, 10098, 16819, 15861, 6522, -4583, -14584, -17652, -12851, -551, 11219, 16970, 16277, 6430, -5808, -14650, -16764, -11910, -743, 10861, 15743, 14936, 6561, -5870, -14410, -17138, -11266, 524, 10596, 16604, 15352, 5230, -6950, -15001, -15957, -10344, -928, 9701, 16354, 13927, 4564, -6770, -15549, -16511, -10332, 580, 10925, 16476, 13570, 5113, -6294, -15212, -15990, -9297, 1260, 11969, 16836, 15151, 4787, -7036, -15144, -15283, -9159, 1334, 12473, 16297, 13129, 3180, -7796, -16143, -16443, -8987, 1015, 12045, 16310, 12198, 4094, -7972, -15627, -16041, -9666, 2355, 11907, 16852, 12636, 3392, -7444, -15737, -15670, -9359, 2554, 12110, 16027]
3481A6027m462q827j1530n617k85N645J2478R061M112m423r769j0290o091j858
3495a5829P867J1990Q609L497n136q480j0870p114P99P417J0570Q157M361m731
3509A1107r192j0187o767P71P062J0371R221M183n423j0202r210o699J260P177
3523f528J1255P943K937n182r289j0013n735P77P708J0568Q322L704m930j1697
3537a60r935n070J354P697J0860R147J547m215j1091r494n431J999O363J1337
3551D908R051J334n432r508j1230m405K041Q960J0062O842L642p156r622r243
3565i756n301J934P857J0536Q142K227o675r519j0608l985J792Q939J1103O466
3579A3152P56m511j0869q626m727J739R435R076Q594q94n119r426q648l989J213
$$ y = [16027, 11565, 2738, -8792, -14409, -14694, -9049, 3429, 12490, 16602, 12179, 2410, -7880, -13971, -15829, -7962, 4028, 12637, 16134, 10998, 2518, -8352, -15466, -14667, -7250, 3320, 11477, 15838, 11107, 1915, -8272, -15039, -14268, -7206, 3165, 12386, 16569, 11146, 944, -8266, -14965, -13705, -6528, 4727, 12670, 15607, 10425, 1136, -8877, -14612, -13835, -6127, 4441, 12763, 16467, 11537, -160, -10095, -15165, -13811, -6114, 4746, 13893, 15440, 11225, 134, -9360, -14791, -12792, -6429, 4908, 13959, 15293, 9861, 353, -10877, -15282, -13241, -4281, 5781, 12623, 16265, 9109, -513, -9756, -15057, -13123, -5266, 5270, 13412, 15639, 8964, -555, -11163, -15148, -13356, -4417, 6686, 13152, 13908, 9397, -1472, -10098, -14825, -13086, -3651, 5425, 14019, 13125, 8006, -1420, -10068, -14057, -12844]
3594a2844Q680J1276N918K192n845j0385q235n271K106Q689R854P371O23n782
3608H347j0409q969m005L885P491J0061P072L28o397j0113p726m817L519P516
3622d217J1865O736q7o842j0339q215l348K865R220R396O792M22o752j0692p193
3637a0389m747M842Q686Q827P108j199o604j0047q499k471L984Q901J0020N927
3651A4339p33q130q534q891l131M702Q856R586N667K23p468j0165p941k282L983
3666i919R246Q841O698k962o637r642p446k719M896R043Q860O241j846p408j0140
3681d894p830j574M444R295J0196L640j076p165r431p563j533M308R136R108M815
3696A3876k954o615q606p753j595M648J0350P595M203j682o761r629o438k422
$$ y = [-12844, -4164, 7112, 13030, 15222, 9377, -1008, -9243, -14514, -12408, -3719, 6135, 13506, 14129, 8347, -2062, -11031, -15036, -11151, -3660, 6401, 13473, 13801, 7404, -2709, -10435, -15252, -11733, -4217, 7648, 14384, 14297, 7455, -2884, -11099, -14447, -11582, -2362, 7034, 13826, 14248, 7496, -3196, -10389, -15136, -10294, -1608, 7219, 14327, 13128, 6524, -3523, -12022, -14493, -10509, -1608, 8412, 14339, 13606, 5476, -3058, -11949, -15080, -10378, -1522, 8064, 13731, 13954, 6486, -3679, -11620, -13902, -9919, -673, 8168, 14866, 11904, 5267, -4375, -11821, -14540, -9644, -601, 8259, 14500, 12654, 5246, -4894, -12724, -14298, -9854, -559, 9637, 13277, 12201, 5036, -4395, -11958, -13491, -9183, -47, 9061, 13876, 10922, 4307, -4299, -12052, -13647, -8999, 1351, 8946, 13149, 11467, 4706, -4923, -11361, -13783]
3710a3783N484R971P882L462j353o520j1941n555j187O094Q888P462M937k139
3724A1702q194r180o654r01N238R293R065L034k366p967q384o910j354N235J0029
3739A686Q200L415l083p244r332n558j358O369Q267P297N149k702r356q883n415
3754a2548m57N578Q587Q727L364k584q335q673o113P66N094R794O142L716k448
3769A0610q148j0096m863RO015R190P189M387m735p560p658p196R39N980Q978
3784C041P698J610l410o115j0274m754J016N302R519O918K882m016q033r716l833
3799a2165J122O962P643P464K790l932q224q351o303K303O536P865P039J816m338
3814H227p509r109m797J782O212R096P019O2k349q791p891m616J546O667Q651
$$ y = [-13783, -8299, 1672, 9554, 13016, 11663, 5143, -6798, -12353, -13540, -7446, 1442, 8904, 13841, 11702, 3508, -5672, -12326, -13227, -7989, 1304, 10369, 13403, 11037, 3070, -5314, -12224, -13578, -8343, 1686, 9886, 13301, 10218, 2974, -6358, -11916, -13274, -6905, 1362, 8659, 13808, 11106, 1750, -7133, -12548, -13005, -7427, 1160, 9887, 13251, 10667, 2332, -6341, -12454, -11688, -6594, 3200, 9342, 13058, 10610, 2462, -7634, -12497, -12488, -6473, 2717, 9906, 14293, 9558, 1998, -5660, -12856, -11917, -5937, 3041, 10739, 12349, 8939, 2824, -7450, -12204, -11188, -5886, 3633, 10551, 13433, 9417, 1384, -8332, -12165, -11043, -4081, 3562, 11026, 13816, 9884, 1660, -6691, -12994, -10691, -4155, 3710, 10749, 12565, 8227, 718, -8391, -13188, -11406, -5194, 3902, 10921, 10983, 8634, -157, -8048, -12664, -11118, -4451, 4200]
3829D200O317J519m443p170r463m005K128P872O517P820O06l826q208q938k942
3844a2016J630O409R333M840J962m850q119p357l885K342N515Q472O339J243m006
3859G852q167r434k715K540P879P995N214L23n461q045o151l560J617P937P767
3874E591N313J248n291q780o942l196K078O960Q023O511J041n416q143p939l144
3889a2086K085P581Q807N922j118n994p956o164k983J512P592J0041L141k80m333
3904E767p741o188l786L580P238P354M856n19n638o088q348k253J993P853Q173
3919F253N567k080m716q342o168k503L493P176Q370M757j199o387p286o868l553
3934a3486N967P211O724N304j089p764o667o013k169N071P031O804N096k172m795
$$ y = [4200, 10517, 12036, 7593, 423, -9040, -13045, -10917, -3045, 3472, 11292, 11898, 8072, -136, -9074, -12016, -10386, -3977, 5356, 10196, 12158, 7308, -811, -8168, -12053, -9711, -4196, 4276, 10615, 11858, 7852, -315, -9749, -12464, -9924, -2045, 5950, 11164, 11487, 6026, -2019, -8170, -11730, -10113, -2176, 5591, 10904, 12152, 6861, -1919, -8861, -12057, -9979, -3019, 5004, 11515, 12556, 7140, -1003, -8942, -12086, -10001, -2420, 6387, 12309, 11191, 5197, -2759, -8923, -11906, -10394, -2802, 7239, 10380, 10100, 5767, -1974, -8162, -11948, -8368, -1130, 6224, 11080, 10561, 4923, -1165, -9513, -11766, -9773, -1920, 6253, 11820, 9740, 5024, -3318, -9486, -11989, -8496, -1320, 7050, 11807, 10608, 4221, -3065, -9933, -13486, -7519, -308, 6416, 11720, 10631, 2867, -3800, -9813, -11982, -6911, 120, 6924, 12020, 9848, 5053]
3949E053q076p364j005M499P028N867M095r35n337p876o134j061M097O784P669
3964G304L333j337m969q669n711j480M781P701O204L158r9p282q317m179k401
3979a1963N558O557P567L854k084m909q103n903j034L058P069P705M012q77p374
3994C133q517l782j341L969Q287N451M564k975n906q681m269q77M616P527P821
4009I020J754k609n218p328o425K08M613P164Q395J210j589p263p114n053j023
4024a1258N614P653N582L596l289n587p922n139j37O072P354O719K202l724n796
4039A940p041m923N4M819P725O942L93k383p165o909l684J229M522O978O384K218
4055A1099l304p541n632m340n8N064Q236N537J947l585o694o760m583J304N712
$$ y = [5053, -3023, -10387, -11392, -6893, 135, 6002, 10097, 9162, 3825, -4051, -10185, -11246, -7149, -365, 7304, 10637, 9300, 4331, -4338, -10049, -11529, -6748, 953, 7157, 10315, 10216, 2934, -5383, -9562, -11963, -6405, 152, 7719, 11573, 9489, 4580, -3523, -9426, -10460, -7402, -333, 7372, 11384, 10507, 3133, -5384, -9166, -10507, -6538, 1749, 7200, 11764, 8789, 2883, -5798, -10067, -10944, -6328, 1199, 9020, 10774, 8165, 2947, -4381, -10806, -10598, -5985, 1179, 9574, 10784, 9195, 1932, -5182, -10235, -11258, -5644, 2009, 7591, 11187, 7898, 2311, -5611, -10750, -10887, -4815, 2539, 9258, 11460, 7736, 1940, -5101, -10024, -9970, -5151, 2574, 9516, 9909, 7526, 361, -6548, -10232, -9003, -4481, 2497, 8881, 11099, 7795, 254, -5378, -9718, -9776, -4712, 3524, 9061, 11008, 7423, 729, -6031, -10614, -9310, -3598]
4070c598P563M897K370l499p902n795k835k081O873P482M761L312m315o862p029
4085f658l289J356N700N796N852K239m462o620p108k625J064N384P028N181R83
4100I821l606o936n752l482j13P766P301M515J192m085o770o407m614K873N360
4115b937O914N047R2k508p697n991l091P18P187N824N014J369m279p624m387l885
4131a0234J484P290N781M472Q46l974o272o752k874K919N669O478L555R11l133
4146F166p862n548l038J900O847O461M180J99n005n933o168j920J581O273O816
4161D949M056M69m867p470n372j507K327O129P655L204p18m418n492o558k190
4176i803K542O544O364M274m05n555n526o446j778L204N139O785L976r38l670
$$ y = [-3598, 3965, 8862, 11232, 7733, -169, -5964, -8799, -10880, -4007, 3475, 8236, 11548, 7233, 371, -6658, -9947, -8591, -2891, 2905, 8757, 10996, 6534, -86, -7194, -9819, -8755, -3371, 3657, 8838, 9821, 6215, -721, -6473, -9955, -10068, -2302, 4999, 9514, 10706, 6621, -149, -6556, -11170, -8297, -2937, 3977, 9024, 9116, 6608, -1089, -7080, -10171, -9453, -2266, 3558, 8572, 9941, 5662, -1962, -6349, -10234, -8750, -1460, 4321, 8793, 9639, 5665, -607, -7359, -10233, -7314, -1645, 4833, 8388, 9299, 6166, -1696, -7244, -10282, -8382, -1535, 4926, 9106, 9305, 4300, -1633, -7801, -9721, -8140, -1867, 4949, 9005, 9474, 4607, -2863, -8235, -9742, -7415, -1286, 6369, 9573, 8855, 4437, -1055, -7613, -9803, -7261, -717, 5647, 9921, 9516, 3961, -1565, -8011, -9789, -6585, -1446, 5339, 9315, 8377, 4707]
4191D707o864o329o42J834O588N670M426j383l300o285o584j859L354O856N935
4206F124L257r32m683n767o566j298L456N149O487M253l75n095o852n241q49L055
4222e877N557N944M349j726n045p278m362r78L104O485O937J969j352n790n469
4237c532m666n13L699N313P288P69r27m167p369m050r19N010N426N754J517j310
4253G323n151n882m732L56J304P624M869K656j395n083o427m329n14M021O769
4268A409M758M148l137n846n813l114j919O403N371M685K578k395m973o639l882
4283h366L05L184O766O033O77k810l500o842m228M02M311N629N639J590k049m480
4299B261p197m682P12M403N392O418J730k507n837o294k673p6M069N060O493J364
$$ y = [4707, -2157, -8486, -9128, -7294, -706, 4964, 9390, 8007, 4707, -1578, -8162, -10021, -6667, 189, 6124, 9381, 8449, 3766, -2001, -8567, -9865, -6409, -1260, 5227, 9480, 9105, 4010, -2842, -8083, -8932, -5877, -320, 5624, 9973, 8247, 3202, -4076, -8438, -9416, -6312, 173, 7110, 9079, 7727, 1937, -3532, -8198, -8711, -5012, 301, 7589, 8358, 7431, 3264, -4105, -8155, -9074, -4064, 1362, 7116, 8633, 7323, 2172, -3710, -8442, -8086, -6782, 842, 5711, 8367, 6972, 1889, -4538, -8867, -9381, -5360, 1409, 6167, 10315, 7178, 1332, -4481, -7595, -9514, -3111, 2260, 6945, 9523, 7128, 2155, -4484, -8366, -8061, -4877, 1889, 7922, 8599, 5789, 2289, -4553, -8781, -8379, -4068, 1561, 7200, 8790, 6741, 2261, -4936, -9618, -8906, -4503, 889, 7307, 9037, 6530, 693, -5601, -8274, -8350, -4281, 779, 7272, 8636]
4315H636k048m727p194l058q3M312P239L719K038k827n094o606k131m6L301Q023
4331C454M402J74j291o000o351k549Q98L806P038L950J205k742o128n241k289
4346g664n16M668N893O506q34j402o872m441l043K52M930O256L033K022k882n766
4362A40n637k803Q57N263N376M666Q08l398n929n585k216J090N141N101N385n69
4378G690l024o125m594k852K157L206O464O184j134k478o076n490j832k57N555
4393b606N985M105L79l587n059n787j578J357N713N571L788M58n237m291n966
4408f755l208L804M487M807N079J27l179n588o103j571J558N135N898L340n11
4423G320l060o883l417k604K575L681O526M117j67l388o875l952l069L012M615
$$ y = [8636, 6588, 1861, -5333, -8391, -8474, -4162, 3077, 6796, 8834, 6007, 913, -5693, -7824, -7870, -4569, 3454, 7856, 8030, 6739, 739, -5612, -8161, -7263, -3457, 3581, 7531, 8736, 5994, -134, -5375, -7664, -8180, -3512, 2381, 8887, 8053, 6651, -221, -4662, -7705, -7453, -2523, 3733, 6766, 8788, 5906, 140, -5497, -8300, -7443, -2180, 3196, 7862, 8670, 5272, -657, -6242, -8458, -7368, -2227, 2874, 8259, 7690, 4666, -1459, -6053, -8905, -6748, -3542, 2922, 9106, 7972, 5494, -582, -6072, -7904, -8161, -2606, 3379, 7484, 7863, 4276, -783, -6570, -8148, -6791, -1078, 4493, 8281, 8739, 3502, -789, -6755, -9963, -6159, -1672, 3135, 8214, 8341, 5162, -426, -6529, -8100, -6542, -1407, 4491, 7831, 7320, 4260, -2623, -6040, -8644, -6069, -2388, 4138, 8255, 8088, 4700, -2175, -6127, -9196, -6184, -1569]
4438a569O215M571j638l392n069n001k422J649N199N893L871j59m600n455m479
4453f386j323K433L350P191K332n97l849n762m617M34K224L642N834K976l74l703
4469C805o853l635k143K979O410M627L089j612l973m382n687j277K499N997O259
4484F103J851p59n404n012l413j061K902M545N147K557m43l910n397m931n32L674
4500d083M200M884L521k256l223n855m523q63L682N103M926K467k146l351m971
4515b488m513j241L953N023M859K771k131m467m808l895R59J327N370O701N52
4530G972j805l749o034k922q02K171N477N434K599j735o200m248l977K81K640
4545d898N918N020R06r25m802m994l475M80K778M859M905K221j820m463n705k855
$$ y = [-1569, 4646, 9217, 7579, 4187, -882, -5883, -8305, -6656, -1457, 4436, 8307, 8148, 3548, -1907, -6386, -7709, -5276, -1926, 5265, 7597, 7000, 3151, -2611, -7228, -6794, -4570, -928, 4906, 7882, 7508, 3805, -3048, -6683, -8826, -5847, 563, 5190, 8279, 6667, 2694, -1688, -7375, -8652, -6153, -156, 6103, 7954, 7195, 1791, -3221, -6634, -7695, -4793, -248, 4899, 7456, 7013, 3103, -2294, -7225, -7757, -4083, 117, 5001, 8522, 6266, 3043, -2812, -7335, -8198, -4516, 587, 5513, 7980, 5834, 2483, -2488, -7001, -8242, -4289, 734, 5593, 8364, 6233, 1766, -3042, -6937, -5978, -4651, 719, 7420, 7972, 6167, 2418, -3616, -6538, -7340, -5169, 308, 5742, 8341, 6606, 406, -3842, -7819, -7538, -4898, 1020, 6040, 6946, 6021, 1219, -3775, -7250, -6770, -3992, 867, 5772, 7993, 6173, 1710, -3995, -6850]
4561f850n35L956N274K867K034j545n029m642l119L91M153N757K828K352j233
4576F659o020m864l477N51L610N470L858J970j662m836n682j890J81K261N983
4591B112L563L392m798m665m427l189J934K362N985M682K73r15n285o845j244
4606g065M50M201M145N557J194m374l967n184k090J170L487M681M432Q46l643
4621C840l638m482k943N46M326N583L285P20k357m534m826l882K749K955M999
4636B341L795M52j132n809n074k317J990L638M759M994q35k700n476l635k297
4651g306J273L467N976L492O41l272n059m108k830J127M221N795K596O35k867
4666C781m581m418k268J086M464N909K658L64l034n485m669j654J222N187N305
$$ y = [-6850, -7385, -3429, 1845, 4712, 6746, 5201, 172, -4470, -7589, -7198, -3045, 2712, 5540, 7892, 6659, 639, -4225, -7702, -7151, -3541, 1929, 5787, 7757, 6095, 1259, -4423, -6313, -6132, -3871, 2112, 5675, 9067, 4269, -396, -4823, -8012, -6078, -3716, 2269, 6951, 7224, 6309, 1024, -5821, -7065, -6615, -2414, 1731, 7288, 8482, 4108, 141, -5043, -7133, -5963, -2476, 2205, 6637, 7483, 3840, 202, -4280, -7223, -6677, -2351, 3232, 6517, 7237, 4880, 346, -4480, -8362, -5613, -2658, 2341, 6136, 6588, 5456, -353, -5427, -7744, -5754, -2116, 2643, 7637, 6802, 4102, -1374, -5009, -7306, -6033, -2566, 3410, 6902, 7543, 4271, -788, -4896, -7726, -6599, -2378, 3417, 6013, 6648, 3781, -800, -5218, -7486, -6400, -1936, 3973, 6631, 6995, 3961, -1524, -6193, -7847, -6625, -1438, 3867]
4681C867K475J528m759l638n449j670L064L892M324L156L77k892n848o035r6J440
4697f264M548N643K526O8l502m939l696j193J009N188M155L746q00k988n513l484
4713e496k262L400K944N908K505k77l115n781m140p78J356N056L867L802l25m024
4729B640l990l989j102J746L844M026L570j022k033n863m035j733L256M794M442
4744D551J755K12l116n354m802m49L132M834L541J320j063j964n090l590n72K429
4760d226M284M042L547k075l335m640k943k136K605N084N220J263p76l797m219
4775b102l543j053K114N198M254J509r95m814l790k083q03K506L799M653J585
4790F435j464l350n021k559j253L403M635L962J751j512m367l876k561k67K342
$$ y = [3867, 6342, 7870, 3111, -527, -5976, -7646, -4582, -690, 3634, 6790, 7167, 4275, -1573, -7608, -7704, -6264, -1716, 3927, 6453, 6521, 3019, -1920, -5616, -6809, -5800, -612, 3543, 7289, 6489, 3501, -2012, -5496, -7758, -4358, -1414, 4494, 6999, 6722, 3607, -2174, -6314, -7092, -5736, -680, 3187, 6989, 6664, 2640, -1350, -5339, -6441, -4695, -851, 3175, 6745, 5723, 3690, -2173, -6208, -7941, -4685, 109, 4551, 6306, 6518, 3402, -1952, -6754, -7203, -4071, 763, 4304, 5624, 4561, 2597, -2493, -6083, -6655, -4226, 58, 4100, 7647, 5572, 2237, -2403, -5346, -7482, -4877, 207, 5427, 6690, 5914, 2117, -2102, -5645, -6698, -4584, 614, 4868, 6377, 5382, 568, -3222, -5305, -6108, -3602, 197, 4850, 6435, 4971, 1621, -3400, -5959, -7212, -3809, 826, 4788, 6539, 5027, 660, -3216, -5777, -6044, -3702]
4805c702N481K608L553k312l472n695k203l81J540O418L697Q53j584m328l698
4820c225m001lM117N050L101J851j594m150m293l411K46L919L302M331J184j142
4836E282m519m509k576L29L080L903M254J845k784m242l137l297O29K505N913
4851B676L028Q3j392l487n262k179N63L788L529M576J88j718m883l310k069O3
4867e806K722M056M509J688l182l422n364m53q05L418M282L912R55k515l800n419
4883e224q18L98L035M945L179m52j246m129l562l693K203M004L196L480Q70k706
4899C480m667k564k679J465K506N087L030O15k584l588l870k214J252K747L949
4914A965L145J400k184m759l360k838J09M900M056L499J068l340m330l832o63
$$ y = [-3702, 1779, 4387, 7940, 5628, 2156, -3539, -5742, -6123, -4583, 1835, 5532, 6385, 4801, 473, -3225, -7226, -7229, -3112, 1938, 5039, 6890, 5296, 1146, -3147, -6558, -6312, -2393, 909, 5240, 6424, 5282, 763, -3746, -6322, -5993, -2913, 990, 5244, 7089, 4305, 63, -3074, -6371, -5742, -3237, 2676, 5704, 5787, 4395, 908, -4354, -6533, -5970, -2182, 1347, 5923, 6111, 4393, -490, -3800, -5869, -5806, -3084, 972, 5481, 7169, 3987, 565, -4799, -5252, -6057, -2639, 1643, 5555, 6510, 3995, 195, -5224, -6042, -5644, -2609, 2336, 5515, 5063, 3817, -312, -3874, -7567, -5364, -1360, 1836, 5316, 6186, 3480, -1187, -3751, -6430, -4965, -2459, 2628, 5658, 6273, 3689, 101, -3769, -5983, -4731, -1984, 1965, 5110, 6510, 4326, -433, -3793, -6631, -6522, -1622, 2434, 5933, 7001, 3661, -669, -4501, -5164]
4929e164k00M603M402J460R0j110m952l558j525J311L868M448L076j272l498l666
4945a687k802j499Q84L369M997K966q26k004l792m849j226J495L898M367K959
4960F250n06l396l293l679j084Q60L678L599K836M09k127o017k684j558K073L633
4976a006M511K368j393j341m919k893q51J405K345N704J041M74l396m272l514
4991e737q05J725M587L016K139J87k249m058l735p93K200L447L394K090q0l804
5007A524l932k863q68K800L328K745K915o84l413l649k887j660L057L624L943
5022C980K315j992j901m419l892O06J747L170L766J582P83m103m087k382j723
5037f550L247L600L716K328j030l206l976k888n65J873M283L107J563m76l346
$$ y = [-5164, -5364, -761, 3641, 5101, 5191, 4081, -871, -4429, -5954, -4643, -775, 3673, 6749, 5477, 1979, -1687, -4489, -5988, -5104, -1735, 3262, 6228, 5402, 3398, -394, -5243, -6469, -4974, -1076, 3291, 6250, 5744, 2348, -945, -4624, -5708, -4848, -1170, 2429, 5265, 5674, 3547, -2470, -5154, -6712, -4639, -1006, 3505, 5873, 4480, 3139, -1780, -4673, -5524, -4119, -1774, 3930, 4971, 5445, 2049, -2223, -5737, -6542, -4817, -230, 2786, 4925, 5112, 2863, -1195, -4930, -5723, -3523, -76, 3318, 5408, 5328, 1524, -2408, -5271, -6139, -3339, -11, 2734, 5649, 4965, 1552, -2097, -4984, -6644, -3587, 37, 3980, 6295, 4303, 2402, -2017, -5909, -5303, -3556, -386, 3380, 4962, 5745, 1642, -2445, -4827, -6550, -3303, 297, 4013, 6341, 5311, 2105, -1871, -4759, -5324, -3451, 832, 3939, 5502, 5026, 1680]
5052A680m514k839l01K690M750K808j74J116m023l353l556O51K238K633N254J482
5068F542k697k770m234k033K82K624L667K936J580j477k444m353k947r19L041
5083c202L775M306M12q40l473l656k160N78J201L709L317K248j380m780l863r53
5099d761j108K686M355L409J446j01n360m369j327K18K041M130L203J269r15m192
5115F24k832l174M82K574K779M567M07j205l717l286k770j045L571L730L931J174
5131E810j244k797n354k155J186L684J927L876j61j331l457m097j729K71L769
5146a802M096L145N0j712n118k198k214J393J802M518L862q10q75m654l143j756
5162e416J57L883L852K252J026k687l014n238p87J328K440M830K510J518k634
$$ y = [1680, -2834, -5673, -5974, -3284, 1466, 4274, 4100, 5216, 1193, -2160, -5716, -5065, -2827, -194, 5060, 6542, 3845, 1075, -3159, -5192, -4910, -2286, 1381, 4317, 5897, 4420, 1976, -2377, -5324, -6243, -3202, 573, 4879, 5291, 4451, 978, -2678, -4838, -4260, -3059, 650, 3967, 6215, 4835, 55, -3808, -4761, -5869, -3183, 1172, 4581, 6027, 5926, 566, -3803, -5130, -4912, -2871, 1259, 4462, 5731, 4816, 624, -2208, -5382, -4900, -2326, 453, 5020, 5427, 4222, 505, -2781, -5551, -6596, -3025, 705, 4636, 5810, 4566, 1769, -3585, -5740, -4554, -870, 1057, 4933, 4772, 3441, -16, -4113, -5842, -5571, -1802, 2294, 5439, 5489, 3777, -1341, -3539, -5753, -4360, -2558, 1960, 5822, 5012, 4137, -517, -3660, -5416, -5259, -1376, 2476, 4728, 5754, 3067, 53, -5185, -5972, -4644, -2204, 2626, 5136, 6654, 4020]
5177D020m231l263j968J280K865L083L312Q38k468l255l450l443L216L130K507
5192B173L716q13k213k787m573j571K566L503J829L212J67k778k964l098j825
5207e456N15M655L178K638n31j464m894k049k525J014M157K870K644O14l111l681
5223a426k581n36P09K769K996L000m36j234l584l244j886J694K660M110J943j77
5239D777l594k006l052p55J474K534L661J857n26j809l502l201j263K004M109
5254G08L111J815q43k458m318l926n56L207L169K765K009P25l673k512l427j788
5270e992K076K775L957J803o13j739m605j003j418J014L052L672J742m58j738
5285B525m875o48k743K026M175K558J852j880j899l276k008o55J786L517K843
$$ y = [4020, -211, -3474, -5442, -4162, -1297, 1786, 5098, 5936, 3468, 213, -3237, -6680, -3464, -334, 2173, 5889, 5076, 2863, 76, -4497, -6068, -3502, 1, 1830, 5042, 5209, 2431, -533, -3631, -5456, -4941, -286, 2892, 5530, 4999, 3535, -1359, -3408, -5933, -4919, -762, 2108, 4752, 5366, 2255, -1426, -4007, -4543, -3834, -1065, 1931, 4931, 4495, 3261, -323, -3567, -5453, -3759, -1099, 3011, 4954, 4777, 1183, -823, -3875, -4630, -3156, -622, 3039, 4896, 4370, 2561, -941, -4142, -5405, -3401, 708, 3819, 5634, 4791, 2333, -1985, -5911, -6467, -3260, -91, 2674, 4683, 5408, 1735, -777, -4204, -5992, -3916, -1141, 2816, 4619, 4006, 2267, -2338, -3341, -4759, -3745, -693, 2979, 4721, 4263, 2525, -2350, -2998, -5741, -3715, 460, 3018, 4870, 2990, 1091, -2185, -4193, -4848, -3062, 455, 3298]
5300C298J837o64l341k699l227P26Q36K625L663J883k33k267n012k011p35K488
5316b833M109K746J122j662k379l553k139K88J987K889K172K218j152k382l229
5331a798l095N49K013K652L923M87q66l347k504l471M43K402K714L057J381J37
5347D677l118m699j986J038J640K829M078J133m47l375l743k097Q83M38M215J857
5363C323K632j685l092l772j114J97J433L175K822M98n57k567l523j909l85J912
5379b612M407K635M4j65m099k769m244J651L494K768K727M88q12l309m378n37
5395d711R76K077L244K192M42j137l591k208l095J485J699L314L694M53o70n190
5411a026k074j008m13J941L952L363j97j238k413m105j176L99K816K683L075N92
$$ y = [3298, 5135, 4471, 1130, -1569, -4796, -4070, -3234, -609, 3054, 4937, 4704, 2437, -2575, -4586, -5321, -2833, 1276, 4022, 5144, 3482, 1103, -2450, -4589, -4301, -2314, 575, 2747, 4965, 3813, 1431, -1798, -4893, -4344, -2331, 321, 4244, 4731, 3865, 518, -1986, -5457, -5014, -2612, 102, 3159, 4540, 4677, 1559, -3140, -5126, -4088, -2448, 381, 4459, 5592, 5145, 1770, -1973, -4070, -3187, -2749, 1466, 3323, 5955, 4270, 1178, -2594, -3708, -3511, -2078, 1097, 3919, 4417, 3860, 1293, -2230, -4139, -4524, -2612, 1795, 4430, 4474, 4309, 210, -2559, -6803, -5152, -1658, 1110, 3837, 4325, 3513, 204, -4174, -4711, -3735, -1658, 1586, 3778, 4220, 3083, -508, -2716, -5811, -4326, -2627, 687, 4381, 4834, 4164, -1026, -3100, -4108, -4521, -2580, 1372, 4735, 4538, 3300, 887, -3218, -4394, -3995, -1179, 1504, 4579, 5171]
5427E171j046l165m170k256P12M194K443K388N7m11l849l206j597O87J767L166
5443H85K980J131k087l185k516k779Q80L420K284K522Q67j891k474l326j863K392
5459b760Q09L123L449J07m13m649l097k90l57K940L603J478O1j670k861k538k159
5476e224J253K642L032L936j536k545k983j902n87p46L202L536K048K07j558k936
5492a61m747M71n66L350M253J727J206k944l438l072j465J401L034L687K359j100
5508C995j467l343l906r76K602K940K050K536K76l070k449l391l35J212L219L490
5524C383J213j148j522k673l058j021K335J677K991K361j87k485j962m871J67
5539d800J864K852J825L723j552j680l310k643k47J413K350K425L621k311k659
$$ y = [5171, 4125, 960, -3210, -5466, -4754, -560, 1883, 4271, 4328, 3917, 68, -3138, -4735, -4048, -2281, 885, 3865, 4996, 2909, -276, -2792, -5571, -4691, -1271, 1013, 3535, 4402, 2511, 37, -3289, -5152, -2760, -1951, 1172, 4621, 4728, 4315, -334, -3431, -3721, -4078, -1138, 2465, 3943, 4004, 2334, -527, -3065, -5224, -3971, -1329, 1703, 5639, 4103, 1558, -1425, -3327, -3914, -4660, -1458, 2078, 4126, 4333, 2775, -161, -4908, -4437, -5003, -1653, 2600, 4327, 5533, 2589, -849, -3921, -5386, -3985, -951, 2736, 5095, 3995, 2528, -815, -4721, -5697, -3095, -155, 1895, 4431, 4707, 1637, -812, -4203, -4538, -3326, -107, 3383, 4596, 3448, 1926, -747, -3805, -4826, -2491, -814, 2177, 4538, 4351, 1866, -96, -4967, -4800, -2936, -84, 1741, 5464, 3912, 2232, -1078, -3721, -3968, -2555, -205, 2220, 5841, 3530, 871]
5554H71k279k944N05J676J814L065J531n63j632l961j826o19J718K837L186J51
5570C530K54k169l364j837j130J776M264J131K284j228l302r61k914l86J877K648
5586D73J697J419K48k481k881r74j330J042K699K501K745j037l008j691m138L97
5602d319J866K991L218n21J273l919l250j346q08L375K505K739J038o37k718l936
5618b449o77q56J490K326L805l26j268o27l046j984r24K746L225K511K30j567
5634B609k216l014q59j504K249M636J555J329j319l166k844j300l26K066L326
5649A222K446J692j071m802k729o60j74K372K938L191J106k111k236m443q52M85
5665c626J280L787K406L39j967k187k750k410J118K058L359K126M75r76j943l160
$$ y = [871, -1408, -4352, -3847, -2171, -357, 2708, 4239, 3676, 2044, -1917, -3743, -4362, -2644, 193, 3379, 3530, 3784, 1615, -1749, -3586, -4716, -2940, 1324, 2455, 4739, 3511, 209, -752, -3666, -4052, -2175, 473, 2170, 3589, 3837, 1356, -1525, -2499, -3829, -2787, -88, 2413, 5158, 4121, 1113, -578, -4716, -4319, -2453, 538, 3756, 3235, 4508, 589, -2661, -4007, -4815, -1440, 1065, 3804, 4842, 4205, 1487, -2449, -3126, -3982, -2492, -166, 3639, 3313, 2045, 1418, -1628, -3612, -4536, -1790, 1435, 3946, 4176, 2609, 393, -2621, -3480, -4984, -2735, 1901, 3456, 4785, 3466, 300, -2544, -3844, -4170, -2104, 1222, 3668, 5360, 4289, -513, -3242, -3902, -4076, -1704, 1234, 4425, 5531, 3420, 1184, -3259, -4111, -3626, -2346, 1441, 3847, 4186, 2219, 32, -2718, -5128, -4010, -1952, 1407, 3533, 4008, 3032, 1089, -2071]
5681b071k624P58K651K232K254Q05q14l443k258k070L85L838K683J598J76j149
5697B951l436j916j103q9K952K656K253L75j500k252k938k884J571K313K524K870
5713D347K2j095l975k258j040J564P09L399K577J495l084l520k006k079J106L676
5729a62K485O63Q81k397j241l219j724R69L038L114P35Q49k993k76m781j575K406
5746c228J556L902J652M07k009l066k287j199J781J945K918K273n04j304l263
5761d26k445j401L09L565J240L254Q89l152k325k758m68J311K411L473K74M60
5777D211j205l952k111j548M11L831K998K073j255m69l752j981k578K179J360
5792a788M443J850j344j589k662k991N68P24K159K960K111j224j455k262l792
$$ y = [-2071, -4695, -3937, -1286, 946, 3200, 4005, 3191, -252, -2510, -4580, -4195, -357, 2326, 3924, 4100, 2951, -485, -2401, -3504, -3593, -641, 2015, 4268, 4643, 3143, 891, -2047, -4931, -3360, -1047, 1477, 4347, 4369, 3274, -701, -2959, -3999, -2435, -1726, 1673, 4250, 5745, 2661, -859, -2865, -4944, -3838, -162, 2323, 2986, 3867, 1470, 229, -2990, -4714, -3745, -707, 2407, 3142, 3991, 998, 722, -4059, -5634, -3228, -1672, 2230, 3882, 4289, 2280, -786, -3073, -4272, -2491, -546, 2372, 4645, 4141, 2837, -426, -2871, -4272, -3963, -398, 842, 4096, 4985, 1833, -492, -3250, -3718, -2407, 4, 3477, 3751, 4211, 3006, -946, -3057, -4605, -4194, -363, 2635, 4708, 3453, 2984, -768, -2749, -5327, -3148, -1788, 2655, 4505, 3161, 1572, -1090, -4081, -3513, -2789, -630, 2330, 4441, 3217, 1762, -500, -4292]
5807d292M54P32L151K193R77N48k420l148k506n94J768L269J792J977q82j484
5823A535k617k407l1J284K225K604K94J315l856k554k236K9K428J314L452J622
5839D401j466j149l637k590L1K304K740K601O76m23k148k714k326j056K142L946
5855A332J700N33n56k492k607k524J114J514K273K085K519j230k454l520j860
5870d173J79R20L974J912J563r93k714l075r26L22J804J547J902K098l52m156
5886a68j492k360J074P72L296K337P09p25k520k104k967P33J291J720M040k49
5902C387j520j846l302L00j254K144J783L505J182j681k487j933r74j623K571
5917a748K591K354J056j759j590l324j054j95J218K062L211K283k970k437k510
$$ y = [-4292, -3838, -3106, 45, 2238, 3215, 3763, 1343, -1805, -4311, -4905, -3137, 132, 1924, 3901, 3019, 1535, -1082, -3489, -3520, -2236, -11, 2593, 2887, 4202, 346, -2208, -4444, -4415, -1987, -673, 2779, 4401, 2935, 1786, -1851, -4441, -4410, -2106, 634, 3235, 3911, 3488, 1340, -1374, -3700, -4756, -2614, 1332, 3032, 3565, 3009, 517, -2090, -4614, -3500, -1986, 287, 2372, 4891, 3661, 1207, -2313, -4173, -3994, -3074, 900, 2812, 4375, 3382, 668, -2407, -3333, -3011, -1207, 340, 2242, 4340, 3988, -168, -1660, -4020, -2946, -2174, 1122, 3459, 4168, 3443, 923, -1181, -4148, -3415, -2124, -404, 3636, 3387, 1867, 21, -3281, -2981, -4235, -2091, -308, 3197, 4379, 2698, 211, -1722, -2696, -4319, -1748, 843, 3197, 4253, 2494, 904, -2420, -3474, -3669, -2451, -389, 2822, 5105, 2135, -302, -2812]
5932b812n02n28K605K350K213Q16j369k128l787k50O91M38M344K385j076j249
5948B141k314j538r13l34J965K589J820n59K99k843l981o0J11J631L783Q55J608
5965D260k106l084j426j940J149K371K791J465K14k207k311k086j466L83K909
5980a084L182J314k26j118k781k468j430J254J468K591K574k84j785k407j392
5995b592j110J133J413K115K622K31j634j556l073j238K100M28L392J234k54o12
6011B599k698l354j074Q76K480L591P89J050j454l130l404m77J319J648L340K397
6027D498l98k163l149j964l21N99K891J676K134m06r27k855k806J86j014M227
6043B08J925J076M84j714l066j739j767J985J852K538J714N18k513k246k854J05
$$ y = [-2812, -3314, -3842, -1237, 1113, 3326, 4142, 2773, 645, -3142, -3392, -2701, -2263, 2081, 4466, 3390, 2141, -173, -1711, -2624, -2958, -993, 1596, 3416, 2857, 3156, 313, -3668, -3728, -3617, -1986, 1797, 2652, 4260, 2154, -930, -2356, -4296, -3147, -776, 2015, 3480, 3694, 1487, -824, -2910, -4376, -3993, -1084, 2098, 3412, 3186, 2068, -713, -3181, -4611, -3357, -1889, 702, 3276, 2992, 1207, -1200, -2592, -3702, -2569, -1156, 959, 3581, 3812, 2178, 622, -2451, -3689, -1589, -1161, 2231, 3465, 3211, 2599, -99, -3453, -4527, -3651, -1171, 2420, 3209, 4259, 2805, -325, -3729, -4206, -2887, -1239, 2101, 4498, 4100, 1937, -1212, -3176, -3497, -2898, -7, 1669, 3803, 3397, 2470, -385, -3191, -3005, -4019, 208, 2133, 3209, 3693, 1979, -1087, -2826, -4593, -2608, -756, 1782, 3496, 4014, 1501, -745, -3599, -3494]
6059c494J402J981K667M80n91j141k334k806R28P43J868L351n21L30j024k843
6075a004k722l8J864J488K971J638m75j688k784k024j463K588K155J894J031M81
6091C912k474k910r87j450J515K638K499J558o47k736j970j438j739J914J974
6106c41K605J713j082j040k993j657j381K060L332J684J205j512k574k012k051
6121d044K05R59L277J871J105n26k042k686j496n66J501K566K962K61m47k175
6137G25k278m46j972K799J174K303J675n13k987k280j602j46K519K700Q52R39
6153C462p71k342k862n06j101K064L082J594L36n78l79n284q27R77J638K692J055
6170B250J982j764k137j634k626J135L02L993J355O29r12k980j199j824P72K726
$$ y = [-3494, -2092, -111, 2556, 3036, 2445, 1304, -1030, -3836, -2908, -2165, -297, 3054, 2533, 2863, 1839, -1004, -3726, -3764, -1900, -412, 2559, 4197, 3722, 2034, -750, -2774, -4237, -1649, 506, 2400, 3431, 3912, 1438, -1472, -2459, -3909, -2394, 244, 2743, 4301, 3654, 918, -1052, -2490, -4229, -2315, -341, 2264, 3977, 2895, 1855, -1138, -2795, -4176, -2116, 1216, 2900, 4105, 2593, 19, -1993, -4044, -3839, -2880, 397, 2268, 3373, 2847, 805, -1881, -3377, -3943, -2442, 124, 3086, 3347, 2900, 725, -1553, -1999, -3971, -1172, 2, 2305, 3980, 3467, 480, -1800, -3402, -3548, -1029, 1671, 2523, 3462, 2691, 349, -2513, -3019, -4120, -2056, 1026, 2620, 2956, 2378, 1999, -3285, -4112, -3135, -1497, 1195, 2250, 4232, 2468, 331, -1303, -3929, -2794, -2492, 1501, 2856, 3485, 2573, -407, -1606, -3430, -2658, 68]
6186F8R54J840J203j863k549k087j113o10L306J459J217J104p67j728l730k99
6202c595N01K270J502K262M72j313k422j943j815R36J446L173K872p39j022l463
6218h78k204r19J193K501J667J523R03j900k213k291o16J4J897L337N76r2p15
6235A783k897j585j115R10J142L481J979m81j376k212k427q50M31L125K521O18
6251C047J094k051k461k244o93J483K116R50J079J168j696k279k072j503J708
6266b354J134K932J232J57j529k570j904p6J07K741K876N27n23j017l022j337
6282b626m71J570J050K164J809q55p48k275j210k139O52K038L481J314j057j269
6298A428k381j692n91J236J411K924O87L04k462j396k791k6J193J899J485K570
$$ y = [68, 1022, 2862, 4065, 2202, -347, -2434, -3547, -4157, -851, 608, 1825, 2929, 2162, 434, -3296, -3595, -3094, -824, 678, 2940, 3412, 2099, -323, -2266, -4081, -3145, -1699, 1474, 4346, 3607, 2585, -878, -3082, -4001, -2808, -307, 1360, 2883, 3786, 1886, -327, -2618, -3234, -3220, -1323, 2014, 2590, 2498, 1783, -1114, -2699, -3814, -2904, -1762, 1719, 3698, 3217, 1841, -371, -2798, -3648, -3217, -92, 2429, 3047, 4141, 2090, -371, -2615, -3308, -1825, 291, 1241, 2320, 3488, 1792, -487, -2559, -4062, -2354, -1220, 1712, 2944, 3101, 1572, -998, -2902, -2978, -2871, -130, 2746, 3273, 2750, 1733, -1289, -2626, -3097, -1527, -477, 1687, 3496, 2641, 1893, -382, -1592, -3731, -3079, -1041, 2440, 3754, 2697, 1428, -953, -2645, -3236, -2000, -589, 2335, 3022, 3326, 864, -532, -3323, -3349, -2156, -257, 1228, 3798]
6314C798J65k037l261j344j705J852J554L586J23J46j913j315j978j671K324J142
6330e34K411J435j7l029j706j809j23J215K027L152J32k60j389l018j935Q0J227
6347b141J934K787O87l97q54m198o34l28Q81K310K696O30j022j631j816k018K78
6364b836Q82J424J706K232j42k208j912k041k92J413K184J348J939m63j140k900
6380h06k594L10J432J738K313J094L39k881k575j493M91J264R74J943M95M91j986
6397E49k106n25q27J018K480J367J441p72j175l555r57p93J953K095K872L79j833
6414A611m83m017m18N07R98J520L096J449j721j266k957j144O3J201K271K736
6430C446m09p68l301p95j323J793J56J423K968M4r02j981j382k623O43N60K980
$$ y = [3798, 3963, 1926, -1335, -2679, -4384, -2532, -978, 2608, 2731, 2877, 964, -351, -2329, -4000, -1676, -534, 1877, 3312, 3295, 266, -1440, -3249, -3372, -2157, -130, 3022, 3154, 2894, 1505, -1513, -3448, -3368, -2141, -207, 2580, 3267, 2870, 2016, -2182, -2816, -3144, -2263, 47, 2743, 3373, 2351, 720, -1096, -3114, -2836, -1954, -530, 1176, 3408, 3266, 1058, -854, -2895, -3187, -1774, 410, 1758, 3697, 3234, 2094, -806, -3400, -3090, -1658, 80, 2393, 3487, 3826, 945, -1630, -3123, -2632, -1368, -394, 1549, 2044, 2535, 549, -1557, -2082, -2909, -1891, 589, 1956, 3397, 2625, 1450, -2105, -3062, -3855, -1902, 193, 3065, 3444, 1611, 1128, -2889, -3307, -2800, -1802, -282, 2814, 4263, 2542, 1276, -1681, -2825, -2762, -1561, 710, 3446, 3037, 2269, -1032, -1827, -3150, -1357, -1201, 222, 3190, 3234, 2332, 351, -1031, -3654, -3011, -2451, 529]
6447E29J285J325j030j304l673K6m54J512J638K886M73m04l504o00k936K75J952
6464b004K842J939m46Q79j723k222k943Q33J212K412J144J554k122m62l043j828
6480c978Q47K529J912M15J705k182j815j996j096J068J446K272J669J009j847
6495A958j242l141j319P15K488J935O02L17j239j398j701r93J43K760Q43K581
6511C309L45j144l482p44j594J42K680J202K336n20j222o47k603j847J172J627
6527i90K394J334j22j038k010l249J238j87K467J455J197Q92j708k508k054q60
6543c749J166K228K537K143j407q91k457k828P46L03Q65J925K489l07n30k687
6559d54j866k503J762K407J964J738k58j422k856j846L39J091J419K584J882l21
$$ y = [529, 1814, 3139, 2109, 805, -2868, -2842, -3296, -1784, -146, 2740, 3213, 2809, -695, -1295, -4231, -3956, -2004, 838, 2777, 2331, 3210, 1487, -735, -3678, -2845, -1633, 779, 1923, 3477, 1355, 893, -2150, -3978, -3131, -602, 1310, 1725, 3430, 1248, -567, -2563, -3659, -2591, -1145, 1127, 2796, 3805, 1958, 716, -2425, -3744, -3029, -541, 1394, 1996, 2313, 1074, -324, -2025, -3018, -2875, -115, 728, 3309, 3654, 2510, -972, -1716, -3310, -3168, -488, 714, 3050, 2530, 1308, 661, -1942, -3789, -2617, -990, 1404, 2738, 2616, 1578, -432, -3681, -2443, -2630, -163, 1292, 2489, 3381, 1673, -835, -2889, -3749, -2583, -355, 2182, 4325, 2918, 2027, -430, -3258, -2512, -2209, -1344, 581, 3070, 2763, 2233, -454, -2320, -4823, -3061, -654, 1310, 3048, 2790, 1368, -1488, -3334, -2995, -1904, -485, 2099, 3981, 3660]
6575C660k163k911j259n28L09K846Q11J668O53k422j362j205j229L87K069K205
6591A529J825l72k458j467j445q70R16R57J902K918j056j985j396j197m28R19
6607a708K258J488Q70O11j442k628k429j76J755J699K385K35k03j595k471j370
6623b721m9P84K284J663R01Q44k902k164k232J314Q29R70K175K045j433k253j341
6640a286j865Q88j73K336K201R83j759l88j398k985L55K078J666J475P67l94k349
6657A52k263j695R09J159J826J013J992k03j923k809j827J187J137K402K398r90
6673B465l51o94k768j035m93J800J122K351R74j080j783j276j255n08J27M414
6689B010J72j82O30j431k863j526P34J481J398K463P1p05j577k460j301K57J598
$$ y = [3660, 1497, -1414, -2673, -3201, -2892, -46, 765, 2433, 3086, 664, -698, -1903, -3132, -2745, -676, 1529, 3354, 2982, 524, -943, -2388, -3258, -2342, -1385, 517, 3435, 2379, 394, -1002, -2199, -2627, -1708, 550, 2038, 2908, 3519, 2077, -551, -2980, -3156, -1401, 298, 2683, 2918, 2715, 1120, -1351, -2721, -2770, -1986, 298, 1961, 2862, 3706, 804, -1360, -3592, -2278, -1449, -479, 1696, 3741, 2308, 55, -1286, -3151, -2263, -2436, -100, 2101, 3084, 1325, 937, -461, -3446, -3091, -1013, 653, 2128, 2895, 2501, 152, -2111, -3806, -2897, -1738, 88, 1101, 3093, 2890, 967, -1842, -3669, -2482, -1345, 1057, 3455, 2465, 2114, 1420, -1348, -2383, -2876, -1076, 46, 2397, 3371, 2291, 508, -768, -2023, -2531, -2404, 2010, 2182, 2000, 2630, 1199, -1664, -3190, -2456, -975, 423, 2886, 2957, 2252, 675, -1785, -3086, -2829, -1231]
6706a231J281L445K07r23k228j458j793m89K066J636J894L29M27k436k900q51
6722c024J98K374J775R48J025j737k239j050j365J25K337J881K127q73k24l139
6738h61j276M3j22J408O75K310J390j729j492k434k60j154K894J092J405J496
6754C385j453j372l085o23J47K427J572M73O09L36k361j849n80j71J673J026K123
6771B277N80j062k498j314j273J55K628J912J406M06j826j265k342j160J332J603
6787d41J853N82M42j889j298j696j25M15J220J719J464N06k000q61k408j063J531
6804b049K204J326J405k12j660j551k041k28J273O93K842R32j151r98q92k573
6820b680n65K212K250q18K456M62j720r98k361j235J944R88J545J645r95q14k118
$$ y = [-1231, 50, 3495, 3702, 2779, 551, -907, -2700, -3189, -1123, 513, 2407, 2736, 3163, 727, -2173, -3024, -2826, -452, 1323, 2271, 3296, 1559, -680, -1730, -3095, -2970, -633, 1248, 3375, 2502, 2278, -861, -2137, -2094, -2216, -808, -133, 2177, 3567, 1838, 346, -2088, -2348, -3502, -608, 484, 1889, 3385, 1932, 560, -2525, -3148, -3001, -574, 998, 1471, 2080, 2416, 55, -1794, -2374, -2545, -872, 154, 2277, 2857, 1795, -703, -2017, -3290, -3135, -507, 1405, 2811, 3217, 1391, 126, -2216, -3376, -2044, -441, 1412, 1994, 2436, 547, -751, -2447, -2572, -2157, -937, 782, 2246, 2752, 752, -109, -2517, -3580, -2049, 155, 1481, 2886, 2674, 1014, -537, -2578, -2806, -1533, -840, 2002, 2934, 1783, 785, -107, -2680, -3245, -1033, 1217, 399, 2855, 3317, 1597, 599, -1762, -2997, -1053, -65, 1480, 3125, 2130, 1316, -802]
6837h02j778J211q04J530K238L51J71j416j276j420r86R91J748J755J633k71k726
6854A49j223j482k2O47K078O68J295J070j648k817r95j10M82K448R01J652o29
6871B464j777j157k745k70J420K295J666J005o94j357j811k255M02J535J458R22
6887A101K499k162r89j871r29l66L69K571J857K76m10j134l465k56O40J144J595
6904D70O77J647n80k364k92k562N59O51J573K619k56L24j966j860j360P86Q00
6921a134J079K017n17kj507j155k047K92J166K345J130N93k60j310j728j271N7
6938b252Q02K633J048J257r53k391q15j333p92J393K340J007J264r58q09l137
6954a696k67m32N19K435Q81K131j451j874k314r88J95J153L042O70l26N62k348
$$ y = [-802, -2580, -1369, -2173, -643, 1595, 1946, 2117, 701, -575, -1995, -2981, -1990, -242, 1513, 3146, 2875, 149, -1074, -2556, -2578, -1931, 147, 815, 2110, 3180, 1532, -1285, -2280, -2390, -1908, 540, 1441, 3093, 2464, 687, -470, -3215, -3485, -2065, 230, 1896, 2901, 2207, 850, -961, -3216, -2814, -1279, 179, 1101, 3600, 1438, 449, -1422, -2351, -2717, -2348, 223, 2080, 2356, 1946, 812, -2653, -2909, -2269, -1125, 470, 1147, 2794, 2214, -150, -442, -3004, -2445, -1794, -221, 2398, 2142, 2466, 500, -1360, -2720, -1934, -1134, -55, 1962, 1445, 1443, -64, -1219, -3266, -2974, -1808, 537, 1667, 2260, 2000, 690, -1038, -2309, -2252, -1450, 1183, 2231, 3488, 2535, 144, -671, -2004, -2796, -1403, 937, 1944, 3208, 2250, 1441, -1696, -1963, -2395, -1876, 559, 1440, 3571, 2120, 246, -2068, -3056, -2861, -1708, 1334, 2004, 1678, 2240, -108]
6971a08j758q49P95l20K901J440R42q99j992j453j404O54qK994J998q26J09r52
6989A264l446j74J095p5J835K066J033j018k099k056j403Q79Q96J597K192k00
7005B386p27k284j885l52L83K218R47K054k93j409j279j483j413J840M72Q45K382
7022B402N94j572j569j338p80O98L59K710J036j08j206Q8m033L36M33J512J474
7039A036K732p51j082k686j140l83o32K057K100J590O75k826j697j79m14L84K92
7056i24K264R13P43j760j046j976N66k23P89R21K335J81j154k335k777M03J265
7073a815R35K519O05J43j146j556l148J006j14J807J713J369o81l27j235j821
7089a746k029K226Q05K295l4J908j534k597j347o57N02J711J981K744j347j976
$$ y = [-108, -1866, -2715, -1920, -2240, 661, 2101, 3043, 2144, 152, -1301, -2705, -2051, -2059, 935, 2933, 2107, 2216, 1264, -2182, -2356, -1261, -1336, 499, 2565, 3598, 2580, 481, -1575, -2978, -2099, -1203, 394, 2586, 2386, 1659, -625, -2510, -2862, -2479, -261, 686, 2740, 2447, 1038, -241, -1724, -3137, -1297, -825, 20, 2402, 2996, 1424, -145, -1483, -2263, -1565, -1206, 1504, 2540, 2432, 1226, 1314, -2719, -2383, -1950, -438, 1036, 3768, 3017, 1935, -751, -1891, -2274, -2906, -849, 1251, 2841, 3516, 690, -1007, -1186, -1600, -1216, -924, 1340, 2253, 2996, 1236, 190, -1786, -1220, -1443, -654, 267, 2602, 2783, 1629, -706, -3483, -3080, -1815, -880, 1639, 2244, 2387, 1241, -315, -3463, -2457, -2571, -764, 949, 2318, 1637, 1310, 75, -1746, -3775, -1549, -744, 1551, 1517, 3425, 1891, -706, -2053, -2710, -2208, -497, 1484, 4228, 2881, 905]
7105I05j298k534J213J42K066N83J432Lj010j792l091Q94O58J372J563J253o03
7122A756l60j971o19m00M8R89K116N47p8l44l046j86j832J472J885O42J700m26
7140A893j580j941O21l47N41K10K161L10M54o85l150r25p09J122J839J232K170
7157C216j901p11j590j696N29J317M83K732L3j30k488l47j112j047P62K281J072
7174A403Q26L55k271j800k89k11R37O67L028l50l28j152j423r06j044P68L124
7191A334P70J41n70j486k135Q17p86J135J929O13M80J15k360j378L7M2M95J620
7209H13K77R08j31k010l60j618o96J063K140J869M40j695j242r51J47q86J454
7226d78J061P66J388j208r14k012m55q28J725J719K06N96M56j221k870q07p9K004
$$ y = [905, -393, -2927, -1714, -1572, 494, 1077, 2509, 2512, 1502, -290, -3381, -2487, -1829, -457, 1106, 2359, 1756, 1396, -575, -1194, -1594, -1546, -557, 1559, 2106, 2028, 1684, -1362, -1548, -3380, -1908, -23, 619, 2319, 1893, 313, -1628, -1007, -1354, -813, -603, 1558, 1868, 2322, 1637, -1513, -2438, -3147, -2025, -186, 1046, 3216, 1315, 604, -986, -2682, -2153, -836, -353, 2379, 2412, 2282, -206, -553, -1665, -2712, -1950, 331, 1403, 2229, 2584, 313, -1487, -1776, -1987, -1050, -383, 2645, 2295, 1967, 815, -608, -1514, -2558, -1790, 1334, 2104, 2245, 1675, 189, -1946, -1129, -1915, -780, 1149, 1762, 2242, 2357, -3, -1381, -1344, -1302, -807, 813, 1090, 1998, 1867, -143, -503, -2121, -2817, -1754, 386, 2255, 2695, 1000, -242, -1193, -1046, -1932, -478, 583, 1349, 2737, 1529, 615, -1397, -1852, -2680, -955, 764, 970, 1566, 2022, 801, -2069, -2876, -2955, -951]
7244i51J624J637k75J078k219j311j576J190j15O52K405M6j21j937k214m81R77
7261a591J66L190q9O80r08j238j906j386P66J243J577N55J895j040k609n50o75
7278a920k10J254J312J908r1o94k106j675n2p5K225J979K00l47q84j536l01j097
7296b110j33K205J750k01R78j968n75j520j639J657M31J544J719o23o19R0l388
7313b402N90o42K406J421O91o90m03j150r41j887J116N57J365K073M10m35k329
7330b50j443O19m63K228K74K92Q75j458j121j510j08N91K121R57O68j076K11k323
7348i16j77j224M33J292J336J403j09j25k778r01j258J145R12K340M23l25p6j474
7366g9j624N22j275K446J269Q46L51j212k102j377j67l86K043J701J354p92o09
$$ y = [-951, 673, 2310, 2035, 3113, 894, -417, -1993, -803, -918, -266, 2139, 2185, 2064, 127, -2087, -2568, -1591, -1425, 1765, 1676, 2356, 1448, 210, -1696, -3082, -2316, -1073, 504, 1059, 2954, 1914, -695, -1245, -1920, -2130, -876, 436, 2344, 2253, 1559, -547, -2222, -2274, -2349, -124, 1855, 2055, 1708, 824, -712, -1013, -2110, -2243, -38, 1712, 1511, 2489, 521, -54, -1574, -3213, -1556, -1125, 419, 2138, 1515, 896, 986, -2402, -1812, -2454, -48, 1373, 2064, 1374, 971, -179, -1120, -3007, -1891, -1334, 31, 2104, 2514, 2079, -250, -1693, -1074, -1537, 691, 965, 1257, 2132, 674, -447, -1957, -2065, -1474, 647, 1604, 2272, 1196, 1407, -916, -1093, -2317, -1884, -592, 744, 2147, 2038, 1913, -865, -1766, -3024, -1879, -967, 1373, 1796, 1471, 1395, -79, -1703, -1181, -2456, -10, 1259, 2105, 2456, 1244, -858, -2235, -2402, -2788, -745, 956, 2310, 1518, 909]
7383I09j268j201r65N00J712J47K428j59n65k255j085q32J188N74J765J676q75
7400A694q45j387p17l4j017K489K215n32J621l626k79j339j48J446m73K324R26
7417B318J96j159j954j822n95K178R56J935nL18j371j298j228k9o96K527J236
7434A507P73j525j39n80k550P5MK518O03J164j157l05p57k523J420R30J400j22
7452G36J286J67l136P52j558r03J298O15K801l72k83r63j103j868j28K46K333
7469h0K134j004J272j871k374N40m75Q42J120J862P72p49j164j723j128l50J649
7486g27J587J920p83m34j261j537q24j16J568L57L59K270m49j310k308n16N06
7503a698O34J895N96K15M78j317j938k43q74J584P93J308J44N07k343j766j650
$$ y = [909, -359, -1560, -2525, -2025, -313, -166, 2262, 2103, 1538, -717, -1802, -2634, -1446, -872, 893, 2569, 1694, 849, -538, -1255, -1289, -2306, 183, 2398, 1866, 3487, -139, -418, -1757, -1905, -459, -932, 1392, 2318, 2514, 1355, -599, -2421, -3016, -838, 118, 2053, 2048, 2366, 995, -303, -1531, -1560, -2256, 271, 1507, 2280, 755, 616, 36, -2514, -2439, -2435, 83, 686, 1850, 693, 388, -369, -2892, -1472, -542, 858, 736, 2022, 2189, -947, -195, -1753, -2656, -1358, -743, 2058, 1686, 1403, 440, -663, -2531, -2659, -2413, -80, 2054, 1050, 2322, 451, -1923, -1383, -1858, -1016, 104, 1966, 2738, 1989, 825, -898, -2026, -2376, -727, 860, 2780, 1997, 1563, 302, -1235, -2059, -2175, -607, -250, 109, 2379, 1930, 620, -1688, -2204, -1698, -1064, 831, 1427, 1642, 2120, 803, -1135, -1378, -2252, -668, 125, 1433, 1577, 2084, -259, -2025, -3675]
7520c675J046J576J390J280P95j082k000J88k157J268j24J454K337j19m18j123
7536F36k359l07K16L19J413J544J311q76r67k228q96j320K526J465J596M50j523
7553A000J59k448j199O36O46J197Q94R79o40j712j457m75M6R91J954K095m96k039
7571A31r65l44j544O14J713J763N33M86j530j096j456J11K4R21J550Q56J065j275
7589A557j972j358K57J50J446M16J235M57j411m51j920p55L00R89K014N73K23
7606A750j433P6k473J32n5K416J320M7r6k49j406j997K56L95O53O83J242O37r11
7625I87r36j387n15M23J901N83P13J63j328rk072o39o58J883K100R27n97m08j579
7644d48j008j212J015J298J310J22k26L99r64k158n56J247N66O37J086K17j242
$$ y = [-3675, -2629, -1053, 337, 1617, 2412, 1330, -670, -482, -2639, -1371, -1495, -41, 2296, 2177, 1759, 636, -1723, -2030, -1814, -1495, -82, 1462, 2773, 1897, 930, -1298, -2194, -3514, -988, 477, 2073, 2523, 1000, 1159, -1289, -2488, -1852, -1206, -9, 885, 1864, 1224, -488, -1945, -2420, -2374, -1383, 571, 2666, 2170, 131, -834, -1178, -2722, -2108, -395, 1368, 1901, 2387, 857, -239, -1695, -1584, -1560, -639, 911, 1767, 2832, 1557, -415, -1773, -1516, -1366, 80, 496, 1731, 2188, 777, 326, -1594, -2349, -2049, -1060, 954, 1527, 1750, 317, 393, -2080, -1948, -2003, 413, 1733, 1780, 1684, 1435, 29, -1968, -1712, -1317, -664, 19, 1261, 1898, 987, 51, -1336, -1851, -1428, 473, 1056, 1769, 1932, 604, 595, -1477, -2116, -2774, -891, 1209, 2136, 1539, 1131, -448, -1456, -2668, -1653, -355, 955, 1077, 851, 1250, 286, -1872, -2428, -1181, -615, 22, 1108, 1325, 83]
7661H3k31k510K27P79J312K269M53n33r17j562j300j191K455J228M64J116j102
7678A040O56k666l78l01K24J110J849J078p56j162j607j161P60p05J453K199P61
7695B394n73j137k016p7m75O92J158J065o0j47J64p91j304m27N3J035K178Q94
7713B626j010n81j485n95n79j38J527J154O17J1j327l50j777q95J860M61K471
7730A990P06j502j159j142j242P12Q65K66J713N67j50j650k724O36J119L83J417
7747H05j33J232J120j372l109j43q09N26K733O60Q81n84j110k089J36j058J450
7764h64J251J58K467j778o48j760m73R1M85R00J578J062j023j328k055m23J202
7781a158p61K374J261L98k38j402j062n93J4K69R54O93K314j930q6k792P2M25
$$ y = [83, -148, -2658, -2431, -1652, -340, 1929, 2382, 1849, 932, -630, -1930, -3121, -666, 562, 1026, 2142, 1040, 1696, -970, -1348, -1649, -1425, -315, 1534, 2612, 1856, 694, -913, -2074, -1314, -2019, -566, 1633, 2394, 1821, 684, -1332, -1409, -1884, -1192, -34, 1031, 971, 824, 988, 197, -1107, -1534, -1481, -446, 1732, 2626, 1616, 1035, -450, -1045, -1624, -1762, -235, 919, 1536, 1547, 220, -130, -1907, -2802, -942, -481, 1990, 2696, 1194, 35, -1107, -2349, -1637, -772, -506, 1207, 1774, 1624, -26, -2750, -2114, -995, -612, 805, 672, 1904, 3024, 1652, -1457, -1600, -2409, -1883, 850, 1510, 2391, 1807, 697, -1392, -1256, -2314, -864, 387, 545, 3012, 1234, 586, -1174, -1647, -1556, -1071, -171, 1407, 2469, 1446, 118, -1937, -2360, -1158, -1919, 455, 1716, 2114, 1876, 474, -588, -1181, -1167, -898, 56, 749, 3063, 1133, 1047, -1745, -1673, -1248]
7799a248K58J909M89J248j433j91k547q69P32Q25K029n9j38J300j796j517n51
7816a559P35L48J762J308n64k19j682j377m19o66J610J839N81j809J253r89j815
7833a663q47J306M59P31L230k523J702j384k721o01P75M65J895J388n07L5j557
7850A83j664p1o92K031R51J412o09j166q72o21q91J50K075R40N38N35j705M4k367
7869a799q83J566J037J534k78J41j135k50l06k714J191Q59J859M41L59o65j102
7886a45j065M6k74M54K889l3L36j216r43j609r6J620n56K008K66l26n0j594j571
7905a859o27J53K616N63J246J73j485j245r80n34M22R26J511J558o41j47l243
7922a593J45P68r92J371O86J320p43p2j194j047j170J391Q51K319q09N57r23j761
$$ y = [-1248, -990, 919, 1408, 2656, 1223, 1032, -1515, -2384, -1652, -827, 1202, 1143, 1005, 2305, 509, -1008, -1559, -824, -476, 1286, 2594, 2030, 1811, 129, -1248, -1667, -2333, -723, 1116, 1697, -112, 1141, 152, -1663, -2510, -1204, -745, -14, 3216, 693, 2395, 1011, -1710, -2311, -1536, -1071, 824, 2212, 1705, 1740, 183, -1481, -1552, -2244, -213, 738, 2150, 1541, 375, -497, -1118, -2009, -1859, 216, 1156, 1694, 2229, 524, 568, -1799, -2682, -1116, -79, 1455, 1177, 1318, 183, -67, -373, -3087, -1896, -1037, 822, 1263, 1622, 957, -145, -1210, -1164, -1438, -984, 1905, 1872, 2208, 992, 49, -1560, -1656, -36, -592, 1416, 1682, 1356, 1306, -288, -1859, -2486, -2333, 283, 846, 2092, 2265, 780, -465, -1445, -1979, -1557, -631, 880, 2438, 1797, 1650, -1593, -1448, -680, -1672, -301, 385, 1705, 962, 890, -304, -1351, -2521, -1130, -279, 2040, 1231, 1788, 865, -896]
7940h96n92j80L34J155J363J046p31m72j788j209J018r67K029O80Q49k58k96k76
7958H09k529j70J72J456N70N44p84J353j730j149p27P89J310J751N84q25l32k511
7976a419K93o10N78R52J074O47k60k52j002j540J34J029nK048k85j41j243r76
7994i78l94r7J11R38K476k95l51K57k407r31j59Q99J81K163K66q61J33j313p72
8013a134p79L47R52J877N33j132j84j069j344R27r20J513R87M9Q10j520K95k183
8031a975n3J063K045N60M28n4k433p60o07o23N69J688J89J396J366j987k581J44
8049a625J300j403K726n66K485j388m85j717m34o4j29J544K82K405j509j635P6
8066a37j692M65J78q1K453P25M95j100j457r47j261K104J131N20P00o38o36j906
$$ y = [-896, -1488, -1668, -1334, -179, 1184, 2230, 1499, 1027, -761, -1970, -952, -1919, 110, 790, 1639, 1381, 1085, 809, -1720, -1890, -1718, -262, 308, 852, 68, 1421, -309, -1458, -2185, -1396, -86, 1665, 2249, 1424, 1092, -1419, -1126, -1736, -1158, -206, 868, 1515, 1255, 1003, 1, -1539, -1405, -376, -381, 1667, 1382, 1241, -2, -978, -1372, -1469, -1358, -420, 2056, 1761, 1410, 1667, -740, -1671, -1830, -931, -750, 1413, 1679, 818, 951, -362, -1134, -1913, -1566, -614, 1263, 1796, 664, 480, -589, -1933, -1006, -1926, -413, 574, 623, 1433, -87, 208, -1975, -2028, -965, 1080, 1640, 2068, 2014, -419, -1179, -1786, -2409, -1840, -152, 37, 1433, 2799, 812, -1769, -1625, -325, -1728, 998, 432, 2917, 1529, 1044, -673, -1107, -1171, -1300, 244, 526, 2931, 1422, -213, -137, -1829, -1364, -1186, -1267, 1186, 1911, 2406, 1306, -151, -1098, -2359, -255, 876, 1396, 2096, 1458, 822, -1084]
8084a084j76o24J758J36R67J431N8p55l331m69m95K453Q62J167o0n07j697o95
8102a061r97M03J565M79J691r77L12k287m33k15j79R18J699j82J061o61m50j907
8120a221J85j178N3K326J653j379Q95j164q58q07N35L40P63J398n89m55l51q14
8138f68r24r19J583L019j75K7j259o6k287q9j9R55R82J557o7q43n79k602J60L46
8158a868J563R20J300n80r29k31j265q71P84J2J313J645j95m27j937r69J57J1
$$ y = [-1084, -1260, -1884, -126, 10, 977, 2408, 2466, 1711, -1620, -2089, -2584, -131, 731, 1898, 1838, 1331, -366, -1061, -2058, -1655, -90, 389, 2080, 1103, 1415, -872, -1305, -1520, -1699, -781, 918, 736, 1797, 1136, 686, -1221, -1036, -2214, -2161, 165, 1818, 439, 1334, 170, -688, -1495, -960, -620, 143, 1541, 952, 497, 146, -668, -1592, -2511, -928, 2091, 1916, 1943, 684, 618, -1669, -1758, -1777, -822, 160, 1717, 1650, 807, 228, -2374, -2214, -1868, -305, 615, 1915, 1335, 406, 175, -1090, -1961, -1177, -1165, 148, 1793, 1598, 1171, -766, -1735, -1578, -1567]
$$ [...]
##END NTUPLES=NMR FID
##END=
