##TITLE=1H_PR164_SEA
 D2O, 8 sc, 
 6.2.2020
##JCAMPDX= 6.0         $$ Bruker NMR JCAMP-DX V2.0
##DATA TYPE= NMR FID
##DATA CLASS= NTUPLES
##ORIGIN= UXNMR, Bruker Analytische Messtechnik GmbH
##OWNER= root
$$ XWIN-NMR		Version 3.5
$$ Thu Feb  6 16:29:40 2020 Russian Standard Time (UT+4h)  she@DPX200
##.OBSERVE FREQUENCY= 200.1315
##.OBSERVE NUCLEUS= ^1H
##.DELAY= (6, 6)
##.ACQUISITION MODE= SIMULTANEOUS
##.ACQUISITION SCHEME= undefined
##.AVERAGES= 8
##.DIGITISER RES= 18
##SPECTROMETER/DATA SYSTEM= spect
##.PULSE SEQUENCE= zg30
##.SOLVENT NAME= D2O
##.SHIFT REFERENCE= (INTERNAL, D2O, 0, 15.7039)
##AUDIT TRAIL= $$ (NUMBER, WHEN, WHO, WHERE, WHAT)
$$ ##TITLE= Audit trail, XWIN-NMR		Version 3.5
$$ ##JCAMPDX= 5.01
$$ ##ORIGIN= Bruker BioSpin GmbH
$$ ##OWNER= she
$$ F:/spectra/data/she/nmr/H-F/1/audita.txt
$$ ##AUDIT TRAIL=  $$ (NUMBER, WHEN, WHO, WHERE, WHAT)
(   1,<2020-02-06 16:28:11.06 +0400>,<she>,<DPX200>,
      <created by zg, POWCHK disabled, PULCHK disabled
       configuration hash MD5:
       00 E9 B6 7A A2 85 ED C7 34 08 36 98 17 FE 4E 26
       data hash MD5: 16K
       DD 02 98 86 21 37 BD 23 DB B5 43 4B 5B 49 0E 58>)
$$ ##END=
$$ 
$$ hash MD5
$$ 02 9B 74 6F 35 7C 15 D2 F3 C4 35 8B D7 60 F8 9A
##$RELAX= 
##$RELAX= 
##$RELAX= 
##$RELAX= 
##$RELAX= 
##$RELAX= 
$$ Bruker specific parameters
$$ --------------------------
##$DU= <F:/spectra>
##$EXPNO= 1
##$NAME= <H-F>
##$PROCNO= 1
##$TYPE= <nmr>
##$USER= <she>
##$AMP= (0..31)
100 100 100 100 100 100 100 100 100 100 100 100 100 100 100 100 100 100 
100 100 100 100 100 100 100 100 100 100 100 100 100 100 
##$AQSEQ= 0
##$AQ_mod= 1
##$AUNM= <au_zg>
##$AUTOPOS= <>
##$BF1= 200.13
##$BF2= 200.13
##$BF3= 200.13
##$BF4= 200.13
##$BF5= 200.13
##$BF6= 200.13
##$BF7= 200.13
##$BF8= 200.13
##$BYTORDA= 1
##$CFDGTYP= 0
##$CFRGTYP= 5
##$CHEMSTR= <none>
##$CNST= (0..31)
1 1 145 1 1 1 1 1 1 1 1 1 1 1 1 1 1 1 1 1 1 1 1 1 1 1 1 1 1 1 1 1 
##$CPDPRG= <>
##$CPDPRG1= <>
##$CPDPRG2= <>
##$CPDPRG3= <>
##$CPDPRG4= <mlev>
##$CPDPRG5= <mlev>
##$CPDPRG6= <mlev>
##$CPDPRG7= <mlev>
##$CPDPRG8= <mlev>
##$CPDPRGB= <>
##$CPDPRGT= <>
##$D= (0..31)
0 1.2 0 0 0 0 0 0 0 0.06 0 0.03 0 0 0 0 0.0002 0 0 0 0 0 0 0 0 0 0 0 0 
0 0 0 
##$DATE= 1580992090
##$DBL= (0..7)
120 120 120 120 120 120 120 120 
##$DBP= (0..7)
150 150 150 150 150 150 150 150 
##$DBP07= 0
##$DBPNAM0= <>
##$DBPNAM1= <>
##$DBPNAM2= <>
##$DBPNAM3= <>
##$DBPNAM4= <>
##$DBPNAM5= <>
##$DBPNAM6= <>
##$DBPNAM7= <>
##$DBPOAL= (0..7)
0.5 0.5 0.5 0.5 0.5 0.5 0.5 0.5 
##$DBPOFFS= (0..7)
0 0 0 0 0 0 0 0 
##$DE= 6
##$DECBNUC= <off>
##$DECIM= 24
##$DECNUC= <off>
##$DECSTAT= 4
##$DIGMOD= 1
##$DIGTYP= 9
##$DL= (0..7)
0 120 120 120 120 120 120 120 
##$DP= (0..7)
150 150 150 150 150 150 150 150 
##$DP07= 0
##$DPNAME0= <>
##$DPNAME1= <>
##$DPNAME2= <>
##$DPNAME3= <>
##$DPNAME4= <>
##$DPNAME5= <>
##$DPNAME6= <>
##$DPNAME7= <>
##$DPOAL= (0..7)
0.5 0.5 0.5 0.5 0.5 0.5 0.5 0.5 
##$DPOFFS= (0..7)
0 0 0 0 0 0 0 0 
##$DQDMODE= 0
##$DR= 18
##$DS= 0
##$DSLIST= <SSSSSSSSSSSSSSS>
##$DSPFIRM= 0
$$ [...]
##$SUBNAM2= <"">
##$SUBNAM3= <"">
##$SUBNAM4= <"">
##$SUBNAM5= <"">
##$SUBNAM6= <"">
##$SUBNAM7= <"">
##$SUBNAM8= <"">
##$SUBNAM9= <"">
##$SW= 24.9337058887773
##$SWIBOX= (0..15)
0 0 2 0 0 0 0 0 0 0 0 0 0 0 0 0 
##$SW_h= 4990.01996007984
##$TD= 16384
##$TD0= 1
##$TE= 0
##$TE2= 300
##$TE3= 300
##$TEG= 300
##$TL= (0..7)
0 120 120 120 120 120 120 120 
##$TP= (0..7)
150 150 150 150 150 150 150 150 
##$TP07= 0
##$TPNAME0= <>
##$TPNAME1= <>
##$TPNAME2= <>
##$TPNAME3= <>
##$TPNAME4= <>
##$TPNAME5= <>
##$TPNAME6= <>
##$TPNAME7= <>
##$TPOAL= (0..7)
0.5 0.5 0.5 0.5 0.5 0.5 0.5 0.5 
##$TPOFFS= (0..7)
0 0 0 0 0 0 0 0 
##$TUNHIN= 0
##$TUNHOUT= 0
##$TUNXOUT= 0
##$USERA1= <user>
##$USERA2= <user>
##$USERA3= <user>
##$USERA4= <user>
##$USERA5= <user>
##$V9= 5
##$VALIST= <valist>
##$VCLIST= <CCCCCCCCCCCCCCC>
##$VD= 0
##$VDLIST= <DDDDDDDDDDDDDDD>
##$VPLIST= <PPPPPPPPPPPPPPP>
##$VTLIST= <TTTTTTTTTTTTTTT>
##$WBST= 1024
##$WBSW= 4
##$XGAIN= (0..3)
0 0 0 0 
##$XL= 0
##$YL= 0
##$YMAX_a= 442901
##$YMIN_a= -384448
##$ZGOPTNS= <>
##$ZL1= 120
##$ZL2= 120
##$ZL3= 120
##$ZL4= 120
##$ABSF1= 10
##$ABSF2= 0
##$ABSG= 5
##$ABSL= 3
##$ALPHA= 0
##$AQORDER= 0
##$ASSFAC= 0
##$ASSFACI= 0
##$ASSFACX= 0
##$ASSWID= 0
##$AUNMP= <proc_1d>
##$AZFE= 0.1
##$AZFW= 0.1
##$BCFW= 1
##$BC_mod= 2
##$BYTORDP= 1
##$COROFFS= 0
##$CY= 11.3945322036743
##$DATMOD= 1
##$DC= 2
##$DFILT= <>
##$DTYPP= 0
##$F1P= 16.9975609425685
##$F2P= -3.02152046262296
##$FCOR= 0.5
##$FTSIZE= 0
##$FT_mod= 4
##$GAMMA= 1
##$GB= 0.15
##$INTBC= 1
##$INTSCL= 1
##$ISEN= 128
##$LB= 0.24
##$LEV0= 0
##$LPBIN= 0
##$MAXI= 10000
##$MC2= 0
##$MEAN= 0
##$ME_mod= 0
##$MI= 1.114404
##$NCOEF= 0
##$NC_proc= 0
##$NLEV= 6
##$NOISF1= 3.799351
##$NOISF2= 2.8
##$NSP= 1
##$NTH_PI= 0
##$NZP= 0
##$OFFSET= 15.70392
##$PC= 1
##$PHC0= -9788.771
##$PHC1= 11.00081
##$PH_mod= 1
##$PKNL= yes
##$PPARMOD= 0
##$PSCAL= 0
##$PSIGN= 0
##$REVERSE= no
##$SF= 200.130013532006
##$SI= 16384
##$SIGF1= 3
##$SIGF2= 2
##$SINO= 400
##$SIOLD= 16384
##$SREGLST= <1H.CDCl3>
##$SSB= 0
##$STSI= 0
##$STSR= 0
##$SW_p= 3612.71676300578
##$SYMM= 0
##$S_DEV= 0
##$TDeff= 0
##$TDoff= 0
##$TI= <>
##$TILT= no
##$TM1= 0
##$TM2= 0
##$TOPLEV= 0
##$USERP1= <user>
##$USERP2= <user>
##$USERP3= <user>
##$USERP4= <user>
##$USERP5= <user>
##$WDW= 1
##$XDIM= 8192
##$YMAX_p= 0
##$YMIN_p= 0
$$ End of Bruker specific parameters
$$ ---------------------------------
##NTUPLES= NMR FID
##VAR_NAME=  TIME,          FID/REAL,        FID/IMAG
##SYMBOL=    X,             R,               I
##VAR_TYPE=  INDEPENDENT,   DEPENDENT,       DEPENDENT
##VAR_FORM=  AFFN,          ASDF,            ASDF
##VAR_DIM=   8192,          8192,            8192
##UNITS=     SECONDS,       ARBITRARY UNITS, ARBITRARY UNITS
##FACTOR=    0.0002004,     1,               1
##FIRST=     0,             0,               0
##LAST=      1.6414764,     0,               0
##MIN=       0,             -384448,         0
##MAX=       1.6414764,     442901,          0
$$ Real data points
##PAGE= N=1
##DATA TABLE= (X++(R..R)), XYDATA
0@%%%%%%%Qj1J1j6J6k4L2m0M9n6P1q1R5j16J33j57J81k06K38k70L10l51L94m50
31b40N06n66O34p06P90q80R77j087J205j336J478j636J816k011K228k473K748
48A447l065L430l856M363m974N734o702P992r809J2566j7328K7820r2522Q8758
62A3854K56986N6998o0955j97766k25308j92686l5571J25495K44168K29944J29338
73C44497l1707j59482k26052j84415o8413R3665K10930K33311J38251q542j48967
84A93076k20785k03540q8225O4157J78976K01427J40210K0309j15465k09274k02071
95b41205r3722N5076J62900J94747J49851M6670q4042j81638j88825r6074M2303
106b33959J50996J84831J44004M9094o9835j67230j90173j14354J8983J30764
$$ plain form
0 0 0 0 0 0 0 0 0 8 -3 8 -8 8 -16 16 -24 25 -31 40 -41 54 -62 71 -86 95 -111 127 -143 167 -184 210 -240
31 -240 266 -300 334 -372 418 -462 515 -572 633 -703 775 -861 955 -1056 1172 -1301 1447
48 1447 -1618 1812 -2044 2319 -2655 3079 -3623 4369 -5440 7126 -10202 17618 -74904 13854
62 13854 270840 327838 266883 69117 -156191 -348877 -384448 -258953 -14785 215159 344497
73 344497 312790 153308 -72744 -257159 -325572 -231907 -20977 212334 350585 342043 193076
84 193076 -27709 -231249 -319474 -255317 -76341 125086 265296 285605 170140 -39134 -241205
95 -241205 -334927 -279851 -116951 77796 227647 274317 190275 8637 -180188 -276262 -233959
106 -233959 -82963 101868 245872 294966 225131 57901 -132272 -246626 -227643 -96879
116i6879J70859J35608M5856o8147j60762j83218j15971O391J17996J71225J49387
127A72345O2221n5597j47644j69807j10170J351J11938J75160J62364P6755m5877
138B33039j48012j75326j19807j4350R1491J60947J62956Q6805l8936j50824j88234
149a00251j37507l3868P7952J57837J71037J04990j5450j31179j83111j47574
159b37124m6115P1875J58642J82110J27948J3769j09467j77661j61433p2491M6990
170b02957J45275J81954J35770K6206r5586j73797j75894j03658J4494J25893
180a22300J77395J45126M6947o9794j55541j74013j15193m106J10976J76656J60912
191A77065P4710m0798j32165j63895j23323k5496Q7323J61803J61268Q6019k4293
$$ plain form
116 -96879 73980 209588 255444 187297 26535 -156683 -272654 -266263 -148267 22958 172345
127 172345 234566 178969 31325 -138482 -248652 -247301 -135363 39797 202161 278916 233039
138 233039 85027 -90299 -210106 -224456 -132965 27982 190938 277743 238807 87983 -100251
149 -100251 -237758 -271626 -193674 -35837 135200 240190 224740 93561 -89550 -237124
159 -237124 -283239 -211364 -52722 129388 257336 271105 161638 -16023 -177456 -249947 -202957
170 -202957 -57682 124272 260042 286248 190662 16865 -159029 -262687 -248193 -122300
180 -122300 55095 200221 247168 177374 21833 -152180 -267373 -271479 -160503 16153 177065
191 177065 251775 210977 78812 -85083 -208406 -233902 -146579 15224 176492 262511 238218
202B38218j19977j63288j36309m8258N9922J38160J50155R2408o949j03542j53494
213e2954j35383n6879M6771J27214J49316J04758J4951q0513j37137j27628n8316
224b05800L7873J16809J42668J05867K4142o9888j31712j31580p0410K1672J00255
235f0104J31413J01526K4570o6510j29597j33236p5542J4052R4852J31164J08880
246A41468L6464n3517j18618j27185p5584J1500R4539J36257J18990M8252m5335
257A67231j17170j32491q6798k374Q2803J31271J20915N3249m2335j19552j42629
268h7880j02817j9391P1691J30262J30396O8321k6244j08503j40796j09716k9469
279b24146O5085J33949J43762Q9440n174r4397j39099j20805m8232M7632J24192
$$ plain form
202 238218 118241 -45047 -181356 -229614 -169692 -31532 118623 211031 204082 100540 -52954
213 -52954 -188337 -245216 -198445 -71231 78085 182843 197794 117281 -19856 -147484 -205800
224 -205800 -167927 -51118 91550 197417 221559 151671 19959 -111621 -182031 -160359 -60104
235 -60104 71309 172835 197405 130895 1298 -131938 -207480 -193428 -98576 32588 141468
246 141468 177932 124415 5797 -121388 -196972 -185472 -90933 45324 164314 212566 167231
257 167231 50061 -82430 -169228 -171602 -88799 42472 163387 216636 174301 54749 -87880
268 -87880 -190697 -210088 -138397 -8135 122261 190582 164338 55835 -84961 -194677 -224146
279 -224146 -159061 -25112 118650 208090 202916 108519 -30580 -151385 -199617 -151985 -27793
290b7793J44499R9213P812q6421j40841j35166p1604K3488J07348J42033J09032
301A71600K6020o7749j30327j37291q3184Q686R8786J43082J22921M9042m3056
312A58530j14181j32852r0656o126Q2190J33555J24052O0176k9202j04869j33422
323e2805j03575k6660O0340J17323J18033O5064j6613r2728j27040j05879l5865
334b00405M9549J09755J19231P6185M78p4534j14753j00100l8031M2989J02677
345b6959J16697P9784Q350o7281j11031j03063m7638K9129Q9184J08615P7060
356A52847R147o4964j11179j06395n2843K2175Q5452J09259Q3025J8318n5282
367H9560j03473j02497n3575K1343Q6613J14822R2668K8358m8476j02046j07586
$$ plain form
290 -27793 116706 215919 223731 137310 -3531 -138697 -210301 -186813 -79465 62568 171600
301 171600 197620 129871 -456 -137747 -220931 -212245 -113459 29623 152544 201586 158530
312 158530 44349 -88503 -179159 -185285 -103095 30460 154512 214688 185486 80617 -52805
323 -52805 -156380 -183040 -122700 -5377 112656 177720 161107 68379 -58661 -164540 -200405
334 -200405 -150856 -41101 78130 154315 154793 80259 -34494 -134594 -172625 -129636 -26959
345 -26959 89738 169522 177872 110591 -440 -103503 -151141 -122012 -32828 75787 152847
356 152847 161994 97030 -14149 -120544 -173387 -151212 -65760 43499 126524 144842 89560
367 89560 -13913 -116410 -169985 -148642 -62029 52793 145461 173819 125343 23297 -84289
378h4289o3061J0658P9139J12767R4758L2846m7186j06134j17312p6919m592P0181
390i9144J12855J03669M5089l5041r8949j18460q4432j2286O6214J17630J16999
401A14144O3369j7633q8681j17867r3694k7333N2859J11326J19846P3682o421
412A83597q3115j21838j08675m7849L3406R8751J19096Q3073Q282o9357j16005
423b0634j12161n9087K0857R2047J21616R6488K8910m8690j02455j10298o6973
434a60380P709Q0537J16257R9467L9810l6414r5359j12101p9030j0755O1921J03419
446A5081R5784M5229k6146q6205j09438q2858j9230N1999R7420R8006N4980j1409
458A23213p1403r8444p9445k2151M6501R3412R7031N9079l317o4186r5892q2382
$$ plain form
378 -84289 -147350 -136692 -57553 55214 149972 182818 135632 29498 -87814 -164733 -169325 -99144
390 -99144 13711 117380 162469 127428 28479 -89981 -174413 -186699 -120485 -2855 114144
401 114144 177513 159880 71199 -46668 -140362 -167695 -114836 -3510 116336 190018 183597
412 183597 100482 -21356 -130031 -177880 -144474 -45723 73373 156446 164728 95371 -20634
423 -20634 -132795 -191882 -171025 -78978 42638 139126 168036 119346 16891 -93407 -160380
434 -160380 -152671 -72134 44123 143590 183400 146986 51627 -60474 -139504 -150259 -88338 15081
446 15081 110865 156094 129948 43743 -65695 -148553 -167783 -115784 -18364 79642 134622 123213
458 123213 51810 -46634 -126079 -148230 -101729 -8317 88714 147793 144476 80290 -15602 -97984
470i7984l0785L5421Q2744R0740N7088k573o3223r6403q5804l6917K8481P8602
482d0613R2368O2541M409n5324r0602q3838l6949K7608Q0585R7841P1862J3634
494A43522m9931r0292q7771m4177J9678P4916R6366P4714J8048m9278r5389r7682
506h7276n6839Q772O7753R6810Q1382K8291l9631r1163j00846o3837J603O6380
518h8601J01996R3055M4483k4666q2758j01542p3081j0227N7099R9056R7601N3277
530A65692j5983p8069j06040q6667k9140M0831R0413R8276O0866m028o7432j01930
542c3211r1840m0786K9221Q5275J02809P4148J3628n1915r1828q9712m7278J6985
554a24504P5832J00860P9999K3667m1688q6520r2462n8070J427O0251R0518P7981
$$ plain form
470 -97984 -128769 -93348 -10604 80136 137224 134651 71428 -24975 -110779 -147696 -119215 -40613
482 -40613 51755 114296 118705 63381 -27221 -111059 -148008 -120400 -39815 58026 129888 143522
494 143522 93591 3299 -84472 -128649 -108971 -34055 62311 137025 155073 105795 10406 -87276
506 -87276 -144115 -135343 -67590 29220 110602 138893 99262 8099 -92747 -156584 -154981 -88601
518 -88601 13395 106450 150933 126267 43509 -58033 -131114 -141341 -84242 14814 112415 165692
530 165692 149709 71640 -34400 -121067 -150207 -109376 -18963 79313 140179 136151 68719 -33211
542 -33211 -125051 -165837 -136616 -51341 51468 125616 139244 87329 -4499 -94211 -141489 -124504
554 -124504 -48672 52188 132187 155854 114166 27646 -64816 -122886 -121459 -61208 29310 107291
566A07291K9428l3445q0527r1908o2468o471N1039Q4631Q0361L9622j9884o8793
578B8876q4483o0840q106M6871Q1948Q0524M4196j1610o2183q2879o3907j6252
590a07845L8990P4375P4854M1836j0949o0461q3730o8683k2774L2870P1228P6531
602E6242M5488m952n4339p9826o7526k3169L2022P4095Q2314N4287K421n0258
614F6799p8558p0651k9549K5982O9920Q3210N7860N348n0502q3639p9848m0506
626a24134J6417O4238Q3405O4322J4360m4176q2477q3311m6584J0566O2968Q8882
638B4476P5964K8353l1791p6603q5067n4363J140N6829Q7586Q1062L7544k3524
650A21606p4266r0782o6716j4237M2830Q0942Q2586M4567j3974o6646q9669p2829
$$ plain form
566 107291 136719 103274 22747 -69161 -131629 -138100 -87061 -2430 77931 117553 97669 28876
578 28876 -55607 -116447 -124553 -77682 4266 84790 128986 117376 55193 -27686 -91593 -107845
590 -107845 -68855 5520 80374 122210 111261 50800 -32930 -101613 -124387 -91517 -20289 56242
602 56242 101730 96778 42439 -37387 -104913 -128082 -96060 -21965 60349 114636 117057 66799
614 66799 -11759 -82410 -111959 -85977 -16057 67153 125013 130361 79859 -3780 -83628 -124134
626 -124134 -107717 -43479 39926 104248 118608 74432 -8045 -91356 -137940 -127374 -64406 24476
638 24476 100440 128793 97002 20399 -64668 -119031 -117891 -61062 26524 107586 145130 121606
650 121606 47340 -43442 -110158 -124395 -81565 -623 81963 126530 112556 45910 -43759 -116588
662a16588k4942L3930P7269Q6707N7039J510n3565q1741p3302l1579K4682P1006
674b9574Q7073O3317J0773m4452p7552p6423m1716J0693N8810P9449O1911J5555
686A17864l7096p2717p7224m8240K362N1471P5768O4263K4255k5681o3024p1484
698e9483m6960m53M7666P4520O7160K9448j9761n7378o8531n0338p707M0633O8909
711A7725O3285K7733j8899n6236p0861n4553j3333L4682O5611O3784L2588j3334
723G8192n3210o8796n3411j3446L4091O8001P0183M0497p052m9307o8537n6902
735g9697j7870L0549O6283O9909M2800k944m8478p4064o6739k7735K3330O1236
747b3420P0668M8827L765m4004p4192p0768l4898J8468O2114P7058N8790J5659
$$ plain form
662 -116588 -141530 -107600 -30331 56376 113415 114925 61360 -20381 -93683 -125262 -100580 -29574
674 -29574 57499 120816 131589 87137 9585 -66838 -108554 -97861 -39051 40398 102309 117864
686 117864 80768 8051 -69173 -117413 -115051 -63580 12188 76451 100706 75025 12001 -59483
698 -59483 -106443 -106896 -59230 15290 82450 111898 92137 34759 -33772 -84110 -91817 -51184 17725
711 17725 81010 108743 89844 33608 -37253 -91806 -105139 -70457 -4846 58938 91526 78192
723 78192 24982 -43814 -97225 -110671 -76580 -8579 61604 102101 95049 45742 -22795 -79697
735 -79697 -97567 -67018 -735 69174 111974 109030 60552 -13512 -80251 -107986 -84656 -23420
747 -23420 47248 96075 99840 55836 -18356 -89124 -124022 -105554 -43440 33618 92408 108067
759A08067l3767o8769p3370m2076J0373N8064P7852O4663K4013k7058o7697p8480
771d8185n2768l716M5387P3639O7748L0517k0182o2792p7965n9787j4245L7243
783h5106P1464P2819M2378o912n2573p3278o0026j8922K9900O5460P3860N0194
795A09258K494m5009p0969o2760k8443J7598N5431O8217N0221P252l8844o8109
807c663o5583l4724J0481M8860O4594N2284J5891k9191o0238o2066l4017Q019
819h9353M6543O4871N4472K0519k3049n4424n9830l7629K111M0861O0058N1704
831G6854J9774k1699n3942o2217m2738l782L5820N8237N3283K2621j8980n1437
843A1794o0592m1812m649L5779O1373N8561K9293j3045m7349o0267m4951q421
$$ plain form
759 108067 74300 5531 -67839 -109915 -99542 -41478 36374 101037 125050 97992 30295 -48185
771 -48185 -100953 -104669 -59282 14357 82105 112622 92440 29648 -48317 -108104 -122349 -85106
783 -85106 -13642 59177 101555 94643 42070 -31208 -91234 -110156 -80256 -14796 59064 109258
795 109258 111752 66743 -4226 -66986 -95429 -77831 -22400 45817 96038 103290 64446 -3663
807 -3663 -69246 -103970 -93489 -44629 19965 72249 88140 58949 -1289 -63355 -97372 -89353
819 -89353 -42810 22061 76533 97052 74003 19579 -40251 -77880 -75769 -34908 25150 76854
831 76854 96628 74929 20987 -41230 -83968 -87750 -51930 6307 59590 82211 63231 11794
843 11794 -48798 -90610 -95259 -59480 1893 60454 89747 76702 29353 -30914 -75865 -84286
855h4286L3029N9827O0499L2956j0141m8874o5384n2776j6978K5911N6515O1714
867E2012L8044m942m5772o6382n7916k3300K2063N7330O7375M7380O088l7360
879E4620o3625o0011k8957J6152N4163O8851N3867J4158l1556o2944o5444m0031
891i0757L561M5683O6048N6418J9894k5323n9704o8128m6727n043L8832O4048
903a198O0895L0431j3390n0781o4544m8255j0424L2774O1524O3489L7400n239
915I2682m3752o1877n2309j9241K2614N3121N9190L8269l31l9087o0630n4970
927f6321k5587J4873M7290N7629M0984N846l1754n3504n1794k5752J2358M5353
939c0379N7446M4216J1344k5397m9322n0490k8246P758M0260N3841M2768J1445
$$ plain form
855 -84286 -51257 8570 69069 102025 91884 43010 -22374 -75150 -92128 -66217 -9702 52012
867 52012 90056 85114 39342 -27040 -84956 -108256 -86193 -28863 38512 85892 91980 54620
879 54620 -9005 -69016 -97973 -81821 -27658 41193 95060 109218 77662 14718 -50726 -90757
891 -90757 -87196 -41513 24535 80953 100847 75524 15820 -52308 -99035 -104078 -65246 -1198
903 -1198 59697 90128 76738 25957 -38587 -86842 -97266 -64492 -2968 60521 97921 92682
915 92682 48930 -12947 -65256 -84497 -61883 -8762 50428 88697 88366 49279 -11351 -66321
927 -66321 -91908 -77035 -29745 27884 68868 74714 42960 -10544 -62338 -88090 -75732 -30379
939 -30379 27067 71283 82627 57230 7908 -42582 -70828 -63070 -22810 31031 73799 85244
951H5244k4918n0131n2684l2554K805L5399N1750M2866J4446k2153m7394n3033
963e0357l2625J801L6367N4513M7777K0001j6151m4965n2567l5017o60L4301N4425
976A6843M9806K3558j4145m6165n7239m2862q203K8960N2376N1221K7217j0631
988G0736m4088n9324m6941j4837K5669N3438N6764L6146j312l7405n7024n0091
1000f8269j9250K0397N1691O0230M2631N458l2773n7120n4831k9400J0546M4154
1012b6536N8210M5439J1236k8115n5548n7913l6112K135L8359N7535N0351K0360
1024G9401j8370m8351n5556l8090k708L3470N5966N3609K7425j0635m2639n4130
1036b0608m1700j0178K5175M9095N0926K8616o305l8956n3933m4579j6704J8000
$$ plain form
951 85244 60326 10195 -42489 -75043 -72238 -36839 14911 57777 72223 50070 2676 -50357
963 -50357 -82982 -81181 -44814 9699 57476 77477 61326 16361 -36206 -71223 -71883 -37582 16843
976 16843 66649 90207 76062 29897 -27342 -70204 -78407 -49447 2929 54150 81367 70736
988 70736 26648 -32676 -79617 -94454 -68785 -15347 41417 77563 76251 38846 -18178 -68269
1000 -68269 -87519 -67122 -15431 44799 87430 92888 60115 2995 -51836 -81236 -70690 -26536
1012 -26536 31674 77113 88349 60234 4686 -53227 -89339 -87204 -48845 8690 59041 79401
1024 79401 61031 12680 -42876 -80966 -83674 -50204 5762 59371 86796 76161 33522 -20608
1036 -20608 -62308 -72486 -47311 1784 52710 81326 75021 36065 -17868 -62447 -79151 -61151
1048f1151M4512M9110L1153o40l2476m8648m2605j7381J5795M2855M9733L4706
1060F4963M486k6429m4769m2064j9790J2278L8826M7502L3743M558k6309m4944
1072B051m4794k3442P807L4623M5229L3982O603k3450m3940m4667k4936O988L5719
1085c2227M8141L8259J2052j9544m1356m4504k6591M877L4666M8787M0793J5637
1097G8990j7823m2912m8904l2806k227L0101M7433M2536J8459j5030m2403n1175
1109c5761l8074o803K6949M8732M7990K6674p565l6778n0627m0308j1591K3513
1121e3649M8360N1675L2469n28l3533n0936m5391j9726J5015M2279N0473L5439
1133G1947M586k9293n0847m9576k6247P541L7841N0227M0296J2264k1122m5280
$$ plain form
1048 -61151 -16639 32471 63624 62984 30508 -18140 -60745 -78126 -62331 -19476 30257 64963
1060 64963 69449 43020 -1749 -43813 -63603 -51325 -12499 35003 68746 73304 46995 2051
1072 2051 -42743 -66185 -58378 -23755 21474 55456 62059 38609 -5331 -49998 -74934 -67946 -32227
1085 -32227 15914 54173 66225 46681 5325 -39179 -65770 -60893 -26227 22560 63353 78990
1097 78990 61167 18255 -30649 -63455 -65682 -35581 11852 54388 72847 57817 15414 -35761
1109 -35761 -73835 -80638 -53689 -4957 43033 69707 62142 25364 -25263 -65571 -77162 -53649
1121 -53649 -5289 46386 78855 78327 44794 -6142 -51533 -71259 -56244 -13965 36508 71947
1133 71947 76533 47240 -3607 -53183 -79430 -71889 -34048 16179 56475 68739 47617 2337
1145B337m8022k9094L343L3948N0130M3652J9428j4027l9824m7615l2571l615
1157f1930K6939M4516M2606K1022j0475l7081m7673l6308r352K0377M0492M1019
1169C4152K3703n587l1734m3558l5277j0696J9255L8800M2668K6707k91k7144
1181C0998m0156l4554j2626J5592L6024M0944K6580m03k6091m0546l7185j6393
1193e7816J1400L2770L9125K6561J724k5080m0611l6720j7195R976L3343M1803
1205A9280L1086O280k1567l8490l7100j8991R223L2903M3140L3616R337j9988
1217D8729m0051m1684k4222L359K9382M2004L5723J1942j7731m0847m4544k9168
1229f7108j016K7534M3260M0206J8750j1280l6272m4434l2196m675K5155M4183
$$ plain form
1145 2337 -45685 -74779 -71436 -37488 12642 56294 75722 61695 21871 -25744 -58315 -61930
1157 -61930 -34991 9525 52131 73153 62678 25597 -22076 -58384 -67736 -47359 -6867 34152
1169 34152 57855 52268 20534 -23024 -58301 -68997 -49742 -10942 31726 58433 58142 30998
1181 30998 -9158 -43712 -56338 -40746 -4722 36222 62802 62399 36308 -4238 -41423 -57816
1193 -57816 -46416 -13646 25479 52040 53764 28684 -11927 -48647 -65842 -55866 -22523 19280
1205 19280 50366 56646 35079 -3411 -40511 -59502 -50279 -17376 25764 59380 68717 48729
1217 48729 8678 -33006 -57228 -53869 -24487 17517 53240 65182 47451 6604 -37940 -67108
1229 -67108 -68124 -40590 2670 42876 61626 50346 14074 -30360 -62556 -67231 -42076 2107
1241B107M3990K4657n514l2561m5626l7184j2256J8034M0440M3481K7360j405
1253F5523k9713m5788m1228j9487J1724L6074M4657L1897N407k3407m1286m0278
1265d5905k1824P051L3072M5234L5980J1991j7183l7010m0046k4891P43K7275
1277b5513M1047L5925J4181j4009l5393m1081k8272m539K1323L6761L5498J6896
1289E2824r547l1140l8565k8148n261J9654L5924L6127K0294m342k6456l5822
1301a4458k7795p329J7835L3751L4530K0167l382k5560l6574l0630j1108J4154
1313c6399L1157L3376K0118k902k4612l5798l1650j2239J2658L2588L6352K3984
1325D6633L91k1734l4376l1019j3702J1754L1907L8477K7087L344k1088l5874
$$ plain form
1241 2107 46097 70754 65240 32679 -12947 -50131 -62387 -44353 -3913 39568 66928 65523
1253 65523 35810 -9978 -51206 -70693 -58969 -22895 21762 53659 59066 35659 -5627 -45905
1265 -45905 -67729 -60678 -27606 17628 53608 65599 48416 11406 -28640 -53531 -52788 -25513
1277 -25513 15534 51459 65640 51631 16238 -24843 -53115 -57654 -36331 430 35928 52824
1289 52824 43277 12137 -26428 -54576 -59837 -40183 -4259 31868 52162 47820 21364 -14458
1301 -14458 -42253 -49582 -31747 2004 36534 56701 53319 27759 -8815 -39445 -50553 -36399
1313 -36399 -5242 28134 48252 45350 20738 -15060 -46710 -58949 -46291 -13703 22649 46633
1325 46633 47024 25290 -9086 -40105 -53807 -42053 -10146 28331 55418 58762 37674 1800
1337A800l4930j8289O845K9517L7741K8681O381k0487l7296l8237k2256L133K7401
1350b9996L8821L3432J2022j4352l4401l8647k4920l78K5985M0362L7165J7629
1362F2722q696l1942l9916l0447n941K0646L7202L6897K1030n634k9116m1593
1374a4788l4529j2275J4848L4066L7733K4815N27k3930l7884l4818j5435J0950
1386e0720L2454L9191K8939O649j8555l4014l4940j8915N983K7019L6933K9277
1398D9301Q579j5886l3340l4838k2676M06K2152L3608K8645J0904j1859k9635
1410E361l3574k2448j309K0603L2431L0550J4944p911k5761l1317k2116k299J8065
1423b4781L1167K9789J5330o715k5281l2374k4155o243J5695K8598K8502J4816
$$ plain form
1337 1800 -33130 -51419 -44574 -15057 22684 51365 57746 37259 -37 -38274 -60530 -57397 -29996
1350 -29996 8825 42257 54279 39927 5526 -33121 -58041 -58419 -32434 7928 45093 62722
1362 62722 54026 22084 -17832 -48279 -54220 -33574 3628 40525 61555 55921 26805 -14788
1374 -14788 -49317 -61592 -46744 -12678 25055 49870 50397 26467 -11417 -46235 -61670 -50720
1386 -50720 -18266 20925 49864 56513 37958 3944 -30996 -49911 -43928 -16909 20024 49301
1398 49301 57880 41994 8654 -26184 -48860 -48454 -26302 7306 35951 46855 34996 5361
1410 5361 -28213 -50661 -51970 -31367 1064 31614 46558 38647 12886 -18431 -40547 -42846 -24781
1423 -24781 6386 36175 51505 44790 19509 -12865 -37020 -43263 -27568 1030 29532 44348
1435D4348n915k4477l2414k5820o563J4725K9009L0508J8303k328k2251l1239
1447a4114k5589q310J3773L0616L2913K0927n07k1214l2426k9196j2536J0352
1459c5311K7885L3291K2349J461k0751l3740l2699j6587O646K6517L4245K6921
1471D0227P163j6849l1833l2900j9468L701K5630L6786L0502J1732j1409k9754
1483A3528l4379k4087j082K0927L3970L1590J5240q886k8481l6267k7692p328
1495e2947J5464L1728L2748J9025l583k4105l4031k8779j0382J3174L0387L3704
1507B2403K2904K895j9235l1634k8723j3267Q941K5894L1897K3911M641j6771
1519C3856l0580l0107j6940L819K1683K9312K3845O644j3523k7463k9409j7171
$$ plain form
1435 44348 38433 13956 -18458 -44278 -50841 -36116 -7107 23401 41704 39376 17125 -14114
1447 -14114 -39703 -48013 -34240 -3624 29289 50216 49709 28495 -3931 -33127 -45663 -35311
1459 -35311 -7426 25865 48214 49675 28924 -4816 -37515 -54102 -47456 -20939 13306 40227
1471 40227 47390 30541 -1292 -34192 -53660 -49959 -24329 12457 42959 54691 43282 13528
1483 13528 -20851 -44938 -46020 -25093 8877 40467 55707 46821 18340 -17927 -45619 -52947
1495 -52947 -37483 -5755 26993 46018 42435 18330 -15701 -44480 -54862 -41688 -11301 22403
1507 22403 45307 48202 28967 -2667 -31390 -44657 -35716 -9822 22075 45986 50627 33856
1519 33856 3276 -26831 -43771 -39952 -18269 11043 34888 41532 28009 546 -28863 -46034
1531d6034J900K0228K8986K5116J0129r850k4395k6986j6661K96J9030K7818K5483
1544C5060J0540r189k3769k7493j9471j739J5888K5809K4316J0359q015k3935
1556H361k8607k0268l294J4969K6173K6498J3689n513k1886k7335k0762l821J4753
1569b7043K7830K8339J5932l495k0824k8601k3852q039J2382K5960K8437J7649
1581D4675k196k0380l0681k7481j1542R032K4993L0402K1019K351j7553k8965
1593f326k7951j4320O370K5582L1861K5480O986j3638k7608k9740j7627J950K1373
1606a7608L0858K6471R983j1450k6770l1154k2556k657J6722K9029K7030J3394
1618D1292o093k3858l0307k3122n597J4183K8092K8944J7719j333j9291k8491
$$ plain form
1531 -46034 -44134 -23906 5080 30196 40325 30475 6080 -20906 -37567 -37271 -18241 9577 35060
1544 35060 45600 36411 12642 -14851 -34322 -36061 -20173 5636 29952 40311 32296 8361
1556 8361 -20246 -40514 -43808 -28839 -2666 23832 37521 32008 10122 -17213 -37975 -41796 -27043
1569 -27043 787 29126 45058 41563 20739 -7862 -31714 -39753 -27371 -1411 27026 44675
1581 44675 42479 22099 -8582 -36063 -47605 -38573 -13580 16822 37841 40192 22639 -6326
1593 -6326 -34277 -48597 -42227 -16645 15216 40696 47682 34044 6436 -23304 -40931 -38981 -17608
1606 -17608 13250 39721 49704 38254 11484 -19670 -42226 -44883 -28161 868 27898 41292
1618 41292 35199 11341 -18966 -42088 -47685 -33502 -5410 23534 41253 39920 20629 -7862
1630g862k3471q512J0847K5024K7988J8586J073j7192k8071k5186j1972O948K0748
1643a1052K5759J8599K889j4368k5914k4880j2826M476K0434K5727K0120N729
1655C4693j1366k2680k2777j2845L655J8328K5703K0662O288j0478k1956k3670
1667a6443j4348P24J6135K3701K0062O437j0386k2412k4510j6062k28J5459K4094
1680B223K1743R152p626k1126k3999j6038n14J5443K5271K3969J1531o009k0020
1693A4000k5516j8600l988J3489K4342K4227J2782m936k0209k7249k2109p735
1705d1502J0756K3842K5760J6016j091j7598k6342k3888r435Q799K4322K7809
1717A7448K0021L128j4513k5235k5398j2957M865K1588K7444K1506N599j2139
$$ plain form
1630 -7862 -31333 -39845 -28998 -3974 24014 42600 43673 26481 -1590 -26776 -38748 -31800 -11052
1643 -11052 14707 33306 36195 21827 -4087 -28967 -41793 -37317 -16883 8844 28964 34693
1655 34693 23327 647 -22130 -34975 -31320 -12992 12711 33373 39661 29183 7227 -16443
1667 -16443 -30791 -30067 -13932 9769 29831 36268 25882 3470 -21040 -37102 -37330 -21871 2223
1680 2223 23966 33118 25492 4366 -19633 -35671 -36185 -20742 4529 28498 40029 34020 14000
1693 14000 -11516 -30116 -34104 -20615 3727 27954 40736 35800 15591 -11658 -33767 -41502
1705 -41502 -30746 -6904 18856 34872 33781 16183 -10159 -34047 -43482 -34683 -10361 17448
1717 17448 37469 40597 26084 849 -24549 -37506 -32641 -11053 16391 37897 43496 31357
1729C1357k5062k7507j7320N87J7643K6102K2404R209q782k3016k6811j8188k530
1742d1914J5806K5091K4997J2868m404j8968k4948j8985m971J2531K3111K4476
1754B4690J4505k109j7273k4806k0773p895Q081K0211K2339J4818l25j5104k3889
1767g530k0683q850O877J8508K2491J5871L053j2113k1260j9431q996O005J8284
1780g774K1823J6988L458j1137k0746k0122j0570L582J6087K1058J5805L535j1314
1793B0673k1058k0912j2115K323J5579K1573J7745N415r329j9656k0981j2520
1805c3263J701J5898K3468J9699P865p683j9672k1804j4843m07J4141K2270K0761
1818B8131Q926p051j9616k4080j7908l746J1825K1931K2180J1538l749j8051k3920
$$ plain form
1729 31357 6295 -21212 -38532 -37945 -20302 5800 28204 37413 28631 5615 -21196 -39384 -41914
1742 -41914 -26108 -1017 23980 36848 32444 13476 -11472 -30457 -35428 -22897 214 24690
1754 24690 39195 37086 19813 -4993 -25766 -33661 -25580 -5369 16970 31788 31463 16359 -7530
1767 -7530 -28213 -37063 -30186 -11678 10813 26684 29737 17624 -3636 -23067 -32063 -26058 -7774
1780 -7774 14049 31037 34495 23358 2612 -17510 -28080 -24498 -8411 12647 28452 31987 20673
1793 20673 -385 -21297 -33412 -31089 -15510 6063 23808 29223 19894 238 -20743 -33263
1805 -33263 -31562 -15664 7804 27503 35368 27685 8013 -13791 -28634 -29041 -14900 7370 28131
1818 28131 37057 30006 10390 -13690 -31598 -35344 -23519 -1588 20592 32130 28381 10330 -13590
1831a3590j9378o071J0682K2583K4357J5827O9j5577k3155k0857r005P695K0722
1844e698K4618J6963K426j3494k3264k3579j2791L635J7650K3021J8570N182j0186
1857B3053k1963k3708j4291J154J5657K2940K0831R131o492j8509k2204j5192
1869b9593j137J3167K1492K0688J0906m296j7147k1930j7308m299R699J8729J9820
1882A8791J1026k570j5993k1049j7376n515P669J8051J9471J2950k33j3011j8965
1895f754j6183n884P255J7140J9920J3147J372j2392j8854j6357p415N205J5344
1908d456J8853J3063N97j1965j9328j7785q632L862J5321J9057J4299K337j0657
1921A4566j8240j7522r315M014J5336K0970J6463M443r064j8451j8598j0834J528
$$ plain form
1831 -13590 -32968 -39039 -28357 -5774 18583 34410 34479 18902 -4253 -25110 -34115 -26420 -5698
1844 -5698 18920 35883 38309 24815 1551 -22028 -34819 -31184 -13534 9487 28057 33239 23053
1857 23053 1090 -22618 -36909 -35755 -20098 2842 23673 32804 26312 7803 -14401 -29593
1869 -29593 -30730 -17563 3929 24617 35523 31227 14080 -7850 -25158 -29457 -19758 -1029 18791
1882 18791 29817 27247 11254 -9795 -27171 -32686 -25017 -6966 12505 25455 25222 12211 -6754
1895 -6754 -22937 -28821 -21566 -4426 15494 28641 30013 17621 -1233 -17590 -25005 -19800 -4456
1908 -4456 14397 27460 28057 16092 -3236 -21021 -29653 -25791 -10470 8587 22886 25223 14566
1921 14566 -3674 -21196 -30511 -26497 -11161 9809 26272 30715 21651 3200 -15398 -26232 -24704
1934b4704J4437K0481J7495N456q224j8842k0892j4495j106J2523K0290J8862
1946B1281P888n972j7249k1467j5879l179J1509K1344K1315J1506k425j5382k0664
1959g374j7584n565R113K0162K1317J3118j97j3942k1036j9717r651N657J7521
1972h178K0570J4343K529j1234k0388k0186j1313L468J5589K0851J7019N519p419
1985B1170j7866j9518j1958J406J3812J9694J7548P464n896j6110j9704j3386
1997b3344j805J0644J7302J6288Q197m283j5395j9281j4207k839Q978J6522J6714
2010A3491R788k349j2917j7468j3290l112Q687J6262J6660J0335p79j2454j6677
2023c823j4063m678P201J4820J6347R780j075j2411j7653j4885n878N741J4198
$$ plain form
1934 -24704 -10267 10214 27709 33165 24941 6099 -14793 -29288 -30394 -17871 2419 21281
1946 21281 29169 23197 5948 -15519 -31398 -34577 -23068 -1724 19591 31097 28672 13290 -7374
1959 -7374 -24958 -30523 -21410 -1248 20069 33187 32990 19048 -1988 -21705 -31356 -25699 -8178
1972 -8178 12392 26735 29264 18030 -2358 -22544 -33857 -30389 -14800 6051 23070 28589 21170
1985 21170 3304 -16214 -28172 -26766 -12954 6740 24288 31752 25856 9746 -9958 -23344
1997 -23344 -25149 -14505 2797 19085 27282 22999 7604 -11677 -25884 -28723 -19745 -3223 13491
2010 13491 23279 20930 8013 -9455 -22745 -25857 -17170 -908 15752 26087 25308 12854 -3823
2023 -3823 -17886 -22564 -15363 -543 15804 25584 24509 12098 -5555 -20440 -26318 -20577 -6379
2036f379J6906J1299J5j1374j7146j4877o144N408J4926J8523J3107K234j0329
2049A6169j6600j6042p756L948J4245J8402J4231K809r452j8054j7833j0583J038
2062b5478J2804J8266J5680N349p487j7664j8569j2303k02J2315J9041J7498Q711
2075B7961m724j4847j8664j3821l275J0646J8725J8784R768k112j4201j9219j6573
2088b1552n917P138J6319J8532J1310j65j2238j8463j7300q042M702J5582J8585
2101H491J3795K395q920j6387j6873q638L368J3867J7620J4710M663p112j5535
2114E444j6713j0517O15J0807J6117J3741N549o007j5330j6380j1036j073R687
2127a5096J5601J3726O446m027j2687j5185j0790q91R352J5076J4267P853k534
$$ plain form
2036 -6379 10527 21826 21841 10467 -6679 -21556 -27700 -22292 -7366 11157 24264 26498 16169
2049 16169 -431 -16473 -24229 -20281 -6036 12366 26597 29406 19954 1900 -15933 -26516 -25478
2062 -25478 -12674 5592 21272 26621 19134 1470 -17099 -29402 -29604 -17289 1752 19250 27961
2075 27961 23237 8390 -10274 -24095 -27370 -16724 2001 20785 30553 28441 14240 -4979 -21552
2088 -21552 -27469 -20331 -4012 14520 25830 25665 13427 -5036 -22336 -30378 -25676 -10094 8491
2101 8491 22286 24681 15761 -626 -17499 -26137 -22769 -8902 8718 23428 28091 20979 5444
2114 5444 -11269 -21786 -21171 -10364 5753 19494 25043 19036 3706 -12674 -23710 -24783 -15096
2127 -15096 505 14231 20677 16650 3963 -11222 -22012 -22903 -13551 1525 15792 23645 21111
2140B1111j1917j5346j0945k446P618J4354J3631P838l292j1798j5900j2686l444
2153b3222O929J3879J4150Q290j799j1290j5549j2431m044O587J4539J5752J0498
2166B2289J80j0366j5362j3817n103N405J3927J6633J1084P51j0009j6217j5510
2179a6115q073L335J2639J6386J2738K930q768j6327j6267r776J506J2336J7832
2192D376J4819N521o131j4315j6583j0847l60J1146J6940J5888P581m081j3813
2205A0141j7135j3599l482Q240J5442J5794Q971k560j2070j6852j4703n409O144
2218b1078J4537J6604J0430R88r364j5502j4360o495M917J3384J5973J2290K710
2231B5034p931j4793j4401p648K085J0809J4902J1480K674o737j4245j4157q908
$$ plain form
2140 21111 9194 -6152 -17097 -19543 -11925 2429 16060 23898 20606 8808 -7092 -19778 -23222
2153 -23222 -16293 -2414 11736 20026 18227 6937 -8612 -21043 -25087 -18500 -3961 11791 22289
2166 22289 22469 12103 -3259 -17076 -22179 -16774 -2847 13786 24870 25621 15612 -605 -16115
2179 -16115 -24188 -20853 -8214 8172 20910 23840 15072 -1255 -17522 -27298 -25792 -13456 4376
2192 4376 19195 24716 18585 4270 -12313 -23160 -23520 -12374 4566 20454 28035 23954 10141
2205 10141 -6994 -20593 -24075 -15835 -393 15401 24372 21812 9742 -7110 -21813 -27222 -21078
2218 -21078 -6541 10063 20493 21481 12117 -3385 -17745 -24240 -19323 -5939 10034 22324 25034
2231 25034 17103 2310 -12091 -19739 -17654 -6845 8057 19537 22211 15474 1229 -12928 -21836
2244b1836O18J0069J3541J1799M540n067j2681j3357q276N41R393J3695J2499
2257A5478N696l932j1361j3268r043n83Q136J3553J1973N040m106j1729j3813
2270g959j0325j669P271J2511J2600O169l410j1419j3564j0392j814P047J3352
2283a602J4187P875j710j0556j3855j0826l432O329J3767J3977R408j344r736
2296A2482j5166j3050n845M350J2391J4860R790R81r543j4793j3971p086K669
2309b1931J2304J5937J2206L255o916j3787j4534q405J304J1361J5792J3200N139
2322B4925n086j3116j5443j0844j056Q797J4429J3667O229l971j1900j5076j1912
2335b0357l722O818J4098J3911Q443j170r727j4133j1867m008N853J2780J3975
$$ plain form
2244 -21836 -21218 -11149 2392 14191 18731 13664 983 -12374 -20650 -20109 -10716 2979 15478
2257 15478 21174 17242 5881 -7387 -16430 -17013 -8877 4676 16649 21689 17583 5854 -7959
2270 -7959 -18284 -19953 -12682 -171 12429 18598 15188 3769 -9795 -20187 -22001 -14954 -1602
2283 -1602 12585 20460 18750 8194 -5661 -16487 -19919 -13590 177 14154 23562 22218 12482
2296 12482 -2684 -15734 -21579 -17229 -4838 10022 19812 20793 11250 -3543 -17514 -24600 -21931
2309 -21931 -9627 6310 18516 21771 14855 1068 -13466 -21871 -20567 -9206 6586 19786 24925
2322 24925 19839 6723 -8720 -19564 -20620 -11823 2606 16273 22502 18531 6631 -8445 -20357
2335 -20357 -24079 -17261 -3163 10748 19191 18021 8294 -5839 -17706 -21714 -15861 -3081 10894
2348A0894R709O84p921j3601j2312n418L613J0653J2914R329J436p256j3106j2858
2362a3240o526K010R603J2381R684K645n831j1950j1490o498J901R409J2410J0211
2376A4719L917m772j1100j1487o617P59Q829J1512J0183L672m829j1290j2301
2389h805q059j78P896J1318J0634M169m397j0914j2616p837o03P742J2158J1928
2403A2436N899k954j0229j2652q439j492P095J2358J2384P093k173j0277j3908
2416d859j0421l725N423J1865J2644P989j105r228j3670j2594m759M356J1815
2429f269J3814R934J297p568j2678j2374o439K857J0747J4716J1176L013o093
2442A6133j2394j3390q533P30Q840J3266J1403M719m908j1869j3533j0064j607
$$ plain form
2348 10894 20603 21287 13366 -235 -12547 -17965 -14352 -3699 9215 18544 19980 12724 -382 -13240
2362 -13240 -19766 -17756 -8153 4228 13912 16557 10726 -1224 -12714 -19212 -17311 -7902 4508 14719
2376 14719 18636 13864 2764 -8723 -15340 -14581 -5752 5760 15943 19615 14786 3496 -8805
2389 -8805 -16864 -17042 -9146 2172 12806 16975 12578 1664 -10952 -18789 -19392 -11650 508 12436
2403 12436 18335 15381 5152 -7500 -15939 -17431 -10336 2022 14406 21499 19326 9049 -4859
2416 -4859 -15280 -19005 -13582 -1717 10927 18916 17811 8583 -5087 -17681 -22440 -18084 -6269
2429 -6269 7545 17479 18776 11208 -1470 -13844 -20283 -17426 -6679 8037 19213 22226 16133
2442 16133 3739 -9651 -18184 -17454 -8614 4652 16055 20774 15866 3997 -9536 -19600 -21207
2455b1207P397J2897J2772N610k604r679j2516r593k575O103J2264J2818P316
2468A9003j028q095j2029j0539l896M626J0636J1423P609n5p738j2229j0719m698
2482a7729L369R055J1003P919Q22o596j0596j0401m918L614Q942J1274Q362J869
2496A5989n191j0118j0032n117K146Q633J0905Q056K168n640j0373j0638o341
2509a5553J605P552J0486Q588K350m949j0365j0773o839J137P611J1420R952L886
2523A6108l832r805j0878o999oP335J1758J0802N092l617r702j2049q982j682
2537a6457O135J1151J0887O314k173r989j2495j0418k729M985J1253J1837Q219
2550A6520n78p684j1858j0639m133L757J0767J2824R001J641o657j2018j1428
$$ plain form
2455 -21207 -13810 -913 11859 17469 14865 5186 -7330 -16923 -19498 -13395 -1131 11687 19003
2468 19003 17975 9880 -2149 -12688 -16584 -11958 -1322 10101 17710 17655 9917 -2312 -13031 -17729
2482 -17729 -14360 -5305 5698 13617 14439 7843 -2753 -13154 -18072 -14458 -5516 5758 14120 15989
2496 15989 10798 680 -9352 -14469 -12323 -3690 7215 15271 17439 11799 1426 -9212 -15553
2509 -15553 -13948 -6396 4090 12678 15028 10079 -286 -11059 -17898 -16761 -9150 2270 12222 16108
2523 16108 12276 2471 -8407 -15406 -15412 -8077 3681 14483 19575 15958 6256 -5793 -14775 -16457
2537 -16457 -10322 829 11716 18030 15857 5868 -6627 -17045 -19774 -14789 -3536 8301 16520
2550 16520 15942 8258 -3600 -14239 -18372 -14615 -3848 8976 17977 19618 12961 943 -10485
2563a0485o077J880R213J1831R652K492n508j1088j2391p379l85Q059J1553J0509
2577A1876L877l569r387j0974q531n95O685J1677J0652N633k290q280j0803q439
2591a2468k011N241R804J0288N852j474p814j0837r018l320L903R122R741N837
2605A2846o96o692r780q374l435L818Q730J0051O682M86n190r466q653l668L636
2620i705Q125R497O691P71n855r609r136m849K364P536R254P170J015n098r942
2635a771r883n049K291Q086R912Q165K469m674r037r443n912J514P631J0795R107
2650A4201K971l674r634j0688p184j70O713J0201R078M427l430r081j1360q141
2664a5771j755N402J0446J0479O263j464q352j0916q397k766M825R962J1557O956
$$ plain form
2563 -10485 -16562 -14682 -5469 6362 16014 18506 12998 1910 -10481 -17860 -18245 -10186 1367 11876
2577 11876 15753 12184 2797 -8177 -16708 -17303 -10618 1059 11711 17344 15054 6774 -4029 -12468
2591 -12468 -14479 -9238 566 10854 16706 15232 7418 -3419 -12437 -15757 -11854 -2732 7009 12846
2605 12846 12150 5458 -4322 -12696 -16131 -12313 -3583 6468 13150 13636 8446 -1020 -9673 -13341 -9705
2620 -9705 -1580 7917 14608 15379 9524 -85 -9221 -14070 -11706 -4170 5084 12254 13269 8171 -1771
2635 -1771 -11654 -16703 -14412 -6326 3586 11751 14220 9546 509 -8934 -14846 -13332 -5701 5094 14201
2650 14201 17172 13498 3864 -6824 -14008 -14178 -7465 2736 11814 16241 12811 3730 -7630 -15771
2664 -15771 -17526 -12124 -1678 8801 15064 13600 5248 -5668 -14065 -16831 -12006 -2044 9513 16469
2678A6469N93p304j0570r661m601K715Q993J0932P769J216o151j0556j0339o043
2692a6538J262P718J0529Q524K832m539q991j0020o308K89O990J0440R199M003
2706A5390k689q028r742o862q22N474R259Q716M542k359p412r840p180j957L986
2721i524Q348Q693M550j553o740q855p399k296M445Q393Q506N563l63o029q334
2736b595p034k012L414P924Q654N098r6o263q399p724l243K861P338Q473N114
2751A1510L5n865q655p896l634K364P800R046O233J319n162q427q185m193K338
2766a1372P585R916P181K165m483r323r192n357P28P030R452P611K603l621r058
2781A865j0014o569n84N943R615R121M213k416p957j0042p205j159N468R641R979
$$ plain form
2678 16469 17062 9758 -812 -10473 -15074 -12359 -3366 7566 15335 16551 10400 -156 -10495 -16538
2692 -16538 -15276 -7558 2971 11495 14327 9788 797 -9223 -15531 -15242 -8252 2188 11387 15390
2706 15390 12701 4673 -5069 -11931 -12753 -7279 1980 10696 15238 12879 5467 -4373 -11553 -13510 -9524
2721 -9524 -1176 7517 12067 10514 3774 -5081 -12480 -14776 -10331 -1938 6568 12131 11768 5739 -2595
2736 -2595 -9629 -11641 -8227 -303 8351 13449 13353 7090 -1309 -9033 -12276 -9415 -2077 6396 11510
2751 11510 11545 5680 -2975 -10871 -14505 -12141 -4341 4705 10938 12257 7095 -1332 -9517 -13710 -11372
2766 -11372 -3787 6129 13310 15475 10992 1669 -7523 -12880 -12152 -5122 4330 11941 14544 10923 1865
2781 1865 -8149 -14718 -15302 -9359 256 9377 13590 11174 3217 -6825 -14030 -15189 -9721 -80 9899
2796I899N420j193o778r595q095k927L462Q726R672N885K60o750r617q866m497
2811a4994J942P632R714O980J660n380q765q517m564J330O881R515P549K760l633
2826A0110p640q388n472L92N862Q588P524K668k812p510q171n947j186M954P587
2841E59O993L715k389o704q086o059m87M459P434P563L813j228n626p763n628
2856i434j257M194P468P251M251j063n834p880o335k354L701P026P425L907r31
2871A0135n818q120o805k697L210P238Q231N126m8n418p771p260k346K936P054
2886b353Q894N816Q95n135q046q026l511J427O763Q487O425J613m446q334q997
2901h528n365J217N900Q395P687L017l288p633q690o117mN725R159Q001M370j649
$$ plain form
2796 9899 15319 14126 7348 -2247 -10342 -13269 -9807 -1081 8591 14476 14736 7986 -1631 -10497 -14994
2811 -14994 -13052 -5420 4294 11274 12934 7554 -1211 -9728 -14292 -12962 -6081 3434 10983 13743 10110
2826 10110 2470 -5918 -11390 -10998 -5136 3452 10976 13644 10832 3322 -4849 -10796 -11982 -7028 559
2841 559 7552 11267 8878 2174 -5912 -11971 -12458 -7999 -565 6998 10811 9583 3957 -3806 -9434
2856 -9434 -10691 -6497 971 8222 12473 11410 5576 -2304 -8639 -10993 -7292 -266 7159 11066 10135
2871 10135 4317 -3803 -10608 -13305 -10095 -2857 5374 10500 10452 5034 -2737 -9997 -12343 -9407 -2353
2886 -2353 6541 12357 13252 8117 71 -7955 -11466 -10039 -3276 5211 11636 13249 8803 469 -8528
2901 -8528 -13893 -12676 -6776 1619 9306 12323 9035 1402 -7288 -13405 -13409 -7684 1475 9476 13846 12197
2917A2197o947q922o369j841M226Q003Q228M956q09o488q864p653k731K503P333
2932c178Q409N596j18n278p777p424l510K071O488Q799O286J585m013o822p671
2947f557l868P41O312P830O107K179l557p069p524m983L21M750P359N930K303
2962A0274l151o095p196n034lM498P047O278L158j847n521o818m496j71M108O564
2978A595O630L173j791n514p248n469o61L516O510O293L209j528n890p371n639
2993a0185j504L619O697O627M269m87n464p248n858j621L068P155P604M738j7
3008A1393m758p477o774k780K149O564P512N215P61m579p805p661l905J050N965
3023e130Q035O068J893l448p176p821m625O51N808Q018P065K839j934o856p778
$$ plain form
2917 12197 5250 -3672 -10041 -11882 -7656 347 8575 13531 12722 6234 -2630 -10283 -13014 -10511 -3178
2932 -3178 5231 10827 10709 5431 -2346 -9770 -13280 -11209 -4721 4078 10364 11949 7936 1114 -6557
2947 -6557 -10425 -9684 -3372 4458 10565 12744 9187 2118 -5406 -10389 -10068 -5318 2041 7971 10274
2962 10274 7123 1028 -6168 -11202 -11205 -6707 340 6618 9776 7929 2408 -4410 -8906 -9077 -4969 1595
2978 1595 8225 11398 9607 4093 -3155 -8624 -9285 -5769 741 7034 10243 8715 2825 -4546 -10185
2993 -10185 -11689 -8070 -1373 5254 9523 9036 3572 -3676 -9534 -11155 -8087 -932 6672 11410 11393
3008 11393 6635 -842 -7616 -10396 -8247 -1683 5829 11044 11805 7226 -579 -8240 -12145 -11095 -5130
3023 -5130 2905 8973 10866 7418 242 -7579 -12204 -11553 -5745 2273 9338 12177 10243 3387 -4391
3038d391n374p41M469P488P194L835j320o447q199o067k043L057O944P115M306
3053I826m24n002p537o461k632K647O538P367N316P82m262o430o591k654J701
3068g816N523O857N345J556m145o156p141l175N94M926O146M787J855l168o221
3083b33o180l894O82M301O504N269J885j739n527n969l359J73M179O439N539K239
3099A0309k283n540o189l990k90L619N982N510K492k299n469o674m572p37L546
3114f585O285N931L066j433n112o187m922q62L353O491O474L866n58m707p099
3129a999n227j997K497N932O902M356j40m300p638o381l202J981N607O878N214
3144H483R06l882o550o702l324R06N276P501N999K441k799o260o739m525o2N037
$$ plain form
3038 -4391 -9765 -10506 -6037 1451 8645 12480 11160 4713 -3486 -9553 -11596 -8539 -1595 5520 9826
3053 9826 9402 4400 -3137 -9598 -12230 -9583 -3045 4322 9638 10420 6158 -272 -6863 -9517 -7816
3068 -7816 -2293 4564 9909 11465 7320 1164 -5977 -9152 -8558 -3632 2514 7301 9156 5988 -233
3083 -233 -6413 -10307 -9625 -5324 1180 6449 8334 6595 1068 -4901 -8260 -8087 -3908 2531 8070 10309
3099 10309 8026 2486 -3703 -7693 -7983 -4364 1618 7128 9620 7321 1852 -4822 -9394 -10131 -6585
3114 -6585 -300 5631 8697 7264 2152 -4035 -8957 -9819 -6466 25 6499 10365 9807 5100 -1999
3129 -1999 -7226 -9223 -6726 -794 6108 10464 10324 6024 -1614 -7995 -11197 -9216 -3609 3269 8483
3144 8483 9389 5507 -1043 -7745 -11069 -10163 -4887 2614 8613 11054 8255 1995 -4744 -9269 -9331 -4294
3160d294O536O250K944k106n913p170n215j419L712O022O399L172o88n108o857
3175c735n309j724K785O058O724M163K4m111n899n391k252K074N442O241M509
3190I599J55l339n964o039l033J443M450N822M460N86l331n491n530l102Q50M492
3206c972N622M595J617k745m990n067l034P25M368N766N105J108k315n038n397
3221c652l343L29L338N791M693J080k047m955n707m259p9L674N681N215K174j669
3237F264m760o137l945n76L811O169N896K616j048m554o040m540j439K834N948
3252D99N844L464j025m287o490n784k081J974N475O429M096K68l524o652n725
3267g519k850J713N305O498N135J547k991n941o056l589Q95M501O170N458K353
$$ plain form
3160 -4294 2242 8492 11436 9330 3417 -3753 -8968 -10387 -6675 -653 5746 8918 8230 3122 -3735
3175 -3735 -9044 -10768 -7983 -1925 4799 8962 8986 4875 -1024 -6415 -8667 -6593 -1151 5090 9599
3190 9599 9754 6415 451 -5588 -8621 -7178 -2728 3094 7554 8140 4809 -682 -6212 -9314 -8464 -3972
3206 -3972 1650 6245 7862 5117 127 -4940 -7974 -7249 -2881 2885 7990 9098 6783 1745 -3652
3221 -3652 -6995 -6666 -3328 2463 7156 8236 6189 1234 -4473 -8732 -8811 -5137 544 5759 7933 6264
3237 6264 1504 -4633 -8578 -9154 -5343 826 6722 9338 8290 3736 -2304 -6844 -8283 -5449 499
3252 499 6343 9807 8782 4495 -1995 -7779 -9860 -7886 -2411 4018 8114 8382 4858 -1794 -7519
3267 -7519 -10369 -8656 -3351 3147 8282 9829 6838 897 -5159 -8748 -7853 -3352 2818 8276 10629
3282A0629k807n436o719m087n40L591N763N491K483j305m882o038m715r42K853
3297f661N530N762L506n03m006n279n075j045K227M967N591L301L92l505n514
3312c12m943j962J319M411N028L458K22l694m580n066k374J258M137N272L749
3327E923P96k602m872m447k545J274M276N068M253Q73k571m733m603k732Q21L523
3343b298N050L855R25k206n285m750l355L08L627N469M080J664k190m495n106
3358d707l413J69L589N506N073K172j254m361n468l915r69L445N172N476K435
3373H950p70m759n713m896j635K421N191N406L258l00l794n811m939j870J692
3388g569M989N867M416O18k971n094n356k737J048M525N459M661J268k145n708
$$ plain form
3282 10629 7822 2386 -4333 -8420 -8960 -5369 394 5885 8368 7063 2181 -3857 -8572 -9514 -6661
3297 -6661 -1131 4631 8137 7634 3628 -1651 -6726 -7771 -5544 -577 5014 8315 8707 5202 -312
3312 -312 -5255 -7217 -5898 -1487 3541 6999 7221 3527 -1053 -6119 -8493 -7235 -3098 2174 5923
3327 5923 6719 4117 -755 -5202 -7747 -6473 -2197 2871 7124 7997 5426 693 -3910 -6642 -5821 -2298
3343 -2298 2752 6607 7532 5326 41 -4709 -8064 -7756 -4129 1340 5420 7084 4894 399 -4707
3358 -4707 -8120 -7951 -4362 1144 6217 8389 7135 2774 -2694 -6609 -7578 -4133 1039 6515 8950
3373 8950 8180 3421 -2292 -7188 -8823 -6402 -1211 4195 7453 7153 3359 -2452 -7391 -9261 -7569
3388 -7569 -2580 3287 7703 8321 5350 256 -5100 -7837 -6789 -2264 3195 7856 9124 6979 1271
3403A271n345l156m83L548N380M285K023j627m694n300l882m71L029M999M832
3418D409L028q74l949n144l787n73K241M548N065L236o93l459m763m276j376J228
3434e139M166M598K842j27l079m918m170j862J595M047M244K868M55k318m384
3449a182l750j853J388M051M739L206M54k536m126m190j929P43L802M195L358
3464F370N33k717m260m574k430N54L473M403L966P97k141m329m238k871L69L617
3480c478N209L901J748j411m168m574l582M0L071M886M666J464j134m071n374
3495b807l887o63K345M539M747K556o59l778n175m233j658K131N003N165L356
3510F982L37k889n167m598j697J388L975N250M076O60k510n079m984k974Q03L387
$$ plain form
3403 1271 -4074 -7230 -7713 -4165 1215 5500 7523 5896 1202 -4098 -7980 -8451 -5422 -423 4409
3418 4409 7437 6563 2614 -2530 -6317 -6890 -4649 -101 4964 8200 7507 4048 -715 -4991 -6367 -5139
3434 -5139 -973 3625 6467 6340 3261 -1657 -5827 -7689 -6094 -2047 2197 5065 5520 3202 -1182
3449 -1182 -4932 -6785 -5397 -1346 3393 6599 7053 4517 391 -3799 -5728 -4985 -1183 3012 6370
3464 6370 6903 4186 -74 -4648 -7078 -6524 -3051 1352 5318 6115 3974 -355 -4593 -7464 -7095 -3478
3480 -3478 1731 5632 7380 5969 1801 -2773 -6355 -6315 -3244 1642 6308 7772 6638 2567 -2807
3495 -2807 -6694 -7357 -5012 -473 4274 6830 6171 2393 -2782 -7015 -8673 -6542 -1539 3626 6982
3510 6982 7319 4430 -737 -5335 -7032 -5644 -1669 3581 7657 8317 5807 728 -4256 -7230 -6427 -3040
3526c040M531M224J262j956m562m872k986j11L080M771M154K037r89l827m274
3541b558l363m78K441M565M154K605o83l385m487l880p50J850L753L739K784n88
3557E719l548l930l941j009J522L609L932K499K25k794l760l253j132J311L429
3572a121M245K588M52k363l993l181j759O51L725L944K842J60k612l991l964k113
3588f490J093L132L833L458L01k234l846l972k031N52L671M650L097J448j824
3603D838l967l980k584R2K965M895L698J168j620l710m858l261m69K600M198M065
3619D070K328j156l436m717l678j119K187M458M533L080p9l005m651l899j434
3634f518J402M167M612L475r0k353m247m643k047O71L377M194L591M98j999m005
$$ plain form
3526 -3040 1491 5715 6977 5021 459 -4413 -7399 -7510 -4430 341 4495 6532 5543 1716 -2558
3541 -2558 -5921 -6399 -3958 607 4761 7366 6683 3298 -1189 -5069 -5819 -3969 -216 3523 6307 5719
3557 5719 2171 -1759 -5700 -6709 -5187 -1578 2354 4853 5078 2284 -1476 -4729 -5861 -4550 -1121
3572 -1121 3124 5712 6164 3801 -192 -3373 -5132 -4481 -756 3188 6030 6190 3578 -413 -4377 -6490
3588 -6490 -5397 -2265 1568 5026 5327 3093 -753 -4725 -6756 -6204 -2533 2117 5214 6662 4838
3603 4838 871 -3109 -5693 -5601 -2636 2259 5957 7125 5505 1795 -3063 -6324 -6793 -4193 5 4070
3619 4070 6398 5242 1806 -2911 -6589 -7708 -5521 -1063 3470 6550 6471 3466 -1185 -5084 -6518
3634 -6518 -5116 -949 3663 7138 7048 4695 448 -4195 -6242 -5571 -2194 2000 5591 6089 4090 85
3650H5m330k764L26L017L997L814J648j622k981m275k467j81K435M465L340K274
3666F781j259l112l835k853p35J794L491L371J841q43k530m196k955p41J524L135
3682a122L800J759K43l135l298k956j006J694L469L557K536j49k383l487l106
3697c584j011J160L246L547J909L95k814l815l073j711J155K827L783K632K56
3712D902k300l622l459j869J195K946M335K975P80j841l447l664k080K05K885
3727b059M545L091J050j899l086m812k409l23K503M286L401J323j061l622m166
3742c238l090o14K259M126L914K773r72k467m243l434j022J936L809L658L121
3757F516j39k501m034l827j759J068L318L370L312M91k113l946m153j880L87L076
$$ plain form
3650 85 -4245 -7009 -6683 -3666 331 4145 5793 4171 1190 -3085 -5552 -5733 -3298 1167 4507 6781
3666 6781 5522 2410 -1425 -4278 -5013 -3219 272 3643 5484 4641 2111 -2085 -5040 -5781 -4257 -1122
3682 -1122 2678 4437 4680 1545 -1753 -4709 -5715 -4021 -552 3005 5541 5392 3009 -478 -3584
3697 -3584 -4595 -3435 -189 3358 5267 5662 2848 -967 -4040 -5751 -4596 -1769 2014 4646 4902
3712 4902 2602 -1020 -4479 -6348 -5153 -2207 2128 5103 5883 4042 595 -3069 -5149 -4944 -2059
3727 -2059 2486 5577 6627 4728 1642 -3170 -5579 -5902 -3399 887 4288 5611 4550 928 -3238
3742 -3238 -6328 -6942 -4683 -557 3357 6130 5158 2691 -1552 -4986 -6008 -4072 -263 3395 6516
3757 6516 6377 3876 -158 -3985 -5744 -4676 -1358 2012 5324 5815 3702 -244 -4397 -6277 -5890 -2814
3773b814L495L569J392j804l589l384k297K69K646L545L457J739j327k947l688
3788a738k341p39K073L351L047J443r24k812l758k387o07K023K765L195K177j155
3804C613k647k901k466o22J737K963L223J613J09k521l186k447r18J439L092L425
3820C506J442j86k339l422k950j285J216K686L883J825J38k548l499k755j596
3835e884J371L201L529K356Q46k178l588l103j711R21L120L594K693J041j915
3850D293l707l498k310J76K231M181K970J042j673l319l615k623m2K010M072L394
3866C582J603l21l166l764k911m09J672L835L780K320k95k542m064l219j404J228
3882d075L121L735K110R7k003l624l490j931J173K358L830K700P19j762k996l329
$$ plain form
3773 -2814 681 4250 5642 3838 249 -3135 -5432 -5163 -2517 1028 4485 6224 4897 1950 -1738
3788 -1738 -4079 -4818 -2745 606 3653 5096 4172 1360 -2398 -4785 -5392 -3369 -604 2591 4768 3613
3804 3613 966 -1935 -4401 -5023 -3286 -323 2900 4513 4622 2101 -1085 -3532 -4450 -3011 81 3506
3820 3506 4948 4762 2423 -999 -3949 -5234 -4018 -1332 2551 4376 4514 1966 -1533 -4288 -5884
3835 -5884 -4513 -1312 2217 4573 5419 3241 -347 -3450 -5161 -4240 -1120 2474 5167 6208 4293
3850 4293 586 -2912 -5222 -5046 -2815 1366 4336 5378 3705 386 -3229 -5852 -5894 -3884 188 3582
3866 3582 5185 4864 1698 -2066 -4977 -5386 -3714 121 3901 6221 5926 3384 -680 -3899 -5303 -4075
3882 -4075 -954 2781 4891 4988 2985 -639 -4129 -6060 -4887 -2529 1301 4001 4720 2958 -38 -3367
3898c367j625K29K602L539L007J051r66l064l310k324K66K007K929K559J359j451
3914C441k219l380k414N7J558K735K662J331n24k421l114k084K7J440K661L059
3930B815J648m47k515k852k072m22J581K917K435J736p36k350k776k766p22J286
3946c240K855K959J548o83j843k933k998j025J216L189L176K211J7j940l203k865
3962c559r37M89L189L351K601K65j831l476l006j772K13K585L504K567Q73j754
3978C302l399l139k779M03K433L907L064J172r87k744l581k333j80J833L317L557
3994C846J802n12k722l288k920q80J519K626L164K227k84k357l222l044j232O66
4010d611L115L219J927Q26j707l239k651j642P04K776K684K559P35j090k720k800
$$ plain form
3898 -3367 -4992 -4763 -2161 1378 4385 5436 4470 1406 -1904 -4228 -3962 -1955 974 3533 4892 3441
3914 3441 1222 -2158 -4572 -4515 -2957 -222 2440 3771 3247 826 -2288 -4372 -4345 -2905 -244 2815
3930 2815 4463 4016 1501 -1351 -3423 -3845 -2264 653 3088 4824 4088 1738 -1038 -3804 -4526 -3240
3946 -3240 -385 2574 4122 3439 1596 -1337 -4335 -5360 -4144 -955 2221 4432 4449 2509 -694 -3559
3962 -3559 -4496 -4007 -818 2533 5134 5399 3568 92 -2914 -4686 -4473 -1888 1616 4183 5056 3302
3978 3302 -97 -3236 -6015 -5612 -3179 728 3792 4964 3977 1233 -2348 -4681 -4861 -3028 289 3846
3994 3846 5648 5136 2414 -874 -3794 -4674 -3155 -529 2635 4862 4578 2221 -1001 -4045 -5277 -4611
4010 -4611 -1496 1723 3650 4476 2769 -470 -3121 -4763 -4059 -1283 1401 3960 4695 3605 885 -1915
4026a915j838J92J768L014K421Q93j206k757k569k069p5J675K831K077J133o65
4042B910k482k698j981K53J316L081K380J433p53k323k321k075j00J161L061K615
4058C477Q93n21k529k753k267k61J417K432K735J257o45k480k697k108j001J533
4074c518L005L083J349N0j990k908k963k15J287K578L057J856L00k157l098k817
4090c101j400N15K925K828K275O80j805l093l425j514J40K677K822K906J150j322
4106C258k600l016k042l24K301L243K911J360o56k399l009k740n15J194L284K851
4122C101J546n65j958l547k605r60R59K811L006K049J24j824l209k172j349J110
4138c483K498K881K162K53j416k539k712j083K90K357K541J945M84j430k481k897
$$ plain form
4026 -1915 -3753 -3561 -1793 1221 3642 4535 3329 572 -1997 -4066 -4141 -2466 365 2442 3575 2910
4042 2910 428 -2270 -4251 -3998 -2682 399 2779 4212 3459 1136 -1185 -3260 -3360 -2199 862 3477
4058 3477 4370 3849 1320 -1433 -3700 -3961 -2544 -112 2623 3880 3235 755 -1942 -4050 -5051 -3518
4074 -3518 -513 2570 3919 3969 1979 -929 -3892 -4107 -2820 -242 2815 4671 4971 2814 -284 -3101
4090 -3101 -4501 -3986 -1061 1767 4042 4722 2917 -176 -3601 -5115 -4975 -2298 524 3430 4580 3258
4106 3258 658 -2358 -4400 -4724 -2423 820 3731 5091 4435 2036 -973 -3713 -4228 -3034 250 3101
4122 3101 4647 4082 2124 -1423 -4028 -4988 -4029 -1218 1788 3837 3961 2137 -1072 -3244 -4593 -3483
4138 -3483 -985 1896 4058 4311 2895 356 -2356 -3439 -3149 -792 1749 3694 4178 2748 267 -2630
4154b630j232L4J931K591J868P25q89k392k357j450N9J699K386K608Q09q19k156
4171G85k291j567j18J572K674K197Q00r34k204k641j577k71J369K510K489R10
4187C703j030j754k870k020k01J199K872K452J589o58j985k516k110l69R85K683
4203c0K860J772k27j957k939k689q95R00K218L084K070j45j840k984k401j648
4219d851J056J658L241K395K99j074k879k360j926L21J868L325K520J145q62k189
4235A687l317j913j22J620K641K430J045m86k310k884k177p24J444K324K692J666
4251C616j48j675k445l156l86J059K527K515J538N58j764k308k240r97N91J892
4267h23K385K080lr44k382k752j095L23J820K238J791O97j207k111k490j221N65
$$ plain form
4154 -2630 -3862 -3828 -1897 694 2562 3287 2398 6 -2351 -3801 -3742 -2043 343 2951 3760 2941 785
4171 785 -1506 -3073 -3191 -1619 1055 3252 4052 3118 914 -1727 -3304 -3575 -2206 304 2793 3703
4187 3703 2673 919 -1951 -3971 -4172 -2973 -101 2351 3940 3282 1297 -1219 -3329 -3698 -2713 -30
4203 -30 2830 4602 4375 2418 -521 -3210 -4105 -3205 -987 2097 4167 4022 2182 -802 -3203 -4851
4219 -4851 -3795 -2137 1104 3499 3798 2724 -155 -2515 -4441 -4120 -2252 1073 3593 4738 3876 1687
4235 1687 -1630 -3543 -3665 -2045 596 3026 4071 3585 1275 -1609 -3786 -4510 -3066 -742 1950 3616
4251 3616 3468 1793 -652 -3808 -4194 -3135 -608 1907 3445 4003 2239 -69 -2309 -3306 -2715 -823
4267 -823 1562 3642 3639 2695 313 -2439 -3534 -3211 -1391 847 2638 3335 2128 17 -2473 -3694 -3129
4284c129J590K276K229N24r27k187k053j504M03J737K369K184M85j191j987k563
4300a744j387j34J620K336J805R17j157j916k634j513k76J612K467K226J474p37
4316B959k283k045j888m17J372K741K311J445l21k103k133k657o15M91K851K906
4332B614J206k77j630k694k513j033M96K562K561K087L13j081k996k512j243K34
4348c906K496L050K111O78j182k254k962j328j54J629K843J897P51k83k329k735
4364a678k054m83J177K440K611J434m64k051k315j898n50R52K484K351J507kj216
4381B245k566k083q51Q92J666K389J736L55j776k328j868j197M49J694K583J356
4397B696J87j313k235j958j091N71J915K043J868L50r88k150j746p51m41K147
$$ plain form
4284 -3129 -1539 737 2966 3490 2563 376 -1677 -3181 -2778 -1041 1328 3512 3997 2806 819 -1744
4300 -1744 -3131 -3265 -1645 691 2496 3413 2256 340 -2294 -3807 -4083 -2471 -4 2222 3696 2959
4316 2959 676 -1369 -3257 -3674 -2302 439 2750 4195 3874 1771 -362 -3019 -3634 -3143 -292 2614
4332 2614 3820 3543 1913 -781 -3294 -4327 -3831 -1269 1292 3379 3692 2611 -385 -2897 -4140 -3906
4348 -3906 -1410 1640 3751 4429 3247 993 -1969 -3297 -3451 -1822 1021 2918 3669 3386 1057 -1678
4364 -1678 -3732 -4215 -3038 -598 2013 3447 2983 932 -1383 -3281 -3831 -2879 -395 1956 3463 3461 2245
4381 2245 -321 -2404 -3255 -2363 -697 1692 3428 3783 2007 -321 -2189 -3386 -2937 -1243 1340 2696
4397 2696 2883 1570 -665 -2623 -3714 -3143 -1228 815 2683 3033 2045 -105 -1851 -2602 -3043 -896
4413h96K034K220M56j376j836k246j094m71J708K176J806R52j281k020k429j373
4429c670P1J330K360K206J059q22j885k324j734J07J474K613K140J013m58k037
4445A443k353k007l91J046K409K169J460nk265k418k273r97P64K299K847J410
4461C138K3j459k345k182r55J62K728K587J830N76j526j880k523j297l4J986K226
4478A055J865R99j177j862k688j778j63J079L086J793J056n24j785k552j639m60
4494c695J294K468J974J210J10j520k344k040n64P68K034K432J194j89j032k454
4510c54j905o65J72J777K212J485l04j199k157j971k04M49J383K430J442K6r61
4527A656j789j914o68M82J857K017J533L72j397k028j849j432R41J106K181J379
$$ plain form
4413 -896 1138 3358 3814 2438 602 -1644 -2738 -3209 -1501 675 2481 3433 2152 132 -2297 -3670
4429 -3670 -3599 -2269 91 2297 3356 2534 649 -1675 -3409 -3302 -1828 785 2925 3938 3480 1443
4445 1443 -910 -2917 -3308 -2262 147 2316 3776 3771 1506 -912 -3185 -4182 -3418 -1119 1728 3138
4461 3138 3161 1702 -643 -2825 -3780 -3618 -890 1697 3527 4103 2577 697 -1826 -3123 -3157 -1171 1055
4478 1055 2920 3919 2742 880 -1808 -3586 -3749 -2670 416 2209 3265 2741 956 -1596 -3235 -3695
4494 -3695 -2401 67 2041 3251 3361 1841 -503 -2543 -3107 -2339 -305 2127 3321 3132 2100 -354
4510 -354 -2259 -2924 -2752 -975 1237 2722 2418 1219 -938 -2909 -3113 -2664 -1281 1149 2591 2617 1656
4527 1656 -133 -2047 -2715 -2233 -376 1641 3174 3546 2149 121 -1728 -3160 -2219 -1113 1068 2447
4543B447P83j175k368j887j244K47J499K238J896P25j055k088j772j509L26J215
4559a722K456J993J021m77j999k482j969J24J279K274J775J454l97k031k517j960
4575c178p85J163K227K307J273J20j504k400k183p32N49K071K674J745N58j270
4591B635k128k440j297O35J494K412J914L01p33k290k156j506O1J120K390J976
4607B388M90p79j789k062j634L02R92K190J999J129n09j153k309j695p29J545
4623a624J924J673J525o53j605k069j652k43P72J329K183R69p4j186k144j593
4639b468n14L91J814K131J100k77q29j754j525p80P40J726J969J216L23j381k070
4656a88j686q26O44J296K066J234M07j229k168k019r38N42J791J936J682J30m99
$$ plain form
4543 2447 3230 2055 -313 -2200 -3444 -3197 -1698 540 2436 3161 2106 18 -1754 -3263 -2937 -1722
4559 -1722 734 2727 3748 3271 1272 -1210 -3179 -3055 -1776 498 2273 3727 3330 1299 -1218 -3178
4575 -3178 -3963 -2800 -573 1734 3007 3127 1623 -777 -2960 -3692 -3143 -1072 1602 3347 3905 2635
4591 2635 507 -1933 -3230 -2595 -1101 1311 3225 3526 2793 503 -1653 -3159 -3098 -1978 412 2388
4607 2388 2878 2099 310 -1752 -3386 -3084 -2092 98 2097 3226 2717 1564 -745 -2440 -3169 -1624
4623 -1624 300 1973 3498 2845 1240 -829 -2481 -2724 -1952 -623 1560 2529 2455 1269 -875 -2468
4639 -2468 -2982 -2591 -777 1354 2454 2177 1348 -406 -1931 -2711 -1971 -245 1724 2940 3263 1882 -188
4656 -188 -1874 -2700 -2056 -760 1306 2540 2947 1718 -450 -2469 -3407 -2865 -1074 862 2544 2674 2175
4673B175k019k237r54K18J497K053K456J96p11j907k283r94k59R29K466J866J046
4690C538r31j786k264j919l72J004K312K231J185l89j617k065j499p73O72K128
4706e45K230J675j05j347k057k246o51M32K132K257J352M23j019k321k413q31
4722c034k42J916J792J905N10q16j820k314j273M69J045K175K036N78m39j807
4738F81j602j627Q1Q26J885K211R05l67j830j867j757k93Q31J812J814O82j8j618
4756G49k002j336l91O47J663K059J195l17j359j570j244m12N99J746J808J193
4772C028k2j634j835j618n59P18J547K114Q92J42j249k156j902p29O99J606J874
4789I16J530J86j105j838j924q49N05J257K360J652L77p08j815k151j055R0J549
$$ plain form
4673 2175 156 -2081 -3035 -2817 -1320 733 3189 3385 2674 767 -1516 -2510 -2769 -1840 626 2492 3538
4690 3538 2607 821 -1443 -3362 -3734 -2730 -418 1813 2998 2609 992 -1073 -2572 -3345 -2673 -545
4706 -545 1685 3360 3255 1908 -149 -2395 -3046 -2614 -482 1775 3127 3550 2531 210 -2203 -3034
4722 -3034 -3276 -1360 432 2337 2847 2031 211 -2103 -3376 -2907 -1862 313 2349 2927 2488 681
4738 681 -921 -2548 -2467 -1641 244 2455 3360 2993 1163 -704 -2461 -2754 -1923 -111 1703 2385 2367 749
4756 749 -1253 -2589 -2980 -2333 -670 1389 2584 2267 908 -662 -1906 -2318 -1719 27 1835 3028
4772 3028 3006 1372 -463 -2081 -2640 -1922 -375 1739 2631 2773 1524 -632 -2534 -3263 -2564 -958 916
4789 916 2446 2632 1527 -311 -2235 -3084 -2579 -1322 1038 2690 3067 2359 544 -1607 -2662 -2572 -1023
4806a023J838J634J018r00j622k510j326l03J048K392J655J044m41j674k157j832
4822c159j98J078K370J734J108K50j399k421j667p10Q46J822J839J956k95j174
4838A980k144k038j040N63J617K155J431J68r98j936j718j150L22J543J752J769
4854B276L97l60j918j953r18j55J163K106J669N27o76j197k006j323L3N18K459
4871F42J259M36o82j252j694j105j96O18K113J179R14o9j493j778j030j13R40
4888a311J775J408P38N7j206j942j626l83J084J557J560J174p16r95j833k097
4904b756o0P40J410J672J431L8j313j662k066r3K32J686K002J544L57j240j693
4921B29k095r02K87J553J992J681N44j294j517k446j092J52J374J961J643O87
$$ plain form
4806 -1023 815 2449 3467 2567 945 -1565 -2891 -3194 -2146 246 1901 2945 2504 830 -1327 -3159
4822 -3159 -3357 -2279 91 1825 2933 3183 1784 -637 -2304 -3014 -2168 -346 1493 3449 3154 1980
4838 1980 -164 -2202 -3242 -2679 -1062 1093 2524 2692 1694 -242 -1960 -3110 -2788 -1245 507 2276
4854 2276 2673 2313 395 -1558 -2476 -2631 -1468 638 2307 2834 2158 961 -1045 -2368 -2335 -1817 642
4871 642 1901 2337 1655 403 -1291 -2396 -2592 -1974 139 1318 2232 2163 670 -1108 -2138 -2251 -1311
4888 -1311 464 1872 2610 2667 1461 -481 -2107 -2490 -1406 151 1711 2885 2169 1174 -659 -2756
4904 -2756 -2816 -2076 -666 1006 2437 2475 1162 -500 -2566 -2659 -2427 -741 1261 2805 3162 1922 229
4921 229 -1866 -2768 -2481 -928 1064 2745 3289 1995 478 -1968 -3060 -2908 -1534 427 2070 2757
4937B757o28j743k205j332m6J171K129K035J053n41j479j841j866j69Q52J744
4953a09K070R75K94j782j741j885n39N12J268K126J439j63j193k004j383r55M11
4970b659J483K080J570J34r18j454j742j084M38J451J618J628J26o56j745j518
4986a248q56l17J441J404J736M45j021j164k116r43J59J375J400J292Q21p37j458
5003B13j379r91o1P91J700J716J040j012j212j353j816K44P76J656J683N25j39
5020B381j414k180j098l82O60K003J227J083o2j425j897j416k59R58J339K245
5036A763J200m33j065j570j998o81O99J566K143J243M0j214j928j736j054K68
5052b757J773J901J307O59j135j739k021j016N5J297K234J738N48k90j841j938
$$ plain form
4937 2757 2129 386 -1819 -3151 -3197 -2026 103 2138 3191 2650 1171 -670 -2536 -2705 -1853 -109
4953 -109 1961 2936 3230 1448 -293 -2178 -2717 -2205 -937 1189 2628 2465 1272 -732 -2115 -3070 -2659
4970 -2659 -1176 904 2474 2608 1690 236 -1506 -2590 -2152 -701 917 2545 2671 2015 270 -1248
4986 -1248 -2104 -2421 -980 424 2160 2605 1584 420 -1696 -2639 -2480 -1105 295 1587 2408 1671 213
5003 213 -1166 -2157 -2218 -1427 273 1989 3029 2017 805 -548 -2364 -2120 -1344 312 1995 2520 2381
5020 2381 967 -1213 -2311 -2693 -2033 -30 1197 2280 2218 793 -1104 -2520 -2779 -1821 -482 1763
5036 1763 2963 2530 1465 -105 -2103 -2784 -2085 -519 1624 2867 2907 1693 -235 -1971 -3025 -2757
5052 -2757 -984 917 2224 2883 1748 9 -2012 -3028 -2973 -1676 558 2296 2844 2554 713 -1225
5068a225j318Q2P03K163J863Q99k18j533k200j471n95N94K062J628J075l35q80
5085A294k157j482o30M22J662K119O93N91j054j536j678r19O84J438J785J074
5101B306N11r31j411j657j069L12J261J391J354L15o90j628k078m81j29J219J857
5118D52J368K31m90j324k006o97M69Q14J906J352L23l22j468j604j071NJ084J424
5136D46J556N32k00j978j797j046l73Q50K014J820N50n38j372j510j466m10J093
5153a829J609K132R15j02j446j851j421n81N35J843J838J130J74j527j664k103
5169b348o32P44J353J888J209M18j143j881j817p45M65J365J988J535N28r06j636
5186C85j757j012j24J240K044J773K90l35j752j935j227k28R97J827J623Q35n15
$$ plain form
5068 -1225 -2543 -2461 -1758 405 2268 3167 2949 1416 -784 -2255 -2850 -2256 -194 1434 2509 2174 1294
5085 1294 -863 -2345 -2975 -2553 -891 1228 1921 2512 1458 -78 -1756 -2675 -1991 -553 1232 2306
5101 2306 2817 1886 475 -1182 -2251 -1939 -678 713 2067 2382 1692 64 -2014 -2495 -2624 -1405 452
5118 452 1820 2051 1561 237 -1769 -2466 -1997 -1183 723 2075 2398 2076 608 -996 -2067 -2062 -978 446
5136 446 2002 2534 2334 356 -1441 -2487 -2860 -2010 4 1824 2374 1836 464 -1046 -2512 -2922 -1829
5153 -1829 -220 1912 2827 2725 1279 -572 -1993 -2574 -2039 -196 1642 2772 2946 1419 -245 -2348
5169 -2348 -2980 -2236 -883 1005 2214 2632 1489 -392 -2209 -2954 -2489 -1124 864 2399 2927 2021 385
5186 385 -1372 -2384 -2508 -1268 776 2549 2839 2504 752 -1183 -2410 -2638 -1641 186 1809 2644 2129
5203B129j171k091j486l28J008J457J827P76q3q23j548j746l51Q06J195J704J264
5220B539N2j215j700j336n66K47J626J315J246N6j021j464j733r17O97J343J612
5237G81J003L77q61j703j553p02P16J013J927J438R9p04j566j792n54J30J252
5254f99J725J185M23o83j819j593r72k5J250J796J353M10n24j555j664j069k18
5271b679J015J871J946O05m45j450j834j219k90R96J619J680J144n45j056j853
5287d95j817o17Q89J729J559J765m86j435j830j738o23M98J863J696J295M53o38
5304B068j921k024j045N85J065K461J533pn39j736j741j300L53J092J671J489
5320B004N82m85j501k285j132k41J538J252J620J342n15j584j787j033j30J048
$$ plain form
5203 2129 958 -1133 -2619 -2947 -1939 -482 1345 2121 2038 1215 -333 -2079 -2430 -1624 -429 1275 2539
5220 2539 2591 1376 -324 -1660 -2226 -1979 -353 962 2208 2264 1243 -221 -1954 -2871 -2174 -831 781
5237 781 1784 2161 1300 -403 -1956 -2658 -1942 -929 998 2436 2535 1831 265 -1527 -2081 -1951 -699
5254 -699 1026 2211 2634 1951 132 -1461 -2433 -2458 -1208 588 1941 2351 1827 272 -1392 -2461 -2679
5271 -2679 -1664 207 2153 2758 2313 863 -971 -2190 -2480 -1484 135 1815 2959 2414 1358 -495
5287 -495 -2312 -2929 -2040 -311 1248 3013 2527 1092 -738 -2476 -3099 -2601 -738 958 2253 2706 2068
5304 2068 147 -1877 -2922 -2337 -1272 1189 2722 2715 2176 440 -1301 -2601 -2248 -1156 515 2004
5320 2004 2586 2101 600 -1685 -2817 -3058 -1520 -268 1352 2694 2179 595 -1192 -2225 -2355 -1307
5336a307J380K027M98k92j064j864r89o44Q68J210J782N09l1o89k090j277o47
5353b620R09J234J275Q57K2o96j439j389p24O37J750J098J171M52j000j609j428
5370a500q08Q58R97K128M18M09q52j813j417p79K42J009J812J484pq49j600j566
5388a834j004L74J065J828J528N57o62j194j831j148k0J199J854J749M56o64j453
5405H00j725j551k72J051J490J911P34k9j704j668j650n00R18J674K036R37J01
5422B553j335j623j537p91Q50J451J847J082P68j329j825j802p39M03R44J953
5438H70J418r3m32j725j774j124L99J232J531J652O14p72j472j640j081j52Q59
5455a690J962J643Q46q20j114j574j030n82J058J599J132J139l39j502j792j002
$$ plain form
5336 -1307 73 2100 2598 2306 1242 -622 -1611 -2255 -1387 -177 1605 2114 2083 1394 -696 -1973 -2620
5353 -2620 -1711 -477 798 1655 1677 981 -458 -1847 -2571 -1934 -184 914 2085 2537 1537 -72 -1500
5370 -1500 -2308 -1450 -453 1675 2093 2502 1650 -163 -1580 -2359 -2117 -1108 704 2188 2181 1332 -268 -1834
5388 -1834 -2838 -2464 -1399 429 1957 2514 1852 658 -1173 -2321 -2341 -1142 712 2461 2917 2253 800
5405 800 -925 -2476 -2748 -1697 -207 1704 2438 2409 705 -963 -2613 -3113 -2195 -521 1515 2452 2553
5422 2553 1218 -405 -1942 -2733 -1883 -432 1415 2497 3265 1936 111 -1691 -2430 -2027 -1083 870
5438 870 2288 2195 1763 38 -1736 -2860 -2461 -1229 302 1954 2568 1796 324 -1316 -2397 -2549 -1690
5455 -1690 272 1915 2761 1941 827 -747 -1777 -2359 -1301 298 1430 2569 2230 728 -1064 -2066
5471b066j81M09J875J168Q48j97j045j961q34m58Q39J375J706Q70O3j274j617
5488d80j375j36O01J448J531R41p0j177j702j461o28P19J168J629J134p7q51j555
5506c41j693p51K62J777J828R80M62r23j338j898j042N37J298J890J368N28o61
5523B283j584j727j560L4J048J846J695P31o10j411k072j283m40R45J771J851
5539A517R06n9j261k000j421j59N80J592J994J039O0r25k107j333j035P39J303
5556e70J776J168J49r42j944j209j205K93J223J852J210M20o40j397j977q66L60
5573b299R12J971J447M77o61j194j566j004j53J041J553J486P0o5j342j835j020
5590b182k18J097J406J447N98m44j461j492j139N4J020J140J548R85m81j060j708
$$ plain form
5471 -2066 -2247 -1838 37 1205 2053 1856 811 -1150 -1984 -2442 -1603 -228 1478 2348 2411 1137 -480
5488 -480 -1855 -1991 -1390 58 1589 2530 2460 1283 -419 -1880 -2508 -1789 -621 1008 2142 2065 1214 -341
5506 -341 -2034 -2785 -2523 -746 1082 2062 2524 1601 263 -1635 -2677 -2140 -842 1048 2416 2944 2283
5523 2283 699 -1028 -2588 -2554 -1506 340 2035 2766 2156 745 -1327 -2610 -3050 -2105 -334 1517
5539 1517 2423 2364 1103 -897 -2318 -2477 -1897 -305 1689 2728 2788 1863 -244 -1577 -2612 -1873 -570
5556 -570 1206 2374 2523 1581 -363 -1572 -2777 -2484 -1261 591 1801 2221 1581 184 -1793 -2659 -2299
5573 -2299 -1387 584 2031 2508 1847 653 -913 -1917 -2070 -1029 524 2010 2080 2015 673 -1162 -2182
5590 -2182 -2400 -1303 103 1550 2148 1704 243 -1249 -2388 -2334 -1314 -174 1374 2359 1878 818 -890
5607h90p97l82O50J946J281P81m50j138j463j387n56N51J615J386J176k93r92
5624A038j691j421q02M54J706K179J073l42r41j320j499r56M00J446J799J461
5640B584K56j002j326k096r40L69R61J903J404N50q50j668j838q87l36J282J673
5657C9J533R37m10j372k001j163m04J212J686J671J133j25j484j844j367k33N92
5674a600J466J664R01K33j216j764j604p82O17J383J590J280K06r90j963j447
5690b026m01K81J617J373J116M60o42j578j612o94K21J284J608R55M61p61j532
5707A30j495j045R7J093J891J080L19o82j297j387j113k2J077J558J564M70m40
5724A798j358j481j118J36Q80J574J635O17l06j605j925r32j34R52J412J475P73
$$ plain form
5607 -890 -1687 -2069 -1419 527 1808 2589 2139 1001 -462 -1849 -2405 -1854 -239 1147 2323 2030 1038
5624 1038 -653 -2074 -2876 -2422 -716 1463 2536 2194 1253 -67 -1566 -2522 -2122 -676 1123 2584
5640 2584 2840 1838 512 -1584 -2524 -2155 -1194 709 2113 2663 1813 145 -1693 -2580 -2916 -1634 39
5657 39 1572 2509 2099 727 -1274 -2437 -2841 -1629 57 1728 2861 2736 1252 -592 -1959 -2192 -1600
5674 -1600 -134 1530 2431 2664 1448 -316 -1920 -2702 -2085 -702 888 2168 2374 1384 -579 -2026
5690 -2026 -2427 -2146 -529 844 1960 2420 1778 200 -1412 -2106 -1885 -601 1007 1962 2423 1662 130
5707 130 -1365 -2410 -2313 -1220 671 1751 2070 1388 91 -1296 -2409 -2431 -1354 204 1768 2238 1798
5724 1798 440 -1041 -2159 -2023 -1143 431 2066 2683 2377 772 -1153 -2085 -2219 -1267 145 1620 2393
5741B393m86j093j828j439j45O37J693J676J126j08j278j471j846m23P02J440
5757d50K027R63M12j134k189j445q55P04J262J896J220M51j165j882j502j234
5773b921K25J245J816J415M96k11j708j757j439j0J346J694J984M26k04j189j850
5790f42j928J02Q71J918J597N35q3j234j667j741l54L04J933J696P52L79j462
5807I76j608j093q79N19J632J677J115J67j168j302j396p28K78J119J921J124
5823B354j47o35j423j591o71J53J486J184J088R7p49j459j256r10R0J391J800
5840H02J237J25l94j613j416q90M27P63J764J336L26m20j602j749r27q6J193J658
5858E34J227P57m61k079j532j172J53O70J797J869M12R4j380j830j139m88P63
$$ plain form
5741 2393 1907 814 -1014 -2453 -2598 -1961 -268 1408 2534 2426 1148 -323 -2169 -2592 -1890 -450
5757 -450 1577 2540 2952 1818 -371 -1816 -2671 -1967 -705 1191 2411 2862 1697 -185 -1687 -2921
5773 -2921 -2696 -1451 365 1780 2276 2065 357 -1400 -2839 -2849 -1503 191 2175 2601 2397 1208 -642
5790 -642 -2570 -2468 -1597 321 1918 2453 2370 1136 -531 -2272 -2626 -2322 -389 1307 2059 2438 976
5807 976 -632 -1725 -2604 -2085 -453 1224 2339 2506 1338 36 -1360 -2088 -1810 -691 1230 2354
5823 2354 2207 1572 149 -1442 -2113 -1960 -474 710 1798 1895 1146 -313 -1569 -2479 -2389 -998 802
5840 802 2039 2164 1770 157 -1259 -2149 -1722 -959 805 2141 2467 2047 445 -1304 -2231 -2317 -1124 534
5858 534 1761 2518 2057 -22 -1554 -2726 -2573 -1903 -106 1763 2175 2269 889 -941 -2080 -2568 -1805
5875a805J794J876R62j89j137k026j091r79P97J632J691Q59R7r45j983j451j024
5892b922M45J400J936J069N00q25j563j940q27J74J437J818J806N4m95j211j975
5909a119j013j03R38J825J348J016n84j615j819j310l60J115J511J418J069j72
5925B145j447j673j375p9O32J366J657J375n02r87j451j416k71L52J564J261J065
5942B216Kq29j842r59p40M19J080J970P89l18p25j637j344m18N95J199J307J222
5960A987j49l30j277j854q30O17J447J524J234K96j001j559j520q34J66J140J469
5977E26J475L39p37j459j548j194MJ282J429J624P77q28j168j663j374K10J030
5994a275J420J731R22k88j594j738j121r5Q08J444J371J457m83j461j680j780
$$ plain form
5875 -1805 -11 1865 2827 2638 1501 -525 -1616 -2595 -1798 -166 1525 2384 2481 1536 -447 -1898 -2922
5892 -2922 -2477 -1077 859 1928 2428 1603 40 -1900 -2727 -2553 -1116 702 2508 2562 2067 856 -1119
5909 -1119 -2132 -2235 -1297 528 1876 2892 2308 693 -1126 -2436 -2796 -1681 -170 1248 2317 2145
5925 2145 698 -975 -2350 -2429 -1797 -431 1226 2601 2099 1112 -339 -1755 -2026 -1674 -110 1151 2216
5942 2216 2218 1389 -453 -1412 -2152 -1733 -653 1317 2106 1788 1063 -574 -1918 -2336 -1741 -542 765 1987
5960 1987 1838 1508 231 -1623 -2453 -1836 -389 1135 2369 2665 1664 105 -1415 -2249 -2083 -943 526
5977 526 2001 2340 1603 144 -1404 -2598 -2594 -1312 117 1741 2518 1690 522 -1141 -2515 -2305 -1275
5994 -1275 145 1876 2798 2510 916 -822 -1943 -2038 -1230 214 1585 3042 2559 1098 -582 -2362
6010b362m36O25J592J457J425Lj065j677j162j315R05R75J977J580P5o91j679
6027B27j681r78L15J459J673J204N51o41j678j717j147r5R63J602J539M19m72
6044A543o44k217j197J69P16J445J860N49J83j853j506q77l12P70J208J792Q73
6061B502l46j119j911p55o19O38J423J293J158k29j158j586j350m38P15J346J423
6078I87J238k19j019j332j142o43K09J447J800J257n0j147j627j073p98K11J673
6095b28J161J248J72r99j546j443r08K21J528J354J234L10n09j497j592q60m8
6112b402J362J640J543M24k04j752j557j278j33R22J840J581P32n20j400j472
6128f74j976k13O85J871J519J006M0j294j913r79p14N92J706J472J292j24o49
$$ plain form
6010 -2362 -2798 -2173 -581 876 2301 2304 1239 -438 -1600 -2915 -2010 -1035 942 2522 2597 1906 227
6027 227 -1454 -2432 -2117 -658 1015 2219 2770 2129 451 -1266 -2413 -2508 -1545 57 1596 2015 1543
6044 1543 899 -1318 -2515 -2346 -1630 -185 1675 2224 2407 554 -952 -1829 -2141 -1371 -163 1629 2502
6061 2502 2156 1037 -874 -1629 -2248 -1610 -187 1106 2264 2035 877 -709 -2059 -2497 -1782 -436 987
6078 987 2225 2006 987 -345 -1487 -2130 -1921 -474 1326 2583 2533 1386 -241 -1314 -2112 -1901 -228
6095 -228 933 2181 2353 1354 -192 -1635 -2543 -2322 -794 560 1794 2104 1595 98 -1494 -2354 -2402
6112 -2402 -1040 600 2143 2567 2363 611 -946 -2224 -2357 -1435 405 1986 2718 2198 798 -674
6128 -674 -2650 -2863 -2178 -307 1212 2218 2258 964 -949 -1928 -2642 -2050 -344 1128 2420 2296 1647
6145A647j673j574p57K57J598J847R53L27q68j595j614r80K12J122J677J127P05
6162B411q16j363j786j010M44O21J717J412Q34o27j513j198j111j22J344J218
6178D55J333N37j92j138j777j277j15P91J532J380O63l89j302j068j582l00P84
6195a665J267J987N29j8j391j535j133l91J009J486J230J059p7j198j483j517
6211a841j69J30J593J700J184l15j182j208j845p17O04J499J349J161L39q24j698
6228b40j582p34N09J178J600J552M20q25j464j775q61O1J190J837J396K22l02
6245B182j691j648j505p5J003J573J563J020n67j356j754j279j75Q10J880J327
6261A308J311j54j140j843j424n00P10J659J495R08J95r74j895j550l94K36J173
$$ plain form
6145 1647 -26 -1600 -2357 -2100 -502 1345 2298 2625 1757 162 -1452 -2432 -2220 -1098 579 1706 2411
6162 2411 1595 232 -1554 -2564 -2120 -1499 218 1630 2464 1837 324 -874 -1985 -2107 -763 455
6178 455 1788 2325 2133 995 -782 -2059 -2174 -1383 149 1529 2192 1803 501 -567 -2149 -2449 -1665
6195 -1665 -398 1589 2118 2100 709 -826 -1959 -2350 -1341 145 1375 2434 2357 1159 -324 -1841
6211 -1841 -2010 -1880 -287 1413 2597 2282 1100 -108 -1953 -2670 -2066 -567 782 1943 2282 1458 -240
6228 -240 -1822 -2556 -2047 -869 731 2283 2703 1878 414 -1361 -2222 -2161 -971 866 2262 2484 2182
6245 2182 491 -1157 -2662 -2737 -1734 -161 1402 2422 1855 499 -1255 -2534 -2709 -1899 -19 1308
6261 1308 2619 2465 1325 -518 -1942 -2442 -1732 -73 1422 2330 2525 1551 -344 -1894 -2288 -2052 -879
6278h79J650J457r7q27j420j686p77J87J202J679J105M11l74j489j464r38O17
6295a643Q86J468J356P43p68j231j747j046l13J283J358J487M03n36j542j514
6311a356r59N0O75J429J753K43k36j280j258j044l18J020J819J509J51l4j178
6328I86j517j180n27J011J145J582J076k82j389j554j350n19O57J467J509Q71
6344A986Q7j170j640j305p56P52J179K254J131J58r33j799j406r81M75J292J911
6361A235J135L15o38j914j609j331M18J134J824J376L15l48j871j174j379k21
6377b733J262J627J536J150m13j740j415j511j05N38J836J717J003k70j205j362
6393h5j889n78N92J934J266R01N4j185j495j268o72M66J158J577J238J97o81j773
$$ plain form
6278 -879 771 2228 2131 1304 -116 -1802 -2579 -2392 -1190 489 1594 2005 1631 142 -1322 -2260 -1643
6295 -1643 -757 711 2067 2810 2042 811 -936 -1982 -2295 -1012 346 1833 2236 1700 158 -1356
6311 -1356 -2315 -2265 -1590 -161 1592 1835 1599 319 -939 -1983 -2301 -1281 538 2047 2198 2164 986
6328 986 -531 -1711 -2238 -1227 -82 1500 2576 2294 905 -649 -1999 -2518 -1861 -394 1115 1986
6344 1986 2073 903 -737 -2042 -2798 -2046 -867 1387 2518 2676 1743 -56 -1462 -2443 -1968 -676 1235
6361 1235 2370 2685 2047 133 -1476 -2807 -2389 -1255 569 1945 2260 1912 41 -1133 -2512 -2733
6377 -2733 -1471 156 1692 2842 2429 689 -726 -2237 -2342 -1804 32 1749 2752 2482 1277 -85
6393 -85 -1974 -2552 -1960 -26 1240 2141 2195 1010 -485 -1753 -2425 -1959 -801 776 2014 2211 1530 -243
6411b43j213r15N34J327J720Q36L53j064r95j429q50K31J049J621R71m7l99j540
6429e3j222r25J05J005J457J253M58p10j178j545r15J63J156J498J317P01q06
6446A759j225j705q73J25Q05J486J627M63m21j441j629j446j94J060J611J653
6462A655P96o40j294j532j108m71R95J426J989O90k55j114j275j791o77P33J600
6479b73J682J346n7q31j961j794r03Q10J014J546J417L41p72j701j256j330J58
6496b564J322J555J769L91m14j343j630j352k68J137J813J672N32l10j416j731
6512h37j013n55Q56J480J596J070q39q70j863j235l25O92J597J452R87j97q48
6529A148j645j252q47P81J744J197J243p2r50j688j207l90L51J075J473J209r1
$$ plain form
6411 -243 -1456 -2371 -1837 -510 1210 2046 2399 1335 340 -1089 -1939 -1708 -659 962 1933 1886 1487 -53
6429 -53 -1275 -2200 -2095 -1090 367 1620 2078 1368 190 -1355 -2270 -2107 -951 547 1864 2565 1759
6446 1759 534 -1171 -2044 -1919 -1114 372 1999 2462 2041 600 -1029 -2475 -2669 -1609 2 1655
6462 1655 2451 1811 517 -1015 -2123 -2594 -1599 -173 1816 2506 2251 1137 -138 -1929 -2606 -1873 -273
6479 -273 1409 2755 2698 1867 -94 -1888 -2791 -1981 -967 579 1996 2337 1565 -136 -1392 -2722 -2564
6496 -2564 -1242 313 2082 2473 2059 716 -914 -2266 -2534 -1397 416 2088 2620 2310 894 -837
6512 -837 -1850 -2405 -1549 -69 1527 2597 1758 888 -975 -2210 -2535 -1843 -246 1206 2193 1996 1148
6529 1148 -497 -1749 -2596 -1815 -71 1126 2369 2297 1347 -341 -1548 -1938 -1587 -512 961 2170 2079
6546B079o83j674j381o21M29R61J399J223p5k59j350j306j223M47J439J293J613
6563B311J87n98j590j559p25K16R22J540J280M57r39j194j570j139p5J010J672
6580B06J328N91o91j023j739r98l59J130J627J656P64k84j197j714j382m22O90
6597a817J936J772Q02M4j820j465j604l00M40J319J514J541J02j157j766j363
6613a822r27L80J323K127Q52M83o40j533j642j050J80J493J226J762M85n01j631
6630E65j595j068k39R26J801J278N21k52j395j691j254k03J096J537J475M91m12
6647A581q96j626j136k52R64J358R96J494k37j164j433j452k66O10J405J508P34
6664B188k04p87j491j459n04N23J003J910P74l13n77j835j038l82M38J378J472
$$ plain form
6546 2079 1396 -278 -1659 -2280 -1851 -890 509 1732 1657 1398 48 -1258 -2481 -2034 -595 698 2311
6563 2311 2498 1900 310 -1249 -1974 -1758 -836 704 1984 2441 1502 308 -1262 -2401 -2476 -1466 206
6580 206 1534 2125 1434 411 -1328 -2326 -2685 -1555 72 1728 2492 2208 1011 -703 -2085 -2507 -1817
6597 -1817 119 1891 2693 2737 917 -548 -2152 -2452 -2012 -693 821 2362 2464 1307 -459 -1822
6613 -1822 -2749 -2369 -1046 1081 1933 2416 1776 243 -1399 -2449 -2269 -776 450 2212 2697 2196 565
6630 565 -1030 -2098 -2337 -1411 390 1668 2189 1937 542 -1149 -2403 -2606 -1510 27 1502 1993 1581
6647 1581 685 -941 -2077 -2329 -1365 -7 989 2483 2246 1082 -351 -1803 -2069 -1459 -54 1454 2188
6664 2188 1984 1197 -294 -1753 -2257 -1734 -731 1179 1953 1640 1063 -772 -1810 -2192 -1754 -376 1096
6681A096J089J16q20j611j134n94J78J343J528J083M64j288j323j528j024L30
6697b095J298J232J435M11n43j822j422j187K54J080J641J512M55l93j295j550
6713i89j181l2P77J738J854M86n49j046j970j271k81N23J937J227J220j61j098
6730A184j727j769l63O11J259J772J220m7n75k007j233n35j9J505J941R42L23
6747B482p67j362j772q61K47J072J687J169L91p56j414j511p95j35R12J569J560
6764A716N45n87j653j319o31j19P96J384J690L09k72q16j760j020k15R19J277
6781B44J297P46l82r88j343j213n87Q65J173J273Q83p7j269j415j188k51M66J340
6799d26J387J386k81r99j413j124n42N44J405J114J233L83j342j367j488q47N75
$$ plain form
6681 1096 2185 2301 1481 -130 -1264 -1858 -1680 -337 1191 2274 2738 1450 127 -1401 -2425 -2095
6697 -2095 -797 435 1870 2281 1738 -84 -1506 -2693 -2439 -1359 282 1794 2249 1856 561 -989
6713 -989 -2170 -2202 -1425 313 2167 2653 2104 1058 -912 -2183 -2464 -1941 -4 1223 2443 2282 1184
6730 1184 -543 -2312 -2675 -2064 -805 967 2187 2140 1565 -442 -1675 -2210 -2229 -724 1217 2159 2482
6747 2482 1715 353 -1419 -2280 -2033 -961 726 1895 2286 1530 116 -1395 -2190 -2325 -1413 156 1716
6764 1716 2261 1674 21 -1298 -1929 -2048 -1252 132 1822 2131 1859 1043 -717 -1737 -1952 -1033 244
6781 244 1541 2287 1905 917 -426 -1639 -2226 -1361 -188 1085 1968 1891 622 -793 -1981 -2232 -1766 -426
6799 -426 961 2347 2066 1067 -346 -1470 -2012 -1468 -63 1051 2284 2667 1325 -42 -1530 -2377 -1802
6816a802J087J437J529p4j000j630j372o93K15J120J853J294M12n36j720j350
6832a230j075J41J432J310J609M42n24j556j755q79n56J094J708J566O82k35j728
6849D46j483j203m97O26J648J778Q26K8j036j771j193m21P28J276J573J149o0
6866B414q78j641j291n00j8J378J733R90L00q03j686j289j242J56J389J525J222
6883A759J3l48j595j318o16o3J160J306J153J001o65j204j634o52n6Q04J315J292
6901A652N79k80j554j533q14j13Q34J458R93M42o5j189j410j021k08Q45J111J693
6919A420N21j25r68j923n24l76J001J142J647M74j05j194j427j182n00O07J220
6936b92J334Q66N8r91j354j829m98P22J212J451J326N2n30j596j609j096P53J005
$$ plain form
6816 -1802 -715 722 2251 2177 1177 -453 -1825 -2518 -2303 -1183 670 1964 2376 1840 120 -1230
6832 -1230 -2305 -2164 -732 578 2187 2629 2105 549 -1206 -2085 -2641 -1547 161 1727 2409 2174 446
6849 446 -1037 -2240 -2737 -2111 -463 1315 2141 2169 1133 -638 -1831 -2252 -1524 -248 1325 2474 2414
6866 2414 1536 -105 -1396 -1896 -1914 -536 1197 2187 2487 1684 -2 -1291 -2533 -2377 -988 537 1759
6883 1759 1772 1424 -171 -1489 -2105 -2168 -1008 298 1451 2452 1787 583 -1051 -1703 -1759 -955 360 1652
6901 1652 2231 1951 397 -1136 -1950 -2063 -1229 229 1222 1664 1599 410 -1000 -2021 -2229 -1384 -273 1420
6919 1420 1941 1816 848 -1075 -1599 -1975 -974 168 1815 2289 2184 990 -437 -1619 -2119 -1512 -292
6936 -292 1042 1908 1966 975 -379 -2208 -2706 -1984 -772 679 2005 2057 1527 -69 -1678 -2774 -2021 -1016
6954a016K003J345O19r80j575j480j164K29R68K002R88O84p85j386j704j212r8
6971b562J204J265J365R71k54j260j696j171j39N50J635J596R33r9j282j367j353
6988a664o15Q01J054J745Q51j2r56j708j227o48K89J509J204J244j24p97j254
7005c08j193q67N59J120J479J184K72n51j438j306n26o5P76J345J662n9k69j543
7023B72j472p53m3J126J355P97M98n98r92j282r45k36J148J430R56R13m70j243
7041D61j229j132j05R09J406J385P67o31j195j706q52k14O73J537J314O68k53
7058A803j047j702j227r5L69J658J666R56j80j151j433j544m94N74J228J808J048
7075B237M06r60j574j610q40N69J097J497J421J97n94j577j835r42J84Q91J539
$$ plain form
6954 -1016 987 2332 2951 1971 396 -1084 -2248 -2019 -1051 951 1939 2623 1838 452 -1252 -2464 -2562
6971 -2562 -1358 -93 1272 2243 1989 729 -967 -2138 -2277 -1727 -92 1504 2437 2338 1056 -311 -1664
6988 -1664 -2279 -1478 -424 1321 2172 2160 1204 -504 -1731 -2379 -2090 -581 623 1867 1743 946 -308
7005 -308 -1501 -2368 -1809 -689 790 1974 2246 1695 257 -1049 -1575 -1640 -864 481 2143 2084 1815 272
7023 272 -1200 -1953 -1996 -870 485 1282 1780 1182 190 -1092 -2037 -2273 -1125 305 1261 2174 1704 461
7041 461 -768 -1900 -2005 -1096 310 1695 2462 1831 636 -1070 -1922 -2136 -1463 74 1388 2056 1803
7058 1803 756 -946 -2173 -2268 -1899 -241 1425 2381 2201 1050 -383 -1927 -2421 -1847 -619 1189 2237
7075 2237 2643 1683 109 -1501 -2341 -1772 -675 822 2243 2440 1846 269 -1566 -2508 -2324 -1433 106
7092A06J867K11l75j146j828j196j62J373J476J182Q32m14j067j616r85j15N29
7109a328J714J109N40l3j090j325j313n49N71J491J123Q95J14j035j398j444m51
7126b409N46J237J488P03L08q34q33j388o87K96J129J453J153M1r68j131j566
7143a462m15L21J140R63J126L47p59j424j331j181O13J001J279J394N68p45j373
7160F2j457n15P4J342J150J471K07n24j121j404j196K8R15J493J172M93l36j586
7178B68j532r87p2R51J420J106R68K3j415j478j156k72Q17J295J536P52o2r16
7196A246j508j178r16P22J201J605Q47M25j063j148j943p00L55R28J743J287P5
7213A978m50j385j738q13K6J122J872J283L64o95j014j204j588K07J192J203J328
$$ plain form
7092 106 1973 2184 1809 663 -1165 -2361 -2523 -1150 326 1508 2340 1926 859 -757 -1742 -1857 -1328
7109 -1328 386 1495 2035 2002 912 -413 -1726 -2275 -1704 -213 910 1805 1919 884 -514 -1958 -2409
7126 -2409 -1863 -626 862 1565 1873 1039 206 -1182 -1869 -1573 -444 1009 2162 2203 1235 104 -1462
7143 -1462 -1877 -1556 -416 547 1673 2020 1261 -163 -1494 -2675 -2062 -1061 218 1612 2180 1435 62
7160 62 -1395 -1910 -1836 -494 656 2127 2334 1810 689 -715 -1911 -1883 -968 525 1697 2190 1854 268
7178 268 -1264 -2251 -2323 -1372 48 1154 2122 2145 730 -748 -1904 -2176 -1359 -64 1472 2224 2162 1246
7196 1246 -262 -1440 -2356 -1634 -433 1172 2019 2444 1381 233 -1710 -2410 -2055 -1127 616 1903 1978
7213 1978 1528 143 -1595 -2408 -2382 -1260 612 1895 2259 1564 550 -654 -2242 -2035 -843 360 1688
7230A688P73n59j176j578r40p1Q29R10J363M88k31j023j187j306n6N65J189J352
7248A030P71j92p46j357j050p3L88J434J036O45l4m75j747j169m96M88J230J239
7266I22R43P3r11j537j117p08O42J173J271J061J90j048j325j058o17N89Q80J487
7284I10R92O42r84j205j452r05J18R99J680J002K19l51j462j486j002r6J107J819
7302E45Q56P56n43j085j710p10l66O77J705J389J066o45q50j613j584L28M38J258
7320h8J487P14o2q63j612j507m21M66J366J351J069K20r47j350j512q09M72J319
7338g07J437J183K15o92j243j314q62o6J394J237J214K38l12j356j469p03r0M27
7356a469J562J496K15k77j069j302j342J15O74J503R12P88j65r61j420q04m38
$$ plain form
7230 1688 2461 1902 726 -852 -1792 -1863 -1034 -124 1239 1727 1496 473 -714 -2020 -2076 -1511 -322 1030
7248 1030 1801 1609 863 -494 -1544 -1617 -1229 205 1241 1886 1852 1377 -370 -1539 -2035 -1547 -317 922
7266 922 1865 1938 1027 -510 -1627 -2335 -1693 -520 751 1812 2002 954 -371 -1429 -2046 -1457 -577 910
7284 910 1902 2544 1560 355 -1097 -2002 -1884 -885 795 1797 2016 1665 203 -1283 -2285 -2381 -1274 545
7302 545 1401 2157 1614 529 -1181 -1891 -2257 -1580 125 1514 2580 1935 1085 -528 -2112 -1784 -1346 -88
7320 -88 1399 2113 2051 1188 -424 -1931 -2352 -1886 -520 831 1900 2120 1173 -177 -1689 -2498 -2026 -707
7338 -707 730 1913 2128 1436 193 -1121 -1983 -2049 -655 582 1796 2034 1722 366 -1103 -1806 -1896 -1469
7356 -1469 93 1589 1804 1527 458 -844 -2186 -2071 -1397 106 1018 1806 1641 680 -740 -1544 -1982
7373a982Q69J377J208N74j72r55j628p83l01L21J539R19Q86J39j279j435j161
7390a864k36M93J208J230O90J04n91j547q49p25J04J636J393J104O7q59j424j288
7408a354o36M72J228R99J057L86n99j647j504o63N3J313J453J272J35l93j478
7425I4j361q99L80J088J184J392L01k80j213j646j000O4P82J327J368M66j71j356
7443E20j318j095m02P21J271J283R84Nj286j296j287k87N25J134J339J143J62
7460B116p27j256j546p3J0J131J328J092L47j036j352j208n71m3Q13J198J249
7477A472N40o53j060j542q17J4J002J179J017P38j81j227j311r08j53Q86J233
7494B29J460N97p48o59j657q61j6O70J325R85N18k94j053j274j339n0O99J363
$$ plain form
7373 -1982 -1113 264 1472 2046 1874 919 -709 -1492 -1793 -1472 67 986 1872 2011 732 -703 -1864
7390 -1864 -2100 -1607 -399 831 1521 1625 1034 -513 -1362 -2087 -1983 -347 1046 2150 2217 1358 -66 -1354
7408 -1354 -1990 -1518 -290 709 1766 2152 1553 -94 -1598 -2261 -2208 -895 558 1830 1965 1572 94
7425 94 -1267 -2166 -1786 -698 486 1878 2179 1899 686 -960 -1960 -1896 -1114 213 1581 2047 1876 520
7443 520 -798 -1893 -2295 -1574 -303 980 1964 1969 683 -613 -1900 -2187 -1662 -528 811 1954 2116
7460 2116 1389 133 -1413 -1486 -1476 -345 983 2075 2422 1386 34 -1174 -1745 -1788 -975 223 1472
7477 1472 2012 1359 299 -1243 -2060 -2046 -1044 135 1152 1890 1709 482 -829 -1737 -1890 -1004 229
7494 229 1689 2286 1538 879 -778 -1639 -1655 -985 340 1325 1843 1549 496 -778 -2117 -2167 -1468 -105
7512a05J464J97J04j152j230q35n66J059R46J571O71k91p55j362j126m95N46J079
7530b80J345J060j97r21j383j286n66J91J156J724R86K38q35j421j422o31N55
7547a687R83J214J102P98n90j630j156q12k29J320J294J296J27j10j376j670o87
7564a813l79N48J736J092P71l53j057j511r26m01O00J237J495Q95j73m28j962
7581f29p50l97L83J293J089R73N6p96j287j191o53M05P79J316J064n9n06j382
7599b92j242n07qJ336R63J261N2o02q62j019p37o0R13J193J119O02p58q63j131
7618f42q17k28R03J329P27O36m02j293j401r10R2P02J254J453N77p06q24j150
7636g00j084k18Q11J298J586l8j5r68j012j187l72J058J017J112N69J59j215r32
$$ plain form
7512 -105 1359 1556 1660 508 -722 -1557 -2123 -1064 -118 1453 2124 1833 1078 -284 -1410 -1905 -1359 -280
7530 -280 1065 2125 1928 1007 -376 -1662 -2228 -2037 -881 843 1829 2067 1232 -189 -1611 -2242 -1687
7547 -1687 -704 510 1612 2410 1820 190 -966 -1778 -2007 -687 607 1903 2030 1920 544 -1126 -1813
7564 -1813 -2192 -1644 92 1184 1955 1602 545 -966 -1892 -2293 -1693 -456 1039 1934 1761 1333 -629
7581 -629 -1379 -1776 -1393 -100 989 1962 2018 1222 -65 -1256 -1909 -1504 -725 591 1655 1596 1090 -292
7599 -292 -1534 -2041 -2049 -713 250 1511 1563 961 99 -920 -1657 -1717 -804 389 1508 2110 1352 489 -642
7618 -642 -1459 -1687 -784 545 1272 1908 1506 213 -1188 -2098 -2006 -1304 -50 1403 1980 1274 450 -700
7636 -700 -1784 -2002 -1191 107 1693 1655 1640 672 -340 -1527 -1899 -841 176 1288 1857 2016 801 -131
7654a31j586n54O24J812N64J127q2n37j957q99o65K40J266K017R09R5q96j267
7672H0j123q32K66Q11J472J154O96j066j232j356p12k4R53P19J618N88o46j184
7690A82j207j126k7R43Q30J402R67m2j226j490q31k25O60J187J331P07k38o95
7708A102j367r64m36J04J130J333J156k74j005j097j131n91M12R93J235R46L23
7725A869j026j386r41l55L01Q30J402Q45N61p40j418q09p43N0R03J212Q16M90
7743A861p97j089r54q49J9J222P62J197J21j64j145j310m78k46Q41J198J290R57
7761B436q87j071j253r14j49R40J218J023M02j55j093j030j251j40N61J071J350
7778A058P77j02j282j196j554J62N11R63J469P98L36p52j146j559l46M92J065
$$ plain form
7654 -131 -1717 -2271 -1647 165 729 1856 1774 1237 -720 -1619 -2284 -2044 -778 1239 2148 2243 1347 80
7672 80 -1043 -1875 -1609 -798 674 1828 2524 1458 226 -1130 -1842 -1866 -913 -194 1424 2012 1366 182
7690 182 -1025 -2151 -2178 -1235 -405 997 1964 1922 696 -794 -1625 -1850 -1190 -3 1328 2035 1797 1102
7708 1102 -265 -1229 -1665 -1561 -431 902 2058 1784 779 -318 -1449 -2040 -1628 -635 600 1546 1869
7725 1869 843 -543 -1484 -1839 -1538 -708 694 1539 2100 1360 -58 -867 -1610 -1560 -657 555 1371 1861
7743 1861 1064 -25 -979 -1828 -1809 -587 175 1372 1493 1329 184 -1126 -1604 -1850 -1009 189 1479 2436
7761 2436 1549 478 -775 -1689 -1838 -898 320 1343 1745 1590 497 -533 -1784 -1924 -1363 -292 1058
7778 1058 1835 1733 451 -745 -2299 -2137 -1626 -663 806 1604 1940 1188 42 -1517 -1863 -1371 -306
7795c06J230J167L35j054j117j438q73L73R07J355Q40K41n18j043j390p51K28
7812a814N69J680R18N32n53q15j129r77k01N24J456R42R15k35j023j103j114k33
7830a661L51J298Q19R63k19p13j338j183n0J96Q81J702L87M4m62j383j176n1N45
7849a050J098R49Q58j75q14j202q01n83M79J128R56P87p8m52q65j603l38J66Q50
7868f90J186M97L68m23j108j113p57M7J187J420P89M54o99p22j333r69O28Q06
7886d32J003J025K48m39j092j291p23j74Q27J233J065M67k36j076j267j031k45
7903b138O58J226J645N88j61j012j428q63l69L05J244J409O66J72p95j495q04
7920a152r73L97J067J154J343k6o18j118j390p43K15J036J014J351L03p25o38
$$ plain form
7795 -306 924 2091 2426 1372 255 -1183 -2056 -1683 -776 579 1419 1660 1142 99 -1291 -2042 -1814
7812 -1814 -1245 435 1353 1885 1332 517 -612 -1589 -1790 -1266 190 1132 2047 1812 789 -314 -1428 -1661
7830 -1661 -1310 -12 807 1770 1551 838 -500 -1683 -1733 -1537 -656 1046 1433 1477 1015 -368 -1544 -1595 -1050
7849 -1050 48 997 1855 1680 866 -336 -1137 -1720 -1241 -113 843 1630 1552 1100 235 -1368 -1706 -1540 -690
7868 -690 496 993 1361 938 -170 -1283 -2040 -1993 -806 614 1403 1857 1158 436 -897 -1866 -1238 -432
7886 -432 571 1596 1844 1405 313 -978 -1701 -1875 -1048 185 1250 1717 1481 405 -862 -1893 -2138
7903 -2138 -1480 -254 1391 1979 1818 806 -622 -1485 -1854 -1549 -305 1104 1770 1942 1147 -348 -1152
7920 -1152 -2125 -1728 -661 493 1836 1810 1192 74 -1316 -2059 -1844 -808 206 1557 1860 1135 497
7937D97j392r95M15N79J587R43O53k69j478j277q83k03P79J044J280L33k98j046
7955B69j086p66q16J116J176Q14Q25k71p55j221o97j93K90J321J011Q85j38q82
7973H82j070q63j27m1J007J026N25K74q96j125o88l87J33R62J169N12K51r29o60
7992d5j272n15L68R44J305P44J27l48j415p87o44J13J081R05J068J50m90j018
8010B71j272q84J92O81J360R25N56p17r25j452l39m30O43J689J073M03n2j068
8028F54j274r81m3O33J167R77P58P5j218j227n65q56M51J046J324Q81k6q92j378
8047d94r10n07L05R21J068R90L99p54j078j089l79j19R52J248J154O1j57j280
8065C31j217o14P7N17J199Q49N66l52j034j052r30j02Q57Q14Q32P43j14q67j175
$$ plain form
7937 497 -895 -1890 -1475 -896 691 1634 2287 2018 540 -737 -1620 -1823 -1044 0 1280 1613 1315 269
7955 269 -817 -1583 -2399 -1283 -107 707 1532 1261 506 -715 -1412 -1605 -1315 6 1017 1902 1764 882
7973 882 -188 -1051 -1178 -1219 -212 814 1339 1613 717 -408 -1096 -1483 -1350 -388 781 1293 1544 615 -45
7992 -45 -1317 -1832 -1464 -520 785 1529 1656 1308 -107 -894 -1538 -1425 -344 561 1629 1779 1289 271
8010 271 -1001 -1885 -1693 -1012 348 1273 1829 1112 187 -1265 -1604 -2034 -1391 298 1371 1774 1722 654
8028 654 -620 -1601 -1644 -1011 156 1133 1891 1966 748 -479 -1044 -1900 -1449 -403 921 1802 1776 884 -494
8047 -494 -1404 -1911 -1606 -685 383 1373 1772 1018 -60 -1149 -1528 -1647 -695 553 1707 1768 1611 331
8065 331 -886 -1500 -1423 -906 293 1142 1708 1356 322 -730 -1660 -1762 -905 -91 741 1484 1370 503 -672
8084f72q45K53L21R13J157M73M9p39j171m84n21L52J182Q03K90n6p52j101j012
8103a560R3J76J010J086N38j46m88j206p46n29K95J208J262O07J72p40j146p98
8121i12n64K88J180J126M56J28m83j110j247p17M82P13J016R37Q1l07r49j239
8139a121o68L39M36J043J212N13l87q15j070r77M7O84J147J269M70p16p47j071
8157d12r00n60N84J277Q27N54k6l97j405j067k57J82J110J223J077Qo26j543j005
8176a356j06K03P63J195O15L48o39q00j141m78O6Q73P88J122Q0
8191A533
$$ plain form
8084 -672 -1517 -1264 -943 -30 1127 1600 1649 910 -261 -745 -1266 -914 268 1071 1361 1305 553 -548 -1560
8103 -1560 -1467 -1291 -281 805 1343 1197 709 -497 -1243 -1772 -1477 -269 993 1600 1772 1032 -114 -912
8121 -912 -1476 -1188 -8 1118 1574 1702 1219 109 -1138 -1855 -1373 -660 356 1293 1374 1067 118 -1121
8139 -1121 -1789 -1450 -1014 29 1241 1754 1367 552 -518 -1495 -1448 -764 383 1652 2122 1406 659 -412
8157 -412 -1312 -1872 -1288 -11 816 1370 1344 947 -458 -1525 -1782 -1600 -490 733 1810 1818 1192 -351 -1356
8176 -1356 -1462 -1259 -496 699 1314 1662 1023 223 -918 -1396 -1330 -457 331 1453 1533
8191 1533
$$ Imaginary data points
##PAGE= N=2
##DATA TABLE= (X++(I..I)), XYDATA
0@%%%%%%Qj6J6k4L2m0M8n6P2q2R8j21J39j64J95k27K67l07L53m06M63n30N98o77
30c61P64q58R67j082J207j346J497j665J847k046K268k510K780l078L409l784
46a991M201m675N219n845O583p464Q538r879J1609j3949J7301k2550L2031n4637
60c5508K08352K70057j92337k08825k49978j23820j6037J60078K30072K20852
70B62906P1084q1571k13126k25604j60742j2498J27753K30904K21653J20172m7829
81B93102j76795k22075j61945l9112J10170K09796K12908J11846k7086j49877
91A60932k08591j85280p1343P9265J88682J93395J10320j3469j25247j91983j79973
102b43292q0156O5322J76396J95150J22391O139j01873j65795j62207q2109N0067
$$ plain form
0 0 0 0 0 0 0 0 8 -8 8 -16 16 -24 24 -32 40 -42 56 -65 74 -90 105 -122 145 -162 191 -215 248 -282 316 -361
30 -361 403 -455 512 -570 637 -709 788 -877 970 -1076 1192 -1318 1462 -1616 1793 -1991
46 -1991 2210 -2465 2754 -3091 3492 -3972 4566 -5313 6296 -7653 9648 -12902 19129 -35508
60 -35508 172844 442901 250564 41739 -208239 -332059 -348096 -188018 42054 262906
70 262906 333990 252419 39293 -186311 -347053 -359551 -231798 -894 220759 340931 293102
81 293102 116307 -105768 -267713 -306825 -196655 13141 226049 337895 310809 160932
91 160932 -47659 -232939 -304282 -225017 -36335 157060 267380 253911 128664 -63319 -243292
102 -243292 -323448 -258126 -81730 113420 235811 241950 140077 -25718 -187925 -270034 -219967
113b19967J64137J93503J27559J2077r7185j63805j64130r0492L1861J40265J74827
124A08650J24549J9372r4009j68400j70135r3815K5000J30858J73546J37230M0569
135B33415p5639j59354j68860r5173K6748J32034J75876J47212N9773n7915j54936
146F3181j80413j14580O549J17828J70113J49657O7067n1465j54775j90005j37018
157b53861k0667J00300J69320J60985Q6134k8463j34754j84739j46099l7673Q6930
168b02587J70591J79924J13648k651j16809j77103j54514o1213N7816J52507J80979
179A40588J27090J2690j05740j75089j67698q9218K5823J28791J73243J36682
189B07162L6421q1572j60683j65806r9606Q726J13416J70217J52320O3819n1852
$$ plain form
113 -219967 -55830 137673 265232 277309 180124 16319 -147811 -238303 -206442 -66177 108650
124 108650 233199 252571 158562 -9838 -179973 -273788 -248788 -117930 55616 192846 233415
135 233415 157776 -1578 -170438 -265611 -238863 -106829 69047 216259 276032 218117 63181
146 63181 -117232 -231812 -225263 -107435 62678 212335 279402 227937 73162 -116843 -253861
157 -253861 -274528 -174228 -4908 156077 242211 213748 78994 -105745 -251844 -289517 -202587
168 -202587 -31996 147928 261576 258925 142116 -34987 -189501 -250714 -192898 -40391 140588
179 140588 267678 280368 174628 -461 -168159 -257377 -231554 -102763 70480 207162
189 207162 243583 162011 1328 -164478 -264084 -255358 -141942 28275 180595 244414 192562
200A92562j38653j57449j06683q608R4533J57709J48836P2999l5126j24429j57690
211f1999j20418l1624O9995J37672J39151P5858k1519j10042j49187j22358m0357
222b34828O0074J30284J39635Q6145l315q8845j33355j15796m2530N2360J24262
233b5909J37803R1029M837q2277j32145j20521n3708L8525J10937J29115Q7388
244A85074N685q0260j33026j26049o1807K9827J06446J32026R7531J9929o8260
255A07116j26106j24952o4457K8374J08195J39753J10494L3161n8364j24533j32672
266a03991p7493J3133R7007J35969J15390M1628n3963j28187j44468r5881o152
277b07008Q3450J35347J25614N9154l7056j17874j43991j04260j8386P5693J38515
$$ plain form
200 192562 53909 -103540 -210223 -218831 -124298 33411 182247 255246 220120 95691 -61999
211 -61999 -182417 -214041 -144046 -6374 132777 208635 187116 77074 -72113 -194471 -234828
222 -234828 -174754 -44470 95165 181310 177995 89150 -44205 -160001 -202531 -150171 -25909
233 -25909 111894 202923 207760 125483 -6662 -127183 -180891 -142366 -31429 97686 185074
244 185074 190759 110499 -22527 -148576 -210383 -180556 -74110 57916 155447 175376 107116
255 107116 -18990 -143942 -208399 -180025 -71830 67923 178417 211578 153214 28681 -103991
266 -103991 -181484 -168351 -71344 64625 180015 221643 167680 39493 -104975 -200856 -207008
277 -207008 -123558 11789 137403 196557 159501 41627 -102364 -206624 -225010 -149317 -10802
288a0802J40845Q1412j4928j02795j41881j14628l6331N7787J26984J42101R2535
299B20299n96r3320j43457j29317o0404L2738J11017J38515J01778J6287p6429
$$ plain form
288 -10802 130043 211455 196527 93732 -48149 -162777 -199108 -141321 -14337 127764 220299
299 220299 219703 126383 -17074 -146391 -206795 -174057 -63040 75475 177253 193540 117111
$$ [...]
8191A65
##END NTUPLES=NMR FID
##END=
