##TITLE=1H_PR164_S37
 D2O, 8 sc, 
 31.1.2020
##JCAMPDX= 6.0         $$ Bruker NMR JCAMP-DX V2.0
##DATA TYPE= NMR FID
##DATA CLASS= NTUPLES
##ORIGIN= UXNMR, Bruker Analytische Messtechnik GmbH
##OWNER= root
$$ XWIN-NMR		Version 3.5
$$ Fri Jan 31 14:42:04 2020 Russian Standard Time (UT+4h)  she@DPX200
##.OBSERVE FREQUENCY= 200.1315
##.OBSERVE NUCLEUS= ^1H
##.DELAY= (6, 6)
##.ACQUISITION MODE= SIMULTANEOUS
##.ACQUISITION SCHEME= undefined
##.AVERAGES= 8
##.DIGITISER RES= 18
##SPECTROMETER/DATA SYSTEM= spect
##.PULSE SEQUENCE= zg30
##.SOLVENT NAME= D2O
##.SHIFT REFERENCE= (INTERNAL, D2O, 0, 15.7039)
##AUDIT TRAIL= $$ (NUMBER, WHEN, WHO, WHERE, WHAT)
$$ ##TITLE= Audit trail, XWIN-NMR		Version 3.5
$$ ##JCAMPDX= 5.01
$$ ##ORIGIN= Bruker BioSpin GmbH
$$ ##OWNER= she
$$ F:/spectra/data/she/nmr/H-F/1/audita.txt
$$ ##AUDIT TRAIL=  $$ (NUMBER, WHEN, WHO, WHERE, WHAT)
(   1,<2020-01-31 14:39:13.59 +0400>,<she>,<DPX200>,
      <created by zg, POWCHK disabled, PULCHK disabled
       configuration hash MD5:
       00 E9 B6 7A A2 85 ED C7 34 08 36 98 17 FE 4E 26
       data hash MD5: 16K
       AB 65 55 64 3B A9 2C B4 5F 11 EB 2B FB 45 4A BD>)
$$ ##END=
$$ 
$$ hash MD5
$$ 0B 65 C0 62 5F 2A DB 16 DE A6 5C 65 E2 FD 4C 6A
##$RELAX= 
##$RELAX= 
##$RELAX= 
##$RELAX= 
##$RELAX= 
##$RELAX= 
$$ Bruker specific parameters
$$ --------------------------
##$DU= <F:/spectra>
##$EXPNO= 1
##$NAME= <H-F>
##$PROCNO= 1
##$TYPE= <nmr>
##$USER= <she>
##$AMP= (0..31)
100 100 100 100 100 100 100 100 100 100 100 100 100 100 100 100 100 100 
100 100 100 100 100 100 100 100 100 100 100 100 100 100 
##$AQSEQ= 0
##$AQ_mod= 1
##$AUNM= <au_zg>
##$AUTOPOS= <>
##$BF1= 200.13
##$BF2= 200.13
##$BF3= 200.13
##$BF4= 200.13
##$BF5= 200.13
##$BF6= 200.13
##$BF7= 200.13
##$BF8= 200.13
##$BYTORDA= 1
##$CFDGTYP= 0
##$CFRGTYP= 5
##$CHEMSTR= <none>
##$CNST= (0..31)
1 1 145 1 1 1 1 1 1 1 1 1 1 1 1 1 1 1 1 1 1 1 1 1 1 1 1 1 1 1 1 1 
##$CPDPRG= <>
##$CPDPRG1= <>
##$CPDPRG2= <>
##$CPDPRG3= <>
##$CPDPRG4= <mlev>
##$CPDPRG5= <mlev>
##$CPDPRG6= <mlev>
##$CPDPRG7= <mlev>
##$CPDPRG8= <mlev>
##$CPDPRGB= <>
##$CPDPRGT= <>
##$D= (0..31)
0 1.2 0 0 0 0 0 0 0 0.06 0 0.03 0 0 0 0 0.0002 0 0 0 0 0 0 0 0 0 0 0 0 
0 0 0 
##$DATE= 1580467152
##$DBL= (0..7)
120 120 120 120 120 120 120 120 
##$DBP= (0..7)
150 150 150 150 150 150 150 150 
##$DBP07= 0
##$DBPNAM0= <>
##$DBPNAM1= <>
##$DBPNAM2= <>
##$DBPNAM3= <>
##$DBPNAM4= <>
##$DBPNAM5= <>
##$DBPNAM6= <>
##$DBPNAM7= <>
##$DBPOAL= (0..7)
0.5 0.5 0.5 0.5 0.5 0.5 0.5 0.5 
##$DBPOFFS= (0..7)
0 0 0 0 0 0 0 0 
##$DE= 6
##$DECBNUC= <off>
##$DECIM= 24
##$DECNUC= <off>
##$DECSTAT= 4
##$DIGMOD= 1
##$DIGTYP= 9
##$DL= (0..7)
0 120 120 120 120 120 120 120 
##$DP= (0..7)
150 150 150 150 150 150 150 150 
##$DP07= 0
##$DPNAME0= <>
##$DPNAME1= <>
##$DPNAME2= <>
##$DPNAME3= <>
##$DPNAME4= <>
##$DPNAME5= <>
##$DPNAME6= <>
##$DPNAME7= <>
##$DPOAL= (0..7)
0.5 0.5 0.5 0.5 0.5 0.5 0.5 0.5 
##$DPOFFS= (0..7)
0 0 0 0 0 0 0 0 
##$DQDMODE= 0
##$DR= 18
##$DS= 0
##$DSLIST= <SSSSSSSSSSSSSSS>
##$DSPFIRM= 0
$$ [...]
##$SUBNAM2= <"">
##$SUBNAM3= <"">
##$SUBNAM4= <"">
##$SUBNAM5= <"">
##$SUBNAM6= <"">
##$SUBNAM7= <"">
##$SUBNAM8= <"">
##$SUBNAM9= <"">
##$SW= 24.9337058887773
##$SWIBOX= (0..15)
0 0 2 0 0 0 0 0 0 0 0 0 0 0 0 0 
##$SW_h= 4990.01996007984
##$TD= 16384
##$TD0= 1
##$TE= 0
##$TE2= 300
##$TE3= 300
##$TEG= 300
##$TL= (0..7)
0 120 120 120 120 120 120 120 
##$TP= (0..7)
150 150 150 150 150 150 150 150 
##$TP07= 0
##$TPNAME0= <>
##$TPNAME1= <>
##$TPNAME2= <>
##$TPNAME3= <>
##$TPNAME4= <>
##$TPNAME5= <>
##$TPNAME6= <>
##$TPNAME7= <>
##$TPOAL= (0..7)
0.5 0.5 0.5 0.5 0.5 0.5 0.5 0.5 
##$TPOFFS= (0..7)
0 0 0 0 0 0 0 0 
##$TUNHIN= 0
##$TUNHOUT= 0
##$TUNXOUT= 0
##$USERA1= <user>
##$USERA2= <user>
##$USERA3= <user>
##$USERA4= <user>
##$USERA5= <user>
##$V9= 5
##$VALIST= <valist>
##$VCLIST= <CCCCCCCCCCCCCCC>
##$VD= 0
##$VDLIST= <DDDDDDDDDDDDDDD>
##$VPLIST= <PPPPPPPPPPPPPPP>
##$VTLIST= <TTTTTTTTTTTTTTT>
##$WBST= 1024
##$WBSW= 4
##$XGAIN= (0..3)
0 0 0 0 
##$XL= 0
##$YL= 0
##$YMAX_a= 466028
##$YMIN_a= -405248
##$ZGOPTNS= <>
##$ZL1= 120
##$ZL2= 120
##$ZL3= 120
##$ZL4= 120
##$ABSF1= 10
##$ABSF2= 0
##$ABSG= 5
##$ABSL= 3
##$ALPHA= 0
##$AQORDER= 0
##$ASSFAC= 0
##$ASSFACI= 0
##$ASSFACX= 0
##$ASSWID= 0
##$AUNMP= <proc_1d>
##$AZFE= 0.1
##$AZFW= 0.1
##$BCFW= 1
##$BC_mod= 2
##$BYTORDP= 1
##$COROFFS= 0
##$CY= 11.3945322036743
##$DATMOD= 1
##$DC= 2
##$DFILT= <>
##$DTYPP= 0
##$F1P= 16.9975609425685
##$F2P= -3.02152046262296
##$FCOR= 0.5
##$FTSIZE= 0
##$FT_mod= 4
##$GAMMA= 1
##$GB= 0.15
##$INTBC= 1
##$INTSCL= 1
##$ISEN= 128
##$LB= 0.24
##$LEV0= 0
##$LPBIN= 0
##$MAXI= 10000
##$MC2= 0
##$MEAN= 0
##$ME_mod= 0
##$MI= 1.114404
##$NCOEF= 0
##$NC_proc= 0
##$NLEV= 6
##$NOISF1= 3.799351
##$NOISF2= 2.8
##$NSP= 1
##$NTH_PI= 0
##$NZP= 0
##$OFFSET= 15.70392
##$PC= 1
##$PHC0= -9792.907
##$PHC1= 15.80081
##$PH_mod= 1
##$PKNL= yes
##$PPARMOD= 0
##$PSCAL= 0
##$PSIGN= 0
##$REVERSE= no
##$SF= 200.130013532006
##$SI= 16384
##$SIGF1= 3
##$SIGF2= 2
##$SINO= 400
##$SIOLD= 16384
##$SREGLST= <1H.CDCl3>
##$SSB= 0
##$STSI= 0
##$STSR= 0
##$SW_p= 3612.71676300578
##$SYMM= 0
##$S_DEV= 0
##$TDeff= 0
##$TDoff= 0
##$TI= <>
##$TILT= no
##$TM1= 0
##$TM2= 0
##$TOPLEV= 0
##$USERP1= <user>
##$USERP2= <user>
##$USERP3= <user>
##$USERP4= <user>
##$USERP5= <user>
##$WDW= 1
##$XDIM= 8192
##$YMAX_p= 0
##$YMIN_p= 0
$$ End of Bruker specific parameters
$$ ---------------------------------
##NTUPLES= NMR FID
##VAR_NAME=  TIME,          FID/REAL,        FID/IMAG
##SYMBOL=    X,             R,               I
##VAR_TYPE=  INDEPENDENT,   DEPENDENT,       DEPENDENT
##VAR_FORM=  AFFN,          ASDF,            ASDF
##VAR_DIM=   8192,          8192,            8192
##UNITS=     SECONDS,       ARBITRARY UNITS, ARBITRARY UNITS
##FACTOR=    0.0002004,     1,               1
##FIRST=     0,             0,               0
##LAST=      1.6414764,     0,               0
##MIN=       0,             -405248,         0
##MAX=       1.6414764,     466028,          0
$$ Real data points
##PAGE= N=1
##DATA TABLE= (X++(R..R)), XYDATA
0 0 0 0 0 0 0 0 0 8 -7 8 -8 8 -16 16 -24 24 -32 40 -45 56 -64 72 -87 99 -115 132 -148 172 -190 216 -245
31 -245 273 -309 345 -384 431 -475 530 -590 653 -725 800 -888 983 -1086 1208 -1338 1491
48 1491 -1665 1866 -2103 2387 -2732 3168 -3728 4490 -5585 7307 -10434 17915 -74457 27053
62 27053 291414 331315 255498 60500 -155310 -354989 -405248 -275862 -8230 235066 355525
73 355525 308489 146764 -74709 -260671 -333485 -236466 -15829 225024 364108 351170 195359
84 195359 -31013 -235001 -320594 -254156 -74236 127803 269381 291493 175908 -40959 -252436
95 -252436 -345463 -281003 -115043 71474 216896 273441 200815 12926 -191268 -288702 -233024
106 -233024 -74915 101050 235942 292016 235865 70939 -127833 -248301 -225446 -89170
116 -89170 77424 202848 248570 192390 39753 -147936 -272929 -269259 -148244 20732 162741
127 162741 223173 173489 32047 -134488 -244265 -245700 -139461 29829 192496 272671 228893
138 228893 84586 -84121 -197480 -212794 -129238 23072 184433 275381 239941 90949 -94064
149 -94064 -225158 -255356 -185011 -43031 119857 230445 223239 93240 -90836 -233324 -274342
160 -274342 -207168 -61317 112192 242599 264056 160417 -14116 -171202 -239384 -195105 -58600
171 -58600 114323 249149 282769 196516 28564 -144865 -248823 -238740 -121866 47039 190078
182 190078 240879 177939 29775 -138979 -256375 -269628 -170210 -307 160027 238712 206095
193 206095 83759 -72573 -196446 -231808 -156280 -770 161418 253848 238770 129390 -24157
204 -24157 -158519 -217170 -173271 -45739 104714 203415 206077 113788 -30920 -166096 -234313
215 -234313 -205220 -91963 53859 164108 190544 123517 -2512 -128717 -196692 -175395 -73877
226 -73877 63254 174972 212739 160711 43605 -83293 -162217 -157455 -74099 48405 152759
237 152759 190489 142574 29637 -97717 -182452 -187529 -112412 5929 112591 159424 125006
248 125006 25222 -93482 -175494 -182155 -108189 13226 128866 187011 162014 67506 -52457
259 -52457 -141027 -157940 -95527 19381 134141 194989 172397 75974 -51315 -154667 -188055
270 -188055 -138033 -26616 92377 164584 155499 68538 -57583 -165769 -207429 -162014 -48552
281 -48552 82111 173096 184594 112327 -8773 -123383 -179518 -149614 -45780 86896 187655
292 187655 210548 146770 24582 -102960 -181532 -174968 -87950 39305 146480 184524 136691
303 136691 23373 -106367 -195569 -204167 -128305 -2080 117779 178716 155146 59847 -63502
314 -63502 -157843 -179867 -119246 -1523 120924 193898 185723 101919 -19160 -123624 -166160
325 -166160 -128790 -29115 84680 161459 164838 94264 -20715 -128808 -182441 -158752 -70296
336 -70296 41476 126362 146604 94735 -4218 -104349 -158432 -142154 -62689 45617 134129
347 134129 164622 124583 34353 -64295 -125739 -122656 -57681 39173 122452 152558 115981 28069
359 28069 -70724 -137920 -143531 -86820 5024 87610 123598 96864 18832 -74120 -139187 -145024
371 -145024 -88003 6471 95509 139950 121368 49275 -42312 -110877 -122867 -72129 18143 106308
383 106308 152100 134494 60503 -37417 -116259 -141055 -100316 -13957 76991 129384 119479 50160
395 50160 -47715 -131408 -161880 -124827 -35780 64868 132000 136989 78857 -15486 -102933 -142826
407 -142826 -115295 -31173 72170 148599 163893 111934 15033 -83602 -140150 -129828 -58473 40738
419 40738 122297 148453 106126 13755 -88815 -156053 -158800 -95938 3303 95640 139613 116675
431 116675 37856 -60368 -132773 -145698 -92842 2390 98867 154386 145185 76308 -20356 -101729
443 -101729 -131619 -96828 -15251 75925 135049 135264 75325 -18475 -104806 -145505 -123817 -51576
455 -51576 37297 102980 116648 72617 -8741 -89898 -132670 -117450 -51377 35872 105919 129656
467 129656 97788 24952 -55091 -103277 -98192 -42886 35477 101067 124539 95956 26402 -54088
479 -54088 -108526 -112502 -66061 7178 71878 99230 77331 14790 -60075 -112742 -117860 -71770
491 -71770 2878 72796 107623 92582 35739 -36344 -89030 -97704 -57316 14040 84405 121773
503 121773 107775 48597 -28361 -89396 -106337 -74044 -7864 62910 104900 96761 39088 -40662
515 -40662 -105319 -126548 -96410 -28759 48318 101861 106558 58693 -19011 -87551 -115081 -89893
527 -89893 -23161 56505 117037 130313 88455 9289 -68818 -110244 -98276 -39837 37448 100951
539 100951 121217 86323 10710 -72373 -125387 -125446 -74177 5649 78447 111220 90048 25421
551 25421 -53015 -110872 -121038 -76677 2403 81227 124552 114022 58018 -18642 -82432 -106588
563 -106588 -78188 -9686 67397 115542 112130 60383 -14253 -82228 -116005 -100224 -42125 32955
575 32955 87598 96216 57046 -10357 -75151 -109531 -99091 -46147 26411 85914 105896 78313
587 78313 17433 -46422 -84731 -80529 -36492 27661 83751 105087 82140 24208 -41849 -86098
599 -86098 -89378 -52895 5871 58881 82041 65510 14500 -48355 -92794 -97323 -60686 -718
611 -718 54991 83836 73693 28576 -29460 -73650 -81111 -48304 10012 67544 97498 87204 41400
624 41400 -19521 -68465 -83977 -58539 -4273 53659 86481 77815 32192 -30125 -82265 -101287
636 -101287 -79317 -24583 39022 80936 82163 42957 -17793 -71324 -94317 -75226 -21153 45686
648 45686 95333 104286 68973 6525 -54038 -86722 -78217 -31263 33751 86295 100941 70238
660 70238 8510 -57182 -100034 -101502 -59943 6026 65251 90341 71407 17916 -46064 -93127
672 -93127 -101454 -64680 1213 66019 100760 92284 46172 -16597 -69552 -88646 -63372 -5062
684 -5062 57985 96234 94190 53144 -9347 -67679 -96370 -81428 -31057 29208 71923 79404 49297
697 49297 -6996 -64175 -95398 -85114 -38520 21095 67845 84423 64376 16164 -39396 -73926
709 -73926 -69831 -30228 23934 68656 86557 70622 25543 -30944 -70654 -74629 -42505 6460
721 6460 49017 68628 55923 15301 -37327 -76437 -82268 -52840 -4207 42185 66915 59980 23985
734 23985 -24604 -61186 -67969 -41711 4687 51700 79376 74068 36890 -14119 -54550 -66152
746 -66152 -45323 -3787 41494 70755 67839 30452 -23683 -67099 -80731 -62302 -20703 27115
758 27115 63189 67613 36224 -16225 -61768 -77947 -60906 -17851 33583 74298 84938 57707
770 57707 5568 -45271 -70857 -61288 -23059 28349 70732 84246 60332 8962 -46313 -81184
782 -81184 -81405 -47506 5709 53752 74911 58094 12725 -39966 -77943 -84482 -55328 -1545 53513
795 53513 83237 74965 35579 -15700 -57653 -72811 -53326 -5303 49455 83263 80386 43953
807 43953 -7542 -53800 -77013 -67294 -26896 25283 63127 68567 40062 -7060 -52860 -78609
819 -78609 -72922 -37013 14473 56794 71269 52606 11172 -33273 -61164 -59722 -28808 17305
831 17305 58055 74927 60993 22977 -23140 -55842 -60879 -36529 4118 41836 59473 49117
843 49117 15230 -28400 -62168 -69339 -46766 -6135 32751 53979 48886 20455 -18651 -50923
855 -50923 -58648 -38182 1209 41260 63993 60400 32413 -7763 -41930 -54499 -38775 -3065
867 -3065 35641 58827 55240 26899 -14762 -51406 -66683 -53330 -18106 22977 50601 52776 28456
880 28456 -11687 -49017 -65542 -53256 -18031 26557 59984 67900 46317 5800 -35157 -57069
892 -57069 -51342 -19114 24277 59258 69852 50876 9350 -35793 -65359 -66334 -38440 4719 44083
905 44083 61199 48632 11340 -33822 -66193 -71280 -46549 -2750 41481 66803 62115 30541
917 30541 -13292 -49256 -61493 -44028 -4278 40072 68679 68981 40856 -3375 -44937 -64369
929 -64369 -54973 -21152 20831 52018 58563 36674 -3985 -45026 -67994 -62177 -31926 9911 45588
942 45588 59060 44975 10462 -27999 -53033 -52222 -26778 12610 47495 63328 53302 21920
954 21920 -16684 -45773 -51405 -31897 2315 34763 51537 43976 15245 -21370 -50209 -58200 -41764
967 -41764 -8781 24917 44526 41866 18180 -14664 -41681 -49879 -34983 -3233 31151 52775
979 52775 51475 28891 -4178 -32729 -43763 -32796 -4586 27846 49114 48280 25594 -8961 -40330
992 -40330 -53913 -44866 -17363 16205 40470 43815 24694 -8650 -40103 -55284 -46225 -17587 19040
1005 19040 47600 54971 38935 6382 -27899 -47375 -43261 -16906 19668 49056 58667 44049
1017 44049 10852 -27295 -53206 -54902 -32358 3532 36634 50919 41267 10714 -27230 -55756
1029 -55756 -61216 -40868 -4211 33154 54622 51703 25821 -10851 -41974 -52681 -37990 -4511
1041 -4511 33007 58302 59585 36713 -1176 -36070 -54131 -46492 -18262 17167 44533 51041 33092
1054 33092 -1642 -36997 -58013 -54622 -29557 6361 37068 49844 38822 9450 -23929 -46000
1066 -46000 -46226 -25188 8235 39332 54734 47219 20894 -12611 -37841 -43090 -28248 185 29182
1079 29182 45325 40360 16247 -16001 -41811 -49784 -37226 -10624 19062 37526 36604 16842 -11949
1092 -11949 -35713 -43730 -32248 -6138 23326 43365 44763 26543 -1582 -26455 -36903 -28235
1104 -28235 -5115 22608 41712 42467 24378 -4494 -31612 -44427 -38305 -15640 12216 33079
1116 33079 37162 21161 -6103 -33441 -46617 -40556 -17527 13592 38122 45670 32779 5728
1128 5728 -22464 -39279 -36712 -15403 15251 41479 50984 38709 10493 -21119 -43139 -45508 -27608
1141 -27608 2409 30706 44182 35731 9461 -22789 -47056 -52478 -36341 -5445 26772 45776
1153 45776 43556 21515 -9457 -35994 -45672 -33689 -5126 28022 50348 51831 32189 216
1165 216 -29613 -44908 -39891 -15665 15788 40190 45133 29449 -844 -31418 -49762 -48392 -26942
1178 -26942 4309 31608 42873 33179 8241 -21040 -40546 -41989 -24014 5193 33512 47466
1190 47466 41720 18994 -9342 -31587 -38116 -25040 -11 25830 40003 36389 16288 -11211
1202 -11211 -35008 -43468 -33093 -10120 15456 31106 31229 15624 -8488 -30656 -39621 -30500 -7226
1215 -7226 18515 35587 37502 23898 1326 -20889 -32230 -26114 -5241 19185 35572 36513 22829
1228 22829 -900 -24024 -37442 -33629 -14010 9849 28140 31244 18329 -4282 -27213 -39946
1240 -39946 -35992 -16603 9277 30731 37999 27666 5376 -18834 -33384 -31212 -13108 12426
1252 12426 34536 43267 34631 10877 -17072 -35936 -37574 -22226 2175 25437 37402 31447 9507
1265 9507 -19368 -41114 -45114 -30475 -4851 21098 37486 36826 18741 -8724 -32441 -40392 -29069
1278 -29069 -4189 23840 42331 44622 28730 1221 -25384 -38900 -33719 -12415 14712 34936
1290 34936 39616 26750 885 -26271 -43009 -42383 -24092 3187 27110 36765 28448 6558 -18497
1303 -18497 -35499 -37669 -22905 3275 28855 41748 36495 16800 -7971 -26643 -32490 -22549 -809
1316 -809 22840 36900 33820 15724 -8761 -29125 -36805 -29588 -10329 11513 27382 28482 14326
1329 14326 -7739 -27135 -34908 -27617 -8582 13265 29595 33299 21892 1472 -18008 -27699 -22281
1342 -22281 -5141 15294 30304 32824 22066 1677 -19233 -31232 -28360 -12761 7814 23176
1354 23176 26779 17205 -2132 -22430 -34401 -32056 -15890 6663 25243 31151 23140 4677 -15536
1367 -15536 -28634 -27461 -12583 9938 29953 37722 30143 10043 -13016 -29054 -31272 -19375 2249
1380 2249 22864 33552 27660 8022 -16127 -34846 -38913 -27820 -5757 17666 32371 31364 15045
1393 15045 -8837 -28855 -35285 -26194 -4937 19594 37069 39685 25485 980 -21696 -33269
1405 -33269 -28856 -10683 13371 31761 36288 24487 1385 -23099 -38039 -37422 -21369 2904 23371
1418 23371 32105 24964 5588 -16916 -33161 -35081 -21086 2136 24732 36284 32833 15770 -6460
1431 -6460 -23731 -29629 -20417 -209 21207 33091 30832 15680 -5471 -25110 -33190 -27623 -9567
1444 -9567 10989 24499 25168 13217 -5678 -23919 -32014 -26333 -9643 10763 25659 28981 19115
1457 19115 1797 -15311 -24598 -20561 -6030 12966 27050 30349 20725 2770 -15359 -26481 -24706
1470 -24706 -11444 6246 20545 24165 16057 -1139 -19641 -30355 -28680 -14865 4296 20221
1482 20221 26592 20288 4134 -14101 -25464 -24465 -11443 8244 25279 32696 26797 9887 -10350
1495 -10350 -24713 -26746 -15959 2746 20788 29522 24318 7741 -13347 -30177 -34197 -24530 -5223
1508 -5223 15377 27936 26792 12304 -8688 -26105 -32120 -23899 -4434 17623 32851 34464 21964
1521 21964 1158 -19044 -29174 -24949 -8399 12664 29151 32938 22185 1363 -20136 -33659
1533 -33659 -32658 -18406 2760 21211 28882 22180 4339 -16558 -30749 -32182 -19498 1665 21559
1546 21559 32260 29006 13756 -6268 -22405 -27096 -17665 645 19425 30425 28715 15514 -4316
1559 -4316 -21931 -29505 -23919 -7975 10143 22287 23219 12292 -5435 -21922 -29690 -24747 -9689
1572 -9689 8955 22265 25213 16913 1620 -14078 -22144 -19241 -5928 11215 23952 27509 19788
1585 19788 3781 -12953 -22410 -20765 -10014 5693 18161 22078 14738 -918 -16862 -26523 -25100
1598 -25100 -14001 2295 16643 22554 17203 3113 -12801 -22837 -21865 -9988 6536 21495 28226
1611 28226 23535 8730 -8780 -21207 -22464 -12892 3475 18740 26187 21674 7373 -11516 -26601
1624 -26601 -29825 -21348 -4012 13567 23847 22054 9566 -8598 -23749 -29082 -21565 -4191 15455
1637 15455 28815 30111 18526 223 -16802 -25412 -21505 -6823 12877 27025 30119 19972 1314
1650 1314 -17588 -29038 -28227 -15692 3094 19670 26158 19307 2928 -15626 -28191 -29119 -18095
1663 -18095 479 19069 28729 25710 11518 -6673 -20502 -24322 -15774 364 17534 28348 27160
1676 27160 14643 -3525 -19543 -26026 -20797 -6803 9582 20247 21315 11704 -4819 -20009 -27331
1689 -27331 -22926 -9295 7121 19292 21993 15090 1279 -13029 -20330 -17981 -5961 9267 21716
1702 21716 24815 17885 4309 -10256 -18927 -18716 -8806 5401 16752 19699 13599 219 -13989
1715 -13989 -22850 -22679 -13340 1467 14189 19307 14316 2258 -11628 -20319 -20097 -10124 5117 18467
1729 18467 24805 20300 7783 -7417 -17831 -18871 -10657 3528 17021 23703 19909 6275 -9634
1742 -9634 -22214 -25284 -17757 -3407 11937 20563 18873 7546 -8259 -21929 -26435 -19033 -3574
1755 -3574 13385 24804 25739 15452 -823 -15398 -22665 -18351 -4414 12250 24685 27104 17674
1768 17674 1239 -15481 -25976 -24713 -12898 3989 17988 23278 16970 1825 -14796 -26151
1780 -26151 -26948 -16278 680 17143 24744 22113 9340 -6660 -19068 -22344 -14284 1099 17034
1793 17034 26221 24702 13519 -3079 -16938 -22759 -18021 -5162 9751 19939 20140 10453 -4561
1806 -4561 -17890 -24731 -21299 -9315 5670 17172 19866 12897 317 -12317 -19188 -16448 -6224
1819 -6224 8098 19081 22687 16830 4774 -8924 -16822 -16030 -7250 5342 15471 18590 13369 1250
1833 1250 -12310 -20384 -20406 -11273 1131 11971 16262 12339 1681 -11010 -18596 -18289 -9370 4164
1847 4164 15805 21005 17301 6830 -6289 -15539 -16909 -8758 3723 15977 20943 17499 6487
1860 6487 -7991 -19217 -22076 -14969 -2032 10929 18100 16346 5986 -8338 -20410 -23650 -16698
1873 -16698 -3100 11823 21386 21565 12849 -1641 -14716 -20153 -15382 -2853 11402 22850 24645
1886 24645 16223 986 -14348 -22653 -20829 -9926 4948 16964 21100 14988 925 -14637 -24266
1899 -24266 -23804 -14023 847 14904 22083 18998 6745 -7995 -18301 -20116 -12718 1485 15979
1912 15979 24244 22351 11733 -3183 -15567 -20090 -15696 -4155 10076 19187 18747 9634 -4349
1925 -4349 -16671 -22649 -19168 -8705 4827 15788 17595 10916 -811 -12488 -17847 -16261 -6228
1938 -6228 7294 17246 20566 14878 4323 -7717 -14633 -14180 -6269 5220 14743 17597 12384 1618
1952 1618 -10052 -17578 -18036 -10594 707 10749 14421 10211 878 -9332 -17118 -16941 -9167 2849
1966 2849 13703 18393 14873 5583 -5382 -13164 -14083 -7623 3673 14926 19271 15950 5618 -6841
1980 -6841 -15878 -18332 -12645 -1291 10519 15999 13762 4245 -8267 -18323 -20822 -14941 -2943 10254
1994 10254 18285 18058 10231 -2555 -13694 -18064 -13458 -1687 11243 20266 21355 13746 985 -12492
2008 -12492 -19872 -17450 -7440 6054 16003 19023 12602 340 -13599 -22393 -22014 -12137 1626 13661
2022 13661 18996 15640 4755 -8119 -17765 -18899 -11381 2235 14902 21702 19789 10250 -3222
2035 -3222 -14151 -17895 -13060 -2181 10351 18076 17336 8457 -3999 -15496 -20340 -17142 -6975 4994
2049 4994 13733 15913 9414 -1525 -12253 -17084 -14459 -5498 6446 15479 18392 13466 3415 -7265
2063 -7265 -13267 -12509 -4751 5064 13573 16304 12005 1724 -8889 -15538 -15650 -8932 1224 9156 12646
2078 12646 9030 581 -9373 -15421 -15345 -8333 1930 10978 15571 12245 4397 -5478 -12142 -12359 -6211
2093 -6211 3921 13236 17092 13991 4861 -5741 -13650 -15511 -10113 -295 9301 14169 11796 3513
2107 3513 -7759 -16345 -18150 -12932 -2147 8683 15547 15041 7617 -3479 -12665 -15959 -11688 -958
2121 -958 10629 18374 18888 11927 -175 -11017 -16884 -14159 -5036 6429 15141 17046 10824 -738
2135 -738 -12751 -19743 -18803 -10149 2057 12468 16470 12675 2994 -8672 -16631 -17045 -9827 2177
2149 2177 13501 19464 17108 8407 -3350 -12547 -15923 -10522 -552 10221 16960 15918 7799 -3857
2163 -3857 -13752 -18158 -14934 -5995 5079 12788 13770 7469 -2549 -11759 -16032 -13713 -5026 5215
2177 5215 13682 16108 11329 2515 -6522 -12509 -10857 -4210 5364 12755 15088 10963 2287 -7133 -13494
2192 -13494 -13307 -7378 1066 8528 10978 8015 369 -8454 -13974 -13530 -7552 1272 9255 12737 10762
2207 10762 3447 -5159 -10727 -10968 -4946 3806 11345 14928 12523 4747 -4635 -11507 -12609 -7850 524
2222 524 8537 12729 10333 2636 -6852 -14800 -15961 -10903 -2069 7318 13244 12448 5350 -4196 -12018
2237 -12018 -14217 -9655 -476 9501 16017 16529 9992 -662 -9888 -13843 -11550 -3274 6799 14051
2251 14051 15137 9183 -1381 -11335 -17154 -15801 -8437 2224 11233 14237 10490 1021 -9002 -15143
2265 -15143 -15365 -8192 2476 12479 17347 14674 6318 -3709 -11756 -13476 -8977 487 10409 15788
2279 15788 14425 6696 -3429 -12258 -15857 -12678 -4184 5363 11658 12147 6016 -2866 -11144 -15265 -12994
2294 -12994 -4758 4959 12367 14108 9470 1603 -6184 -10929 -9904 -3482 5174 12302 13576 9677 2269
2309 2269 -6019 -11386 -11525 -6266 1556 8294 10091 7227 202 -7628 -12674 -12648 -7130 974 8268 10656
2325 10656 8500 2388 -4778 -9672 -9754 -4635 3434 10443 13349 11044 4100 -3620 -9619 -10545 -5875
2340 -5875 1095 8035 11061 8860 2372 -5907 -12470 -13746 -9041 -1361 6254 10847 9899 4048 -4051
2355 -4051 -10708 -12800 -8250 257 8538 14124 13853 8092 -850 -8774 -12105 -9411 -1541 7153 13052
2370 13052 13291 7993 -1306 -10064 -15021 -13382 -6733 2861 10281 12245 8026 -313 -8825 -14029 -13372
2385 -13372 -7029 2164 11018 14849 12546 4797 -4113 -10899 -11496 -7266 1333 9960 14496 13114 5811
2400 5811 -3517 -11064 -13688 -10547 -3261 5223 10924 10723 5114 -3410 -10676 -13907 -11220 -4038 4293
2415 4293 10621 11978 8275 1040 -6442 -10253 -8301 -2884 5021 10941 12392 8991 1863 -5547 -10125
2430 -10125 -9612 -5078 2125 7545 9237 6456 142 -6752 -11532 -11037 -6562 713 6652 9295 7007
2445 7007 1693 -4827 -8523 -8721 -4027 2946 8775 11627 9246 3839 -2976 -7697 -8539 -4869 1452
2460 1452 7540 10320 7654 1790 -5375 -10464 -11325 -7604 -1174 5450 9297 8197 2751 -4492 -9988
2475 -9988 -11422 -6875 22 7149 12039 12028 6368 -1637 -7601 -10058 -7384 -659 6745 11877 11807 6888
2491 6888 -1145 -8839 -12968 -11314 -4828 3117 9037 10511 6596 -540 -8395 -13183 -12213 -6093 2376
2506 2376 9615 12748 10249 3655 -4522 -9766 -10422 -5715 2106 9491 13317 11417 5107 -2871 -9798
2521 -9798 -11875 -8744 -1840 5378 9904 9383 4314 -3403 -9828 -12356 -10217 -3706 4001 9345 10382
2536 10382 6517 -109 -6221 -9104 -7786 -2629 4561 10336 11280 8145 1846 -4341 -8635 -8360 -4109
2551 -4109 2113 6930 8757 6449 -48 -6103 -9723 -9702 -5902 137 5641 8020 6080 1214 -4445
2566 -4445 -7827 -7838 -3986 2467 7434 9923 7895 3141 -2366 -6438 -7284 -4056 1797 6708 8891 7027
2582 7027 2155 -4338 -8778 -9943 -6633 -638 5083 7599 6269 1502 -3931 -8839 -9729 -6771 -392
2597 -392 6583 10256 9861 5198 -1188 -6811 -8530 -5983 -226 6413 10523 10323 5827 -1238 -7437 -10656
2613 -10656 -9117 -3618 3230 8210 8958 5279 -1127 -7779 -11569 -10268 -4998 2215 8322 10559 8789
2628 8789 2664 -4269 -8886 -9055 -4256 2355 8671 11730 10064 4428 -2888 -8730 -10245 -7081 -1042
2643 -1042 5350 8921 8444 3551 -3558 -9035 -11094 -8888 -3335 3404 7915 8852 5473 -422 -5909
2658 -5909 -8628 -7045 -2204 4175 8953 10197 7512 1487 -4195 -7433 -7264 -3092 2472 6987 8203
2673 8203 5304 306 -5128 -8707 -8500 -5197 166 4812 6784 5050 633 -4258 -7039 -7045 -3689 1530
2689 1530 6450 8877 7021 2713 -2095 -5728 -6019 -3169 1759 6186 7849 6180 1571 -3537 -7491
2704 -7491 -7928 -5345 -711 4347 6552 5563 899 -4220 -7808 -8722 -5757 -281 5181 8395 7585 3983
2720 3983 -1304 -6098 -7399 -4775 125 5891 9481 8788 5142 -997 -6419 -8892 -7117 -2565 3322
2735 3322 7351 7625 4328 -1569 -7061 -10405 -9197 -4374 1830 7067 9149 6691 1459 -4170 -8240
2750 -8240 -8058 -3923 2399 7872 10223 8356 3629 -2638 -7573 -8919 -5964 -367 5339 8458 7711
2765 7711 3078 -3322 -8296 -9872 -7945 -2888 3189 7289 7519 4160 -921 -5759 -8280 -6504 -1850
2780 -1850 3452 7829 8962 6476 1458 -3827 -6594 -6037 -2531 2392 6244 7194 5059 694 -4674
2795 -4674 -7258 -7565 -4521 148 4177 5994 4412 162 -3951 -6663 -6642 -3340 1261 5497 7184 5785
2811 5785 2326 -1665 -4741 -5047 -2578 1929 5819 7153 5657 1704 -2875 -6309 -7040 -4363 -325
2826 -325 3816 5605 4472 523 -3763 -6942 -7432 -4787 -407 4623 6785 6507 2991 -1966 -5423 -6300
2842 -6300 -4185 771 5221 8209 8041 4122 -922 -5447 -7565 -5897 -1422 3447 6520 6886 3727
2857 3727 -1611 -6536 -9082 -7963 -3499 2159 6441 7734 5481 526 -4436 -7507 -7045 -3067 2384
2872 2384 7464 9304 7538 2924 -3174 -6649 -7465 -4553 463 5225 7542 6633 2363 -3062 -7420
2887 -7420 -8576 -6485 -2147 3165 6336 6560 3356 -1309 -5829 -7364 -5861 -1947 3519 7217 8153
2902 8153 5423 1014 -3492 -5652 -5264 -2080 2726 5897 6803 4752 295 -3879 -6650 -6571 -3780 217
2918 217 3829 5144 3922 88 -3665 -6379 -6271 -3349 973 4710 6061 5112 1920 -1842 -4169 -4482
2934 -4482 -2169 1900 4920 6447 5126 1714 -2387 -5254 -5670 -3789 299 3454 5073 3830 453
2949 453 -3374 -5981 -6716 -4518 -249 3721 5826 5080 1774 -1985 -4924 -5607 -3470 675 4860 7260
2965 7260 6956 3310 -1104 -4686 -6253 -4730 -959 3450 5953 6035 3105 -1597 -6020 -7983 -6640 -2785
2981 -2785 1966 5701 6370 4196 -268 -4643 -6951 -6536 -2145 2320 6867 7836 6382 2344 -2689 -5759
2997 -5759 -6187 -3173 1021 5349 7171 6161 2004 -2883 -6900 -7967 -5630 -1396 3096 5553 5532 2695
3013 2695 -1808 -5670 -7199 -5503 -1273 3320 6466 6800 4704 569 -3477 -5346 -4576 -1358 2684
3028 2684 5794 6582 4436 632 -3626 -6020 -5684 -3305 391 3757 4728 3199 119 -3849 -5966 -5372
3044 -5372 -3406 420 3688 5578 4484 1525 -2029 -4076 -3994 -1932 1597 4446 6088 4897 1734
3059 1734 -1751 -4447 -4643 -3055 325 3175 4187 3374 395 -3267 -5651 -5912 -4126 -288 3267 4898
3075 4898 4343 1514 -1995 -4559 -4683 -2849 850 4285 6374 6063 2963 -673 -4238 -5009 -3967 -410
3091 -410 3599 6071 5557 2417 -1801 -5342 -7114 -5877 -2533 1988 4913 5415 3254 -883 -4624 -6401
3107 -6401 -5562 -1984 2631 5719 7080 5704 1887 -2381 -5169 -5450 -2856 1348 5264 6722 5431
3122 5431 1790 -2755 -5972 -6931 -4946 -1119 3198 5245 4996 1992 -2099 -5670 -6724 -5131 -1198
3137 -1198 3141 5834 6252 4027 417 -2881 -5117 -4136 -1029 2650 5484 6011 4179 592 -3236 -5366
3153 -5366 -5073 -2713 767 3485 4571 2996 -203 -3351 -5478 -5485 -3518 407 3154 4698 3769 956
3169 956 -1708 -3783 -3745 -1852 1350 4180 5526 4537 2062 -1374 -3495 -3928 -2292 352 3040 3940
3185 3940 3212 395 -2588 -4833 -5042 -3254 -516 2638 4170 3316 1111 -1818 -4245 -4340 -2484 816
3201 816 3860 5540 5153 2520 -778 -3556 -4343 -2951 87 3189 5090 4973 2295 -1496 -4974 -6031
3217 -6031 -4625 -1758 1740 4332 4586 2505 -694 -4316 -5896 -4882 -1853 2081 5485 5976 4603
3232 4603 1501 -2506 -5217 -4696 -2265 1875 4976 6174 5044 1458 -2450 -5766 -5868 -4081 -681
3247 -681 2634 4866 4541 1539 -2248 -5414 -6388 -4547 -1138 2598 5243 5414 3151 -33 -3242 -4604
3263 -4604 -3826 -859 2365 5254 5913 4266 525 -2564 -4798 -4568 -2358 626 3287 4352 2994 41
3279 41 -3433 -4876 -5196 -3266 -24 3056 3895 3375 972 -1778 -3495 -3721 -1925 1263 3551 4628
3295 4628 4094 1506 -1107 -3170 -3309 -2013 688 2894 4020 3005 149 -2336 -4344 -4416 -3151 -418
3311 -418 2223 3350 2991 695 -2017 -3823 -4129 -2089 528 3445 5009 4544 2093 -629 -2946 -3880
3327 -3880 -2291 439 3237 4826 4190 1895 -1335 -4003 -5321 -4124 -1724 1748 4114 4026 2080 -1469
3343 -1469 -4095 -5316 -4509 -1662 1948 4789 5421 3818 646 -2487 -4529 -4093 -1573 1845 4607 5919
3359 5919 4319 1299 -2180 -4795 -5312 -3687 -163 3031 4564 3763 1190 -2688 -5222 -6004 -4193 -897
3375 -897 2367 4575 4715 2802 -121 -3411 -4468 -3390 -791 2820 5144 5319 3756 467 -2465 -4144
3391 -4144 -4176 -1815 975 3330 4098 2595 14 -3316 -4969 -4566 -2790 -25 2399 3265 2874 790
3407 790 -1848 -3539 -3741 -2118 787 3442 4699 3595 1687 -891 -2649 -2983 -1603 552 2530 3628
3423 3628 2696 698 -1985 -3678 -4127 -3220 -333 1650 2715 2543 594 -1971 -3360 -3592 -1983 580
3439 580 2668 4022 3437 1833 -513 -2660 -3215 -1853 599 3213 4339 3853 2079 -1251 -3779 -4178
3455 -4178 -3507 -697 1716 3401 3191 1575 -1467 -3766 -4896 -4124 -1347 1623 4468 4588 3193 274
3471 274 -2471 -4087 -3569 -1517 1828 4262 5386 4481 923 -2212 -4072 -4582 -2850 217 3176 4520
3487 4520 3439 1077 -2310 -4956 -5239 -3841 -934 2183 4084 4332 2448 -597 -3157 -4243 -3132
3502 -3132 -442 2512 4919 4950 3564 573 -2354 -3911 -3357 -1461 1038 3658 3993 2748 -222 -2781
3518 -2781 -4594 -4400 -2484 89 2518 3087 2611 757 -1956 -3146 -3351 -1824 725 2852 4086 3382
3534 3382 1474 -790 -2700 -2762 -1781 770 2693 3432 2946 935 -1404 -3159 -3665 -2401 -339 1738
3550 1738 2600 2098 9 -1672 -3518 -3402 -1928 12 2599 3581 3266 1492 -590 -2193 -2482 -1632 428
3567 428 2681 4099 3608 1916 -1055 -3151 -3809 -2956 -635 1730 3374 3018 1623 -1461 -3729 -4663
3583 -4663 -3817 -1081 1420 3517 4020 2401 349 -2667 -3747 -3095 -754 2060 4309 4890 3778 1131
3599 1131 -1978 -4183 -3740 -2322 549 3112 4032 3028 743 -1997 -4452 -4947 -3564 -589 2234 4139
3615 4139 3952 1716 -1049 -3307 -4042 -2760 -485 2631 4638 4594 3224 439 -1956 -3555 -2982 -846
3631 -846 1330 3297 3865 2426 144 -2795 -4158 -4097 -2718 -317 2186 3121 2401 223 -2260 -3717
3647 -3717 -3425 -2074 356 2498 3778 3445 1475 -625 -2347 -2768 -1445 657 2193 2997 2742 1011
3663 1011 -1078 -2687 -3142 -2143 -601 1524 2291 1774 265 -1744 -3233 -3288 -2267 -211 2020 3079
3679 3079 2804 1336 -766 -2167 -2325 -1333 254 2255 3808 3300 1675 -646 -2597 -3140 -2397 -329
3695 -329 1695 2862 2762 978 -1187 -3529 -4061 -3476 -1134 1478 3133 3609 1990 -247 -2584 -3577
3711 -3577 -2988 -656 2052 4092 4577 3058 846 -1728 -3380 -3379 -1590 895 3065 3840 2785 734
3727 734 -1999 -4150 -4620 -3049 -323 1971 3725 3416 1331 -1343 -3417 -3803 -2906 -632 2285 4148
3743 4148 4281 2858 277 -2244 -3342 -2868 -824 1624 3578 3900 2412 56 -2578 -3917 -4008 -2241
3759 -2241 -30 2095 2984 1984 409 -2013 -3399 -3338 -1885 153 2502 3439 3091 1371 -496 -2014
3775 -2014 -2293 -1277 617 2260 3298 3123 1225 -891 -2687 -2775 -2151 -360 1201 1958 2009 148 -1679
3792 -1679 -2953 -3031 -2104 -163 1342 2643 2673 1295 -648 -1842 -2086 -1256 575 2283 3271 3110 1418
3809 1418 -250 -2326 -2864 -2179 -98 1435 2766 2510 993 -1117 -3267 -3554 -2875 -975 939 2692
3825 2692 2660 1492 -343 -2071 -3265 -2797 -663 1577 3728 4061 2870 618 -1394 -3083 -3031 -1025
3841 -1025 1117 2978 3550 2606 580 -1898 -3941 -4054 -2682 -458 1981 3099 2685 822 -1640 -3616
3857 -3616 -3795 -2800 -134 2028 3618 3895 2645 24 -2085 -3039 -2571 -661 1613 3434 3536 2266
3873 2266 185 -2264 -3292 -3054 -1618 278 2011 2604 1720 22 -2020 -3524 -3362 -2172 4 2148
3889 2148 3141 2625 1212 -784 -2145 -2187 -1274 595 2678 3299 2464 1129 -729 -2303 -2721 -1577 -286
3906 -286 1365 2401 1862 337 -1079 -2768 -2903 -2192 -275 1357 1994 2318 828 -589 -1737 -2076 -1326
3923 -1326 540 2059 3068 2825 1569 -477 -1715 -2155 -1778 114 1445 2551 2178 888 -822 -2786
3939 -2786 -3748 -2681 -1150 815 2216 2325 1350 -569 -2393 -2859 -2346 -629 1644 3429 3457 2760 514
3956 514 -1662 -2745 -2748 -926 1022 2810 3353 2484 389 -1706 -3617 -3656 -1970 -185 1936 2949 2302
3973 2302 568 -1343 -3142 -3543 -2314 -504 2058 3481 3192 1847 -285 -2290 -2623 -2155 -295 2060
3989 2060 3402 3259 2154 -8 -2072 -3098 -3040 -1460 340 1809 2312 1533 -208 -2299 -3289 -3049 -1799
4006 -1799 191 1775 2921 2018 729 -1082 -2122 -1953 -1239 694 2221 3041 2904 1410 -439 -1837
4022 -1837 -2098 -1917 -233 1750 2106 1692 290 -1072 -1945 -2675 -1891 -413 1003 1843 1854 650 -448
4039 -448 -1692 -2134 -1534 456 1835 2439 2367 1399 -68 -1446 -1732 -811 189 1692 2426 1975 573 -959
4057 -959 -2342 -2823 -2226 -822 1111 2051 1800 831 -884 -2306 -2637 -1897 -200 1410 2804 2811 1921 263
4075 263 -1692 -2448 -2141 -437 1273 2525 2832 2263 369 -1871 -2722 -3221 -1800 23 1885 2713 1985
4092 1985 335 -1562 -3069 -3380 -2206 -139 1880 2869 2984 1770 -193 -2034 -2501 -1938 -135 1800
4108 1800 3214 3351 1957 15 -1776 -2436 -2553 -1199 684 2241 2326 1738 -226 -1734 -3256 -3105 -1691
4125 -1691 140 1687 2416 2147 490 -917 -2305 -2088 -947 582 1866 2593 2254 1149 -428 -1533
4141 -1533 -2171 -1224 62 1422 1911 1707 278 -1086 -1916 -2321 -1887 -617 907 1538 1177 695 -694
4158 -694 -1705 -2179 -1083 4 1647 2226 2033 1270 -268 -922 -1683 -1393 86 1239 1931 1724 914 -798
4176 -798 -1710 -2328 -2262 -590 580 2094 1421 923 -848 -2228 -2491 -2004 -310 1100 2533 2523 1995 139
4194 139 -1626 -2118 -1836 -374 1431 2664 2763 1734 258 -1576 -2422 -2412 -1538 473 1656 2339 1674 102
4212 102 -1363 -2899 -3341 -1910 -238 1700 2229 2406 1056 -393 -2196 -2473 -1645 167 1859 2892
4228 2892 3179 2055 -121 -1670 -2465 -2357 -981 749 1987 2368 1355 -596 -1917 -2775 -2443 -1730 197
4245 197 1740 2400 2005 336 -785 -2025 -1547 -969 385 2020 2395 2291 1095 -234 -1664 -1893 -1182
4262 -1182 57 1313 2109 1767 790 -780 -1645 -2087 -1849 -295 735 1217 1227 677 -572 -1698 -2015 -1197
4280 -1197 -116 1237 2141 1484 1234 -169 -701 -1445 -670 122 1264 2067 1703 748 -778 -1754 -2069 -1552
4298 -1552 -320 741 1141 1158 622 -663 -1878 -2059 -1630 -377 1045 1788 2011 1561 -30 -1441 -1911
4315 -1911 -1590 -139 1203 2300 2638 1753 274 -1366 -2369 -1949 -1162 535 1851 2003 1330 -93 -1573
4332 -1573 -2832 -2561 -1499 -22 1325 2340 2137 966 -596 -1685 -2001 -1109 212 1843 2588 2453
4348 2453 1811 -116 -1346 -2361 -1501 -605 1041 2055 2003 1509 -112 -1689 -2494 -2537 -1375 213 1547
4365 1547 2039 1276 192 -1131 -1778 -2336 -801 470 1683 2320 1899 1007 -312 -1333 -1464 -1031 223
4382 223 1249 1886 1326 759 -528 -1748 -1983 -1529 -471 766 960 1101 173 -724 -1364 -1459 -1015 -271 1164
4401 1164 1777 1590 851 -134 -768 -1106 -528 243 1184 1609 1355 641 -339 -1310 -1502 -1148 -244 599 1217 1060
4421 1060 73 -763 -1731 -1916 -1378 -367 733 1421 1448 686 -176 -1018 -1525 -1032 95 996 2229 2086 1767
4440 1767 81 -1200 -1721 -1772 -808 599 1856 1645 1141 -193 -1323 -2488 -2662 -1451 106 1140 1999
4457 1999 1408 577 -937 -1979 -1949 -975 262 1620 2290 2288 1305 127 -1455 -1584 -1573 -442 929 1957
4475 1957 2057 1056 -263 -1830 -2269 -2245 -830 110 1046 1701 1229 -31 -1023 -1692 -1867 -1235 740 1443
4493 1443 2071 1917 901 -637 -1092 -1119 -892 452 1267 1536 1503 458 -473 -1317 -1942 -1162 -394 309 1002
4512 1002 967 243 -739 -1273 -1672 -826 -206 467 1058 1174 1000 -111 -689 -897 -390 239 1261 1511 1241
4531 1241 660 -59 -908 -1271 -1093 -87 563 963 945 -41 -889 -1542 -1739 -1442 -482 664 1470 1197 661
4550 661 -173 -924 -1404 -921 260 1313 1903 1913 995 18 -972 -1573 -1058 -145 437 1681 1621 856 -237
4569 -237 -1330 -2112 -2081 -1275 -161 1077 1500 1227 -22 -1079 -1472 -1866 -942 409 1634 2456 2038 793
4587 793 -261 -1095 -1684 -1129 -45 1310 1788 1708 1101 -125 -1487 -1895 -1898 -829 396 1211 1260 700 -119
4606 -119 -1529 -1759 -1707 -733 417 1162 1591 1208 423 -538 -837 -735 -582 393 1081 1529 1530 560 -451 -1027
4626 -1027 -1774 -717 -72 646 977 791 223 -686 -1138 -1424 -655 -241 523 1196 1010 553 -163 -758 -1027
4645 -1027 -741 261 1017 1454 868 519 -375 -791 -1268 -564 -237 771 1145 782 264 -720 -1327 -1549 -687
4664 -687 -118 652 1036 976 40 -579 -790 -1103 -468 282 1089 1760 1483 1088 -87 -500 -1225 -1090 -36 599
4684 599 1175 1526 1056 45 -1226 -1973 -1378 -702 58 1244 1006 826 -55 -1051 -1516 -1405 -578 290 1385
4703 1385 1922 1484 664 -621 -1180 -1178 -659 -2 951 1704 1539 738 -388 -1207 -1753 -1261 -638 497 914
4722 914 992 736 -305 -1171 -1443 -1386 -683 189 1203 1691 992 427 -453 -929 -738 -543 293 1197 1331 1292
4742 1292 259 -434 -937 -1133 -833 -253 570 838 881 171 -454 -918 -1201 -893 -35 717 924 896 400 15
4762 15 -734 -599 -273 243 1085 985 823 478 -313 -809 -1189 -502 240 524 954 589 -52 -709 -1006 -1279
4782 -1279 -694 -299 708 727 548 400 -672 -1039 -1127 -685 45 850 1129 837 439 -276 -792 -1286 -497 82
4802 82 923 1177 1005 606 -604 -1117 -1628 -1501 -298 476 1191 983 546 -354 -1079 -1560 -1186 -580 423
4821 423 1333 1505 1377 394 -462 -1022 -1083 -632 251 1154 1385 1056 409 -29 -1245 -1352 -772 -316 465 1047
4841 1047 875 236 -378 -1268 -1191 -1165 -554 340 799 1190 822 212 -559 -812 -862 -371 465 1219 1346 1015 229
4862 229 -320 -720 -678 -554 96 773 662 596 122 -759 -1075 -875 -933 -321 507 863 480 22 -382 -725 -685
4883 -685 -176 408 1015 731 877 296 40 -751 -664 -283 157 505 434 567 228 -661 -1084 -825 -819 80 552
4904 552 815 280 -110 -469 -831 -773 -533 277 1104 1257 1040 460 -265 -378 -836 -319 126 920 1224 903
4924 903 352 -592 -966 -1070 -1052 -198 728 1110 956 261 -371 -871 -1326 -1179 -423 606 695 999 996 204 -693
4945 -693 -1006 -849 -207 366 1319 1433 1265 197 -417 -1139 -1247 -614 236 518 1285 810 372 -843 -1175
4964 -1175 -1346 -719 -368 266 922 877 520 -186 -773 -1136 -677 -118 662 960 1322 788 98 -385 -838 -856
4984 -856 -217 -6 472 611 516 -8 -362 -1064 -884 -467 -194 427 686 648 -150 -480 -728 -544 -326 154 465
5005 465 615 606 101 -118 -613 -497 -240 402 687 761 394 35 -392 -724 -725 -486 -172 300 222 309 -49 -694
5027 -694 -699 -663 -126 396 795 1144 581 95 -395 -598 -482 -338 426 803 1222 840 182 -719 -1060 -1001 -731
5048 -731 128 375 719 686 304 -645 -961 -1090 -708 217 321 1042 936 528 -83 -767 -814 -537 -262 629 1030
5069 1030 1434 847 167 -524 -802 -1178 -95 41 755 805 650 230 -391 -1231 -1324 -515 37 849 651 626
5089 626 286 -116 -715 -753 -719 241 557 1171 1146 503 140 -420 -618 -481 -191 396 883 661 6 -170 -464
5110 -464 -969 -769 -583 219 572 -4 348 -133 -511 -690 -359 152 340 320 613 712 16 -409 -528 -460 116
5131 116 117 414 772 330 -181 -545 -375 -812 -531 149 445 372 168 1 -639 -805 -569 -358 447 549 739
5152 739 566 -29 -385 -597 -546 -113 425 1029 843 719 263 -225 -1004 -735 -232 -93 612 657 737 1 -488
5173 -488 -1029 -1119 -677 -281 649 602 546 344 -257 -866 -764 -459 106 608 999 1291 789 51 -523 -1008 -405
5194 -405 -126 363 771 786 564 -189 -470 -1092 -744 -821 34 632 580 534 151 -380 -756 -330 -457 -2 474
5215 474 656 628 633 -89 -359 -861 -145 -44 625 517 382 432 -240 -577 -664 -132 -68 -17 450 178 83 -31 -414
5238 -414 -385 -127 -43 212 526 312 335 159 -168 -276 -568 254 844 481 467 295 -232 -674 -535 -620 -229 318
5260 318 395 413 -23 -369 -688 -686 -702 -132 165 468 571 274 -20 -83 -439 -436 109 482 867 568 532 40 -211
5283 -211 -377 -594 -25 -223 567 259 410 -122 -541 -901 -717 -2 -37 471 429 465 -32 -318 -581 -749 -368
5304 -368 138 933 927 624 613 -9 -317 -621 -456 -49 526 749 600 333 -330 -442 -538 -745 -573 38 281
5325 281 400 238 -155 -304 -812 -569 -312 126 829 557 462 407 -130 -146 -493 -235 189 367 635 424 42
5346 42 -110 -568 -663 -453 77 417 386 310 199 -463 -697 -765 -525 33 269 528 166 423 -18 -538 -260 134
5368 134 263 520 562 210 341 -311 -261 -558 -361 190 229 375 201 -250 -377 -685 -855 -509 -200 344 417
5389 417 463 89 -360 -541 -670 -63 219 663 820 618 388 -204 -379 -564 -385 254 254 655 752 343 -296
5410 -296 -627 -873 -795 -314 89 157 534 626 -28 -594 -691 -670 -175 326 562 987 792 306 -258 -583 -503 -411
5432 -411 54 889 849 578 277 -520 -774 -675 -658 -265 217 455 497 323 -139 -897 -687 -803 -318 385 794
5453 794 784 447 -42 -79 -674 -165 -250 289 737 774 152 296 -113 -524 -628 -321 244 29 228 90 -329
5474 -329 -216 -425 -515 -188 -87 185 357 147 219 -82 -359 -329 -138 206 301 344 259 260 81 -434 -314 120 201
5497 201 189 250 61 -290 -352 -416 -662 -165 6 274 337 455 -377 -469 -488 -609 -20 286 481 632 486 63
5519 63 -113 -369 -550 -329 221 154 705 279 -150 -603 -563 -548 -630 -81 242 599 388 326 -10 -655 -698 -512
5541 -512 -434 337 676 829 561 136 -357 -379 -605 -286 356 660 881 451 482 -168 -510 -719 -242 -118 201
5562 201 772 235 298 -538 -802 -744 -498 1 174 365 509 513 179 -694 -672 -460 -43 562 588 586 314 86 -450
5585 -450 -435 -100 -76 284 590 239 306 -281 -215 -374 -534 -392 -74 116 139 103 96 -332 -236 -346 41 283 158
5608 158 825 496 -53 -49 -309 -130 -210 142 527 655 327 -279 -481 -763 -227 -196 -190 486 553 122 -162 -407
5630 -407 -638 -520 -56 310 724 683 714 50 -232 -356 -465 -225 108 483 633 552 240 -209 -942 -826 -282
5651 -282 138 436 544 661 69 -288 -590 -649 -635 94 40 715 723 393 56 -376 -717 -322 62 423 620 785
5673 785 366 -66 53 -435 -543 -469 -265 559 555 410 -199 -510 -887 -671 -428 140 348 561 598 235 -280
5694 -280 -449 -497 -5 209 751 450 346 287 -298 -502 -597 -336 -127 460 343 217 469 -4 -224 -357 -498
5715 -498 -131 211 294 470 77 205 -216 -489 -56 275 189 362 477 374 -204 -109 -434 -442 118 466 555 503
5737 503 36 68 -392 -618 -123 -270 118 584 303 414 -444 -431 -763 -538 -73 327 341 501 490 -21 -537
5758 -537 -627 -519 6 274 404 741 467 -167 -63 -701 -411 -196 98 622 664 243 250 -240 -578 -886 -382
5779 -382 -200 375 860 364 500 -206 -613 -760 -79 -37 339 971 547 541 -49 -415 -682 -364 10 450 666
5800 666 527 330 -401 -365 -692 -486 -366 76 461 475 544 72 -245 -772 -595 -350 349 681 709 554 -61
5821 -61 -28 -481 -364 -253 -78 395 409 591 231 -160 -392 -688 -420 82 391 507 298 89 -300 -473 -477 -463
5843 -463 203 391 622 659 133 73 -355 -106 -449 25 183 467 676 -87 -234 -361 -387 -380 -267 285 344 525
5865 525 8 -140 -637 -728 -281 -241 269 486 623 236 -72 -418 -730 -433 16 622 685 489 688 118 -217
5886 -217 -547 -690 -21 320 699 452 243 -128 -607 -951 -668 -424 104 741 765 617 204 -160 -658 -650 -236
5907 -236 69 414 894 749 374 -253 -497 -559 -488 5 394 686 528 393 -93 -537 -731 -817 -201 186 418
5928 418 470 405 -217 -797 -913 -609 -130 -31 559 793 598 320 -61 -855 -500 -234 127 295 518 392 62
5949 62 16 -771 -186 -602 -118 310 454 252 178 -357 -497 -666 -477 110 690 592 511 260 -225 -474 -215 -193
5971 -193 327 371 469 844 -119 -233 -703 -370 -351 -78 498 599 287 278 -311 -520 -847 -596 -285 206 568 664
5993 664 500 -293 -570 -516 -375 -229 363 676 943 215 -255 -470 -980 -418 -71 154 734 784 300 28 -664
6014 -664 -857 -622 -399 -16 711 820 225 197 -196 -608 -823 -347 400 700 1006 517 429 -240 -655 -655 -300
6035 -300 142 564 838 848 375 -252 -695 -819 -479 -74 307 819 412 351 -345 -624 -651 -535 84 485 442
6056 442 452 611 239 -168 -456 -718 -146 136 665 811 744 130 -134 -472 -503 101 -41 469 627 609 137
6077 137 -448 -833 -666 -388 217 645 715 350 165 -425 -498 -554 -188 31 560 523 686 312 -277 -645 -519
6098 -519 -501 -80 299 650 811 436 -215 -630 -623 -465 -427 515 523 323 397 -363 -362 -598 -549 -23 363 593 549 379
6122 379 -202 -464 -268 -204 13 497 1010 620 440 -62 -573 -756 -438 -587 193 549 608 317 -232 -529 -842
6143 -842 -457 -331 6 610 777 600 82 -68 -752 -545 -325 -32 856 593 564 369 -255 -734 -955 -353
6163 -353 -51 476 435 768 413 -179 -852 -502 -616 -96 298 611 595 495 -303 -512 -617 -342 -326 415 476
6184 476 586 379 -21 -596 -847 -679 -235 434 329 497 269 -138 -172 -718 -598 -414 -81 389 716 455
6204 455 212 -281 -406 -712 -320 -6 541 724 762 113 -488 -443 -645 -397 18 281 794 555 73 -535 -925
6225 -925 -418 -447 -129 234 496 427 198 -151 -815 -556 -352 -29 696 443 555 472 -301 -493 -435 -327 -206
6246 -206 728 635 509 244 -103 -431 -697 -808 -401 487 690 699 79 146 -532 -787 -826 -302 299 738 954 455
6268 455 183 -873 -775 -595 -401 111 777 781 851 211 -270 -747 -899 -626 195 592 883 384 470 -71 -595
6289 -595 -573 -821 71 335 825 699 133 25 -886 -764 -417 -115 533 647 680 411 7 -427 -771 -676 -128
6310 -128 178 360 654 580 -75 -612 -633 -811 -465 286 236 696 429 -120 -267 -981 -830 -647 507 646 892
6331 892 769 117 -174 -494 -435 -232 104 792 1079 435 248 -357 -628 -700 -518 -113 560 426 583 165 -375
6352 -375 -455 -702 -435 -214 654 858 729 228 73 -859 -714 -263 -101 467 953 1048 285 -405 -541 -724 -417
6373 -417 -308 71 946 942 434 -324 -662 -831 -538 -299 203 944 1009 488 43 -566 -1114 -696 -339 198 906
6394 906 995 524 137 -273 -636 -933 -523 129 610 999 724 -83 -494 -938 -845 -668 -15 190 882 397 436
6415 436 -259 -346 -768 -672 14 574 668 688 586 22 -514 -712 -550 -245 305 654 907 644 48 -314 -827
6436 -827 -737 -475 156 615 688 361 -82 -640 -988 -593 -70 203 710 739 634 381 -253 -649 -610 -364 212
6457 212 356 1038 694 57 -71 -779 -778 -456 51 565 682 606 243 -58 -458 -688 -734 12 445 723 761 347
6479 347 -517 -579 -749 -425 43 495 1150 692 424 26 -414 -751 -523 -80 335 778 912 337 -165 -729
6499 -729 -767 -413 -536 486 599 843 479 42 -396 -727 -807 -268 487 810 1235 699 174 -588 -726 -1048
6519 -1048 -434 93 659 1257 586 -241 -351 -602 -911 -642 -101 641 1036 852 129 -276 -1154 -737 -597 -68
6539 -68 581 628 1033 829 -83 -587 -843 -666 -76 598 833 970 426 -228 -614 -809 -719 -303 80 601 470
6560 470 338 167 -575 -838 -572 -398 414 732 901 509 165 -525 -859 -587 -412 382 562 1046 496 113
6580 113 -286 -547 -726 -404 72 492 516 974 477 -420 -879 -676 -642 195 539 946 608 35 -359 -501 -883
6601 -883 -463 116 319 882 1015 727 -509 -696 -1014 -481 84 438 696 1008 271 -337 -743 -1068 -798 -338
6621 -338 360 626 1054 406 -199 -610 -1037 -723 -280 259 1015 994 765 7 -553 -763 -832 -322 175 768 668
6642 668 503 -42 -349 -1066 -606 -611 9 842 838 596 141 -422 -897 -1130 -370 -8 669 763 1036 425 -444 -827
6664 -827 -749 -735 -80 358 932 1024 359 124 -593 -994 -889 -181 362 660 928 384 66 -563 -967 -625 -416
6685 -416 244 673 840 686 177 -471 -699 -681 -333 284 1099 868 685 180 -313 -691 -692 -739 -246 683 706 528
6707 528 142 -403 -782 -1152 -534 -109 590 710 569 399 -188 -939 -1017 -506 12 198 604 687 437 -359 -773
6728 -773 -960 -312 -29 407 822 796 280 -280 -668 -990 -871 -159 318 427 860 519 59 -873 -849 -342 -511
6749 -511 351 801 1069 501 -3 -213 -879 -715 -459 292 796 712 406 75 -379 -1047 -860 -641 237 481
6769 481 385 765 32 -415 -983 -833 -723 -79 539 724 628 351 -166 -690 -657 -810 -5 366 485 894 401
6790 401 -178 -549 -1099 -575 -419 608 715 832 644 -179 -608 -720 -543 -417 221 521 870 716 174 -521
6810 -521 -1018 -852 -606 218 701 774 1060 177 -122 -742 -966 -232 3 660 763 883 377 -609 -604 -735 -448
6831 -448 -138 597 831 633 34 -153 -752 -593 -805 -73 300 913 929 409 -179 -526 -783 -501 -83 422
6851 422 805 849 217 -29 -580 -933 -748 -109 159 695 1042 553 -10 -691 -833 -768 -264 154 693 784 402
6872 402 133 -239 -753 -727 -235 342 783 952 888 302 -384 -813 -694 -399 -40 695 737 463 105 -908 -1148
6893 -1148 -1209 -466 1 555 741 804 207 -152 -840 -782 -459 371 525 717 1106 616 -204 -491 -900 -880 -186
6914 -186 614 924 814 670 24 -625 -1170 -1071 -209 422 895 1044 563 -48 -535 -857 -708 -789 217 962
6934 962 913 945 325 -646 -750 -806 -366 176 740 982 669 246 -314 -793 -828 -663 46 577 509 510 168 -248
6956 -248 -874 -629 -584 273 398 658 771 181 -235 -690 -695 -783 -140 384 1080 818 583 122 -537 -774 -619
6977 -619 -225 351 874 817 277 -225 -888 -910 -508 -341 435 744 526 476 56 -674 -847 -686 -280 328 620
6998 620 1113 656 321 -509 -630 -780 -261 108 451 864 563 184 -686 -965 -884 -498 70 824 903 650 199
7019 199 -370 -1005 -1007 -815 9 614 1002 803 564 -184 -634 -928 -460 -205 483 975 753 703 -19 -836 -919
7040 -919 -750 -514 333 900 979 659 -35 -603 -871 -694 -356 350 546 673 1017 17 -240 -722 -963 -232
7060 -232 302 904 1046 695 461 -681 -439 -673 -564 15 490 919 697 370 -345 -877 -973 -399 -391 144 704
7081 704 945 571 -6 -551 -582 -362 121 550 814 1044 611 -53 -625 -609 -546 -296 379 640 586 362 -83
7102 -83 -520 -763 -563 -337 107 885 768 503 12 -714 -976 -689 -116 -55 1015 787 594 65 -303 -695
7122 -695 -932 -285 265 1005 787 593 76 -333 -1133 -837 -617 275 784 783 868 45 -488 -647 -1034 -809 56
7143 56 439 798 1012 173 -96 -372 -856 -470 70 588 877 589 618 -93 -840 -1192 -1054 -345 322 614 899
7164 899 796 -134 -446 -847 -905 -427 470 547 1074 721 276 -118 -764 -550 -308 79 667 912 1141 225 -680
7185 -680 -549 -790 -408 -100 393 760 754 464 -646 -637 -1024 -740 -141 406 857 598 260 -230 -462 -603 -440
7206 -440 -219 413 816 794 200 -112 -528 -625 -691 -446 324 724 793 381 193 -755 -870 -949 -297 289 662 988
7228 988 442 -217 -629 -824 -575 -2 187 664 680 795 83 -498 -664 -811 -343 122 681 1098 568 360
7248 360 -477 -991 -783 -597 -300 596 663 642 357 -352 -725 -643 -425 -140 604 702 675 406 -280 -386 -891 -483
7270 -483 37 655 1120 966 605 14 -491 -956 -539 -117 192 377 817 240 317 -604 -820 -817 -542 69 610
7291 610 988 601 -107 -284 -819 -833 -280 180 575 861 758 156 -230 -628 -959 -475 47 107 784 682 281
7312 281 -210 -491 -977 -667 -181 312 996 743 238 -138 -722 -455 -692 21 334 745 786 373 -6 -245
7332 -245 -519 -748 67 318 519 619 416 -134 -647 -805 -817 -56 212 487 722 991 267 -687 -890 -477
7352 -477 -214 388 798 1067 810 59 -309 -781 -735 -347 390 605 908 508 -110 -668 -751 -653 -386 154 550
7373 550 595 525 352 -430 -899 -860 -611 47 519 898 1020 307 -172 -502 -769 -617 -30 564 541 1083 556
7394 556 -74 -683 -894 -724 -434 419 521 734 470 -333 -710 -1001 -933 -272 154 630 481 515 74 -582 -783
7415 -783 -936 -425 106 801 826 772 360 -275 -671 -711 -345 -47 452 825 596 307 -190 -804 -705 -726 -187 575
7437 575 564 647 573 98 -457 -894 -612 -202 567 638 626 577 111 -179 -594 -262 -226 283 787 575 500 -211 -463
7460 -463 -1081 -530 -244 16 448 610 349 146 -594 -724 -549 -343 324 554 578 616 349 -615 -913 -294 -222
7481 -222 188 908 594 675 35 -283 -736 -760 -689 -12 499 671 778 117 -218 -819 -827 -666 121 382 544 907
7503 907 254 -251 -282 -758 -443 -102 581 822 1077 400 202 -664 -618 -564 -263 355 674 711 401 -76 -651
7524 -651 -944 -688 -166 -112 686 839 598 353 -378 -747 -799 -537 450 673 1095 868 454 -544 -400 -576 -529
7545 -529 -203 498 717 513 319 -345 -464 -1386 -377 171 336 644 808 211 -76 -420 -664 -736 -185 230
7565 230 765 753 396 6 -383 -679 -664 -101 351 557 632 412 -204 -412 -573 -672 -242 461 508 714 465 -36
7587 -36 -447 -791 -577 -303 133 576 492 449 145 -129 -516 -549 -523 37 576 811 397 244 -107 -573 -646 -651 116
7610 116 317 673 261 42 -297 -867 -687 -463 33 415 546 736 470 8 -852 -637 -656 -81 577 823
7630 823 744 407 14 -609 -606 -479 -23 270 961 726 512 -208 -792 -835 -740 -511 101 375 922 444 -201 -405
7652 -405 -746 -876 -522 173 666 996 821 352 -274 -747 -628 -366 -80 600 518 600 133 -215 -871 -468 -699
7673 -699 -66 265 771 623 -37 -131 -538 -716 -786 40 278 562 794 489 75 -334 -584 -473 -16 299 747
7694 747 876 393 47 -327 -602 -621 -114 228 122 679 121 -64 -672 -899 -456 -494 99 287 564 397 254
7715 254 -299 -837 -674 -156 69 586 543 579 211 -332 -310 -768 -260 264 651 610 168 116 -104 -1136 -943
7736 -943 -465 -187 450 1012 672 234 -226 -767 -732 -541 -86 172 937 615 490 -340 -811 -863 -650 -211 473
7757 473 784 660 582 -82 -346 -693 -777 -384 222 410 890 688 359 -523 -690 -654 -119 194 612 873 557
7778 557 272 75 -610 -961 -335 -132 390 804 666 569 268 -818 -638 -570 -519 310 311 295 364 -191 -721 -645
7800 -645 -757 146 401 593 603 307 336 -498 -631 -373 -306 213 661 805 290 11 -362 -667 -613 -109 229
7821 229 473 434 431 -48 -393 -674 -857 -420 125 494 564 632 239 -263 -1079 -327 -241 373 396 697 582 431
7843 431 -72 -484 -545 -350 21 359 903 528 -19 -300 -749 -573 -550 -199 519 768 575 94 -348 -516 -443
7864 -443 -280 49 739 807 712 583 -273 -357 -519 -423 -52 373 614 777 204 -131 -767 -718 -688 -334 219 994
7886 994 555 532 201 -519 -567 -921 -301 -56 532 628 576 291 -371 -570 -510 -242 -153 739 683 729 417 -126 -750
7909 -750 -703 -547 -143 316 755 711 47 85 -414 -800 -570 -153 426 471 588 365 -130 -490 -781 -467 -236
7930 -236 321 544 719 504 40 -556 -712 -571 -287 425 412 549 534 -215 -403 -475 -688 -268 224 309 755
7951 755 418 401 -425 -476 -535 -384 146 446 721 430 379 -85 -594 -402 -246 90 810 456 425 224 -579 -577
7973 -577 -768 -603 214 418 459 689 318 -314 -606 -706 -368 102 298 398 583 366 39 -578 -770 -524
7993 -524 -4 461 836 968 386 -62 -627 -808 -719 -403 242 530 572 620 -200 -615 -385 -817 -222 128 522
8014 522 810 570 240 -439 -544 -521 -494 266 463 956 743 511 -309 -626 -693 -535 -37 416 433 517 362 -229
8036 -229 -727 -939 -626 -391 386 450 599 375 -160 -436 -856 -566 -184 43 759 829 729 137 -343 -665 -577
8057 -577 -514 460 836 873 429 181 -463 -764 -491 -279 -97 612 709 578 283 -679 -618 -483 -349 241 528
8078 528 527 414 102 -14 -558 -516 -540 191 351 754 408 117 -135 -712 -450 -368 -243 406 363 710 234 -339
8100 -339 -747 -553 -628 207 645 756 719 465 -539 -415 -564 -471 -5 493 591 636 351 -153 -131 -793 -466 -208
8122 -208 461 867 587 570 -36 -436 -904 -680 -268 60 619 668 633 242 -194 -311 -726 -211 358 557 531
8143 531 596 130 -113 -555 -1036 -369 -42 530 509 604 204 -142 -587 -774 -587 -406 59 479 566 401 -100
8164 -100 -344 -810 -502 -259 170 574 881 501 140 -590 -583 -621 -265 88 576 774 455 -115 -685 -747 -791 -276
8186 -276 105 582 192 337 54
8191E4
$$ Imaginary data points
##PAGE= N=2
##DATA TABLE= (X++(I..I)), XYDATA
0 0 0 0 0 0 0 0 8 -8 8 -16 16 -24 24 -32 40 -48 56 -72 80 -96 112 -132 152 -175 204 -231 263 -300 339
29 339 -385 431 -484 546 -607 681 -755 841 -937 1036 -1150 1274 -1408 1559 -1726 1916
45 1916 -2124 2360 -2632 2938 -3301 3728 -4240 4874 -5671 6722 -8172 10303 -13779 20428
59 20428 -37908 183844 466028 247823 26756 -216836 -328087 -349458 -198834 38145 279006
70 279006 353751 253534 22342 -202155 -354124 -364701 -239120 -3400 226957 349855
80 349855 296527 113138 -114463 -277131 -311903 -194569 18728 232555 344253 317398 167866
91 167866 -42845 -234590 -310824 -227139 -29122 166254 267477 249777 132297 -53053 -242793
102 -242793 -338053 -271733 -80574 119755 230708 228905 135765 -17767 -182066 -275736 -230358
113 -230358 -59731 140863 264793 270788 178050 26834 -132235 -230865 -209031 -69908 111139
124 111139 235387 250080 157442 -3578 -169111 -265545 -245725 -120822 46686 181594 225141
135 225141 155074 -1538 -168995 -261835 -234673 -108449 58572 201449 265139 216674 67899
146 67899 -111104 -224863 -215293 -98576 62132 201070 268050 229722 86591 -104452 -245831
157 -245831 -266243 -165249 -4656 144836 227350 207672 82680 -98349 -247322 -287425 -202588
168 -202588 -38246 133420 243364 247372 141848 -26951 -180126 -244790 -191284 -44156 131454
179 131454 257183 276368 180267 12946 -150935 -242259 -224352 -106620 59673 197540 240421
190 240421 166427 12059 -151092 -252770 -253939 -154083 8110 161148 234073 192384 61551
201 61551 -92966 -199616 -215717 -134764 11380 161727 246463 226143 111627 -41178 -162602
212 -162602 -202603 -147414 -23156 114882 200795 193574 95287 -48460 -173376 -224215 -181747
223 -181747 -67083 67773 161326 173332 99754 -24419 -140743 -194219 -159777 -51709 80992
234 80992 178978 200296 136748 19245 -98074 -161111 -141301 -48665 72075 164927 185349
245 185349 124190 7497 -112823 -183754 -174570 -90550 28984 127600 159436 110151 1796
256 1796 -115054 -186294 -176962 -91518 32848 141982 187764 149864 46210 -73419 -153474
267 -153474 -156833 -81914 39072 151153 202468 167719 62068 -68009 -165208 -187251 -125153
278 -125153 -8190 109533 173119 152864 56371 -73259 -177789 -210029 -155344 -37030 93482
289 93482 179335 180871 100048 -25163 -136379 -183209 -143950 -34711 97632 193644 209159
300 209159 138201 12587 -111266 -180510 -166004 -74454 50978 153430 184178 128977 12278
311 12278 -114794 -195694 -195973 -116051 8425 121408 174088 143166 44604 -74780 -160276 -172668
323 -172668 -107400 9196 125382 189174 173530 87026 -29803 -125521 -157520 -112670 -13111
334 -13111 94914 160917 154479 78463 -33192 -132062 -173932 -142402 -52538 52321 125762 134791
346 134791 76563 -21541 -113044 -155965 -130238 -46164 57991 136253 154719 105958 14627 -75994
358 -75994 -125033 -109690 -37989 57299 130679 148211 101700 11006 -82543 -138697 -132904 -68466
370 -68466 24010 99992 123759 84180 -203 -90471 -146040 -139837 -73859 22532 106940 140860
382 140860 109962 30930 -59821 -120054 -120985 -61288 33059 120016 158034 130063 47314 -51810
394 -51810 -124732 -139615 -89720 1547 91007 137177 117519 39804 -61157 -140491 -163340 -118733
406 -118733 -25495 74637 137303 134615 69109 -29208 -114152 -146841 -110888 -22236 81637 153417
418 153417 162234 104157 5333 -90493 -141151 -124221 -48448 51236 128627 148502 100619 5721
430 5721 -94886 -156438 -153577 -86751 12149 99711 136358 107460 26861 -68589 -134904 -141445
442 -141445 -85139 10428 102199 150663 135232 64792 -28690 -103215 -125399 -85487 -3244 83483
454 83483 134043 126482 64124 -26773 -105450 -138482 -111456 -38043 46647 102746 107206 58317
466 58317 -20879 -95283 -129894 -107886 -38959 45832 107767 120454 81298 9319 -62525 -101493
478 -101493 -88476 -29491 48789 107752 120717 83270 11523 -62448 -107311 -103188 -51818 21794
490 21794 81574 99329 66684 -677 -72746 -116877 -112207 -60492 15362 81149 107588 83852
502 83852 21303 -51029 -97526 -96361 -47347 27417 94450 124408 103939 39568 -40060 -97772
514 -97772 -106721 -64202 7295 74941 108809 93778 33080 -48758 -113783 -130475 -91927 -16880
526 -16880 59103 104959 102139 50433 -27317 -95931 -120668 -88722 -15109 66702 121640 127284
538 127284 81306 2915 -72861 -112155 -96103 -33333 46874 107711 121627 80952 3853 -76554
550 -76554 -124939 -121076 -67849 12172 82457 110945 83955 16148 -61098 -111791 -115800 -70576
562 -70576 6411 82025 122734 109398 48729 -27923 -85292 -99559 -67169 -1460 69699 113954
574 113954 107912 54290 -22138 -86226 -110205 -88131 -30235 37839 85244 89741 48901 -19154
586 -19154 -81283 -108850 -89898 -34080 33683 84438 97357 66595 6997 -53035 -84884 -73729
598 -73729 -24499 39165 87922 100249 71422 14091 -47590 -85505 -83065 -41145 19184 67389
610 67389 81482 55221 1508 -57104 -94386 -93305 -52177 9556 62951 84686 65240 15455
622 15455 -41855 -78914 -78963 -40785 19394 75201 101098 84131 31640 -30809 -75079 -82336 -50424
635 -50424 6093 62078 91112 77525 26241 -39290 -90273 -102897 -73360 -15392 46042 84476
647 84476 81448 37960 -26711 -80256 -97932 -72112 -14379 51692 98154 103695 64841 -88
659 -88 -59965 -88960 -74903 -24800 40198 90654 101838 67594 3298 -62264 -100384 -97203 -53767
672 -53767 11161 68316 91034 67519 10677 -52375 -94655 -97956 -59774 4184 67545 99984
684 99984 87445 38622 -23206 -70881 -84001 -56663 649 61461 96424 89852 46205 -14782
696 -14782 -67897 -91080 -73785 -23371 35132 73186 73938 39898 -14099 -65692 -92359 -79655
708 -79655 -31754 27386 70267 78608 52597 5900 -42225 -71288 -65338 -23506 32355 73976
720 73976 83686 60499 15063 -34765 -68117 -68638 -34151 16001 56455 68381 48003 4541 -44644
733 -44644 -77252 -77729 -45149 4799 48270 66540 53070 13952 -33882 -66662 -67498 -34804 14579
746 14579 58584 79538 69276 30296 -21708 -60980 -67592 -38757 8454 50938 72406 64700
758 64700 26220 -27989 -72953 -85037 -59487 -10871 37182 65334 63347 30700 -21141 -67280
770 -67280 -83221 -61149 -11675 41595 77831 82296 52502 949 -49440 -73881 -61060 -17852
782 -17852 35266 75706 84918 57124 4250 -50222 -82246 -78583 -42595 9678 56623 75355
794 75355 55920 7725 -45834 -80163 -81356 -50294 1332 53402 82189 73133 30878 -22652
806 -22652 -61031 -69195 -46037 -461 49928 81885 78922 41154 -12253 -56544 -73880 -58939
818 -58939 -19559 27973 61830 65545 35934 -12214 -56666 -77522 -66774 -29364 18649 56083
830 56083 66182 45183 4330 -37464 -60815 -54967 -21975 23577 60330 71451 53312 14989
842 14989 -27065 -54612 -55781 -28953 12167 47387 59218 42616 6685 -34706 -62096 -64957
854 -64957 -40558 684 38004 54697 43117 10610 -27120 -54072 -56741 -33027 7587 46411
866 46411 65977 57299 24716 -15709 -46481 -52878 -33262 4517 42539 62514 54583 22115 -21056
879 -21056 -56092 -67564 -49821 -11728 29191 54209 52198 23925 -18521 -55023 -68146 -52074
891 -52074 -13042 31939 62941 67545 42395 374 -39719 -59849 -50002 -15449 29458 63498
903 63498 71159 48827 6093 -38920 -66799 -64947 -34616 9162 47113 62036 46485 8015
915 8015 -37040 -67957 -70577 -44030 322 43338 66144 59332 26334 -17618 -51255 -60350 -40272
928 -40272 94 42869 68476 66062 36749 -6355 -45163 -62149 -50611 -15917 24673 52697
940 52697 55665 31816 -7861 -46022 -66082 -58716 -27140 13900 45741 54872 38267 4382 -31134
953 -31134 -52250 -48574 -21457 16985 49008 61194 47531 15265 -20620 -44863 -46351 -25327
965 -25327 8121 38993 50863 39432 9168 -26497 -51067 -54249 -35491 -2811 28309 44806
977 44806 37627 10940 -21615 -45475 -48717 -29887 3011 35483 53175 48463 23268 -10546 -37014
990 -37014 -44189 -28361 2421 34062 51967 47382 21550 -14239 -44096 -55019 -41743 -11194
1002 -11194 22378 43998 43268 20485 -13629 -44908 -57319 -45431 -13865 23874 50710 55339
1014 55339 35837 1326 -32004 -49185 -42846 -13649 24114 52997 60571 42308 7454 -29984
1026 -29984 -54302 -53896 -29344 7369 39568 52341 40062 7519 -30446 -56946 -60816 -39283
1038 -39283 -1445 35068 55063 49664 22325 -14470 -43832 -52249 -35679 -1339 35222 58310
1050 58310 57184 33439 -3190 -36918 -52563 -43147 -14340 20646 45593 49263 29339 -4370
1062 -4370 -38557 -56823 -51380 -25152 9619 37294 46737 34109 5039 -26578 -46044 -43647 -20778
1075 -20778 12101 40451 52148 42825 15985 -15730 -37705 -40149 -22195 6141 32526 44484
1087 44484 35949 11045 -19807 -42644 -47265 -31830 -4362 22118 36986 32539 10909 -17110
1099 -17110 -39048 -43040 -28017 -419 27486 43518 41252 21326 -6844 -29939 -36778 -24679
1111 -24679 924 28002 43886 41447 20690 -9250 -34937 -45508 -35725 -10480 17335 36444
1123 36444 36648 18364 -11113 -37500 -48815 -39806 -13693 17568 40928 45995 30187 1550 -26858
1136 -26858 -41844 -36284 -12148 19205 44612 51944 37803 7854 -24326 -44801 -44723 -24488 6303
1149 6303 33873 45281 34956 7099 -26016 -49274 -52219 -34226 -3046 28291 46196 42421
1161 42421 18759 -13152 -38317 -45670 -31559 -2733 29154 50587 50865 29859 -2084 -31074
1173 -31074 -43871 -36584 -11871 17776 40086 44048 26725 -3059 -32832 -48709 -44907 -23157
1185 -23157 6489 31647 40617 29475 4044 -23330 -40435 -39169 -20418 8534 33948 45331
1197 45331 37607 14699 -12298 -31272 -34830 -20432 4399 28782 39899 32888 11910 -14423
1209 -14423 -34742 -40501 -29445 -5573 18834 31673 28030 9986 -13802 -32401 -37960 -27445
1221 -27445 -3918 21852 37044 35006 18331 -5237 -23982 -31039 -22396 -1035 23353 38412
1233 38412 36643 19242 -5818 -27781 -37043 -30374 -10118 14186 30717 31504 16129 -8573 -31616
1246 -31616 -41871 -34885 -13309 13304 32964 37565 25221 1873 -22461 -36311 -31773 -10533
1258 -10533 16559 37765 43723 32540 8709 -19040 -37487 -38351 -20249 6819 29552 38372 30025
1271 30025 7494 -20685 -42235 -46220 -30328 -2368 24263 38357 34509 15276 -11389 -33511
1283 -33511 -40888 -28733 -2639 25784 43648 43493 25966 -1200 -25950 -37848 -31721 -10631 16649
1296 16649 36449 39754 24963 -1475 -27952 -42086 -39070 -20905 4650 26564 35590 26414 3344
1309 3344 -21408 -36554 -35048 -19034 5126 28335 39663 34039 14161 -10719 -27967 -30257 -17727
1322 -17727 3635 24260 35209 31118 13217 -10955 -30271 -35452 -25345 -5284 14950 26843
1334 26843 25139 10386 -10846 -28907 -34622 -25022 -4849 17113 30563 29941 17072 -2572 -20201
1347 -20201 -27389 -20187 -1668 19558 33248 32441 18220 -3100 -21574 -30746 -25909 -9228 11826
1360 11826 26454 27439 14390 -6730 -26464 -35678 -30701 -13120 9370 27113 32073 21289 949
1373 949 -20197 -31002 -26983 -10060 13048 32009 38837 29545 8039 -16209 -31557 -31251 -16596
1386 -16596 5440 25693 34259 27363 6910 -18178 -36665 -39652 -26272 -3020 19730 32642
1398 32642 30079 13051 -10769 -30574 -36478 -25541 -2969 21664 37914 38277 23393 -744 -22773
1411 -22773 -33148 -27351 -8313 15131 32837 35783 22856 -439 -24005 -37164 -35007 -18999
1423 -18999 4404 23996 31300 22758 2741 -19141 -33308 -33038 -18875 3731 24739 35243 30102
1436 30102 12491 -8453 -24176 -27184 -16853 2507 22377 33044 29020 12963 -8406 -25309
1448 -25309 -31184 -23381 -6027 13139 24176 23095 9684 -9767 -25613 -31210 -23557 -6469 12955
1461 12955 25867 26695 15451 -2330 -17891 -24445 -18478 -2338 16462 28688 29102 17928 -353
1474 -353 -17452 -26578 -22435 -7823 10422 22946 24064 13483 -4883 -22671 -31768 -27708 -12537
1487 -12537 7402 22581 26908 18063 575 -17286 -27714 -24209 -9502 10946 27926 33574 25636
1500 25636 7762 -13113 -26560 -26846 -14031 5932 23563 30689 24498 6202 -15896 -31819 -34510
1513 -34510 -23088 -3053 17385 28868 25719 10124 -10970 -27689 -32811 -23367 -2993 18906
1525 18906 33307 34157 20220 -1118 -20315 -29444 -23702 -6810 14749 30377 32818 20986 103
1538 103 -21142 -33054 -30896 -16385 4794 21818 28071 20022 2094 -18147 -30910 -30758 -17726
1551 -17726 2809 21785 31106 26607 11188 -7998 -22276 -25290 -15538 2857 20689 30356 26828
1564 26828 12847 -6363 -22014 -27627 -20850 -4849 12474 22694 21300 8923 -8347 -22703
1576 -22703 -28624 -22338 -7215 10368 22149 23312 13304 -2123 -16341 -21888 -16405 -2639 13663
1589 13663 25172 26171 16984 840 -15003 -22922 -18943 -6245 9257 20373 21888 12562 -3150
1602 -3150 -19434 -28107 -24556 -11255 5771 19075 22362 15051 277 -15893 -24839 -22292 -8450
1615 -8450 9509 24033 28962 21939 6503 -10852 -22747 -22748 -11370 6226 21589 27914 21753 5380
1629 5380 -13665 -27511 -30082 -20079 -2347 15286 25101 22011 8010 -11132 -25661 -29405 -20716
1642 -20716 -3001 16473 29252 29539 17243 -1750 -18941 -25771 -20270 -4662 14424 27645 30258
1655 30258 19450 284 -18782 -29019 -26871 -13662 4777 19372 25274 18040 1237 -16840
1667 -16840 -28621 -28252 -16163 2294 18903 27188 23172 9093 -7876 -20562 -23171 -14022 2804
1680 2804 19114 27659 24847 12273 -4788 -19231 -24672 -18447 -3893 11427 20723 19395 8728
1693 8728 -7024 -20414 -26015 -21022 -7289 8508 19530 20192 11772 -2048 -14674 -20109 -15692
1706 -15692 -3275 11570 22773 23925 15595 1133 -12187 -19041 -16312 -5709 8255 18369 20322
1719 20322 12094 -2458 -16588 -23978 -21152 -10349 4273 15929 19257 12725 -656 -14803 -22065
1732 -22065 -19694 -7971 7735 20374 25382 19321 5530 -9646 -19676 -18916 -8754 6212 19265
1745 19265 24996 19227 5163 -11641 -23534 -26084 -16936 -1075 14041 21841 18830 6323 -10289
1758 -10289 -23532 -26631 -18625 -2756 14837 25605 25198 14007 -2515 -17019 -23032 -17746 -3310
1771 -3310 13915 25870 27379 16959 91 -16387 -25385 -23357 -11195 5501 18798 23201 15674
1784 15674 320 -15944 -26227 -26081 -15040 1860 17382 24356 20429 7186 -8209 -19162 -21065
1797 -21065 -12476 2342 17624 25683 23285 11397 -4411 -17005 -21218 -15684 -2830 11156 19365
1810 19365 18651 8436 -6457 -19056 -23673 -18789 -7118 7005 16785 18148 10185 -2320 -13922
1823 -13922 -19171 -14835 -3526 9992 19969 21171 14050 1789 -10088 -16647 -14382 -4377 8072
1836 8072 17198 18667 10795 -1320 -14144 -21098 -19044 -9476 3750 13915 16182 10238 -1204 -13056
1850 -13056 -20048 -17968 -7918 6017 17694 21551 16219 4326 -8257 -16852 -16498 -7237 6418
1863 6418 18198 22399 17334 4644 -10178 -20529 -21792 -13926 -177 12890 18946 15988 4287
1876 4287 -10320 -21780 -24353 -16635 -1887 12786 22126 21236 11330 -3616 -16316 -21102 -15165 -1626
1890 -1626 13635 23660 24487 15346 159 -14527 -22894 -19943 -8355 6609 17689 20852 13939
1903 13939 -283 -15260 -24554 -23407 -13219 2219 15512 21457 17699 5657 -8742 -18794 -19733
1916 -19733 -11017 2675 16239 23205 21035 10267 -4243 -15875 -18915 -13173 -1364 10961 18267
1929 18267 17613 8099 -5660 -17264 -21488 -17149 -5973 6218 14821 15989 9025 -2980 -13279
1942 -13279 -17961 -14241 -3787 8280 17554 19350 12992 1618 -9163 -14561 -12229 -3776 7329
1955 7329 15930 17364 10393 -772 -11795 -17755 -16285 -8157 2673 11979 14729 9014 -1957 -12282
1969 -12282 -17884 -16266 -7389 4668 14917 18906 13827 3150 -8391 -15004 -13676 -5800 5982
1982 5982 16381 20387 15424 3912 -8694 -17559 -18390 -10990 572 11701 16899 13654 3254 -9646
1996 -9646 -19732 -21611 -14730 -1680 11664 18963 17441 8805 -4056 -14733 -18403 -13347 -556
2009 -556 12673 21437 21738 12917 -441 -13368 -19512 -16782 -6040 7440 17228 18677 11801 -971
2023 -971 -14079 -21901 -20973 -11362 2134 13992 18669 14355 3072 -9393 -18033 -18077 -10010 2714
2037 2714 15103 21255 18658 8663 -4313 -14350 -16976 -11240 -482 11010 17439 16465 7381 -5083
2051 -5083 -15414 -19489 -15447 -5233 5884 13738 13770 7595 -3044 -13139 -17033 -13445 -3610 7745
2065 7745 15402 16594 11125 1390 -8171 -12918 -10740 -3016 7240 14546 15691 10095 294 -10217
2079 -10217 -15564 -14158 -6709 2977 10971 12803 7686 -1757 -11234 -16241 -14666 -6814 3854 12648
2093 12648 15230 11381 1899 -7389 -13235 -12147 -4848 5746 14816 18020 13713 3975 -7288 -14792
2107 -14792 -15238 -8507 1699 11007 15327 11723 2457 -9068 -17835 -18799 -12093 -1141 10044 16199
2121 16199 14471 6304 -4928 -13944 -16666 -11290 -334 11653 19306 18853 11241 -711 -11812 -16653
2135 -16653 -13681 -3811 7499 16191 17377 10044 -1835 -13330 -19661 -18151 -9441 2600 12698
2148 12698 16566 12132 1697 -9661 -16384 -16145 -8847 3059 14000 19204 16200 7125 -4372 -12887
2162 -12887 -14360 -9262 583 10968 16722 14809 6532 -4809 -14119 -17302 -13054 -4132 5937 12225
2176 12225 12003 6008 -3978 -12492 -15855 -12532 -3873 6413 13533 14776 9527 735 -7481 -11702 -9837
2191 -9837 -2381 6662 13414 14130 9178 552 -8394 -12999 -12096 -5554 3052 9639 11175 6408 -1680
2206 -1680 -10051 -14400 -13228 -6220 2960 10465 13101 9010 1212 -6698 -11637 -10600 -3845 5511 13048
2221 13048 15282 11670 3402 -6197 -12471 -12628 -6730 2490 10184 13229 10178 1610 -8398 -15730 -16316
2236 -16316 -10321 -597 8965 13427 11997 4343 -5465 -13479 -15247 -9365 669 10707 16975 15979
2250 15979 9302 -1234 -10751 -14593 -10982 -2280 7738 14728 15146 8935 -1651 -12265 -17502 -15474
2264 -15474 -7553 3114 11521 14298 9695 229 -9746 -15866 -14894 -7588 2720 12641 16670 14057
2278 14057 5287 -4744 -11824 -12902 -7211 1884 10622 15385 13871 5686 -4645 -12568 -14881 -11277
2292 -11277 -3382 5675 11396 11121 4767 -4184 -11484 -14460 -11368 -3469 5280 11961 12947 7655 -108
2307 -108 -7508 -10756 -8603 -1931 6272 12558 13499 8579 596 -7156 -11144 -10262 -4402 3175 8485 10060
2323 10060 5840 -1674 -8963 -12912 -11772 -5694 2241 8734 10636 7451 654 -6500 -10278 -9106 -3285
2338 -3285 4730 11609 13387 9895 2629 -5021 -10247 -10298 -4980 2973 9648 11779 8779 836 -7523
2353 -7523 -13335 -13811 -8787 -108 8056 11700 9553 3052 -5771 -11700 -13114 -8345 427 9343 14682
2368 14682 13714 7306 -2105 -9325 -12262 -8770 -883 7962 13838 13530 7424 -1914 -10588 -14809 -12720
2383 -12720 -5980 3474 10498 12090 8022 -648 -9298 -14383 -13352 -6474 2990 10913 14710 11847 4290
2398 4290 -4790 -10783 -11382 -5971 2606 10480 14175 12163 5134 -4135 -10957 -13079 -9339 -1988 5901
2413 5901 10614 9803 4201 -3932 -10912 -13463 -10269 -2871 4927 10002 10857 6394 -221 -7199 -9950
2428 -9950 -7730 -1535 6251 10971 11940 7762 824 -6008 -9539 -8682 -3274 3203 8222 9016 5310 -1445
2444 -1445 -7834 -11361 -10179 -5178 1624 7442 8983 5752 -324 -6159 -9549 -8388 -3104 3952 9900
2459 9900 11498 8585 2416 -4649 -8874 -8237 -3672 2980 8790 10475 7251 864 -6481 -11509 -11679
2474 -11679 -6908 -136 6730 9254 7734 2133 -5570 -11134 -11617 -7013 562 8282 12554 11269 5835
2489 5835 -2001 -8321 -10406 -7203 -127 7627 12434 11807 6365 -1807 -9452 -12909 -11102 -4184 3756
2504 3756 9549 10691 6123 -1548 -8765 -12762 -11700 -5672 3000 9678 12410 9482 2795 -4811 -9904
2519 -9904 -9876 -5110 2451 9696 13212 10769 4258 -3517 -9510 -11053 -7963 -1478 5769 9554 9084 3620
2535 3620 -4031 -9768 -11927 -9168 -2743 4190 8820 9510 5626 -1316 -6748 -9221 -6937 -934 5545
2550 5545 9630 10756 7214 844 -4894 -8464 -7414 -2563 2932 7450 8372 5013 -1004 -6954 -9853
2565 -9853 -8787 -4700 1360 6212 7327 4971 -439 -5345 -8732 -7436 -3004 3133 8143 9768 7181
2580 7181 2102 -3297 -7156 -6877 -2918 2838 8297 9513 6808 1044 -5266 -9250 -9890 -5684 9
2595 9 5770 8526 6011 735 -5429 -9850 -9991 -6009 530 7090 10588 9401 4279 -2107 -7279 -9049
2611 -9049 -5526 733 7151 10920 10500 5598 -1738 -8020 -10988 -8880 -2587 3836 8773 9046 5046
2626 5046 -1797 -8543 -11830 -10510 -4787 2758 8427 10444 7658 1955 -4599 -8886 -9063 -4130 2888
2641 2888 9030 11664 9555 3639 -3176 -8426 -9688 -6467 -412 5808 8813 7541 2904 -3464 -9218
2656 -9218 -10694 -8317 -2536 3800 7677 8179 4490 -1766 -6423 -8221 -6519 -1506 4763 8705 9308
2671 9308 6457 969 -4227 -7086 -6141 -1970 3180 6620 7404 4579 -662 -6167 -8775 -7838 -4294 1173
2687 1173 5017 6199 4247 -548 -5241 -7596 -6551 -2797 3033 6693 8339 6440 1673 -3053 -5971
2702 -5971 -5466 -1989 2941 6901 8337 5852 1046 -4417 -8039 -7907 -4691 629 5148 7196 4954
2717 4954 463 -4998 -8715 -8900 -5297 668 6054 8672 7663 3185 -2632 -6559 -7719 -4777 969
2732 969 6737 9848 8991 4523 -1586 -7013 -9253 -7248 -2110 3611 7797 7780 4254 -2074 -7644 -10257
2748 -10257 -9159 -4144 2329 7662 8826 6186 743 -4903 -8231 -7684 -3504 2807 8166 10514 8309
2763 8309 3030 -2736 -7458 -8060 -5268 312 5696 7992 7279 2597 -3358 -8363 -9699 -7085 -1965
2778 -1965 3488 6885 6850 3382 -1819 -5972 -8107 -5749 -1077 4216 7382 8256 5583 780 -3975 -6231
2794 -6231 -5341 -1484 3068 6520 6902 4279 -477 -4820 -7566 -6803 -3665 1110 4628 5340 3405 -741
2810 -741 -4726 -6920 -6054 -2587 1779 5968 7018 5119 1192 -2768 -5446 -4810 -1569 2814 6140 7278
2826 7278 5023 1083 -3965 -6708 -6592 -4053 788 4640 6299 4410 31 -4365 -7698 -7746 -4438 611
2842 611 5188 7233 6345 2185 -2513 -6313 -6653 -3755 1013 6541 8582 7956 3827 -1527 -6165 -7457
2858 -7457 -5773 -915 4326 6981 6922 3354 -2163 -6896 -9389 -7791 -3361 2482 6772 7553 4920 42
2874 42 -4940 -7595 -6775 -2892 2821 7513 9247 7287 2530 -2959 -6476 -6877 -3921 720 5356 7748
2890 7748 6595 2542 -3401 -7643 -8277 -6177 -1494 3139 5999 6000 2745 -2117 -6017 -7131 -5204 -1092
2906 -1092 3731 6673 7332 5071 461 -3515 -5276 -4400 -1288 3052 5960 6745 4022 154 -4013 -6574
2922 -6574 -5791 -2896 930 4325 4766 2706 -763 -4298 -6353 -5629 -2882 1535 4898 5792 4207 495
2938 495 -2425 -4598 -4046 -1308 2538 5987 6683 4690 999 -3109 -5371 -5180 -3015 1064 3905 5497
2954 5497 3345 -57 -4186 -6692 -6848 -3771 426 4214 5844 4797 1623 -2672 -5665 -5666 -3294 1641
2970 1641 5257 7504 6773 3094 -1622 -5309 -6477 -4545 -176 4130 6497 6105 2679 -2173 -6434
2985 -6434 -8064 -6797 -2526 2383 5665 6413 3835 -420 -5265 -7107 -6353 -2216 2695 6786 7789
3000 7789 6327 2014 -3099 -6084 -6031 -2718 1569 5645 7382 5751 1905 -2825 -6625 -7678 -5154
3015 -5154 -1122 3383 5563 5270 1957 -2229 -5584 -6661 -5068 -928 3445 6239 6466 4139 165
3030 165 -3600 -5021 -3854 -919 2839 6085 6181 3870 21 -3619 -5756 -4945 -2231 1280 3944 4165
3046 4165 2417 -561 -4152 -6130 -5143 -2774 1367 4114 5041 3891 530 -2348 -4304 -3608 -1230 2417
3062 2417 5029 5679 4281 1170 -2551 -4530 -4438 -2188 1239 3817 4568 3307 -71 -4042 -6001 -5982
3078 -5982 -3345 333 3520 4918 4157 773 -2710 -4913 -5351 -3050 1232 5205 6621 5846 2814 -1328
3094 -1328 -4639 -5409 -3343 83 3957 6200 5589 2527 -1931 -5895 -7076 -5636 -1943 2044 5014
3109 5014 5699 2975 -989 -4964 -6815 -5651 -2021 2352 6087 7069 5163 1069 -2903 -5203 -5048 -2439
3125 -2439 1646 5475 6628 5447 1666 -2971 -5825 -6458 -4320 -830 3080 5059 4654 1574 -2684
3140 -2684 -5383 -6224 -4677 -1073 3063 5668 5390 3535 52 -3163 -4588 -3541 -736 2783 5563
3155 5563 5370 3642 321 -3444 -5085 -4082 -1760 1208 3564 4106 2308 -537 -3370 -5260 -4859 -2381
3171 -2381 1123 3719 4198 3009 428 -2461 -4029 -3535 -1381 2327 4406 5336 4031 1103 -1837 -3990
3187 -3990 -3605 -1783 1110 3516 4440 2875 -93 -3181 -5343 -4889 -2707 546 3168 4163 3291 484
3203 484 -2660 -4725 -4446 -2217 882 4360 6263 5027 2149 -1338 -4135 -4341 -2657 466 3856 5658
3219 5658 4990 2063 -1846 -5168 -6200 -5039 -1484 2409 4721 4535 2356 -1442 -4702 -6134 -4729
3234 -4729 -1673 2442 5528 6245 4496 741 -2446 -4788 -4696 -1768 1860 5239 6252 5091 1459 -2589
3250 -2589 -5378 -5789 -3693 -299 3215 4850 4004 1224 -2680 -5137 -6021 -4385 -977 2702 4930 4942
3266 4942 2512 -409 -3266 -4396 -3240 -458 3013 5172 5256 3595 322 -2818 -4257 -3795 -1665 1325
3282 1325 3566 3750 1991 -603 -3657 -5053 -4362 -2438 433 3101 3757 2748 310 -2280 -3647 -3412
3298 -3412 -1061 1795 3928 4618 3630 1372 -1431 -3304 -3497 -1163 1178 3536 4139 2683 -10 -2766
3314 -2766 -4567 -4348 -2811 8 2812 3471 2620 119 -2831 -4080 -3937 -2158 1030 4087 5007 4219
3330 4219 1808 -1521 -3515 -3977 -2033 826 3726 5190 4293 1647 -1587 -4422 -5357 -3987 -1052 2208
3346 2208 4116 3934 1747 -1828 -4546 -5669 -4444 -1467 2265 5107 5388 3532 235 -2902 -4428
3361 -4428 -4165 -1228 2134 4907 5847 4596 1151 -2194 -4669 -5124 -3280 69 3222 4500 3662 1376
3377 1376 -2479 -5092 -5400 -4074 -986 2378 4506 4402 2553 -839 -3243 -3984 -3209 -354 2656 4998
3393 4998 5213 3321 135 -2636 -3741 -3374 -1331 1337 3432 3675 2320 -497 -3165 -4544 -4167 -2036
3409 -2036 663 2643 3345 2479 -34 -2236 -3576 -3293 -1004 1453 3512 4220 3375 922 -1318 -2903
3425 -2903 -2566 -876 1107 3259 3606 2562 238 -2337 -3968 -3814 -2265 68 2400 3066 2053 -9
3441 -9 -2494 -4108 -3752 -2023 834 3283 4196 3683 1568 -1331 -2967 -3453 -1507 1253 3718 4394 3643
3458 3643 1576 -1521 -3831 -4544 -3342 -573 2363 3786 3253 1295 -1885 -4641 -5204 -4240 -1308 1855
3474 1855 4644 4716 2814 267 -2865 -4637 -3687 -1054 2241 4888 5599 4074 1065 -2250 -4285 -4532
3490 -4532 -2390 353 2993 4141 3675 642 -2473 -4822 -4985 -3874 -795 2315 4255 3954 2015 -823
3506 -823 -3433 -4042 -3143 -226 2533 4716 4815 2929 264 -2189 -3723 -2983 -783 1309 3504 3797 2004
3523 2004 -440 -2901 -3983 -4257 -1861 359 2307 3162 2052 -265 -2082 -3550 -3276 -1328 1052 3355
3539 3355 3895 3207 1147 -1194 -2555 -2218 -873 1252 3149 3529 2665 595 -1902 -3473 -3194 -1703
3555 -1703 152 1779 2654 1827 -12 -2441 -3562 -3839 -1992 679 2856 3666 3051 1167 -1305 -2744
3571 -2744 -2665 -1326 997 3420 4466 3508 1347 -1455 -3200 -4067 -2672 -405 2349 3400 3227 1112
3587 1112 -2083 -4053 -4735 -3645 -1171 1784 3749 3912 2300 -420 -2579 -4257 -3292 -727 2018 4610
3603 4610 4978 3621 704 -2032 -3634 -3953 -1522 850 3259 3922 3050 417 -2578 -4588 -5113 -3422
3619 -3422 -574 2110 3842 3412 1295 -1290 -3322 -3823 -2894 -207 2666 4450 4409 2759 176 -1917
3635 -1917 -3375 -2775 -682 1640 3542 3374 2308 -88 -2864 -3745 -3632 -2125 317 2222 2904 1995
3651 1995 -165 -2257 -3458 -3030 -1349 788 2598 3194 2667 1128 -911 -2323 -1971 -747 1163 2772
3667 2772 3301 2101 544 -1271 -2988 -2883 -1831 22 1869 2051 1799 -250 -2152 -3780 -3581 -2066
3683 -2066 72 2330 2971 2859 716 -1244 -2546 -2390 -1645 948 2884 4252 3120 1383 -773 -2880
3699 -2880 -3066 -2281 98 1835 3327 2965 833 -1549 -3506 -4539 -3452 -791 1440 3286 3443 1817
3715 1817 -638 -2818 -3797 -2801 -709 1893 3987 4432 3153 560 -2013 -3343 -3588 -1640 1263 3479
3731 3479 4036 2877 651 -2231 -4198 -4186 -2977 -279 2287 3386 3032 863 -1392 -3372 -4023 -2700
3747 -2700 -246 2247 3840 4156 2466 104 -2009 -3132 -2634 -346 2033 3617 3716 2397 -178 -2279
3763 -2279 -3507 -3392 -1766 230 1976 2462 1979 -333 -2103 -3357 -3055 -1426 736 2399 2967 2605
3779 2605 1138 -822 -1993 -2057 -759 802 2740 3655 2327 851 -1291 -2545 -2656 -1621 110 1590
3795 1590 2347 1533 16 -2183 -2680 -3026 -1610 168 1966 2518 2391 628 -983 -2432 -2554 -1088 757
3812 757 2699 3623 2696 1466 -703 -2457 -2753 -1896 255 1827 3042 2383 912 -1376 -3348 -3667 -2961
3829 -2961 -913 1422 2759 2783 1439 -814 -2749 -3502 -2579 -391 2187 3715 4157 2810 227 -2036
3845 -2036 -2835 -2882 -1139 1419 3007 3829 2677 298 -2057 -4180 -4081 -2465 118 2401 3061 2625 659
3862 659 -1933 -3670 -3915 -2471 98 2367 3772 3688 2068 -475 -2273 -2923 -2189 -498 1998 3216
3878 3216 3371 1800 -241 -1982 -3355 -3164 -1427 650 2337 2415 1563 -385 -2342 -3238 -3027 -1548 282
3895 282 2065 2997 2115 496 -1102 -2205 -1975 -658 1332 2583 3374 2177 1119 -688 -2203 -2461
3911 -2461 -1118 311 1595 2134 1420 126 -1571 -2953 -2808 -1759 155 1612 2147 1797 392 -1224
3927 -1224 -2332 -2052 -853 741 2506 3249 2545 1137 -648 -2121 -2123 -1537 575 2011 2573 2350 610
3944 610 -1454 -2490 -3466 -2577 -561 1132 2722 2239 857 -810 -2675 -3102 -2458 -385 1709 3076
3960 3076 3351 2400 428 -1765 -2813 -2255 -737 1658 3120 3333 2622 710 -1829 -3394 -3641 -2072
3976 -2072 -120 2101 2947 2513 678 -1837 -3365 -3517 -2546 -384 1692 3595 3028 1633 -603 -2140
3992 -2140 -2573 -1885 181 2062 3610 3333 2097 -214 -2087 -2898 -2813 -1269 488 1973 2606 1423 -376
4009 -376 -2067 -3142 -2817 -1593 296 1779 2432 2057 396 -1173 -2024 -1685 -948 809 2100 2858 2559
4026 2559 780 -885 -2105 -2072 -1084 485 1457 2100 1396 9 -1565 -2595 -2494 -1451 -118 1453 1689
4043 1689 1360 491 -1309 -2224 -2194 -859 589 2070 2612 2479 1042 -386 -1872 -2053 -833 262 1933
4060 1933 2486 1910 636 -1278 -2433 -2889 -2267 -664 1104 2347 1873 537 -1027 -2546 -3137 -2040
4076 -2040 -440 1715 2780 3079 2092 104 -1537 -2391 -1924 -488 1707 2856 3441 2150 237 -2001
4092 -2001 -3276 -3074 -2022 295 1803 2490 2031 123 -1517 -3097 -3271 -2122 -411 1729 2763 2872
4108 2872 1309 -538 -2028 -2465 -1707 83 2011 3149 2922 1666 267 -1833 -2734 -2362 -1040 768
4124 768 1744 2143 1090 -415 -2024 -2873 -2875 -1240 473 1706 2406 1517 422 -1064 -1940 -2024 -780 693
4142 693 1708 2882 2254 803 -534 -1637 -2014 -926 94 1406 1985 1313 64 -1489 -2112 -2130 -1327
4159 -1327 -124 917 1571 1175 226 -1246 -1944 -1890 -1028 381 1743 2000 1911 666 -614 -1385 -1523 -959
4177 -959 495 1934 2566 1918 761 -980 -2154 -2503 -1698 -569 1050 2124 1579 163 -1058 -2394
4193 -2394 -3000 -1877 -550 1479 2263 2413 1362 84 -1928 -2244 -1598 -337 1508 2610 2891 2161 141
4210 141 -1766 -2630 -2464 -1258 360 1663 2516 1825 165 -1692 -2787 -3026 -2039 -312 1783 2691 2407
4227 2407 1235 -520 -1966 -2298 -1379 27 1741 2978 2824 1702 28 -1750 -2235 -2193 -778 1003
4243 1003 1883 2075 1391 -317 -1979 -2654 -2359 -1043 498 1596 2314 1463 68 -1266 -1862 -1510 -911
4260 -911 602 2054 2339 1988 688 -569 -1470 -1355 -943 351 1558 1755 1318 338 -1328 -2119 -2287 -1445
4278 -1445 -60 822 1399 987 -145 -958 -2004 -1643 -874 278 1436 1862 1712 757 -322 -1420 -1472 -623
4296 -623 564 1350 2116 1669 328 -1093 -2069 -2200 -1478 5 1113 1638 1623 331 -1004 -2319 -2399 -1559
4314 -1559 -630 1099 2251 2082 1154 -323 -1492 -1936 -1314 21 1450 2720 2529 1599 252 -1480 -2446
4331 -2446 -2109 -884 527 1863 2097 1412 306 -1546 -2738 -2634 -1606 81 1600 2221 1822 770
4347 770 -722 -2125 -1905 -1380 -70 1826 2588 2612 1454 35 -1642 -2131 -1494 -378 750 1960 2082
4364 2082 1101 -228 -1622 -2439 -2200 -1170 447 1276 1557 1057 37 -1179 -2026 -1620 -552 373 1633
4381 1633 1873 1660 604 -534 -1108 -968 -414 226 1212 1770 1071 352 -619 -1689 -1754 -1320 -550 842 985
4400 985 748 381 -820 -1498 -1781 -950 149 1174 1521 1293 512 -241 -1151 -1332 -561 665 1653 1785 1744
4419 1744 477 -766 -1201 -1637 -1555 -7 994 1322 1231 -74 -741 -1993 -2215 -1310 -369 1056 1919 1505
4437 1505 475 -257 -1636 -1727 -915 40 1315 2221 2147 1339 59 -1075 -1945 -1464 -861 546 1671 1896
4455 1896 1039 118 -1419 -2157 -2360 -1500 339 1530 1950 1560 571 -1247 -1949 -1944 -1041 425 1672 2249
4473 2249 2422 863 -123 -1335 -1738 -1251 -154 1099 1817 1773 886 -160 -1660 -2148 -1993 -943 703
4490 703 1471 1347 1006 31 -1135 -1521 -1410 -807 639 1559 1899 1416 502 -384 -986 -1106 -365 557 1384
4509 1384 1802 1214 446 -439 -1434 -1262 -807 -154 494 995 867 -128 -710 -1346 -1460 -897 -100 922 1330
4528 1330 1161 772 -326 -1069 -1154 -168 565 1228 1365 1306 724 -795 -1104 -1296 -862 112 869 1122 832 57
4548 57 -1001 -1779 -1736 -1099 -66 783 1442 1301 276 -713 -1261 -1597 -905 219 1352 1949 2103 1079 -149
4567 -149 -1088 -1631 -1407 -560 802 1729 1862 1080 -266 -1334 -2085 -2039 -976 24 1371 1601 1283 75
4585 75 -871 -1670 -1668 -1187 404 1651 2048 1570 755 -89 -1481 -1356 -1159 179 1470 1528 1847 873 -242
4604 -242 -1166 -2015 -1719 -695 442 1065 1102 467 -157 -1032 -1779 -1335 -751 603 1372 1539 1182 236 -533
4623 -533 -1088 -1117 -207 701 1337 1615 1278 562 -309 -1218 -1121 -798 -137 858 809 817 -164 -749 -1174 -1084 -724 108
4645 108 620 1281 803 -11 -218 -827 -633 1 469 1386 1469 1078 473 -150 -965 -888 -516 259 740 1105 644
4666 644 280 -751 -1405 -1320 -798 5 722 902 819 -26 -644 -1187 -1256 -748 52 1239 1550 1717 762 -63
4686 -63 -1280 -1541 -691 -109 795 1405 1397 727 -220 -835 -1653 -1515 -799 67 1124 1193 953 -124 -1096 -1577
4706 -1577 -1583 -923 411 1285 1572 1604 612 -425 -934 -1213 -884 45 1475 1729 1284 686 -290 -1310 -1617
4725 -1617 -1309 -471 394 1101 1020 442 -272 -1397 -1678 -1214 -474 449 1123 1134 1168 311 -346 -1179 -755 -455
4745 -455 955 1203 1617 1074 325 -497 -1146 -1009 -342 153 522 835 619 -144 -738 -1195 -1132 -722 1 403
4765 403 583 509 4 -208 -568 -495 -60 545 1181 1100 964 96 -333 -700 -559 -118 410 759 686 461 -295
4786 -295 -803 -1399 -1275 -889 72 618 760 699 -225 -646 -1133 -1211 -690 61 955 1348 1357 818 -162 -812 -935
4807 -935 -803 79 926 1356 1433 969 -395 -1275 -1793 -923 -318 385 1186 1440 546 -336 -1283 -1764 -1382 -376
4827 -376 479 1344 1199 1026 373 -363 -896 -1013 -413 272 1207 1697 1212 431 -334 -1242 -1286 -960 -112 429
4847 429 1212 1034 554 -578 -1171 -1609 -1095 -295 700 938 1139 866 -66 -605 -857 -752 -296 693 1110 1281
4867 1281 773 418 -432 -1144 -920 -283 427 675 525 477 -307 -414 -1055 -742 -680 125 556 538 417 -91 -526
4888 -526 -535 -693 37 246 1016 1263 604 302 -450 -720 -463 -74 460 763 984 476 -2 -693 -1011 -1189 -392
4909 -392 134 390 590 204 -243 -846 -948 -1034 -647 196 812 1157 952 447 -465 -1005 -859 -372 455 984
4929 984 1179 1297 386 -451 -1010 -1146 -689 29 601 647 799 411 -367 -1089 -1020 -1242 -285 338 890 804 916
4950 916 -24 -675 -1041 -857 -349 495 1354 1264 1275 345 -292 -1008 -1133 -429 29 488 1133 719 301 -452 -1034
4971 -1034 -1361 -1014 -266 309 720 1188 405 -150 -559 -727 -806 132 653 1187 1182 584 170 -398 -637 -596 -67
4992 -67 346 723 691 308 -201 -892 -1039 -772 -323 153 221 417 246 -236 -541 -572 -490 -411 284 650 698 432
5014 432 302 -606 -302 -212 93 167 806 515 321 -243 -446 -896 -763 -348 95 224 407 226 -66 -674 -1158
5035 -1158 -710 -102 418 498 923 506 243 -676 -540 -760 24 392 958 1130 908 57 -438 -943 -972 -623
5055 -623 -13 573 940 592 93 -805 -918 -1425 -799 -145 538 743 786 761 -3 -431 -1099 -605 -130 807 944
5076 944 1037 839 389 -307 -1245 -871 -452 103 672 945 597 88 -484 -1143 -931 -733 48 315 630 297
5096 297 153 -225 -553 -626 -541 43 330 975 831 465 269 -272 -776 -232 -132 139 737 640 -48 -282 -493
5117 -493 -792 -491 -540 112 363 299 -46 -73 -590 -438 -437 -399 590 473 528 528 242 -301 -720 -275 309 580 778
5140 778 729 415 -15 -540 -720 -308 -175 278 655 356 -21 -375 -728 -788 -792 -118 141 449 738 309 -87
5161 -87 -513 -476 -307 255 257 922 980 942 413 -666 -816 -672 -153 221 999 678 538 70 -763 -1086 -1012 -955
5183 -955 239 561 832 956 243 -152 -554 -487 -535 64 784 940 923 481 -60 -430 -775 -780 -171 352 703
5204 703 594 329 2 -671 -944 -594 -640 -168 352 860 481 -20 -287 -804 -577 -148 162 577 1033 879
5224 879 234 111 -278 -509 -135 51 422 600 782 146 -624 -376 -742 -467 -181 -23 308 274 82 -286
5244 -286 -438 -543 -244 -265 347 -9 301 -1 -98 -101 -442 -80 502 335 426 727 273 -21 -325 -585 -242 45
5266 45 409 303 170 -275 -827 -477 -599 -376 59 197 316 528 278 -200 -590 -533 -358 -72 527 886 754
5287 754 496 -51 -340 -534 -528 -528 327 508 760 543 -166 -774 -858 -1016 -540 75 559 479 681 -99 -489 -802
5309 -802 -785 -363 58 709 1023 976 475 6 -441 -536 -334 209 361 581 1095 439 -487 -743 -818 -771 -539 141
5331 141 326 526 148 -170 -682 -503 -341 -226 -1 482 412 623 304 65 -256 -86 -22 343 485 735 381
5352 381 216 -130 -574 -397 -505 -201 244 483 292 -197 -677 -515 -561 -271 301 497 789 524 -24 -165
5372 -165 -432 -463 215 390 524 597 634 175 -460 -459 -216 -262 176 391 624 -24 -280 -606 -877 -726 -558 -88
5394 -88 325 690 477 -117 -554 -783 -336 82 332 308 667 356 332 -35 -515 -349 -6 -72 475 314 639
5415 639 656 -203 -647 -928 -904 -197 377 457 789 149 210 -402 -501 -730 -198 502 505 794 671 263 -644 -668 -664
5438 -664 -313 55 405 906 510 150 -116 -627 -455 -329 -267 244 398 397 186 -480 -301 -827 -349 -25 276
5459 276 680 557 118 177 -320 -465 -542 -79 693 845 653 425 -9 -239 -291 -260 -142 149 125 291 31 -397
5481 -397 -518 -586 -304 -225 -118 137 377 147 179 -145 -326 52 -176 92 679 599 311 12 -263 -279 -488 -85
5503 -85 40 420 363 182 -235 -382 -458 -413 -73 212 637 205 444 -54 -572 -654 -597 -176 373 500 736 552
5525 552 183 -208 -977 -614 -552 194 716 694 762 -6 -149 -531 -439 -486 48 216 547 287 409 -303 -558 -1036
5547 -1036 -707 202 258 585 823 243 -172 -285 -384 -120 -82 581 638 918 579 19 -93 -323 -658 -407 -12
5568 -12 295 482 590 241 -485 -570 -651 -416 108 401 516 511 243 -190 -420 -172 -427 -14 429 759 576 66
5590 66 -280 -648 -382 -397 -257 280 375 356 24 -216 -360 -535 -210 129 176 335 375 60 48 -151 -243 -146 -33
5613 -33 247 351 684 240 314 -329 -410 -332 -38 523 460 325 6 -211 -530 -411 -488 -217 -13 32 335 89
5635 89 -325 -608 -576 -275 -460 336 620 549 488 204 -452 -396 -360 67 443 535 824 320 -154 -247 -538 -595 -358
5658 -358 -204 124 652 689 -89 -415 -902 -702 -432 -232 554 662 552 593 54 -578 -123 -419 397 548 480
5679 480 695 401 88 -188 -793 -671 22 -136 715 513 170 -62 -408 -669 -708 -506 182 291 404 738
5699 738 27 -116 -554 -522 -390 296 299 522 696 72 -93 -726 -495 -469 198 425 492 333 136 -125 -412 -367
5721 -367 -156 198 139 323 352 153 -59 -290 -549 -48 46 396 518 281 222 -136 -238 -309 -261 100 441 588
5743 588 376 126 51 -689 -716 -320 -148 327 95 394 55 -408 -652 -648 -441 -20 383 688 421 408 262 -476
5765 -476 -748 -552 -21 365 932 526 571 79 -405 -442 -465 43 -8 535 724 427 -12 -575 -660 -618 -350 -99
5787 -99 617 715 360 118 -169 -578 -667 -506 -38 433 733 787 242 66 -540 -802 -298 -140 613 714 604
5808 604 169 -154 -492 -699 -944 -331 92 425 517 344 -123 -341 -653 -716 -58 202 442 573 576 -80 63
5829 63 -455 -315 -102 149 581 367 478 -29 -346 -603 -718 -85 135 65 643 276 -17 -439 -758 -368 -297
5850 -297 171 459 561 762 109 -212 -482 -113 -205 23 619 690 635 197 -45 -612 -509 -329 -49 304 461
5871 461 413 186 -227 -491 -735 -471 7 587 604 474 364 -306 -388 -853 -426 -23 291 609 866 807 -202
5892 -202 -736 -447 -234 107 212 367 851 214 -54 -623 -806 -633 -216 -44 667 741 372 113 -356 -580
5912 -580 -294 -87 275 787 916 473 323 -70 -414 -957 -281 73 558 857 675 284 -22 -434 -635 -552
5932 -552 -195 255 340 706 256 -81 -178 -520 -433 -476 247 750 704 449 -90 -298 -395 -325 36 123 358 710 452
5955 452 -24 -551 -725 -746 -269 387 414 363 216 87 -431 -782 -593 -450 -68 191 475 369 280 -165 -377
5976 -377 -709 40 204 662 760 656 210 -184 -493 -843 -527 211 393 527 414 67 -293 -722 -620 -536 101
5997 101 241 530 368 477 -251 -676 -845 -438 7 276 866 888 372 -269 -582 -578 -375 -42 444 676 652
6018 652 302 -241 -692 -843 -514 -258 282 495 819 616 21 -483 -758 -924 -237 228 836 1083 678 221
6038 221 -232 -579 -675 -379 408 723 629 557 251 -210 -604 -1003 -600 13 416 728 467 99 -83 -504 -627
6059 -627 -389 -153 493 426 542 337 29 -510 -647 -481 -414 116 630 673 500 149 -355 -327 -564 -556 398 598
6081 598 795 415 -150 -131 -592 -607 -223 10 648 568 639 181 -377 -628 -388 -223 -12 595 725 414 95
6102 95 -568 -644 -436 -355 499 346 635 549 235 -268 -722 -751 -446 127 98 360 502 -124 -380 -459 -494 -665 -127
6125 -127 697 701 703 253 -218 -317 -810 -668 197 228 768 680 346 134 -646 -820 -868 -171 -30 610 707 391 -58
6148 -58 -404 -931 -553 -509 465 455 925 532 -208 -357 -601 -583 -440 69 680 953 535 167 -307 -487 -554 -562
6170 -562 114 504 500 715 325 -186 -654 -675 -568 -210 470 614 654 735 -342 -442 -887 -577 134 494 791
6191 791 725 197 -67 -582 -542 -727 -236 220 644 659 355 -133 -257 -720 -767 -206 -201 737 422 533 -92 -503
6213 -503 -436 -568 -98 299 721 618 692 131 -229 -588 -441 -53 44 346 905 487 56 -410 -781 -605 -404
6234 -404 -31 471 635 508 124 -229 -806 -694 -749 -23 751 656 628 516 -314 -449 -692 -530 -18 545 620
6255 620 596 348 -233 -493 -768 -683 -258 237 836 759 417 -265 -495 -606 -1003 -320 335 870 698 605 278
6276 278 -647 -937 -409 -524 324 839 977 818 181 -484 -871 -847 -436 170 523 648 871 225 -514 -586 -912
6297 -912 -600 -120 734 857 817 392 -294 -754 -786 -477 -183 782 631 328 682 90 -399 -760 -758 -310 204
6318 204 817 416 218 -34 -525 -802 -737 -593 130 514 763 312 -241 -532 -623 -499 -39 378 464 688 775
6339 775 371 -333 -550 -732 -77 162 608 834 238 28 -592 -484 -814 -247 -19 417 845 676 -157 -258
6359 -258 -733 -755 -246 102 395 788 528 313 -261 -465 -646 -555 -153 482 860 838 178 -371 -566 -508 -470 -230
6381 -230 371 749 982 352 41 -764 -842 -741 -326 256 525 636 595 3 -755 -889 -651 2 409 846 756
6402 756 739 -115 -330 -605 -703 -299 160 805 630 635 130 -743 -642 -1042 -562 -178 294 641 502 108 -334
6423 -334 -714 -925 -832 -28 478 1049 945 468 -258 -563 -940 -471 -14 325 707 711 507 -209 -763 -744 -565
6444 -565 -69 183 560 697 188 -185 -529 -1044 -610 -299 200 607 685 551 209 -220 -474 -473 -492 130 538
6465 538 609 361 247 -350 -920 -901 -337 269 488 860 443 68 -110 -888 -787 -466 -25 696 824 456 -14
6486 -14 -683 -679 -919 -538 381 583 1009 798 552 -202 -551 -1125 -487 -230 584 1015 772 461 -257 -748 -725
6507 -725 -877 -52 653 773 802 480 -273 -684 -776 -656 -53 16 813 713 709 374 -253 -1249 -777 -190 -200 1011
6529 1011 837 810 24 -369 -638 -803 -657 166 540 649 815 173 -358 -768 -805 -448 -184 463 821 881 79
6550 79 -283 -408 -797 -715 -62 207 796 919 127 -35 -360 -957 -916 -338 373 836 862 657 -166 -297 -1166
6571 -1166 -795 -220 462 565 791 522 -114 -434 -655 -560 -202 349 543 717 709 41 -225 -734 -812 -446 315
6592 315 631 936 673 -12 -466 -823 -814 -386 7 295 669 652 224 -576 -915 -850 -233 183 692 1125 1050 276
6614 276 -182 -682 -645 -566 21 664 666 768 282 -268 -691 -457 -575 -182 301 893 533 458 -297 -620 -837 -877
6636 -877 -114 277 563 524 831 167 -887 -853 -845 -260 164 824 730 701 220 -261 -1044 -861 -331 -186 623 560
6658 560 762 150 -527 -891 -722 -581 -122 556 1151 735 385 -150 -716 -860 -677 171 733 582 722 678
6678 678 -130 -805 -1069 -531 -336 263 747 797 523 -67 -731 -939 -405 -223 344 803 781 370 -99 -320 -839
6699 -839 -552 -280 261 568 899 616 121 -198 -999 -715 -200 333 200 1097 645 190 -394 -667 -437 -489
6719 -489 180 753 598 842 213 -400 -869 -967 -510 5 514 828 1000 393 -255 -740 -779 -603 148 591 584
6740 584 655 430 25 -767 -939 -541 -210 349 601 665 374 -195 -667 -915 -356 -200 189 831 1036 525 23
6761 23 -515 -636 -681 -336 402 853 1010 965 13 -372 -668 -865 -585 153 526 1008 625 558 -505 -1082 -807
6782 -807 -647 -236 372 763 728 247 -274 -835 -894 -395 73 1024 719 819 676 -149 -926 -560 -660 -396 322
6803 322 701 652 404 -364 -944 -1152 -874 -466 -18 630 980 105 -122 -370 -961 -643 -405 515 450 696 482
6824 482 332 27 -948 -938 -313 358 662 582 888 245 -544 -738 -887 -580 -10 531 531 615 374 -515 -875 -492
6846 -492 -777 211 404 944 616 138 -191 -730 -709 -540 197 574 864 815 244 -218 -811 -1059 -409 -274 649
6867 649 1009 868 533 -56 -822 -1222 -733 -56 515 966 768 679 51 -380 -526 -536 -132 264 807 923 402
6888 402 50 -517 -816 -939 -383 162 543 839 569 248 -663 -822 -1271 -548 235 647 1079 674 119 -316
6908 -316 -839 -462 -586 -117 597 778 994 497 -175 -656 -901 -477 2 314 847 790 575 35 -546 -1006
6928 -1006 -932 -401 506 575 532 582 -399 -625 -719 -709 -511 -45 734 751 550 -146 -185 -956 -712 -300 359 573
6950 573 874 750 200 -481 -990 -806 -260 -23 410 958 438 359 -619 -904 -1025 -320 -222 616 1110 515 78
6971 78 -189 -571 -885 -594 -121 527 992 860 183 -244 -822 -850 -802 -68 220 718 824 136 -29 -564 -902
6992 -902 -880 -137 369 730 835 106 -162 -719 -768 -719 -155 228 923 1045 595 73 -379 -773 -630 -485 181
7013 181 596 704 748 -99 -634 -828 -1221 -513 -4 516 1086 722 558 -445 -941 -1009 -612 18 669 1078
7033 1078 944 470 -271 -671 -810 -223 -151 515 968 810 471 -338 -680 -849 -773 -260 577 662 761 199 -227
7054 -227 -535 -785 -845 -486 311 1019 925 915 13 -115 -518 -481 -433 292 579 906 855 83 -518 -909 -1078 -618
7076 -618 414 536 683 413 216 -608 -807 -926 -626 -65 604 615 691 249 -259 -411 -1018 -667 -98 237
7096 237 850 943 449 -109 -714 -784 -461 -151 582 878 733 508 -562 -836 -1163 -758 -238 400 537 734
7116 734 424 -223 -590 -830 -609 -216 633 863 830 544 -19 -515 -829 -854 -558 439 812 927 350 137 -562
7137 -562 -718 -991 -445 129 637 986 869 446 -560 -836 -533 -289 24 665 776 781 387 -37 -585 -939
7157 -939 -653 157 714 941 837 225 -267 -363 -694 -1009 -179 507 917 855 532 -79 -520 -633 -758 -297 140
7178 140 820 857 490 41 -373 -642 -532 -197 449 417 870 736 433 -195 -705 -271 -450 112 519 888 712
7199 712 114 -390 -781 -751 -733 -55 579 724 607 281 -86 -711 -862 -318 119 435 762 687 585 -355 -825
7220 -825 -789 -530 -59 561 870 620 422 -83 -825 -596 -585 -40 161 544 362 363 -164 -431 -795 -698 1 102
7242 102 724 972 625 193 -401 -919 -506 -370 539 487 939 722 163 -620 -726 -910 -447 -62 833 904 393
7263 393 228 -771 -720 -830 -480 -33 519 1264 753 495 -55 -751 -871 -655 177 644 742 768 697 -133 -969
7284 -969 -1115 -533 -115 319 707 552 349 -166 -638 -830 -614 -303 169 590 757 636 61 -447 -975 -495
7304 -495 -374 179 685 987 702 494 -207 -661 -705 -380 263 357 791 482 49 -495 -975 -682 -516 180 214
7325 214 718 699 86 -215 -425 -912 -299 232 489 846 440 630 -170 -681 -718 -637 -334 488 799 778 372
7346 372 -285 -353 -791 -546 -423 -104 528 535 316 -149 -760 -849 -577 -264 608 861 971 514 102 -625 -600 -232
7368 -232 -377 449 754 902 333 85 -351 -771 -812 -489 153 361 783 320 162 -452 -922 -867 -494 -90 570
7389 570 1045 848 465 -636 -395 -911 -442 114 579 968 781 212 123 -773 -733 -472 -284 412 560 742
7409 742 524 -192 -695 -1087 -624 -238 422 742 830 641 251 -427 -690 -574 -620 287 580 707 635 287 -646
7430 -646 -598 -913 -537 -145 411 688 655 -27 -430 -808 -739 -558 -124 365 447 488 241 -485 -660 -591 -492 -194
7452 -194 359 636 668 303 -160 -365 -363 -96 4 558 476 657 401 -356 -614 -637 -407 -62 195 388 743 212
7474 212 -333 -727 -600 -662 -223 339 452 1019 638 112 -590 -933 -558 -469 153 634 723 834 117 -527 -696
7495 -696 -919 -514 -4 696 826 622 -192 -565 -1217 -983 -433 117 743 626 658 300 -198 -293 -1125 -393 -113
7516 -113 464 993 602 519 -62 -619 -741 -651 82 308 662 961 608 -175 -499 -798 -919 -431 212 678 813
7537 813 662 -140 -93 -941 -700 -353 308 643 1056 314 100 -421 -590 -429 -439 21 407 959 578 116 -509
7558 -509 -878 -824 -547 -83 430 498 649 113 -202 -777 -750 -397 127 485 802 820 516 -311 -255 -790 -553 -214
7580 -214 304 966 485 130 -248 -170 -623 -304 -420 -21 684 614 330 -122 -613 -802 -580 -171 27 655 933
7601 933 544 204 -531 -821 -395 -199 217 746 545 630 8 -404 -739 -1065 -190 217 561 717 499 -61
7621 -61 -335 -962 -760 -552 78 545 589 682 245 -373 -214 -745 -168 21 526 857 800 359 -53 -506 -965
7642 -965 -558 -1 512 586 879 562 222 -803 -912 -784 -278 276 674 753 656 105 -308 -634 -835 -195 254
7663 254 865 865 769 70 -372 -544 -684 -516 -214 520 668 433 221 -381 -816 -760 -508 234 173 598 771 370
7685 370 -175 -369 -597 -545 -2 405 929 831 192 -1 -822 -648 -343 10 425 735 690 342 -164 -519 -911
7706 -911 -530 -177 269 798 391 423 -103 -401 -821 -768 -402 143 598 432 165 -8 -243 -568 -352 -71 113
7727 113 768 602 584 331 -349 -757 -770 -329 357 582 1007 333 280 -420 -879 -761 -426 -207 634 653 498
7748 498 185 -291 -555 -593 -555 252 576 615 746 227 -15 -638 -666 -621 -215 541 612 729 200 -80 -752 -592
$$ [...]
8191g82
##END NTUPLES=NMR FID
##END=
