##TITLE=1H_PR164_E1
 D2O, 8 sc, 
 5.4.2019
##JCAMPDX= 6.0         $$ Bruker NMR JCAMP-DX V2.0
##DATA TYPE= NMR FID
##DATA CLASS= NTUPLES
##ORIGIN= UXNMR, Bruker Analytische Messtechnik GmbH
##OWNER= root
$$ XWIN-NMR		Version 3.5
$$ Fri Apr  5 16:12:56 2019 Russian Standard Time (UT+4h)  she@DPX200
##.OBSERVE FREQUENCY= 200.1315
##.OBSERVE NUCLEUS= ^1H
##.DELAY= (6, 6)
##.ACQUISITION MODE= SIMULTANEOUS
##.ACQUISITION SCHEME= undefined
##.AVERAGES= 8
##.DIGITISER RES= 18
##SPECTROMETER/DATA SYSTEM= spect
##.PULSE SEQUENCE= zg30
##.SOLVENT NAME= D2O
##.SHIFT REFERENCE= (INTERNAL, D2O, 0, 15.7039)
##AUDIT TRAIL= $$ (NUMBER, WHEN, WHO, WHERE, WHAT)
$$ ##TITLE= Audit trail, XWIN-NMR		Version 3.5
$$ ##JCAMPDX= 5.01
$$ ##ORIGIN= Bruker BioSpin GmbH
$$ ##OWNER= she
$$ F:/spectra/data/she/nmr/H-F/1/audita.txt
$$ ##AUDIT TRAIL=  $$ (NUMBER, WHEN, WHO, WHERE, WHAT)
(   1,<2019-04-05 16:11:51.84 +0400>,<she>,<DPX200>,
      <created by zg, POWCHK disabled, PULCHK disabled
       configuration hash MD5:
       00 E9 B6 7A A2 85 ED C7 34 08 36 98 17 FE 4E 26
       data hash MD5: 16K
       94 3F EF B9 D6 D0 C4 8C 9E 3F 73 26 27 6B 2F D7>)
$$ ##END=
$$ 
$$ hash MD5
$$ 0B DE 97 E8 64 76 9F 87 97 04 4E 1E 9F F3 C8 2B
##$RELAX= 
##$RELAX= 
##$RELAX= 
##$RELAX= 
##$RELAX= 
##$RELAX= 
$$ Bruker specific parameters
$$ --------------------------
##$DU= <F:/spectra>
##$EXPNO= 1
##$NAME= <H-F>
##$PROCNO= 1
##$TYPE= <nmr>
##$USER= <she>
##$AMP= (0..31)
100 100 100 100 100 100 100 100 100 100 100 100 100 100 100 100 100 100 
100 100 100 100 100 100 100 100 100 100 100 100 100 100 
##$AQSEQ= 0
##$AQ_mod= 1
##$AUNM= <au_zg>
##$AUTOPOS= <>
##$BF1= 200.13
##$BF2= 200.13
##$BF3= 200.13
##$BF4= 200.13
##$BF5= 200.13
##$BF6= 200.13
##$BF7= 200.13
##$BF8= 200.13
##$BYTORDA= 1
##$CFDGTYP= 0
##$CFRGTYP= 5
##$CHEMSTR= <none>
##$CNST= (0..31)
1 1 145 1 1 1 1 1 1 1 1 1 1 1 1 1 1 1 1 1 1 1 1 1 1 1 1 1 1 1 1 1 
##$CPDPRG= <>
##$CPDPRG1= <>
##$CPDPRG2= <>
##$CPDPRG3= <>
##$CPDPRG4= <mlev>
##$CPDPRG5= <mlev>
##$CPDPRG6= <mlev>
##$CPDPRG7= <mlev>
##$CPDPRG8= <mlev>
##$CPDPRGB= <>
##$CPDPRGT= <>
##$D= (0..31)
0 1.2 0 0 0 0 0 0 0 0 0 0.03 0 0 0 0 0 0 0 0 0 0 0 0 0 0 0 0 0 0 0 0 
##$DATE= 1554466311
##$DBL= (0..7)
120 120 120 120 120 120 120 120 
##$DBP= (0..7)
150 150 150 150 150 150 150 150 
##$DBP07= 0
##$DBPNAM0= <>
##$DBPNAM1= <>
##$DBPNAM2= <>
##$DBPNAM3= <>
##$DBPNAM4= <>
##$DBPNAM5= <>
##$DBPNAM6= <>
##$DBPNAM7= <>
##$DBPOAL= (0..7)
0.5 0.5 0.5 0.5 0.5 0.5 0.5 0.5 
##$DBPOFFS= (0..7)
0 0 0 0 0 0 0 0 
##$DE= 6
##$DECBNUC= <off>
##$DECIM= 24
##$DECNUC= <off>
##$DECSTAT= 4
##$DIGMOD= 1
##$DIGTYP= 9
##$DL= (0..7)
0 120 120 120 120 120 120 120 
##$DP= (0..7)
150 150 150 150 150 150 150 150 
##$DP07= 0
##$DPNAME0= <>
##$DPNAME1= <>
##$DPNAME2= <>
##$DPNAME3= <>
##$DPNAME4= <>
##$DPNAME5= <>
##$DPNAME6= <>
##$DPNAME7= <>
##$DPOAL= (0..7)
0.5 0.5 0.5 0.5 0.5 0.5 0.5 0.5 
##$DPOFFS= (0..7)
0 0 0 0 0 0 0 0 
##$DQDMODE= 0
##$DR= 18
##$DS= 0
##$DSLIST= <SSSSSSSSSSSSSSS>
##$DSPFIRM= 0
$$ [...]
##$SUBNAM2= <"">
##$SUBNAM3= <"">
##$SUBNAM4= <"">
##$SUBNAM5= <"">
##$SUBNAM6= <"">
##$SUBNAM7= <"">
##$SUBNAM8= <"">
##$SUBNAM9= <"">
##$SW= 24.9337058887773
##$SWIBOX= (0..15)
0 0 2 0 0 0 0 0 0 0 0 0 0 0 0 0 
##$SW_h= 4990.01996007984
##$TD= 16384
##$TD0= 1
##$TE= 0
##$TE2= 300
##$TE3= 300
##$TEG= 300
##$TL= (0..7)
0 120 120 120 120 120 120 120 
##$TP= (0..7)
150 150 150 150 150 150 150 150 
##$TP07= 0
##$TPNAME0= <>
##$TPNAME1= <>
##$TPNAME2= <>
##$TPNAME3= <>
##$TPNAME4= <>
##$TPNAME5= <>
##$TPNAME6= <>
##$TPNAME7= <>
##$TPOAL= (0..7)
0.5 0.5 0.5 0.5 0.5 0.5 0.5 0.5 
##$TPOFFS= (0..7)
0 0 0 0 0 0 0 0 
##$TUNHIN= 0
##$TUNHOUT= 0
##$TUNXOUT= 0
##$USERA1= <user>
##$USERA2= <user>
##$USERA3= <user>
##$USERA4= <user>
##$USERA5= <user>
##$V9= 5
##$VALIST= <valist>
##$VCLIST= <CCCCCCCCCCCCCCC>
##$VD= 0
##$VDLIST= <DDDDDDDDDDDDDDD>
##$VPLIST= <PPPPPPPPPPPPPPP>
##$VTLIST= <TTTTTTTTTTTTTTT>
##$WBST= 1024
##$WBSW= 4
##$XGAIN= (0..3)
0 0 0 0 
##$XL= 0
##$YL= 0
##$YMAX_a= 358384
##$YMIN_a= -362576
##$ZGOPTNS= <>
##$ZL1= 120
##$ZL2= 120
##$ZL3= 120
##$ZL4= 120
##$ABSF1= 10
##$ABSF2= 0
##$ABSG= 5
##$ABSL= 3
##$ALPHA= 0
##$AQORDER= 0
##$ASSFAC= 0
##$ASSFACI= 0
##$ASSFACX= 0
##$ASSWID= 0
##$AUNMP= <proc_1d>
##$AZFE= 0.1
##$AZFW= 0.1
##$BCFW= 1
##$BC_mod= 2
##$BYTORDP= 1
##$COROFFS= 0
##$CY= 11.3945322036743
##$DATMOD= 1
##$DC= 2
##$DFILT= <>
##$DTYPP= 0
##$F1P= 18.9103706918063
##$F2P= -1.10871071338519
##$FCOR= 0.5
##$FTSIZE= 0
##$FT_mod= 4
##$GAMMA= 1
##$GB= 0.15
##$INTBC= 1
##$INTSCL= 1
##$ISEN= 128
##$LB= 0.24
##$LEV0= 0
##$LPBIN= 0
##$MAXI= 10000
##$MC2= 0
##$MEAN= 0
##$ME_mod= 0
##$MI= 1.114404
##$NCOEF= 0
##$NC_proc= 0
##$NLEV= 6
##$NOISF1= 3.799351
##$NOISF2= 2.8
##$NSP= 1
##$NTH_PI= 0
##$NZP= 0
##$OFFSET= 15.70392
##$PC= 1
##$PHC0= -8858.096
##$PHC1= 17.40028
##$PH_mod= 1
##$PKNL= yes
##$PPARMOD= 0
##$PSCAL= 0
##$PSIGN= 0
##$REVERSE= no
##$SF= 200.130013532006
##$SI= 16384
##$SIGF1= 3
##$SIGF2= 2
##$SINO= 400
##$SIOLD= 16384
##$SREGLST= <1H.CDCl3>
##$SSB= 0
##$STSI= 0
##$STSR= 0
##$SW_p= 3612.71676300578
##$SYMM= 0
##$S_DEV= 0
##$TDeff= 0
##$TDoff= 0
##$TI= <>
##$TILT= no
##$TM1= 0
##$TM2= 0
##$TOPLEV= 0
##$USERP1= <user>
##$USERP2= <user>
##$USERP3= <user>
##$USERP4= <user>
##$USERP5= <user>
##$WDW= 1
##$XDIM= 8192
##$YMAX_p= 0
##$YMIN_p= 0
$$ End of Bruker specific parameters
$$ ---------------------------------
##NTUPLES= NMR FID
##VAR_NAME=  TIME,          FID/REAL,        FID/IMAG
##SYMBOL=    X,             R,               I
##VAR_TYPE=  INDEPENDENT,   DEPENDENT,       DEPENDENT
##VAR_FORM=  AFFN,          ASDF,            ASDF
##VAR_DIM=   8192,          8192,            8192
##UNITS=     SECONDS,       ARBITRARY UNITS, ARBITRARY UNITS
##FACTOR=    0.0002004,     1,               1
##FIRST=     0,             0,               0
##LAST=      1.6414764,     0,               0
##MIN=       0,             -362576,         0
##MAX=       1.6414764,     358384,          0
$$ Real data points
##PAGE= N=1
##DATA TABLE= (X++(R..R)), XYDATA
0@%%%%NnQj6J6k4L2m0M8n6P2q8J04j27J51j76K07k39K79l22L70m27M86n54O28
29C32p09Q02r00J010j132J266j414J571j748J941k149K383k639K921l236L585
45A884l975M411m908N479o134O904p819Q930j0314J2090j4478J7870k3109L2388
59A9219n3776J92735P8305l11556j32176o6300P2442J25884K19443J71067M3097
70C58384j53491k29146k08325r3352J4709J31610J95445J94141P6350p6964j95819
81A3542k02059j27188R81J23073K07686J96175J00438l5973j39659j86302j57217
92b06503n5475R1302J92092J86741R0149k0811j10457j73686j85892j03053N0955
103b44638J72303J78373R4945k126p9777j43138j69355j10865K6740J55169J87757
$$ y = [0, 0, 0, 0, 0, 5, 0, 8, -8, 8, -16, 16, -24, 24, -32, 40, -48, 56, -71, 80, -96, 111, -128, 151, -171, 199, -228, 258, -296, 332, -377, 425, -475, 535, -597, 669, -745, 826, -922, 1019, -1130, 1253, -1386, 1535, -1701, 1884, -2091, 2320, -2588, 2891, -3243, 3661, -4158, 4772, -5542, 6548, -7930, 9940, -13169, 19219, -34557, 158178, 236483, -75073, -207249, -273549, -201107, -75223, 144220, 315287, 358384, 204893, -24253, -232578, -325930, -311221, -179611, 15834, 209975, 286325, 209361, 13542, -188517, -315705, -314724, -191651, 16035, 212210, 312648, 276675, 137016, -49286, -206503, -261978, -170676, 21416, 208157, 298306, 277495, 167038, -6648, -192540, -295593, -244638, -72335, 106038, 200983, 198857, 119080, -24058, -193413, -304278, -277538, -122369, 65388]
114F5388J22259K6922n3321j15731j48029j09780M651J27265J72405J26971M0056
125B59056m7538j20527j54836j16303j4825Q7713J37036J20269N4325l8588j24517
136D1265j56357j10582j5311P5243J27586J29382Q1025j1730j05596j46354j03634
147a95063r814P7417J26292J32428R2311N669r7046j51655j20665l0339N9868
158a10597J12755J24364Q9554N242r8477j59592j39019n4975M1256J10727J35227
169E6465J04144J9285q1398j44030j36248o5933L1753J17550J57311J30383M3597
180B32879o1319j33620j40984q6711O424J01140J56004J41589N6763n5028j38032
191G9105j59511j17056k9262P3013J46543J50460P7033l2794j24577j60211j31252
$$ y = [65388, 187647, 214569, 161248, 45517, -102512, -212292, -207641, -80376, 92029, 219000, 259056, 211518, 90991, -63845, -180148, -194973, -107260, 29776, 150045, 204370, 165782, 41265, -115092, -225674, -240985, -165742, -38156, 91226, 172251, 160521, 54925, -91429, -195063, -204877, -127460, -1168, 131260, 223571, 229240, 132194, -19461, -140126, -170465, -110597, 2158, 126522, 216076, 221318, 122841, -36751, -175770, -230745, -189489, -78762, 56465, 160609, 179894, 98496, -45534, -181782, -247715, -215962, -98412, 58899, 189282, 232879, 171560, 37940, -103044, -189755, -183331, -82191, 73813, 215402, 272165, 217137, 79105, -80406, -197462, -226724, -153711, -7168, 143292, 220325, 187531, 62954, -97257, -228509]
202b28509m8072N8870J45198J68160J14028R695r4033j50884j39550o7482L8581
213a93998J33134J69955J32086L6260p3279j48808j59225j01020R45J00008J52552
224D8610J35488N7245n0142j37708j67005j23508k7284P8634J45730J49608Q7574
235A97242j2453j05338j49967j25656m3955N9353J36817J56175J09657J7976p9034
246A60817j39347j36083p1177K5026J08014J41560J10955L0089o4855j32157j42569
257a09727r2698n457Q1683J29098J16748N0220l7401j07434j28924r3971j5478
268b13341P0792J25729J24363P1188j0070q3102j16137r4717k8773N1045J07601
279D578J15185P2165k701p5871j15961j05280m7972K7985Q7462J03179P0049N166
$$ y = [-228509, -276581, -217711, -72513, 95647, 209675, 219370, 125337, -25547, -165097, -232579, -193998, -60864, 109091, 241177, 277437, 204158, 55350, -103875, -204895, -203950, -103942, 48610, 184098, 241343, 191201, 53493, -113512, -237020, -264304, -185670, -39940, 109668, 197242, 184789, 79451, -70516, -196172, -240127, -180774, -43957, 112218, 221875, 239851, 160817, 21470, -114613, -185790, -160764, -52750, 88810, 199765, 229854, 164999, 32842, -109727, -202425, -207882, -126199, 2899, 119647, 169867, 132466, 25032, -103892, -197863, -213341, -142549, -16820, 107543, 178731, 168661, 85559, -30578, -125295, -154068, -103023, 4578, 119763, 191928, 189227, 113356, -2605, -107885, -155857, -127872, -40410, 62769, 132818, 137984]
291A37984o4193j06199j01792n1159K2604Q4280J06392Q1664K2659m4386r0666
302b812r2846m8805J9414Q0336J05716Q5582K8161m0065r0460r9118o1929K408
314a14418O4861R6164Q0870K7507m0718r3293j05862p3201p833N9711R8727R0749
326H3264M2603k5631q2646j01894p3201r286O1587J05203J05307O0760j0632p5903
338G9531j04985q5105k6219M6313R8222J07203O6460n275p6899j16120j04502
349a21376m9479K6612Q9388J10280P9339J1643o1978j10831j10593o1123J6966
360a81152Q8382J21566J02751L9800l9150r9360j13030p4404l21P4753J18503
371C8338J11873N6115k5617r5423j23497r7334l0515M8382J03748J12754O8965
$$ y = [137984, 73791, -32408, -134200, -185359, -162755, -78475, 27917, 109581, 132240, 87854, -2812, -95658, -144463, -125049, -44713, 61003, 146585, 174746, 134681, 44221, -54897, -116826, -114418, -49557, 46607, 127477, 154984, 114266, 20973, -84889, -158090, -165923, -106212, -7485, 83264, 125867, 100236, 17590, -84304, -157505, -166791, -105204, -1, 105306, 166066, 155434, 79531, -25454, -110559, -136778, -90465, 7757, 114960, 181420, 176145, 99246, -16874, -121376, -170855, -144243, -54855, 55425, 134764, 146407, 84429, -26402, -136995, -198118, -181152, -92770, 28796, 131547, 171347, 132197, 32837, -80193, -154597, -154918, -80165, 38338, 150211, 206326, 180709, 85286, -38211, -135545, -166060, -117678, -13930, 98824, 167789]
382A67789p920q3135j22686j08769m9731L1152R7181J20640R0531K2384n5938
393A01498j06837j08203o0333J5761Q6100J20485J04190M2171l5711r7102j13669
404e1650p9753j1474O0387J04260J00987N1256k2718q7380j14828r3080l2691
415a76684L9441R2791J02860O6384P29o4333r9870r0049l9646K9515Q6453J05448
427E3039P9260K1108m4194q6874q9654n0162J1394O8166R3635P6657K5193l7140
439A20428q3399r3811o3202o328M9103Q1615P4183L2128k5709p1041q5601o1630
451a33264j0677M5317Q1603Q0757M4813r821n6473p5511n8552j3787L9206P6076
463I687P8952M5684o359n5368p7843o6809k6338K5199O4309P2773M4285o241n4557
$$ y = [167789, 159869, 76734, -45952, -154721, -204452, -173300, -76119, 44521, 135052, 157436, 101498, -5339, -113542, -173875, -158114, -72014, 48471, 152661, 194832, 159121, 62019, -51650, -131403, -142877, -82490, 21770, 122757, 174013, 151295, 63915, -50913, -143993, -176684, -137243, -44452, 58408, 124792, 125521, 61188, -38682, -128731, -168377, -138862, -52409, 53039, 132299, 153407, 109213, 22339, -67315, -117477, -106083, -37917, 55718, 132375, 157568, 120428, 37029, -56782, -119984, -126312, -77209, 4406, 78589, 110717, 85008, 13967, -71634, -133264, -143941, -98624, -17021, 63736, 108549, 98728, 42255, -33256, -91808, -105595, -66389, 9687, 88639, 134323, 127964, 72596, -5247, -72056, -98394, -73195, -8886, 63887, 108172, 101931, 47374]
476D7374p9215p0322l1191K0868O4346P7995N5691O390m3491p2816o7064l0507
488a21942K1241O6764Q4012O6123J7500l7652p4438p5931m3153R969N7558P9507
500D9558O6489K1273l5691p9441q9124n9783l751N0516Q0352P3892L4889k0791
512H8388p0193r0299o6318j0765M9944Q7671Q7333N3232k264n7522q8501p7220
524i6514k6981L6452Q2516R0839O0926O780n2185r2427r3184n1333J3649P0029
536e1433Q9834O9960J9673l9725q5618r5853o3350j487O1652R5742Q7404M2056
548A28855j8985o9847q9743o8619j6442M6347R1408R5313N6106m932o1923r0916
560c378q0729l7950K1785P2985R0004O3930P030n2774q8379q5697n0910N131N9573
$$ y = [47374, -31841, -102163, -133354, -112486, -48140, 29855, 85546, 91936, 48445, -24371, -91435, -121942, -100701, -33937, 50075, 116198, 133698, 96046, 21608, -54323, -97476, -87507, -29949, 49558, 116047, 137320, 101629, 22188, -66936, -126719, -130470, -79954, 398, 74290, 109179, 88388, 18195, -72104, -138422, -149187, -99243, -11572, 75761, 128993, 126729, 69207, -19294, -96514, -123495, -87043, -4527, 86312, 147238, 154018, 101833, 9406, -83778, -135111, -121462, -51433, 38401, 108361, 128034, 88309, 2691, -93162, -156512, -157999, -96347, -605, 86799, 128855, 109870, 40023, -49720, -118339, -134781, -88434, 2974, 98287, 154393, 149461, 87538, -3378, -84107, -122057, -100272, -27287, 62717, 126647, 133677, 80903, -7476, -93173, -144083, -138952, -79379]
573g9379Q8788P6265K7727l2057p2719p9937n2703l083N0772Q4692Q2499M3524
585A34389j3853o1963p9452o0232j6793L3430O8819P4858M5622o152n5892p9812
597a7031o8772k9276J9122N7668O9120M9228N809l9977o8759o5269l1566J6880
609a02823N6025P0547N5717J8348k5938n7931o1251l4091R454M7806O4344N3789
621I3996J8315k5246n7487o3823m3224l382L6276N8157N0323J8215k2447n3642
633F031o2124m4027n280L5439N9904N7522K8715j2371m5497n7580m1145n142L4095
646e1460O1312O2147L4247r008m6267o1442m9267j6557K4716N5549N9796L4643
658I8409q418m7033o6428n9131k6850J8572N5592O5237M4658L491l7534o2458
$$ y = [-79379, 9409, 85674, 113401, 81344, 8625, -71312, -124015, -127098, -76326, 8366, 90865, 134389, 120536, 58573, -20879, -81111, -97904, -64474, 4345, 79203, 124825, 118673, 62781, -17031, -85803, -115079, -95957, -38289, 30831, 80059, 85868, 45891, -22868, -88137, -119703, -102823, -46798, 23749, 79466, 97814, 71876, 13945, -47306, -81397, -71943, -24137, 40207, 93996, 112311, 87065, 29578, -34245, -77469, -80851, -44575, 13582, 63905, 82120, 59673, 6031, -56093, -100120, -105400, -69961, -10057, 47465, 76180, 63809, 18312, -39268, -80413, -85555, -51460, 9852, 71999, 106246, 97238, 50971, -10471, -59738, -76295, -51579, 3970, 63766, 98409, 89991, 42958, -23470, -82601, -109451, -90879, -35287, 29950, 74608, 78099, 40565, -21893]
670b1893o0402l0776J6077N8292P4081N7474J7076k8539n9928o6234m2460L868
682h3364M9160P1867O1069K3258k3346o2168p6494n7790j2840L6779O7571O6205
694E9907L5715j0525n4195p5892o4189k0635L0488O7262P5614N3300R374l9775
706F6449p1422o8144l0491J8972N9284P3822O0949K1569l0471p1314p8325m7504
718i6626J453M3114O5919O2718L0686j9488o4387p8212n5910j2022L3915O4337
730b4503O9770M4681j725m6515o8533n7581k0722K4556O0674P2084N2234R111
742A13531l5371o2983o1423l5139O418M6493O5585N1720J2068l0386n7084o2263
754d8834m4692p530L6155O1948N5127K1609j8280m5166n3369m1896j0994L0593
$$ y = [-21893, -82295, -113071, -96994, -38702, 35379, 92853, 109929, 81390, 21462, -44772, -87232, -83364, -34204, 37663, 98732, 121990, 98644, 36476, -40018, -97808, -110648, -73869, -6298, 59907, 95622, 85097, 30902, -44990, -109179, -129814, -99326, -32064, 43550, 96850, 106224, 66449, -4973, -73117, -103608, -84636, -25352, 48470, 109419, 130988, 100517, 29203, -49122, -96626, -95173, -52059, 13860, 76578, 107264, 87776, 23389, -54823, -110733, -122755, -88840, -24503, 45267, 89948, 88223, 41708, -26825, -84406, -105128, -80572, -19898, 52186, 104420, 113531, 78160, 15177, -46246, -81385, -74967, -28474, 37111, 88831, 100899, 70513, 13429, -48834, -93526, -101056, -64901, -2953, 52174, 73783, 55503, 10337, -43032, -84928, -95922, -65329]
766f5329N9882N9891L0536p652l6226m8605m2181j6957K0818M9938N3454L0690
778H8259m589l5573n1417m7166k3046J2012L9928M7226L1765J001k9654m8347
790a9601m6366k1344J3363M0739M8723L6887J1234k0350m3158m4532k1312J3410
802e2307L9581M7579L6940J2838j9214m4664n0810k9841M573L3544M4518L5164
814E7901J2645j8732m5789n4647l4976l65L2321M8631M3827K0633j1166l9991
826A0292n0794l6397l046L1695N3282N2414K9953o067l8540n3354m3354j4010
838f7926K1872M8601N3095L4286k851l9578n9265n2295k5340J1461M3377N6822
850B2259M3103P862l0719n5104n4018l0773O194M2427O2398N4876K2652j8088
$$ y = [-65329, -5447, 54444, 84980, 77328, 41102, -7503, -49684, -66641, -45823, 4115, 57569, 88259, 83670, 48097, -3320, -50486, -73532, -61520, -21592, 25634, 57399, 58400, 28746, -19601, -65967, -87311, -73948, -33209, 15514, 52401, 63635, 43285, 127, -44405, -65717, -52307, -12726, 34853, 71793, 84631, 65417, 20753, -30057, -59898, -55325, -21781, 22737, 57901, 70546, 51814, 6025, -48622, -83598, -83963, -51642, -3011, 40816, 61449, 50283, 10292, -40502, -76899, -79945, -48250, 5032, 57446, 87399, 81332, 42792, -10562, -53916, -67926, -46054, 2547, 55642, 89928, 87077, 47499, -11766, -64061, -89401, -77940, -34563, 22259, 65362, 73224, 42505, -12599, -66617, -97390, -91196, -48769, 13629, 68505, 91157, 73069]
862G3069m9570n6676l9194l388L4396N7766N7122L0311j0933m6692o2870n1190
874f7849j8866K0637N0385N7000L7035p22l8197n9697n5891k7217J3124M7391
886d2867O0553M7539J5751k3399n1052n4898l2648M678M0251N7964N2207K4292
898I8371j4262m6677n6791m2085j0245K5729M9050M9521K7713p890m0409n5475
910b3450m7303j8907J6965M4098N0197L5087M381k7634m6761m3782k0469J2115
922f5463L9690N1181L9844J2910j9336m1168m3997k6431K798L0519M3887L6521
934F0955J2343j6611l8591m5948l2244n244K3501L9249L5400J6058j0580l2646
946E642m0024l0106n016K2488M0581L9559K1596m339k6292l5752k9161p224J8858
$$ y = [73069, 23499, -33177, -72371, -75759, -41363, 16403, 73525, 103836, 92903, 46211, -16659, -67849, -86715, -66078, -15693, 41307, 78342, 77620, 39423, -20274, -76165, -103382, -90258, -42867, 17686, 65225, 80976, 57577, 6525, -48373, -81021, -76343, -36092, 21872, 74079, 98371, 84109, 37432, -19359, -61444, -71689, -45960, 3090, 52611, 80324, 72434, 32025, -23450, -70753, -89660, -72695, -28597, 21600, 56687, 61068, 33434, -13327, -57109, -77578, -65463, -25773, 25408, 65252, 78162, 58826, 17658, -26339, -52770, -49972, -19453, 24434, 60955, 73298, 56687, 18096, -27852, -60096, -65340, -41839, -2590, 32810, 48868, 38288, 5642, -34382, -64488, -69504, -47016, -6435, 33124, 54720, 50381, 24089, -11663, -40824, -48048, -29190]
959b9190L7445L8285K1330m742k8070l8998l3527j3616J2864L1820L5705K1855
971E1161l655k8226m0134l4517j4323J1446L3340M0793K9156M111k2906l7235
983a0989l3755j4995J1747L4198M3563L3732R032k0286l9133m0918k3298M769
995d6333K8762M1396L4830J1215j9042m1818m6906l1364l081K5968M3111M0440
1007C7178K0041j0508l5997m5798l5275o488K4790M6483M7333K9406k43k9291
1019D1631m6403m1144j6839J6332M1132M7854L3544M638k6562m8639m9713k8269
1031g2438M481L3793M6833L8592J3445j8322m3308m9750l3626j976K9596M8770
1043c910M6904K5721o172l4510m6944l7422r782K1723M4006M7787L1579Q78k9865
$$ y = [-29190, 8255, 46540, 67870, 63128, 35058, -3940, -37467, -51083, -38219, -6399, 29306, 51161, 47506, 19280, -20854, -55371, -69694, -58248, -24908, 15885, 45041, 49152, 26246, -10989, -44744, -59739, -47992, -13794, 29769, 63501, 72533, 52247, 13114, -27804, -51102, -46333, -17571, 23825, 58655, 69870, 50828, 9010, -37896, -69260, -72341, -46373, -3262, 37178, 57219, 46711, 10714, -35084, -70359, -76847, -52057, -5574, 41759, 71165, 70922, 41631, -4772, -45916, -62755, -46423, -5291, 42563, 76107, 80745, 54183, 5544, -44169, -72438, -67957, -34164, 12669, 51261, 64706, 46384, 3076, -46674, -80300, -82276, -52680, -3910, 42994, 68715, 62543, 28033, -18911, -56333, -66115, -44392, -386, 47401, 78980, 79858, 49993]
1056D9993m7681m3778k1781Q951L4231M4480L3939P181k3777m3697m5582k7235
1068g4756J657K9121M3765L9577J7452j2013l4899l9963k8388l135K4194M1537
1080D149M2048K2658n278k8903l9344l2313j1366J4412L3590L6630K2570k869
1092E5984k6055l8126l4799j7155P908K8446L5782K4973L265j9084l1957l0681
1104d1499j5926P271K8027L6280K7896Q645j2815k7939k9642j7448L817K3162
1116a0171L2409K5930P764j3517k9209l2177k2527j275J8739K9086K4699Q911
1128C8662j1715k7355l1910k1107j121J9764L1968K9196J4479o494k3176k9992
1140a8801k1728j974J9989L2127L1646J6281m861k4776l3538k7873q900J3985
$$ y = [49993, 2312, -41466, -63247, -54296, -20065, 24415, 58354, 65535, 41758, -1939, -47521, -74756, -73099, -43978, -213, 39364, 56816, 44803, 9904, -30059, -58447, -61582, -37388, 4149, 46197, 68855, 63577, 34674, -4670, -36983, -48349, -33937, -347, 36283, 58853, 55984, 29929, -8197, -42996, -60151, -52243, -23797, 11985, 36958, 40223, 21139, -10818, -41499, -57425, -50154, -22127, 14153, 42049, 50694, 37879, 9940, -19702, -37150, -33333, -10171, 22238, 48168, 55932, 42415, 13206, -18971, -41498, -42773, -24034, 5052, 29751, 38662, 26947, -408, -32318, -53425, -54546, -34782, -2814, 26382, 40861, 34367, 11191, -18801, -40529, -42503, -22514, 9613, 41259, 57540, 52679, 27903, -5635, -33508, -42408, -28423]
1152b8423K9813L0950J7533m045k5130l6390l2387j3857J1438L0070L5287K4684
1164C9543L314j8827l4155l2967j6205R072L1020L9766L1737J0303j4105l3410
1176A5086l7350k3576R12K4882L7804L3246J4578j2291l4126m1959l1744q086
1188f2624J7772L5745L7429K1614m194k8054m0018l3830j2923J4422L5227M2302
1200B2868L1459O299k0697l7220l5749j9000O592K9169M0445L4622J1720j6558
1212E3950l6770m0310k7238m235J9753L6244L5122J7385r414l2206l9116l0310
1224e7145q824J5191L4417L8309K5380J249k2268l5684k9862j2370J1347K9547
1236a0713L7199K8117P156j7388l2992l3488j9438K520K2078L1651K5713R203
$$ y = [-28423, 1390, 32340, 49873, 45828, 20698, -15692, -48079, -61936, -50498, -20428, 14859, 39543, 42857, 24030, -10125, -43092, -59297, -50225, -19205, 20561, 52298, 62601, 48496, 15086, -22264, -45840, -44928, -20046, 17758, 51004, 65582, 53291, 19165, -22794, -54538, -62624, -44852, -9107, 28322, 49936, 45742, 17688, -22330, -56160, -69083, -54661, -19434, 22868, 54327, 60626, 39929, 2709, -33040, -52040, -45448, -16279, 24166, 58788, 70508, 53950, 17180, -23130, -50368, -54603, -34850, 1394, 36516, 53901, 44487, 12281, -26835, -57145, -65969, -50778, -16361, 21948, 47328, 48577, 26309, -9375, -39237, -51607, -40260, -10713, 26486, 54603, 61759, 44371, 11379, -22109, -41547, -39027, -16949, 14702, 40415, 49618]
1248D9618j3020k9876l4015k3685k256J8533K9492K7067J3520n252k2002k9039
1260b0915k2781l508J7183K9879K7993J6108j335j7244k6243k3537q290J1938
1272b0752K4708K5420J4169k573j7513k6723k4834j2659O851K1575K4510J5046
1284B7225J2j5448k4035k2383j0562O612K2063K7612K0104M256j3109k2255k0733
1297b0641j0873O062K0062K6319K1100N035j3041k6024k5859j4704J576J6820
1309a4168K4029K0785O855j1954k6579k8563j7733L45J7913K6524K5303J3060
1321C5817o086k3067k8071j9208j836J8053K9528K8935J6278k188k1317l0892
1333d054k5844q622J1814K6558K9121J8465q26k0532l2529l0941j6035O750K4704
$$ y = [49618, 36598, 6722, -27293, -50978, -53234, -34701, -5209, 21858, 35378, 30126, 8124, -20915, -43696, -47204, -30021, -142, 27851, 43959, 42624, 25380, -863, -24400, -32690, -20752, 3956, 29376, 43545, 40972, 23459, -3264, -28098, -40757, -33906, -12331, 12179, 27225, 27237, 11789, -12246, -34629, -45191, -38579, -16516, 11096, 31200, 35456, 22347, 92, -20641, -31514, -25452, -5390, 20929, 42029, 47064, 34023, 7999, -17860, -32564, -30988, -14168, 9861, 30646, 37501, 25547, -1032, -29595, -47328, -46983, -29070, -2546, 22757, 35817, 29731, 6664, -21407, -40615, -42451, -24398, 5130, 34065, 50343, 48155, 26838, -4054, -29898, -38520, -26706, -148, 28973, 47438, 46612, 26080, -6449, -37390, -53425, -46675, -21971]
1346b1971L1581K4206O095j4923k8581l0648j8697K288K3537L4881L0908J3473
1358E2149q166k5796l1734k3664m426J7505L1460L1631J6849m543k4791l4003
1370g529k9382j2759R287K6200L1606K2189K000j9570l1544l0047j6106N528K4044
1383b6083L3322K7969J0366j0789k6874k9210j8498N33J9520L0552K8496J4134
1395E3438o353k4579l1192k3388o731J1470K4705K6651J5402k506k0256k9268
1407a2607k4953j0897P988K2515K7342J9381L641j3121k3711k2783j1369N831
1419c2743K1025K6261K1125O681r756k0729k3263j4285Q3J5098K2619J8693N823
1432C6632r276k0133k3535j6702l224J2735K0785J8418Q233n908j6674k0005j4955
$$ y = [-21971, 9610, 33816, 39911, 24988, -3593, -34241, -52938, -50650, -27113, 7768, 38676, 52149, 43983, 18187, -13547, -37211, -41637, -24132, 7328, 38959, 55808, 51265, 26474, -7529, -36911, -49670, -40383, -14183, 17423, 39612, 41612, 22042, -9502, -39549, -55655, -50127, -26083, 7239, 35208, 45574, 34785, 7911, -21299, -39797, -39264, -19744, 10808, 39304, 53438, 47085, 22506, -8686, -32074, -38805, -27335, -2630, 24021, 39423, 36917, 16661, -12607, -37560, -48457, -40469, -17954, 9388, 28769, 32410, 19289, -4422, -27205, -38574, -32743, -11718, 14543, 35668, 42349, 32593, 11864, -11399, -25684, -25601, -10503, 12116, 30809, 36632, 27356, 7223, -16312, -33014, -36238, -23503, -2718, 15700, 23933, 18025, 1351, -18654, -33609]
1445c3609j987J2837K1338K0814J1281k291j4512j9213j5102l022J0583J9877
1457F994J9185J0552l393j5753k1924j8589o546P672J7575J9028J0964j820j5514
1470H431k1917j8821p628Q033J9781K2317J5622K448j1802k0555j9803q474P074
1483b5294J9954K4269J8109N072j1526k2697k3197j4033J448J6263K3310J9391
1495C1069O494j0174k3552k6305j8237k278J4698K3832K4079J2536m553j9733
1507G876k5350j9475n189J3015K5530K7639J7975Q49j6573k5746k3614j0906O771
1520b7198K1684K7000J9552L572j4228k6867k7837j6911L46J7355K6265K2532
1532B5265R839q912k2992k6823j9220k991J5469K6846K6945J5456k008j7380k4876
$$ y = [-33609, -35596, -22759, -1421, 19393, 30674, 28383, 13871, -5342, -20444, -23466, -12883, 6994, 26179, 36731, 33338, 17585, -4339, -22928, -29474, -21802, -4227, 14801, 25765, 23945, 8431, -13486, -32307, -39935, -31902, -12121, 10196, 25818, 28266, 16464, -4091, -23894, -32368, -25294, -5340, 18929, 37038, 42110, 30584, 7887, -15310, -29343, -27895, -11632, 11678, 31069, 37563, 27389, 3837, -22468, -40705, -42983, -28285, -4453, 19626, 32162, 27609, 7876, -17474, -36949, -42138, -29123, -3593, 24046, 42021, 42870, 26297, 551, -23063, -33969, -27198, -5514, 21486, 41038, 44610, 30382, 3515, -24322, -41233, -40887, -23532, 2733, 25265, 35104, 26192, 3200, -23623, -42843, -45834, -30365, -3519, 23426, 38882, 36874, 19494, -5382]
1545e382k1699p352R508K3388K5873J8075J815j5194k5457k5076j3486K798J7434
1558a4755K3738J8575N413j0779k2489k4412j5763j96J4998K3354K1395J1145
1570C0224m369j7017k1537j5696k187J1968K0976K1443J3027j218j5051k0665
1582a02j8028o746O141J6718J8370J2193o39j3037k0083j8599q746L600J4500
1595a4458J8440J3551K715r069j6020j5553q379L720J4894J8961J4973M678p102
1608B1351j4755j5100r473J366J1914J6711J3781L288p659j6230j7297j1614j001
1621b4718R807J5840J3761N038o372j5064j6612j1096lJ0928J7635J6721Q666
1634B4531l432j3563j6427j1885r60J0732J7348J7454R480k950j3993k0065j6310
$$ y = [-5382, -27081, -34433, -24925, -1537, 24336, 42411, 44226, 29032, 3575, -21501, -34987, -32189, -14755, 8983, 27558, 32971, 22192, -297, -24709, -40472, -40668, -25670, -2316, 19079, 30224, 25855, 8838, -12699, -28395, -30582, -18614, 2362, 23805, 36832, 35614, 20563, -102, -18130, -24876, -18735, -2017, 16353, 28546, 27907, 14870, -5213, -23812, -32558, -28958, -14458, 3982, 17533, 20248, 11179, -4841, -20394, -28773, -25053, -10159, 8802, 23775, 28453, 21351, 6596, -8504, -17977, -16611, -4697, 12014, 25795, 29083, 21424, 5194, -12103, -23717, -24718, -14911, 929, 14690, 19728, 13356, -1708, -18320, -29416, -29419, -18491, -856, 15865, 24531, 21099, 7536, -8891, -20776, -21736, -11004, 6344, 23798, 33278, 30328, 16335, -3730, -20040]
1647b0040m681P136J5951J7296J0756j429j4124k0428j8944q090O515J7058K0602
1660G578J4644L620r355j9179j9317r877M228J6883K2639J8252P026p286j8580
1673A1276k1388j5497j153J2930K0750J9372Q582n558j7740k3620j9289o141Q667
1686b8809J9781K1816J3393j59j3986k1173j9308r157O605J9067K3674J8495N346
1699C5585r958j9109k0498j2860J139J5014K2007J8825P696p702j8618k2143j6937
1712b7559m533R373J8832J9465J1242k706j5252k1310j7290o070P007J7987K0539
1725I725J5138L202j0445j7668j6913q269L516J5169J9127J5811M833p728j6827
1738H671j8083j1789q47R874J5854J4403O092n725j4894j7712j2560k582Q657
$$ y = [-20040, -24721, -17585, -1634, 15662, 26418, 24989, 10865, -9563, -28507, -36597, -30082, -13024, 7578, 22222, 25842, 16487, -2692, -22009, -31886, -27658, -10775, 11864, 30116, 37142, 29856, 11276, -10112, -25609, -26762, -13832, 6918, 26290, 34872, 29314, 11574, -12046, -31335, -37476, -28809, -9028, 12788, 26181, 26022, 12036, -9137, -28445, -37602, -30997, -11930, 11744, 30239, 35585, 25627, 6518, -13980, -26840, -25701, -10687, 11320, 30145, 37841, 30139, 11521, -10622, -27559, -32092, -22719, -3887, 15578, 26820, 24114, 8862, -12448, -29738, -35808, -28801, -10814, 9725, 24863, 28065, 17620, -48, -16961, -25230, -21714, -6545, 12582, 28393, 33226, 25498, 8671, -9412, -21201, -22048, -12174, 3680, 18083, 24175, 18450, 3556, -14156, -26716, -29298, -20641]
1751b0641J5130J5069Q975k039j0696j4375j1445k334P543J4467J4984R766l7
1764B4367r584j3758j2124m460M654J1717J2919Q350j226r520j4675j3039o026
1777b2405L025J0842J2916Q811O57p798j2868j1815n539M271J2051J4922J1009
1790A8079K630o529j2174j1940o023K708J1221J4459J0992K223p307j3717j4657
1803a0035r487j85R379J4063J1777L850o226j4175j5172j0502r80R768J6077J4830
1817A2982Q216k806j1672j5645j1868k235R004J6652J6943R887p27j1516j7280
1830f5j5734o747M917J4049J7026J0996J033j0301j7822j8081j0360K380J2668
1843a6041J8438J4590N707o024j4721j7750j1950J19J1422J8797J8267R597k349
$$ y = [-20641, -5511, 9558, 18533, 16494, 5798, -8577, -20022, -22356, -14813, -346, 14638, 24404, 24367, 14783, 1025, -11099, -15559, -10905, 812, 13731, 22081, 20855, 11335, -3340, -16379, -22405, -19380, -8538, 4378, 13189, 13846, 6048, -6820, -18635, -24174, -19903, -7852, 7070, 18079, 20709, 14180, 2006, -9934, -15957, -13249, -2028, 12431, 23423, 25646, 18339, 4622, -10035, -19522, -19707, -10328, 3735, 15512, 19362, 13136, -1039, -16211, -26713, -27693, -17925, -1848, 12982, 21198, 18392, 6720, -8925, -20793, -23028, -14024, 2628, 19571, 29458, 28731, 17215, -65, -15799, -22546, -17629, -3580, 13446, 24442, 25475, 15174, -2648, -20729, -31089, -28709, -16041, 2397, 16987, 22694, 16670, 1949, -15801, -27751, -27632, -16210, 2587, 20854, 30451, 28102]
1856B8102j3318j8421j4865m686Q014J5852J7224J0908Mj2065j8975j7363r306
1869b8895L227J3085J7749J3307L572q163j6071j6705j0119R46J1416J8230J6452
1882A8031P990l707j3341j5712j1400j973P955J5215J6023R073j819j1960j6454
1895b079j3727o005M177J1880J4514R873k55r244j4371j3685o926K185J1644J4687
1909B668J1479L698n666j1096j1898o827J036R897J3837J1553M413l938j0899
1922H257j1937q947j285O420J1693R826L600m185j0253j2016r550j952N737J0976
1936c616J0282N432k308q144j0241p963j297O374J1380J1580O480p47p411j0891
1950a090q478k445M960J0347J0243N778j387q299j2586j0614m810M270R150J0580
$$ y = [28102, 14784, -3637, -18502, -23188, -15174, 678, 17902, 28810, 28814, 16749, -2226, -19589, -28895, -25668, -12583, 5166, 18473, 22045, 13882, -2189, -18894, -29013, -28067, -16651, 1579, 18031, 26021, 22314, 8973, -6739, -18139, -20112, -12157, 3058, 19081, 28154, 26335, 14375, -2079, -15806, -21811, -17634, -5754, 8760, 18633, 18378, 9134, -5237, -18922, -25848, -23663, -12019, 2668, 14147, 17845, 12179, 1083, -10815, -17642, -16606, -6709, 7128, 18681, 23094, 19156, 8257, -3680, -12627, -13912, -7492, 4201, 14027, 17627, 13442, 3189, -8827, -18377, -20329, -14592, -3616, 6666, 12098, 9790, 1646, -8595, -16558, -17855, -11481, -101, 11479, 17959, 17212, 9801, -1090, -9568, -12013, -7053, 3294, 13537, 19315, 17928, 9629, -2957, -13571, -18381, -14111, -4961, 5619]
1964E619P481q5p582j2096j1383m282M289J0695J2612R655L197n622j1670j1728
1978a0900n705K586J0293J3504J1028M144n696j2759j3998r883n65P960J2646
1991B655J1856N525m369j2165j4954j1520l231O663J3869J4842R072K6r956j3619
2005e306j2292m950N086J3587J6001J1980K304p634j4136j4467q514Q46J0084
2018g411J4664J3087M304o484j3885j5867j1812k300Q061J4146J4133P819j867
2031A6588j1108j4681j1551m010O161J4114J5250J0955K256q317j3410j3348o584
2044a7685K956J0743J4003J1173K998o482j2916j4962r193q53P733J2909J0801
2057A1225M970l206j0776j3298r537j873O504J2470J2598P251q8p980j0691r381
$$ y = [5619, 13100, 13015, 5433, -6663, -18046, -22328, -18039, -7344, 5268, 14923, 18120, 12498, 828, -10900, -16605, -14019, -3726, 9778, 20806, 24950, 19254, 6495, -7503, -17386, -17951, -9991, 2655, 14511, 20036, 15667, 3502, -11452, -22972, -26203, -19540, -5671, 9171, 18243, 18269, 8313, -5306, -17598, -22548, -17462, -3875, 12126, 24106, 26410, 18776, 4640, -9827, -18341, -17495, -7411, 7253, 20340, 24644, 18160, 4275, -11592, -23404, -25704, -17643, -3497, 10636, 18455, 16588, 5480, -9201, -20752, -24762, -18601, -4487, 10763, 21718, 23974, 15657, 2247, -11101, -17685, -14729, -3986, 10017, 21190, 24188, 17706, 4790, -10172, -19365, -20218, -12485, 424, 11225, 16195, 12989, 2213, -11085, -20622, -22495, -15991, -3521, 9077, 16328, 16240, 8260, -2431, -11812]
2071a1812l280M589J0669J1846P632K64o982j0865j0161n661J519P971R813P037
2085A2579Q33o052r469j0450n593N71P774R991Q252L021l908p977q386m722J571
2100a1965O871J0015Q542L518l071q345r030n303k98N267Q706P689K669m141q727
2115B397j0048p065o67N167Q432Q218L884k768p556r462o726l97N821J0672R606
2130I508N557p75o903r675q246j733N264R476J0410O324p46p861j1695r964n289
2145a6348K689R126J0509P686L78o804j1532j1079o214J896R798J2230J0767L629
2159A6731m213j0199j1530o957L29Q056J2487J2035O214l025j0119j3005j0485
2172a3681k904M986J0977J1784P536r82q948j3688j2319n714L137J0260J3162
$$ y = [-11812, -15092, -10503, 166, 12012, 19644, 19908, 12926, 2061, -8100, -13761, -12242, -4271, 5542, 12579, 13412, 7360, -2109, -12559, -18152, -17581, -9807, 184, 8436, 11457, 7549, -428, -8814, -13536, -11965, -5094, 4921, 13463, 16981, 13910, 5565, -3465, -8768, -9066, -3799, 4907, 12596, 15265, 11124, 2397, -7651, -14716, -15383, -10216, -1784, 6434, 10318, 7550, -6, -9468, -16194, -16591, -10770, -98, 9508, 15065, 14290, 7387, -2288, -10534, -12267, -7003, 2473, 12883, 19207, 18461, 10600, -1095, -11059, -16348, -13659, -4533, 5976, 13662, 14040, 7236, -4296, -15375, -21589, -19693, -9895, 2335, 13102, 16731, 12518, 2319, -9211, -16168, -15839, -7783, 4704, 16739, 22953, 19928, 9809, -3196, -13681, -16585, -11599, -622, 11162, 18698, 17716, 8768, -4920, -17239, -22953, -19816, -9556, 3606]
2185C606R860K897n700j1571j1960p087J316R816J3551J1730N091k955j0041j2795
2199d242r358j827O482J1730J1029N935j332r308j3316j1211m407L236R889J1640
2213D940P598J159o500j0915j0419n645K346R160J1643J0047M047l760r016j0306
2227e621o162j21O537J0363R268M387k975q970j0075q090k255L670Q520Q368M722
2242A1566j798p160r080p439k349K994Q300Q999O363L6m886p381o744k370L415
2257g534P165Q904N845O85m858q182p012l706J416N562P579M982k54m800p612
2272a820p921m076Q66N816P762O083J276l251p267o814l587J634O791R170O882
2287A1544K385k694p377p640m892M88N722Q426O807K562l854q011r243p299j142
$$ y = [3606, 13466, 16363, 10663, -908, -12868, -19955, -18639, -8823, 4728, 16458, 21549, 18594, 8553, -4242, -13600, -15427, -8945, 2785, 13814, 19749, 18417, 9109, -4207, -15418, -19825, -16589, -6700, 4940, 12538, 13697, 7197, -3718, -14137, -19782, -17436, -8276, 3367, 13414, 17461, 13701, 4685, -5621, -11783, -11904, -5367, 4996, 14264, 18651, 15676, 6706, -3369, -11459, -13714, -10044, -1524, 6844, 11566, 9768, 2608, -6472, -13911, -16260, -13266, -4966, 4033, 10396, 10432, 5546, -1835, -8579, -10949, -7534, -369, 8535, 14380, 15065, 10207, 2025, -4987, -8693, -7277, -1715, 5864, 10846, 10592, 5792, -1820, -9741, -13817, -12951, -7135, 627, 6710, 7986, 4735, -2532, -9346, -12933, -11299, -4508, 4662, 11544, 13929, 11235, 3858, -3782, -8674, -8186, -2464, 5962, 12769, 15331, 11477, 3466, -5777, -13076, -14218]
2302a4218N203Q626P527L919k505p500r381p481j237M740J0273R554O357m4n945
2317G888r386q598l049L586R386J0512P323R65n906j0451j0972n950R96P910R782
2332D036Q279K608m513j0108j1040p863q67O842J0715J0317O041j606p789j0429
2346e377q528k216M993J0943J1280P552L16o576j1163r805m808J482Q021J0617
2360F731Q446J698n321j0645j1412o851n33O488J0234R483M390k353q133j0175
2374g953p128j309N263R938J0706O218L16o493r322q101l528K864P897R179O531
2389A5078J74n003r727q920n076O12O070Q087O560K247l552p630q201n110K60
2404a4131N658Q793P227L324j719n269p020m897n82M312P716O719L232j640n488
$$ y = [-14218, -9015, -389, 7138, 11057, 8552, 1052, -8329, -15810, -17047, -12307, -2034, 7520, 13877, 13833, 7888, -1498, -10096, -13145, -9559, -173, 10339, 17662, 18627, 12721, 2270, -8702, -14652, -13656, -5746, 4036, 12315, 14923, 10410, 302, -10738, -18601, -19468, -12626, -1911, 8406, 14447, 12841, 5052, -5377, -13905, -16121, -11128, -185, 11095, 18647, 18963, 12387, 1224, -8581, -13389, -11907, -3886, 6731, 15177, 16875, 11554, 909, -10503, -17354, -17887, -11399, -1165, 8318, 12708, 10355, 2222, -7953, -15081, -16390, -11127, -1189, 9517, 15735, 16051, 9558, 236, -7865, -11393, -8529, -632, 8547, 15078, 15252, 10249, 522, -8398, -13474, -12862, -6792, 1295, 7855, 10102, 6550, -1080, -9281, -14391, -14131, -8473, 320, 7547, 10871, 9152, 3883, -3137, -8034, -8616, -4304, 3412, 10131, 13363, 11723, 6235]
2419F235p053o144j898K781N885N811L050j625n051o935n808j768K686O158O769
2434C093L971m36l930o074m802j456L257O530O939M452J85m460o449n683k196
2449g059J722N636O414M511k53n367p385p162l182J320N238P600M961J359l995
2464D358p506p021l285J499O528Q499O885K605k241o949q068m672L22N480P913
2479D347P782K972k217p104r608p276k407M365P423Q248M628q35o860q861q074
2494a3477l541L209Q314R676P258J513m545p809q497m958J644P109J0002Q216
2508A4114K835l037p961r753p195j576M688Q998Q742L836j852p510r886p907l381
2523a6845L176Q284R578O483P33n404q029q010l737K077O851J0121P405L022l650
$$ y = [6235, -818, -6962, -8860, -6079, -194, 5617, 8667, 7042, 1991, -4944, -10752, -12520, -9834, -3676, 3093, 7064, 6628, 2698, -3376, -8178, -9634, -6377, 153, 7092, 11544, 11729, 7269, 820, -4863, -7059, -5337, 299, 6713, 11224, 10971, 5604, -1781, -8943, -12125, -10805, -5567, 2033, 6994, 8353, 4358, -3148, -10169, -13454, -11955, -5427, 3072, 9957, 12562, 10321, 3372, -4696, -9368, -9046, -3566, 4347, 12129, 15101, 12884, 5780, -3828, -11104, -13511, -9146, -1723, 6525, 11153, 10318, 3458, -5403, -13477, -17018, -13809, -5495, 4181, 11439, 12952, 8407, 598, -7899, -12857, -11213, -4104, 5898, 14114, 16949, 13912, 5951, -3802, -10997, -12573, -7885, 1113, 9855, 13691, 11839, 4329, -5557, -13464, -16845, -13669, -5385, 4193, 10676, 11409, 6005, -2024, -10034, -13771, -11694, -4843, 5278, 12683, 15705, 12055]
2538A2055p527q516n512j33N066P688P436L194k476p412q743o741j870L140O783
2553c568P523M496l22n265p409n949k381L309O207P499N573J326l524o239n738
2568d462k989J268N459O085N599R78l271o415o624l935r0L859N661M350J466k556
2584D383n387n780l910J77M295N427N231K549j637l787n277l156Q1M175N601N195
2600H180K434j616m772n331m327n42K605N541M178J510j691m537o119n058j317
2615a0862L127N709N412L128j010m157o069m454q38L168O304O822M272k34l586
2630F732o448n664k055K093N534O447M814R0m410p313o834m445R77M849P073N537
2646F977J877l131o795p493m661Q90N004P530P438L882j124o002p716n425r40
$$ y = [12055, 4528, -3988, -9500, -9633, -4567, 3121, 10557, 13751, 11275, 3863, -4880, -11621, -13491, -10351, -3568, 3955, 8451, 8129, 2864, -4545, -10494, -12875, -9566, -3359, 4140, 9713, 11039, 7515, 1276, -4462, -7451, -6183, -724, 5361, 10960, 11938, 8667, 2252, -4372, -8307, -8397, -4538, 1123, 5473, 6939, 4383, -1004, -6784, -10694, -10517, -6222, -795, 4436, 6985, 5348, 1561, -3716, -6872, -6791, -2616, 2985, 8180, 10614, 8998, 4226, -1105, -5432, -5974, -3369, 2172, 6350, 7860, 6169, 1632, -4487, -9545, -10862, -7735, -2026, 3386, 6514, 5504, 1347, -4722, -9176, -10014, -6846, -542, 6280, 10552, 10318, 6732, 284, -5380, -7435, -5342, 192, 6639, 11453, 11543, 7133, -180, -7014, -11459, -10482, -5633, 1440, 6977, 8854, 5723, -1072, -8565, -13226, -12336, -7332, 198, 7636, 11518, 10394, 4392, -3324, -8749, -9689]
2661i689L698P212Q105M682k91n715q386p292l621J543O322P625N357J248m590
2676F208p641q165m869Q56N652Q201P122L364k081o488p258n153o48M356Q065
2691A521P437M915j003n136p829p024k518K217O189P232M828J90m543p728o986
2706h238m266P70N340O887N673K120k638n719o416l883N1M597O886O507L274j188
2722I757m880n894m776j000L087N088N863K827j031m187o216n210k751K179L911
2737c233N032L602l08l105m920m533j913J540M168N744L884J030k440m177l916
2752c545j931J355L813M996L322Q46k322m584n027k465L87L227L965L245N25k767
2768C040m331n111k958P34L773M763L955J811k157l992l979k527N12L900N544
$$ y = [-9689, -5991, 1221, 9326, 14008, 13717, 8002, -384, -7676, -11297, -9754, -3432, 4193, 9550, 10798, 6208, -1433, -9598, -14467, -13611, -7959, 242, 7364, 10728, 8647, 2159, -5099, -10252, -10900, -6544, 1521, 8958, 13873, 12870, 7734, -95, -7119, -9637, -7420, -1231, 6001, 10829, 11019, 6476, -1252, -8238, -12504, -11734, -6394, 493, 6166, 8286, 5648, -71, -6487, -10370, -10319, -5722, 1164, 7671, 10945, 9757, 4877, -1017, -5793, -6793, -3706, 1382, 7245, 10072, 9041, 4854, -1362, -6572, -9323, -7144, -3233, 1799, 5401, 5093, 1988, -2932, -7465, -9378, -7838, -3670, 2074, 5958, 6988, 4548, 371, -3545, -5476, -4121, -308, 4688, 8010, 8856, 6534, 1950, -3077, -5542, -5155, -1928, 2037, 5282, 5807, 3040, -1291, -6402, -9360, -8626, -4853, -90, 3865, 5676, 3519, -473, -4452, -6979, -6467, -2567, 2977]
2783B977M585J570j468m018n371l308o31L123M846M857J649j774m926o014m646
2798h549j661K947M833N847K977j44m437n776m937j799K936N433O498N106J141
2813A0415l739n800n563k942J080M864O475N331J770l273o340o851m826k36L472
2828f163N933N918K843j595n374p185n347j279L158O651O610M647J67l602n987
2843f05n997k554K094N497P045N125J561l201o130o709m502m0L832O238N563J882
2859I099k131n310o671n335j457L568N688O434L740n52l498n926m714k027K396
2874f696N328O249M299J106k955n318n333k622QL941N526L792J197k434n080n117
2890d109m137l23K676M845M581J964j525l871m510k894k71K749M401M727K369
$$ y = [2977, 7562, 9132, 7664, 3646, -1725, -5033, -5664, -2541, 2305, 7162, 8811, 7037, 2111, -3903, -8549, -10210, -7263, -2430, 3417, 6394, 6250, 1813, -3963, -8900, -10699, -7763, -2330, 4168, 9274, 10415, 6676, 876, -4687, -7629, -6549, -1685, 4790, 10121, 11891, 8618, 2278, -4573, -9399, -9635, -6163, -230, 5688, 8531, 6936, 1562, -5623, -10970, -12249, -9091, -2440, 4170, 8817, 8984, 5382, -605, -6602, -9156, -7062, -1565, 5480, 10605, 12166, 8965, 2835, -3874, -8376, -8416, -4584, 1654, 7217, 9099, 6968, 1658, -5013, -10348, -11805, -8237, -2549, 3885, 7625, 7073, 3575, -2351, -7065, -9092, -6696, -1368, 4881, 9180, 10286, 7331, 2013, -3320, -5942, -5934, -1993, 3533, 7325, 8522, 6088, 1008, -4109, -8246, -8569, -5893, -1048, 3533, 5497, 3972, 101, -4409, -7303, -7574, -4825, -424, 4303, 6672]
2905F672n16k538l894l352o45J957M039L452K359n26k842m736l410j639J036L315
2921a268L326K257n86k945l840l451j327J632L605M153K936J64k243l170l099
2936c856j294J584M109M053K681M32k580m140m056j847R12L154L993L173k44k636
2952C438m691m276k641L77L446M559M084J015j817m308m164k720L08L547N347
2967A504N008K250j156l729n672l359r85K333N382M507L151j387l712o008m885
2982f758k440J474M828N193L803K30k760n597n251k930P02M963O046N060K414
2997H977j493m901n908l474k84L438N677N923K695j531m518n744n526j870J983
3012f556M880N240L969m12l731n738n347k576J165M380N745M743J677k058m735
$$ y = [6672, 6156, 3618, -276, -3628, -4273, -2316, 1723, 5175, 7534, 7008, 4166, -570, -3980, -5619, -4583, -1268, 2058, 4315, 3729, 784, -3056, -6507, -7834, -6202, -2597, 1556, 4492, 4656, 2413, -757, -3856, -5150, -3566, 543, 4596, 7277, 7709, 5129, 989, -3067, -4914, -4002, -848, 3145, 6318, 6074, 3438, -1253, -5529, -8170, -7793, -4347, 212, 4296, 5311, 3494, -814, -4978, -7698, -7390, -3843, 1504, 6512, 8762, 7606, 3877, -1795, -5154, -6139, -3806, 1576, 6083, 9234, 7847, 4135, -1873, -6758, -9198, -7724, -2896, 2297, 6100, 6330, 3570, -2027, -7278, -10208, -9506, -4543, 1503, 6563, 8977, 7484, 2583, -3325, -6799, -7083, -3645, 2032, 7955, 10650, 9119, 4601, -1143, -6669, -8539, -6556, -1676, 3564, 7533, 7121, 3390, -2348, -7695, -10271, -9106, -4726, 1019, 5762, 7439, 5381, 646]
3027F46m767k908O5L639N526N125K205j191m099m796m341j428J853M450M378K567
3043F924n06l570m827m332j955J103L743M257L510L72k164l936l539j758J107
3058e571L509M178M052Q63j556l457l488k265J53K440L872K632J301j764l623
3073A276l850k525l71J831L054K921J194j069l045k919k601J0J975L773L106J864
3089D624m07k376l019k438K37J766L627L028J532p71k959l827k588r67K001K580
3105D3K894J353l69l220l705l094r79J697L655L754K284M8k784l587l013q16J713
3122d126L936M183K942L70k203m255l734k257J104L220M329K947M52k123m478
3137C07m636l473m7L258M260L880J678p85l990m611l559j20K540M891N142K657
$$ y = [646, -4121, -7029, -6964, -3325, 2201, 7326, 9531, 8340, 4241, -555, -4896, -6324, -4471, -21, 4357, 6924, 6418, 2848, -1979, -6311, -8266, -7163, -3420, 837, 4347, 4719, 2555, -1381, -4920, -6678, -5571, -2062, 2116, 6168, 7031, 5475, 2018, -1470, -3735, -3582, -1142, 2730, 5362, 6663, 4899, 1276, -2574, -5099, -5470, -3639, -585, 2336, 3530, 2461, -584, -3503, -6104, -6094, -4119, -346, 2760, 4624, 4217, 1841, -1178, -3616, -3379, -1613, 2014, 5042, 6574, 5803, 2844, -983, -3571, -4538, -2537, 43, 2937, 4290, 3921, 701, -3004, -6098, -7077, -5380, -1725, 2029, 4313, 4361, 1577, -2010, -5023, -5839, -4126, -190, 3993, 6935, 7305, 5102, 847, -2887, -5144, -4040, -820, 3509, 6456, 6908, 4785, 307, -4329, -7802, -7849, -4591, -331, 3549, 5227, 4442, 452, -4159, -7718, -7838, -5298, -407, 4735, 7392]
3153G392M6k638m939m020j642J099M301M996L611O62l159n180m725l472L91L157
3169d120M651M111J994j921m542m959l594p11L199N016M694L076j26l338m839
3184a409l640j440K085M446M871L173L73k811m527m417k820N89L122M338L307
3199E240R62k326m018m406k875K1K193M318L968J903q85l029l345k814m01K257
3215c237L651L932K408l94k311l792l124q93J119K648L061K060J78k692l337l618
3231d341j498P80K415L125J841P65j547l238k286j770J281K418L397K337P10j045
3247C344k342k454j504Q33K077K574K138O05j302k931k942k042J54J890K451J935
3263B484M08j208k416l068j776L69J797L355K796J040p90k520k885j500q1K503
$$ y = [7392, 7438, 4800, -139, -4159, -5801, -4702, -401, 4595, 8206, 8868, 5709, 529, -4196, -7668, -7277, -4120, 531, 4642, 6636, 4715, 173, -4786, -8380, -9091, -5892, -876, 3818, 6894, 6768, 3430, -1409, -5049, -6489, -4404, 42, 4913, 8086, 8459, 5648, 1121, -3296, -6116, -5527, -2405, 1933, 5240, 6202, 3876, -142, -4548, -7423, -7402, -5209, -891, 3077, 4980, 4095, 1066, -2279, -5093, -5494, -3237, 414, 4346, 6754, 6360, 4049, 257, -2867, -3760, -2641, 7, 3068, 5128, 5306, 2614, -723, -4341, -5839, -5059, -2644, 481, 2322, 3087, 1540, -1698, -3984, -5754, -4473, -2055, 1342, 3679, 4389, 3344, 1002, -1452, -2956, -2123, -46, 2528, 4666, 5271, 3969, 1038, -1904, -3946, -3792, -1902, 549, 2484, 2892, 1684, -732, -3800, -5576, -5207, -3410, -55, 2741, 3781, 2991, 471, -2414, -3914, -3995, -1492]
3279a492L345L224J628j094k577l767k640n95J494L304K843J763j124k831m074
3294b593l171j124J602K959L560K825K25k216l574l273j663J320L375M475L231
3309E958J222j623l439m264k149j58K588L979L779J088j111l764m704l555r58
3324g111J962L529M267K561o63k473m524l512j554J364L893M504L257R98j618
3339D880l877l900k188L65L034M341L394J487j307l730l958l585j067J978L614
3354e19L431K415p92l239l780l466j141J251L542L728L022L94j515l275l407j205
3370d556O04K912L563L098J358j711l113l481k435K8J604K837K846J401j472k136
3386A347l836k306n62J095L126K433J443k46j723k602j974p57J744K756K575J752
$$ y = [-1492, 1853, 5077, 6705, 5611, 3034, -733, -3373, -3968, -2474, 830, 3673, 5436, 4312, 1481, -2593, -5764, -6888, -5286, -2327, 1233, 4058, 4283, 2067, -1507, -4780, -6443, -5123, -1748, 2727, 5958, 7180, 5557, 2118, -2146, -4295, -4453, -1865, 2114, 5893, 6981, 5870, 2106, -2598, -6153, -7111, -5149, -1620, 2647, 5208, 4545, 2072, -2452, -5964, -7518, -6154, -2261, 2243, 5500, 6498, 4880, 1003, -2897, -5085, -4720, -1686, 2655, 6049, 7536, 6229, 2499, -1459, -5044, -6111, -4133, -519, 2912, 5327, 4535, 1296, -2484, -5950, -7091, -5840, -2298, 1430, 4452, 4846, 3331, 56, -3351, -4556, -3952, -1040, 2523, 5621, 6979, 5268, 2155, -1326, -3761, -3733, -2129, 708, 3554, 4955, 3483, 1347, -2489, -4795, -5357, -4262, -1136, 1297, 2740, 2494, 771, -1831, -3805, -4562, -2818, -62, 2513, 4265]
3402D265N5j420k274k204o77R70J894K310J545o57j712k332k385j215N03K142
3418a192J876J359l3j611k328j967o08Q61K280K739K025L82j345k785j927o64
3434b938Q58K409K627K115j99j152l222k406j572J76K026K655K046L17j539l300
3450a099k755j483l04K309L112L146J137j069k556k980j868R7J660L705L356J776
3466F184p04k199l338l154p24J180K602L290K133j85k400l518l430k291J026K388
3482c140L426L277Q79j296l628l679k026K28K675L787L879J776p81k687l695k760
3498c765n64J547L356L458J821K27k389l965l813j764Q60K631L542K588O58k138
3514B290l379l150j821k2K702L625L351J402q09k681k961k188l68J558L306L157
$$ y = [4265, 4320, 2900, 626, -1578, -2255, -1285, 609, 2919, 4464, 3807, 2095, -237, -2622, -3837, -3334, -1192, 684, 2043, 2010, 399, -1929, -3896, -4504, -3643, -1363, 1376, 3401, 3783, 2438, -347, -2274, -2938, -2080, 329, 2956, 5071, 4872, 3720, 498, -1908, -3480, -3304, -1278, 1377, 3423, 3740, 2201, -1099, -3854, -5337, -5641, -3332, -220, 2926, 4063, 2994, 438, -2542, -4410, -4313, -2653, 1052, 4408, 6184, 5480, 3281, -57, -3211, -3935, -2755, -153, 3137, 5270, 5085, 2685, -833, -4263, -6554, -5528, -3140, 286, 3563, 4442, 3146, -482, -4161, -6187, -5959, -3284, 503, 4382, 6158, 5377, 2690, -1005, -3765, -4329, -2782, 574, 4032, 5853, 6080, 3691, -274, -4087, -5851, -4991, -2360, 1182, 3770, 4428, 2290, -1089, -4239, -6060, -6082, -3380, 245, 3596, 4998, 4189, 1508, -1453, -3641, -4009, -2451, 855, 4012]
3530D012J638n6k297l259k938j536J017K470K968J879j65j849l032k703j572Q38
3546d585J769L047K018Q20r77k382k303r93K44K052K897K221P31r04j961j949
3562b55j769j39J360K027J545L67m63k143j958j952m91J539J330J993N53k39j535
3579b30j986j420K35J210K408J988J060j97j424k089j445L8J265J977J720J024
3595D134o38k129k143j617r03Q18K162J865J208o43k123k070k011m89R15K276
3611a388K523K077J6j478k092k696m60J038K252K970K276J62j480k785k602j406
3627c073M0J714K638K460L20j015k595l398k203k36J422L041K974J705m67k444
3643H83k728k358p79J474L040L211K265K62j559l043k705j507L84K322L294K077
$$ y = [4012, 5650, 5594, 3297, 38, -2900, -4436, -3419, -949, 2019, 3898, 3733, 1884, -1148, -3851, -5423, -4585, -2816, 231, 2249, 3069, 2092, -290, -2593, -3586, -3342, -1290, 1607, 3828, 4559, 3655, 1694, -255, -2024, -2163, -803, 1224, 2769, 3136, 2673, 530, -1428, -3380, -3871, -2332, -1002, 991, 1544, 1305, -230, -2216, -3636, -3401, -2191, 217, 2205, 3265, 3068, 1644, -445, -1890, -1852, -587, 1390, 3110, 4134, 3496, 1367, -776, -2393, -3296, -2478, -316, 1549, 2757, 2114, -9, -2079, -4090, -4579, -3664, -1388, 1135, 3212, 3228, 1750, -342, -3038, -3498, -2460, -208, 2762, 5038, 5200, 3720, 935, -1667, -3073, -3033, -1319, 1319, 3779, 4099, 3084, 489, -2909, -5112, -5348, -3926, -885, 2089, 3794, 3327, 883, -1845, -4203, -4982, -3508, -468, 2743, 5008, 5270, 3711, 668, -2037, -3544, -3160, -838, 2456, 4533]
3659D533Q85j252l147l763k167k92J526L026K911J468p50k361k824k890k6J371
3675c752K462L434K178J04j604k644k455j119O98K228K950K266N35j149l250k711
3691a829k029o4J558K305K229J019q76k147k628k103k42J423K421K729J442k85
3707B923j446k482j540k30P80K454J961J347M46j735k271j671p04O29J119J804
3723A384J305rj478j946j644j031n9J199K538P44N83m63j693j134j118P03J180
3740i39K407J208J48o46j172j435j098R6J498J700J384L56j183j661k266j459
3756c062O15Q37J686J108N32q64j609j583j437L20J261K365J859P66o89j084k230
3773a209j224o6J336K512K009Q54m66j675k236k198n85Q83K090K011J068l63j654
$$ y = [4533, 5418, 4166, 1019, -2744, -4911, -5203, -3677, -651, 2260, 3728, 2978, 617, -2207, -5097, -5123, -3752, -1290, 2144, 4322, 4426, 2822, 178, -2277, -3396, -2698, -470, 2480, 4746, 5281, 4132, 882, -1829, -3858, -3922, -2364, -59, 2170, 3189, 2313, 166, -2462, -4565, -4807, -3384, -963, 1766, 3208, 2923, 1477, -1005, -2545, -2775, -1995, 459, 2420, 3767, 4213, 2478, 207, -1464, -2168, -1539, -420, 1384, 2689, 2680, 1202, -744, -2388, -3419, -3478, -2279, 259, 1003, 1586, 1123, -570, -1704, -2822, -2119, -939, 1468, 2676, 2824, 2178, 1006, -429, -1527, -1431, 67, 1767, 3151, 3507, 2324, 663, -1603, -3062, -2447, -1610, 76, 1184, 1716, 852, -757, -2340, -3777, -3457, -2196, 169, 2028, 2794, 2105, 1021, -1209, -2433, -2499, -1163, 1349, 3358, 4212, 3746, 2071, -165, -2363, -2948, -2065, 25, 2036, 3104, 2741, 1087]
3790A087k240k569q94O07J844K966J928L69j081k314k185j210L65K032K708K190
3806C603J043m59k659k330j927o20J623K361K316J297n72k138k873k597q85J073
3822c744J921K916J520O29j523k700k501q09M34J975L064K327O46m00k498k286
3838a029j782r4J595K204K047J313j81k134k746k161j057N49K382K249J188L27
3854B670j541k738j758q22N96J853K385K000N69o37k032k029j063K25J448K395
3870A521J438Q28q49j427j823j644l61Q35J637J376P54k65j961j745j121n31O75
3887b663J646J611J191k37j037j275j042o5O24J243J634J218k5r06j443j181o00
3904a307N79R24J370R23m24j155j287j636l94M5J229J580P30M33j219j454j480
$$ y = [1087, -1153, -3722, -4616, -4009, -2165, 801, 2729, 3098, 2017, -297, -2482, -3692, -3327, -1295, 1413, 3603, 4646, 4187, 1528, -802, -2729, -3349, -1726, 635, 2951, 4248, 3676, 1538, -1335, -3932, -4817, -3744, -1823, 1093, 2613, 3242, 1719, -981, -3482, -4291, -3857, -1882, 1182, 3509, 4155, 3755, 1257, -1029, -2811, -2905, -1310, 894, 2941, 4254, 4073, 1939, -807, -2968, -4025, -3476, -1094, 1155, 2343, 2670, 1129, -1609, -3367, -4189, -3593, -1740, 645, 2645, 3214, 2577, 545, -1484, -2547, -2322, -874, 1521, 2959, 3787, 2938, 1511, -312, -1956, -2317, -1482, 155, 1531, 2285, 2020, 59, -1686, -2807, -3338, -2663, -1017, 594, 1785, 1548, 511, -764, -1806, -1871, -1247, -4, 1630, 2848, 2823, 1917, 474, -707, -1307, -728, 196, 1566, 2489, 2065, 910, -377, -2013, -2407, -2362, -1133, 447, 1177, 1610, 391, -1063, -2543]
3921b543r6N38J689J430J083K81o05j638r21p49J11J540J427J745j17j022j830
3938C23j453j393J56R89J668J319O90p51j947j857j222j19J360J633K099J043
3954B538k52j470j480j914J1O22K234K200J404j44j403k003k206j029P53J281
3970h58K208J399L44o70k703k385j585M52J311K029K321J192p52k137k005j472
3986c311l40J493K396J831J547K05j411k316j957r69N43K138J987J495K90j409
4002B212k122k149j422J06J595J734J648P82p60j499k048j241l23J147K020K019
4018A699J183k0j041j678j455q16Q59J627J502J354P2j253j847j735r33K03R11
4035a368J588J209N77j149j495j471n90K1R14J675J231Q11k67j388j451n27O0
$$ y = [-2543, -2639, -2101, -412, 1018, 2101, 2382, 1777, 139, -782, -1531, -1420, 120, 1547, 3292, 3175, 2153, 323, -1130, -2523, -2367, -1378, 290, 1609, 2299, 1548, -399, -2256, -3478, -3597, -2237, -604, 1495, 2538, 2286, 816, -664, -2578, -2567, -1945, 289, 2489, 3893, 3749, 2346, 343, -1863, -2892, -2139, -858, 1350, 2749, 3093, 2423, -280, -2665, -4250, -3798, -2487, -458, 1863, 3055, 2303, 166, -1839, -3311, -3651, -2158, 238, 2069, 3616, 3821, 2410, 94, -1863, -2832, -2289, -151, 1836, 3331, 3621, 2212, 90, -2059, -3481, -3375, -1780, -46, 1602, 2384, 1624, 125, -1923, -3164, -3487, -2340, -320, 1699, 2882, 2862, 1821, 143, -1312, -2128, -1269, 358, 1860, 3214, 3286, 2033, 186, -1549, -2482, -2279, -1368, 220, 1429, 2006, 857, -638, -2109, -2699, -2678, -1764, -89, 1142, 1953, 1686, 298, -1153, -1680, -1620]
4052a620J047J336J347L85J1j380j158j145P0P6J400P83M59j42j421r42j429l52
4070b675J106R43J142P41o32r52q87q48R3Q79J344Q70J100m6q48j023j231j61
4088a085K79J483J222L15k93q10j514j501k88L78J004J261J225l24r59j908j038
4105b553m70N54J522J844J044J78m06j301j495q09M03P99J861J620M62o44j416
4122A193k295j334j75Q52J659J997O99j89k199j548j751l99O94J817J913J248
4138B182L91j065j968j273j130N00J696J916J979K93p99j617k114j308K6J103
4154a188J672J755O00n80j593k086j663l75R10J494K019J037K60j177j872j332
4170b119j027M49K131K053J168L97p81j504j643r63K07O83K052J270M73j92j560
$$ y = [-1620, -573, 763, 2110, 2495, 2506, 1126, -32, -1177, -1107, -1031, 369, 1152, 1611, 1469, 48, -894, -2323, -2675, -1569, -626, 516, 1257, 625, -327, -1214, -2062, -1969, -1090, 254, 1124, 2224, 2178, 1330, 307, -924, -1085, -806, 677, 1899, 2214, 1921, 1111, -403, -1904, -2192, -1814, -810, 451, 1676, 1352, 393, -1515, -2553, -3023, -2469, -947, 897, 1941, 2119, 1713, 412, -1083, -1892, -1489, -690, 1171, 2791, 3253, 2609, 1193, -1102, -2436, -2611, -1759, -100, 1897, 2596, 2407, 208, -1340, -3091, -3490, -2796, -979, 934, 2182, 2573, 1508, -460, -1733, -2863, -2363, -667, 1249, 3228, 3521, 2722, 1105, -1009, -2317, -2291, -1188, 484, 2239, 2839, 2259, 666, -1420, -3083, -3458, -2548, -1054, 965, 2002, 2262, 1085, -787, -2119, -3146, -2697, -566, 1487, 2655, 3052, 2271, 767, -876, -1839, -1632, -949, 1103, 2373, 2846, 2654, 1094]
4187A094j929j327m12M54J882R74N00K40p65j408j567l60N15J255J533J052J47
4204A878o15j155q90n72J12R93J527R86M29j109p65j422r48K9O66J165P39J71
4222A219p85l53j311r98j52J044J042J007M32m43o59r90l30j50R95J473O36J84
4240A861j52r91j075n15j66P12J263P30J1o24p98j482p74l39J304N04J313M55
4258A237n04j085r16q01l6R88J272J387N18J30j002j323j387J80N35J333J519
4275B045N76k74p61j748j314r07N43J042J396J061N8p88j380j885p67K56J206
4292a641J957J325Q38p81q99j554j459l5J134J541J741N77K62j394j680j634n42
4309b244L50J005J980J077J38j062k166j234p09P4J054J682J445R38o81j315j677
$$ y = [1094, -835, -2162, -2574, -2120, -238, 736, 1236, 1476, 711, -697, -2264, -2624, -2109, -854, 679, 1731, 1878, 1263, 108, -782, -1354, -1242, -249, 1278, 2264, 2693, 1584, 819, -603, -1551, -1522, -856, 309, 1048, 1219, 434, 81, -1230, -2228, -2380, -1336, -294, 713, 1145, 702, 43, -947, -1277, -1427, -432, 1041, 1677, 1861, 1709, 718, -357, -872, -1038, -326, 937, 1667, 1678, 1054, 256, -1226, -2000, -2339, -1035, -531, 782, 1237, 733, -352, -1268, -2069, -2105, -1117, 155, 1542, 2060, 2190, 1188, -135, -1522, -1342, -807, 526, 2045, 2621, 2347, 1586, -162, -1476, -2383, -1840, -798, 598, 1659, 1717, 929, -451, -2336, -3103, -2847, -1641, 316, 1641, 2479, 1698, 799, -755, -2214, -2249, -1115, 426, 2167, 2744, 3006, 1612, -68, -1702, -2244, -1894, -889, 1091, 2168, 2306, 1244, -922, -2156, -2865, -2791, -1737, -55, 1390, 2328, 1647, 332, -1345]
4326a345j047L7J207J560J603R34j90j079j686j018q89N99J287J241J115j8q47
4343A464j783j149j281L16J083J520P15Q24p33j098j652n95R7J153J257J400M49
4360A987Nr70j321m81j64K38J239J025M04j66n12j485j085k83K36P72Q45O50K98
4379A232o78j112q72l83m1R20J031O56M89o36n88n35l80K59O37R94P99j30l24
4398A338q25p28p47K10N60P82N92K32o90j133j314k61L25P37P40J043Oo57l30
4417a20j155n5j16J088R78J137K3k51r39p66o77k55Q62J126Q55K94o90j040j471
4436a172o83k76O20J052J320P16m96j080j332q32m79O39J551J519Q51J8n09j273
4454A54j204o09J94J272J663Q52L34p51j204j508j158m8P46R76J640N07k42j492
$$ y = [-1345, -2392, -2355, -1148, 412, 2015, 2949, 2759, 1680, -6, -1024, -1913, -1314, -27, 1214, 2329, 2311, 1464, -319, -1468, -2749, -2433, -1350, 170, 885, 1709, 976, -122, -1774, -2369, -2272, -1119, 138, 1538, 1987, 1992, 1022, -299, -780, -944, -706, 533, 1558, 1962, 1796, 1284, -201, -1286, -1569, -1333, -561, 284, 934, 1232, 554, -558, -1430, -1813, -1854, -934, 97, 753, 1242, 606, 18, -517, -897, -638, -1, 993, 1792, 1662, 1338, 513, -215, -962, -752, -192, 590, 1182, 1414, 724, -409, -1723, -1984, -1659, -922, -182, 861, 867, 210, -120, -1275, -1330, -1446, -358, 620, 1757, 1780, 1529, 590, -176, -853, -1108, -246, 880, 1735, 2029, 1339, 299, -1172, -1855, -2131, -1511, -459, 861, 1577, 1081, 1, -1331, -2163, -2642, -2003, -452, 1067, 1918, 1936, 1427, 154, -1050, -1659, -1465, -193, 1470, 2322, 2656, 1905, 701, -807, -1965, -2013, -1267, -291, 1349, 1856, 1614, 122]
4472A22j033j436o12R29J215J726J062J30j218j219j263m25M60J258J412R81J020
4489C109r76j095j677j068K55L49J269J691L95p84j101j273j541m01J175O59J660
4506F46Q19J77j032j255r80m60N78O86J779J106n0m20j005j139p04J69R93Q71
4524G79R07N83q59r92j165q65j48K00J074J093K12k64m99r19r09lP44P25P77P03
4544A174L78j309l04n07k34N14Q22R74P2k97p49l83q80l49K85O38O30M33j80n77
4564A51q74o76l79L90P26P58Q35k77l82m71o90o1M16P27J257L26l9n26j248o11
4584f48l33L75K94J239J76K89m68j211j124n03J64R17Q18R25n9k41q75j195l43
4603a803l64J146J370J048P16j77j146j004j087j67R31J114J046N57j56j325j009
$$ y = [122, -911, -2347, -2959, -2030, -815, 911, 1973, 2103, 885, -334, -1597, -2022, -1562, -304, 1108, 2089, 3109, 2133, 1038, -639, -1707, -1452, -1103, 166, 1857, 2252, 1468, 367, -906, -2447, -2848, -1673, -1014, 646, 1465, 1642, 610, -645, -1625, -2085, -1507, -821, 958, 2064, 2014, 1594, 589, -550, -1254, -1085, -92, 779, 1686, 2269, 1410, 418, -747, -1612, -1760, -1560, -486, 607, 819, 555, 56, -863, -1772, -1775, -1031, -306, 471, 1174, 1552, 243, -61, -568, -802, -288, 534, 1508, 1580, 1283, 534, 151, -729, -1078, -793, -155, 475, 908, 728, 151, -723, -1399, -1778, -1388, -662, 96, 931, 654, 272, -199, -889, -950, -534, 193, 1450, 1776, 1737, 1211, -37, -648, -981, -606, -312, 927, 1103, 1392, 924, -287, -1411, -1914, -1750, -833, -15, 910, 851, 610, -265, -1460, -1803, -2167, -1021, 349, 1397, 2113, 1936, 790, -214, -1301, -1468, -537, 577, 1623, 2180, 2024, 699, -310]
4620c10j410n16Q8J416J257R13K21p48j365j377p28M31J011J440J061O32k67j272
4638D77j566k88k24P57J465J053Q52k38j137j555q56q10L85J128J515P46J76j013
4656H67j324r40j098J47J071J192J054N59J67j360j210o98l16J173J308J341L80
4673B313o2q68j527p31p64P81N82J366P01k11q50j231j007l53k24J148R57J075
4691A095M8n31n38j043q44L14R74R78O75K23j6n64q37n86O6N92O53J159n61l0
4711A227o32j042o30n8M51K24R33J95k21p64p71m74j30J075m8J284N87n20j49
4730E37j135K03k30M29N46R54L68k57m26j191o29k55M03Q59O11R3k7p71p78o47
4750a343p02P05P89R23N02l50k65q68r06L34R3Q95J091J107j39m97j119r32p29
$$ y = [-310, -1720, -2236, -2148, -732, 525, 1438, 1659, 911, -454, -1831, -2559, -2128, -1117, 323, 1384, 2016, 1749, 477, -1089, -1377, -1601, -844, 621, 1674, 2526, 2288, 1151, -404, -1260, -2070, -1685, -557, 958, 1704, 1880, 867, -457, -1397, -2495, -2348, -1277, -85, 969, 1528, 1695, 335, -875, -1573, -1889, -716, 592, 1933, 2313, 2251, 1383, -144, -875, -1639, -858, -276, 1090, 1791, 1580, 730, -501, -1508, -1861, -2085, -937, 20, 1095, 1143, 612, 74, -969, -1813, -1499, -525, 453, 1128, 1351, 1335, 771, -66, -652, -586, 6, 659, 1818, 1257, 1227, 595, -447, -1077, -1135, -684, -460, 473, 668, 447, -317, -1088, -1562, -1692, -617, -665, 619, 1206, 686, 537, -598, -395, -625, -196, 350, 1304, 1672, 1415, 989, -202, -831, -1086, -683, 176, 787, 880, 853, 82, -696, -1343, -2045, -1340, -551, 372, 874, 524, 259, -609, -1515, -1181, -1088, -193, 898, 2005, 1866, 1369, 250, -682, -1411]
4769a411M97N18J244J020mr49n86j423p89j40N39J172J250P56o97q90r12j081
4787a886p6L64J144J489J139q8p85j115j301l11K24Q68J622Q35K00j097q61j292
4805i27j067J76M45J548P07L96O5j327j441p15l56O44J357R74J338k16o74j056
4823a29j102j68J20J106J494R56l1o20j040j049r88m2Q61O18J057O04n04j000
4841A43j241p59M2K41R38J091M45P3l29j200n23k64O15N32J064Q52o2l30q72o83
4861b27n39J09P17N29O75m6k91p59r48p84L1O98Q82O55k31%q71m48o45R7R26P69
4883B99P03K41n34n05n34l94L76J31R70L13M76n50l20r54q47R2N71R89L93j02
4903H14m90m73p73l84j50N46N48J022J95p1l94r51o02M44N24M86J136J30O9o33
$$ y = [-1411, -914, -396, 848, 1868, 1864, 915, 329, -1094, -1883, -2023, -1484, -312, 938, 1694, 997, 107, -805, -1886, -1962, -1598, -454, 1035, 2174, 2086, 1301, 186, -1115, -1426, -1202, -334, 1288, 2123, 2323, 1226, 365, -927, -1994, -1818, -1373, 175, 882, 1278, 1343, 16, -1425, -2140, -2496, -1852, -495, 479, 1817, 1601, 927, -129, -1231, -1399, -1279, -173, 1321, 2277, 2246, 1626, 586, -463, -1451, -1493, -632, -14, 1043, 1647, 1143, 143, -1098, -1857, -1815, -1574, -636, 455, 900, 973, 644, -556, -1079, -1343, -728, -196, 868, 1720, 1658, 1328, 456, -227, -766, -657, 60, 589, 1264, 1218, 927, 168, -780, -1564, -1533, -835, 47, 702, 471, 471, -400, -848, -1493, -1396, -470, 299, 1002, 1243, 709, 204, -330, -724, -348, -217, 753, 1066, 1542, 992, 672, -282, -1129, -1037, -466, 523, 916, 814, 324, -149, -922, -1306, -1456, -910, -362, 660, 855, 784, 390, -561, -1163, -719, -195, 291, 1427, 1557, 1626, 993]
4923I93j302n97l35M39R67N52P46J96j016j284q25n93M35J059J021M23L34j82
4941A031j101j174p02M91P20J195J107P37m84q80j097q51NL67J258J053L08k15
4959A768q89j369p76p92M45R24J160P83J75p30j366n62j078M53J040R00J396M17
4977A899l12p46j706m55J21M53J240R34M61k23n63j465r07k29jJ492P00N54L9
4996A286p79j129q31n27N3J236R34J019K8j32q28j302k84K74K59J439P41L92M1
5015A890j285o58n56o45N20P85P11M60L9q00q47j034j69M4Q54P23L66K73k41j014
5035e84l42j02L86M27J113J5K81m5o76n08m51k8O38O51P4K49l45p83n27m91r4
5056a142O76N56L29q9j75q68o74j62L96M80R66N02j68J34m98r15k15R01N4O20
$$ y = [993, -309, -906, -1241, -802, 165, 717, 1463, 1659, 643, -641, -1466, -2059, -1624, -565, 456, 879, 1213, 1031, -70, -1244, -1946, -1455, -735, 460, 1567, 2304, 1820, 940, -157, -1008, -1003, -636, 622, 1675, 1983, 1768, 879, -490, -1266, -2058, -1613, -689, 471, 1254, 1429, 699, -667, -1229, -2307, -1854, -814, 86, 1482, 1899, 1587, 841, -865, -1320, -1199, -746, 494, 1428, 1889, 1666, 1103, -362, -1269, -1498, -1499, -7, 693, 1247, 1286, 507, -622, -1453, -1980, -1927, -691, 243, 1262, 1290, 1158, 330, -972, -1256, -982, -723, 716, 1457, 1849, 1890, 605, -53, -609, -1254, -734, 51, 762, 1222, 1261, 461, -386, -1420, -1589, -1545, -691, 32, 398, 671, 430, -584, -926, -1028, -642, -215, 898, 913, 1194, 1149, 473, -35, -486, -514, 124, 775, 849, 1098, 753, -30, -557, -1048, -1142, -466, 90, 419, 330, 155, -713, -1387, -1549, -1153, -673, 293, 795, 627, 761, 263, -652, -867, 34, 88, 708]
5076G08R08lm36p99p74n24k55P04R32O83j10l82q77r36m74o4N09R82P03N14p1
5097I38j047m72o68m20Q20J158N58Q67m4l74j265o81o49O06N47P34R38J73q35
5116H84q93j142n69k76R35J024O01N70J43r88j195o65l53M96J353J236N16L16
5134A993j010r02r52k13o0J080J304M14n3m76j078j067o29l17P83J259Q09N03
5152A388k70r38j033q61l61R26Q43R87Q68l6o76o81j194k33P24O74J108K94o8
5171A461J7j197p48p02k8M75Q27O95j1k66p65o13o56P4K92O74P70M00L54p95q09
5192e51l02k2N19N26O00O15l05k47m65o49j81J0P34N31M4r0o53o49l01j40k8M33
5214e71O84K63Rp55l20l94j12N74P44N11P07k22n78o98j56l10N76M02N41O04o5
$$ y = [708, 1616, 1613, 1177, 378, -396, -920, -1175, -471, 461, 1144, 1034, 652, -225, -1161, -1635, -1699, -1190, -208, 495, 1009, 938, -109, -581, -1249, -1669, -849, 309, 867, 1734, 1690, 1316, 51, -630, -1279, -673, -126, 608, 1546, 1719, 884, -9, -1151, -1720, -1996, -1061, -37, 564, 1134, 1277, 289, -906, -1571, -1924, -1428, -75, 1161, 1677, 1993, 983, 81, -871, -1084, -1144, -64, 1240, 1654, 1601, 1125, 47, -1020, -1649, -1966, -1183, 76, 885, 1388, 1118, 180, -853, -1714, -2075, -1149, -306, 681, 1549, 1513, 837, 156, -1038, -1271, -547, 127, 1235, 1529, 1461, 1478, 281, -467, -1169, -1197, -722, 105, 800, 789, 523, -242, -855, -1511, -1437, -1145, -471, 299, 699, 1053, 258, -551, -853, -875, -356, 170, 770, 1385, 1080, 833, 368, -281, -462, -452, 282, 813, 857, 767, 114, -535, -836, -976, -1004, -571, 113, 376, 385, -370, -690, -1084, -1196, -622, 122, 633, 1340, 1118, 540, -158, -314, -624, -48, 354, 895, 1499, 1434]
5235A434o89r38m83m07M2Q14K55O09J83p42o71o27m45M49O46J122L52m4l6p55
5255F9o89m19K90P85R08P43J23n11n44j056q50q5M12Q06J189M55n73q39j014r80
5275a780j79N47M54J277R57j3o38r91j020j94L96M48J178Q73L37l39o04j059o37
5294i87J5M46Q96P41N44j90p67j288p59n36M32Q82J200N00q4n90p84r50p09L41
5314a647J140J222M96M99m59p76p69o70JJ050L25Q46K47J69r84o67r93j36L70
5333g36N97Q99K25k17n59j014l42o54M61O09Q01Q97Q8l31m66q55k49Q2N79Q73
5353F88O47j1k02r87l11n82J68J25Q24L02m2p1l25o35q85K68M1N91O65K3j64j9
5375A08p00Ql6M41N38L59K96Q0p74k65n44J73K42K81L50N19m56Pj065n06L5J84
$$ y = [1434, 745, -193, -676, -1083, -1041, -227, 28, 637, 820, 78, -593, -1220, -1665, -1216, -570, 552, 904, 860, 824, 69, -620, -1039, -749, 36, 944, 1687, 1810, 1299, 755, -301, -1151, -1236, -824, -18, 1171, 1626, 1053, 214, -800, -1780, -1959, -1412, -958, 319, 1276, 1263, 625, -366, -1386, -1580, -1184, -736, 442, 1315, 1652, 1313, 709, -350, -987, -972, -526, 370, 1111, 1655, 1465, 698, -590, -1349, -1885, -1453, -571, 629, 1129, 1045, 455, -329, -1279, -1988, -1647, -507, 715, 1211, 1710, 1251, 475, -294, -964, -963, 87, 412, 1258, 1505, 1674, 690, 23, -970, -1106, -736, -139, 760, 985, 768, 209, -805, -1147, -1801, -1340, -731, 70, 967, 1055, 724, 258, -597, -846, -764, -185, 688, 1335, 1324, 1122, 135, -176, -758, -590, -465, 359, 661, 619, 548, 223, -412, -1297, -1029, -988, -397, 268, 291, 127, 108, -592, -584, -620, -179, 359, 718, 1014, 1094, 320, 55, -489, -316, -74, 207, 557, 1076, 620, 627, -438, -944, -909, -725]
5397g25N33L98M34o1r13m16l15j73O75K51R79J24L39p12m83o18M2J80Q12N26M90
5418A367j7m29p65j133J03J1M45J015M87k90n43o00j005l17J28M63J101J008K00
5437A229o07k65j162n01J20K71J031R57P34l21p99o47n43o13J84O33Q61P44O8
5456A374n54j299o41o16J94N13Q43R45M40k89p70r58q17j0Q20O71J155P37k58
5475A480p40p59p19m67M65N82J015Q23j08n27j257p22m52l11Q66Q16O32L74l81
5494F10o61r20m11o1P17L67R97N76l92o67l98n69k32N79P16J070k38M12n89o70
5514B36n89q27M83K63P69k2K33l63o51n96j41J23N17N19L10O6q8o53j55l32K58
5535f40M98O86J30O01l76n92l50k64m35P08N01M16l40k70m29l90m12J22L04M62
$$ y = [-725, -192, 206, 640, 579, -334, -750, -1065, -1238, -563, -312, 667, 791, 1130, 418, -65, -683, -641, -461, 351, 877, 1367, 1350, 921, 156, -977, -874, -863, -418, 597, 1084, 794, 251, -349, -1354, -1671, -1543, -1080, 21, 1029, 1229, 622, 357, -805, -1306, -1186, -915, 116, 1073, 1807, 1486, 687, 40, -503, -1116, -932, -299, 562, 1306, 1374, 820, -479, -1120, -1736, -1542, -1029, -186, 759, 1199, 910, 140, -818, -1635, -1645, -825, -154, 1001, 1738, 1480, 740, -19, -738, -1205, -740, -158, 857, 1680, 1572, 1045, -212, -934, -1386, -1697, -831, -15, 617, 991, 610, -51, -971, -1382, -1443, -726, -359, 638, 1214, 822, 155, -243, -812, -1044, -465, 251, 1321, 1083, 1495, 906, 236, -353, -1180, -697, -434, 335, 313, 546, 183, -468, -1064, -1205, -1082, -565, -46, 264, 330, 242, -411, -566, -898, -640, -142, 544, 674, 1275, 899, 307, -43, -307, -742, -34, 467, 883, 543, 273, -156, -546, -958, -836, -532, -70]
5555g0M30j56q2m12n77k16K99M07M65Q29j5k76l03q43J41k28M78L65P35N9l61
5576F69l31p04q57M22m5N98O95M93m6q51o88q31l2N24O35J076L20K96q00o50r17
5597a024k1L18P70P17O02N87q27o16j080o43J15M61J212O91K52n67q79p94p06
5616a432j92L26Q56Q07N10L90o10q52r17j37K3J052R17P70L27n11n13j649l37
5635a172J62Q51L97J099J24n53n03j189l83o58N60R68R77M89k08q22p06p43k01
5654a511M85M80J105R15l12m68l09j008o4k16P02Q48N48Lk34n66q71k78o8N2P44
5675b3L79M71k89n95p01n06J94K72L87J008L03k13n12k22k79m6J11O10O62R4k16
5696H89m04m80k62k79J10O24J06O22l26o24k88p02j02L12L50Q12J68j92m28l42
$$ y = [-70, 360, 204, 122, -290, -867, -1083, -784, -377, 88, 917, 902, 626, 323, -520, -379, -607, -129, 236, 971, 1030, 669, 338, -366, -1223, -801, -846, -248, 447, 940, 894, 43, -645, -1476, -1508, -984, -349, 727, 1047, 1343, 543, -107, -1024, -1045, -727, 43, 760, 1362, 1949, 1122, 506, -574, -1217, -1102, -641, 571, 1262, 1514, 947, 68, -726, -1432, -1624, -1298, -442, 365, 875, 1265, 655, -197, -1114, -1251, -1228, -176, 741, 1511, 1838, 1327, 814, -835, -1172, -1010, -159, 238, 1337, 1461, 908, 405, -784, -1167, -1825, -1265, -297, 680, 1169, 961, 139, -567, -1310, -1511, -1026, -546, 559, 1474, 1162, 694, 385, -623, -687, -903, -201, 647, 1195, 1198, 964, 398, -473, -751, -819, -767, -23, 356, 827, 538, -57, -758, -1264, -1070, -798, -411, 597, 900, 687, 175, -47, -326, -372, -261, 349, 1011, 1105, 889, 485, 5, -257, -536, -426, 198, 304, 926, 600, -24, -312, -1014, -1116, -804, -454, 358, 526, 334, -94, -436]
5716d36k21k73N05N70O34K90k33l65m31j32k70J44P24L82K71k38l21p69p45j6
5736i30l9N11P62K93J24o82o00l51l63pQ31J109J51P7Q5o61o53l56P5L71O97P99
5758A243L53j29q20p88o41k99O36N26O17N40l07j045k13p62n95J47O23J346P43
5777A175j23l45m31j176k65mP06N79J127L31k64k58j388o73O0RJ212P55J42M5
5797A214q48p97n71m77Q0R09O22Q13K52q12p53o49n26J11Q53R79M80N93k35o47
5817E91p30q48P8N20M68Q16N12k95o11q56m50n66O35R5R17N05K97r02n48o10k15
5838a197J23L44J317K03l47K28m77m21l70q0R17P7N65qj45o2q66j40k58L82L77
5859A62J84L37l72o63j51l00j79L79L96N60j73K68o11n76J76M8M32O33M34j3r5
$$ y = [-436, -657, -930, -425, 145, 779, 1069, 836, 471, 40, -92, -362, -218, 506, 888, 1159, 921, 600, -169, -914, -930, -969, -458, 304, 597, 721, 39, -561, -912, -1275, -1282, -451, 658, 809, 886, 971, 310, -343, -699, -624, -253, 444, 1243, 1596, 1467, 647, -141, -782, -1081, -445, 81, 698, 1238, 931, -114, -327, -1089, -1684, -1537, -914, 432, 1175, 1052, 707, 276, -900, -1165, -1169, -463, 116, 1243, 1574, 1310, 1052, -336, -1009, -949, -940, 272, 1027, 1169, 1214, 366, -431, -1002, -1479, -1399, -490, 132, 945, 1197, 385, -368, -1017, -1543, -1432, -579, 400, 880, 1473, 1238, 591, -139, -987, -909, -389, 79, 895, 1407, 1112, 501, -355, -805, -1371, -736, -641, 276, 781, 1078, 176, -372, -982, -1197, -1074, -730, 587, 790, 443, 671, 194, -227, -597, -677, 240, 317, 882, 874, 729, 667, -199, -339, -597, -215, 162, 346, 683, 311, -352, -503, -803, -982, -603, -207, 353, 180, 448, -163, -739, -563, -515, -83, 550, 984, 971, 876]
5880H76o12n47m0L8K86L90O65l49j23m43o04p36J43L37N36N64J47P9j095k48n99
5901a335N93l30R20P24K77J3k25m22r42K88K93N90M76J89j74j80r13q06l43J67
5921a140M97Q20L35k7J99p92q74o12M05N11L51J025M91l22o87o34m74O8R5R35
5941A70P40N29K1p54o08p22o26K99O10R30L63j17o0q52n72r08QL65J044P51K25
5962H36R9r85k94p29j99L26P78J044N79j79m39q13l93p89O19L19J028L63J37l77
5982I31j067o77l96NN63N12O35L15m32l48m08o09k28M64N85Q24P65m31n97k98
6002A08m27Jo3M47P55j2L80m17n69n97l76O3N24K20O51p0m50m86m95J07J21M10
6024a75K10Q5N66l21m53l21j27J93L12P35J04m75K79j63o08m57N10K8M68R5R3
$$ y = [876, 264, -283, -323, -285, 1, 391, 1056, 707, 584, 141, -463, -1199, -1056, -719, -183, 381, 528, 607, -488, -736, -1335, -742, -1072, -152, 572, 849, 862, 637, 215, -727, -439, -146, 444, 920, 1109, 935, 755, -158, -964, -1307, -1140, -643, 177, 512, 485, 684, -108, -982, -1594, -1189, -678, -327, 698, 1189, 867, 180, -454, -928, -860, -765, 170, 910, 1439, 1460, 706, 98, -624, -1250, -951, -341, 589, 952, 835, 775, -77, -649, -1557, -1549, -1184, -140, 611, 836, 935, -50, -344, -1073, -1272, -946, -168, 876, 1455, 1276, 837, 24, -369, -1158, -539, -220, 808, 1171, 1308, 931, -136, -813, -1209, -1204, -641, -129, 506, 821, 389, 41, -367, -976, -1204, -740, -155, 669, 1434, 1003, 406, 108, -319, -318, -381, 66, 821, 809, 1189, 772, 203, -394, -770, -707, -183, 37, 688, 618, 168, -318, -813, -706, -585, -175, 35, 120, 686, 365, -88, -409, -536, -343, -31, 704, 808, 333, 612, 449, -159, -616, -106, -78, 390, 485, 578]
6045E78m46n51p4o42K02P44O3M25j12j50l91j43l83R8M70O96R49k65m74l47o92
6066d45l54J93N85N36N74l01J39q17m98j84n12M23N63Q34n7n59l93m50k78j78
6086a179N13N37M71M08L05n29m52p49k16M12J61J095L27o7l14o1j290m02o7K81
6106h16R32Q04j53k71k85r76o58j95M03J039M96Q80k03o93l20l57l88j04O44R43
6126G22M09K73m22m82p49n95l88P86O64O94O1o6p12m58o32l06L74L30O63L75M
6147E45m23l68o61m9p5P06Q87M57j4k64k07m79p84M15L84L69N48k68L5j36j053
6168d35k22P1K48K02J91L31l50k15p8q39K45L65K66O49Q5P5l72k21r9j31j58M88
6190I6N94R9l24L7o38k17O5ON23j48O3m0j33m76l44O8L92n0L46L69J83k95n99
$$ y = [578, 132, -419, -493, -1135, -933, -189, -126, 299, 187, 37, -354, -497, -880, -782, -312, 384, 1333, 1068, 594, 247, -445, -799, -606, -21, 515, 1089, 788, 927, 110, -388, -572, -1084, -661, -98, 736, 679, 120, -273, -723, -1001, -1179, -666, -129, 342, 750, 1055, 526, 74, -675, -891, -479, -318, 777, 1104, 1037, 723, 662, -628, -1030, -1097, -816, 116, 920, 767, 496, 211, -765, -1423, -1618, -1215, -176, 320, 1200, 997, 304, -16, -373, -761, -865, -221, 722, 1131, 1404, 982, 500, -249, -844, -1232, -446, 218, 912, 973, 907, 195, -263, -895, -1201, -827, -497, 166, 541, 545, 122, -246, -907, -956, -1031, -325, 562, 1019, 1005, 741, 534, 55, -729, -314, 70, 439, 987, 719, 754, 618, -435, -657, -586, -338, -136, 55, 386, 36, -179, -257, -1096, -851, -486, -220, 429, 514, 589, 217, -4, -103, -234, -392, 96, 690, 789, 465, 502, -136, -353, -288, -282, 241, 93, 156, 116, -17, -493, -837, -769, -377, -427, -81, 288, 471, 176, -423]
6213d23j9j09N75M6N80J57j32l07l49j31m53M75R7N76R9Pm44m38l32k60J1o5P58
6236h1N43J48n30l87m21k22K3P62M36M04L36K27q53k20q47M27J39L67O02L14P0
6257A237q30l53n09o19K61L79M72K03O67n18j244J2l14J53K69Q88P29J83m99l71
6277A96o51l10l7N33O99N51P7r7k74o46p02m7K29J30Q99L29l59n75k82n82j76
6298a095l9N15M15P05J71j35k51o96l59n5J75O77O90M03l10m06m48n58J98J33
6318b70K45N49K97o4l97l23m07o00K51J60N67l4M04q4n17n88l0K59K67N55J02
6339C42K66j11l1m59j16Pj04M91K43l30L28r9n22n8j5J29j14L28j1j35j15n61
6361f47j90J15M27mO79k22O8r2l64j95K02J97K47L49L88o19O8l52l50j35K52J27
$$ y = [-423, -442, -551, 24, 70, 650, 807, 675, 368, 19, -112, -565, -90, 7, 583, 682, 689, 245, -193, -525, -785, -774, -839, -81, 462, 610, 80, -307, -728, -950, -927, -165, 271, 675, 1011, 1238, 385, 165, -682, -255, -116, 251, 853, 1167, 1237, 407, 54, -455, -1074, -813, -434, 38, 241, 908, 390, -854, -842, -1156, -1003, -734, 154, 883, 1066, 567, 196, -455, -765, -802, -269, 430, 981, 1058, 961, 687, 41, -661, -708, -479, -349, 550, 879, 520, -55, -337, -919, -1095, -1134, -619, -204, 501, 672, 537, 286, -410, -769, -824, -649, 28, 718, 1121, 811, 405, -43, -601, -403, -270, -25, 524, 821, 757, 360, 37, -370, -970, -719, -559, 8, -26, 378, 294, -223, -811, -841, -582, -315, 240, 342, 608, 497, 466, 7, -109, -102, -206, 285, 528, 198, 526, 427, -95, -153, -168, -39, -153, 175, 164, 29, -86, -647, -837, -722, -295, -299, 380, 158, 226, 134, -230, -425, -223, -26, 221, 570, 958, 339, 407, 55, -295, -430, -178, -51]
6383e1K74J37K79l73r45J18k68K97K81M40K51j36k12l74o50K50K93M29O08J14
6403G62k23j78l36m27K01K3K96L37N97n4n56n71n80l1l3K22M73L33J43k0l37r90
6425i49j14J8L89Q05N51K88M6q59m49l13j82K11P72N53M04k9n23l90j077J25m8
6446g71M30P27J67J50m62k66o00o67K22RR62M31L21J5j70n61o73J51p7P50N30
6467F18N77j91m17l34n89J73k78L16K62M44K8k58l65o12k29N9o3O06M27K34J08
6488E16q06k04J7MM7N25K13N81j85p8n52l52R2J03L33k8N10l18k00k44k33k22
6510d81K36P2P0M05m15j4R2l43l5J68J20J19K6N39m15j44j78J28Q6M45j41J43
6532D83J20l70m65J16j22j42K77L38L59j50l34j98l43m97K18M02L16L08N1Mm61
$$ y = [-51, 223, 360, 639, 266, -679, -561, -829, -532, -251, 189, 440, 304, 92, -282, -932, -682, -389, 40, 648, 762, 539, 361, 25, -402, -201, -178, 118, 455, 1052, 998, 442, -129, -709, -740, -773, -551, -78, 255, 398, 378, 41, -949, -1063, -1045, -656, 149, 700, 988, 1034, 175, -274, -587, -769, -558, 214, 767, 1171, 1142, 619, 229, -848, -723, -771, -341, 386, 553, 703, 241, -25, -625, -1292, -1070, -1061, -99, 332, 653, 668, 498, -63, -736, -585, -662, 88, 618, 1195, 1004, 587, 253, -336, -163, -441, -125, 137, 581, 609, 351, -14, -626, -855, -796, -859, -253, 174, 408, 516, -290, -494, -477, -473, -426, 99, 312, 893, 708, 630, 78, -274, -182, -79, 254, 226, 736, 418, 218, -26, -259, -481, -245, -173, -103, 302, -113, -127, -35, -378, -413, -245, -125, -6, 20, 559, 144, 0, -178, -50, 36, 481, 340, 483, 603, 233, -232, -116, -238, -380, -103, 235, 594, 444, 110, -88, -431, -928, -710, -308, 8, 316, 367, 371, -90]
6553i0n20k69N13Q5O27M09J90k95n57k58o39M30K44J07Q36j9m80m09j96m33k51
6574i75L57P14l6O93m77j54k55q12J6J48O75M92M80k7n86P6p21J1J33K72J73M32
6596F29M49j98n24p54m06J65Q4M18N05Q2P2l49n15l69l90O4P28L04N91K21k94
6617E13l13n94L7p6N6Q01J34K78J1J0j068m92J52J29J67K84L58j5k96l09n12j83
6639i28J03N32K35N79k39j68Q7l78l68P4J38N55K82L56k62l5l68l65k5QL58O8
6661B39M05l07k34k75l74o9j94L25K99K63J58l68o7j53qK7K85N3L01k5n0j24J48
6684B55j02Q7k11M32l96N21j79n27r5k92K86K27K48j72R5l26m1k30K77j51O8K69
6706D3J72l02J63k32k41k0K67K17L14K40J20l29j94l12o2p3K16K63K77j73k21
$$ y = [-90, -610, -879, -366, -281, 346, 755, 945, 650, 93, -165, -804, -374, -130, -23, 813, 794, 314, -95, -291, -724, -975, -618, 96, 60, 753, 276, 122, -133, -945, -929, -781, -106, 386, 866, 839, 253, 329, -392, -381, -248, 24, 197, 629, 1078, 880, 356, -398, -804, -639, -555, -137, 368, 450, 522, 173, -342, -711, -1101, -1037, -309, -5, 586, 807, 513, 200, -394, -357, -433, -377, 424, 558, 836, 847, 857, -211, -703, -551, -422, -255, 29, 387, 372, 76, -233, -745, -928, -825, -293, -58, 521, 282, 114, 201, -177, -545, -471, -333, 222, 504, 860, 598, 563, 195, -170, -195, -187, 171, 239, 644, 337, 103, -172, -546, -615, -809, -484, -185, 78, 236, -132, -199, -352, -360, -333, -48, 5, 306, 281, 231, 107, 255, 153, 240, 29, 461, 65, 586, 407, -120, -215, -507, -221, 6, 254, 82, 177, -149, -190, -420, -143, -294, -226, 43, 215, -87, 76, -156, -397, -417, -150, 67, 381, 621, 741, 412, 218, -94, -156, -229, -13, 250, 527, 354, 133]
6727A33k21k98n92L56L58L03J58J11l20l05k18N2k48M15M88J83L50j29l74k35
6747c3m36J29K23N14Q3K36l9k32o07l94kl19M02O82K50k02J6q7n27n92L58K67
6769c10M09M36L59m16J74m11o86j86M22M18L07K99j99j28k13o28l69J54Q5O60
6789A77L1L7j84j3o8q00k01M03J16O63M87K21n20n93j93J60O8M26J65K36K35k96
6811E57n20m86J44k45N98r0O46l19j57l41m33L49k15L15q5K93K41j79k06R9m23
6832d57K37K25P1Q3O9K0j0k11j72k21O64J80J14m97K29N9n58m24K12K57J51j20
6854i9J07j35Kk55k69K09J49K01k3L60J33n2m80K9J79j25L20J60K9j35l73Q8m26
6877d06J53m5N36r9L30m26Q6n16k20j52Q9L26O19j09J39j36q0l94k73K83M61L66
$$ y = [133, -88, -386, -978, -622, -264, 39, 197, 308, -12, -317, -535, -483, -731, -316, 172, 355, 705, 576, 202, -33, -469, -340, -117, 397, 480, 716, 677, 445, -162, -556, -558, -877, -475, 207, 457, 255, 271, 184, -343, -935, -577, -310, 99, 535, 894, 478, 652, 241, -445, -631, -209, 209, 516, 815, 616, 488, 275, -353, -722, -568, -483, 177, 208, 245, 61, 48, -20, -820, -1021, -618, -502, 161, 648, 869, 349, -244, -437, -277, -209, 217, 382, 618, 853, 557, 37, -449, -305, -550, 48, -42, 604, 285, 128, -213, -646, -297, -512, -197, -282, 11, 252, 73, -133, -34, -457, -220, 5, 76, 159, 228, 248, 238, 27, -145, -366, 298, 478, 592, 95, 324, 383, -175, -599, -387, -130, 21, -99, 8, -127, -125, -380, -649, -440, -291, -90, -113, 247, 380, 328, -152, -123, 56, -69, 251, 411, 440, 305, -68, 20, -406, -253, -298, 238, 139, 469, 43, 129, -387, -607, -759, -670, -344, 275, 166, 305, 169, 89, -305, -578, -295, 166, 532]
6899E32qP9j27j91l92j93p7K94O26j36J25k36l83l86Q4l56J85O59m1J43K33m85
6921e1j93m15L67j02K60M25L79k9k29p3o79j00K0O35r3N51R4k72o87j07k44k27
6943g70M90K0L06L25R7m92n94P2J20n7M25L12N8N97m70k37l31k12o2L60K51L02
6965E10J12J39p38N0j54m60M39j03K45K09K5l61K6n36O7J05M19o8O66l15p6m82
6987b81p4m0J16M67j45P5L30n2j76k25j79mK04K84J36m26K42k33j80j57K51j42
7009b09L70m20L16l21J25k00j38N77m49O82j1l30O6PL8m42L61J78j41N04l32K35
7031D66l84m88j76M41M6J18J04o7J32n78L13m65J76K82O1M33j71Jp1l97k79L95
7053a08R2K12L66j54M05l48o31Q2k12L92O2J49K28k1l44k64o16J07J25K4O06r
$$ y = [532, 524, 603, 476, 285, -107, -300, -377, -83, 543, 407, 532, 296, -87, -473, -389, -745, -560, 99, 58, 201, 434, -51, -244, -659, -292, -394, -134, 291, 670, 641, 412, 339, -340, -440, -420, 215, 122, 673, 767, 495, -192, -299, -543, -770, -280, -260, 46, 371, 468, -24, -618, -546, -426, -483, -58, 254, 312, 909, 439, 202, -129, -341, -403, -43, 208, 510, 622, 761, 23, 73, -81, -541, -102, -205, 40, 249, 274, -87, -61, -597, -530, -425, -6, -74, 592, 277, 201, -281, -355, -395, -279, 188, 43, 118, 448, 396, 220, -5, -184, -188, 16, 300, 436, 10, 252, 19, -161, -318, -67, -209, 161, -259, 57, -264, -139, -339, -477, 100, -349, 333, 322, -8, 58, 65, 103, -339, 22, 200, 59, 563, 231, 466, 82, -406, -582, -141, -95, 23, 127, 60, 192, -386, -73, -538, -362, -80, -19, 414, 243, 244, 173, -224, -503, -108, -16, 196, 562, 408, 813, 465, -166, -84, -296, 96, 158, 307, 535, 514, 170, -94, -710, -603, -478, -454, 152, 143]
7075A43K49q8k50l29N5l38M19M63J61K51k92o8M2o82J27j89J85M12J78%k96l76
7097b23j82j12l6J86K19N20M0k33l81j43l07MM38M0K70M76P7p18l8l7l0j86K67
7120h9M46J21K34k30l05k15n02l4L59M66K05l62j13j73l66J62j9j51M93Q8K42
7141B57K4j84o5Ok82R0J41M08L5Kl2l56J06k56r7L14j94K39M2M2n09r3J20k1l58
7166f21M83L99k50K37m17l1j76K50K20o2M0K64m44K19k79Nj7M22r9K86j21q5m26
7189b03J80L4J45l55K16j5j18k75L35k79j38K84L57r3J28R9j4k50j65j16n8L66
7211F5K78J96j38k33O5k68n79M60L4K23k3K11k90j64R6m32k22K40O94J1K05k85
7233A44j69m2m11J39L85L30j26K83p4l3n55j40m2J16p8O11M3n4J2k92m98K62n67
$$ y = [143, 392, 304, 54, -275, -220, -558, -139, 324, 485, 736, 444, 376, 418, -264, -137, -326, -141, 271, 449, 449, 153, -223, -405, -517, -553, -367, -148, 372, 412, 179, -202, -345, -652, -648, -210, -170, 100, 576, 653, -65, -103, -140, -170, -356, -89, 357, 478, 712, 482, 177, -38, -540, -574, -215, 251, 456, 94, -19, -192, -558, -396, -415, -566, -73, 15, 257, 281, 97, 32, 38, -244, -154, -13, 395, 430, 432, 400, 44, 150, -106, -203, 111, -83, 156, 198, 240, -269, -362, -242, -263, -621, -138, 261, 11, 248, -169, -200, -376, -126, 94, 32, 72, 336, -108, 111, -168, -163, -180, 242, 143, 429, 308, 223, -203, -23, 11, 156, -199, 17, 2, -116, -391, -56, -335, -473, -189, 168, 75, 203, 302, 288, 38, -127, -243, -301, 65, 343, 539, 401, 168, 233, -35, -614, -154, -120, 103, 80, 291, 1, -163, -67, -499, -721, -481, 213, 224, 429, 144, -25, -67, -478, -339, 46, 376, 250, 533, 459, 426, -129, -269, -311, -195, -273, 338, 381, 327, 339, 47, -451, -189, -756]
7256g56O25J32M37j52l56M8p3n35K88m2L38N49j64K65l05R4k63k59k18N31j84
7277@L74m8k67J24l76n1k68m3L10k6M13Pl67K15k33j13k34N24nL94j99K90k91
7300A30l78MQ0K86j08J83LL41l98k24k21j01Q8M07J2J84l29K72m04k09j87N4M08
7323a07nn1K18J15J96l13L2j11o4J53L84l92J14j92J18k56L61l49N29j64k72j24
7345a80K10j43j46p2L43P9j34R1L49o12J84l04L54J6J07N8L2J16o35M56k81K87
7367A75o1K75l58K85l89l18K29l45K33K45m27N67K59m22k12K5q5K31P0L50o6J63
7389D24m87J48k47J2n7l60Q61OK19j72k60J8l08l25O04j97L14J10J32n67J11m56
7411d77m6j7N8Q40J31j10k00k84j1K3k77K36J85L65L8p5m6k71l47J74l05L30L35
$$ y = [-756, -131, 1, 438, 286, -70, -22, -95, -630, -342, -384, -46, 503, 339, 604, 299, 393, 130, -129, -347, 184, 0, 374, 326, 59, 183, -193, -244, -512, -555, -245, -271, 142, 149, -218, -3, -236, -349, -583, -59, -64, 330, 131, 421, 130, -248, -244, -164, 122, 14, 197, 200, 541, 143, -81, -302, -403, -315, 92, 104, 288, -41, 231, -173, -382, -569, -515, -107, -112, -163, 55, 170, 366, 53, 85, -26, -90, 63, 447, 55, 169, -23, 95, -161, 200, -149, 380, 216, -56, -180, 30, -113, -259, -331, 12, 91, -43, 48, 397, -215, -31, -335, 19, 35, 142, 200, 232, 348, -287, 169, -112, 175, 114, 389, 31, 316, -73, -391, -162, -507, -274, -29, -456, 111, 370, -52, -264, -239, -324, -93, -23, 327, 261, 424, -63, 85, -162, -150, -207, -567, 294, 300, 519, 347, 87, 105, -203, -528, 76, -121, 193, 303, 435, -132, -21, -477, -523, -540, -482, 358, 489, 379, 179, -105, -116, -93, -370, -134, 51, 416, 454, 379, 333, 62, -285, -111, -416, -86, 249]
7434B49J65J31l00m24j43L1m18M01N80j54Q3K65n19l5n54L50J98j29J47N91p70
7455b55M04j26J09n35J42J84J23M38l8p1l03O7n56J40m3M63j88L02j07l08k7J43
7477d2j96R9K5J65j35L06k00J89k0k08L31m91L68J2K5j61m4j39l7J09k51K18j20
7500a97K37k79K74j40j67J36J87k30l8N8Q6K42Qn92J39M61l6Pj5J00m7j72p9P0
7524A3R4r0K99j30J33n75L5k0p6K57J0K25k74J48k02J82m83L40K42JR4k7j26Q1
7548A51j96k2k36K50M76J1Q6l24j36k33j42p0L27P7K17n0L7K97q17k36k83L98
7570d18J58L61K27l77J49j18m35O96k35J69P1k24N47j27j82m09J18k14J4J76L2
7591b1M02l02J17q5k68k8k96M51J85O4j19N6J91o07p3L79j41M73j67J81O2o52
$$ y = [249, 414, 545, 245, -179, -322, -291, -709, -308, 272, 118, 201, 466, -53, -88, -642, -292, -94, -223, -76, 515, -255, 149, 23, 132, -403, -261, -77, 46, 484, 446, 375, 72, 139, -417, -277, -320, 143, -45, 257, 150, -158, -185, -42, -238, -139, -114, 51, -84, 222, 22, 211, 191, -17, 314, -177, 191, 203, 228, 67, 23, -116, -153, -44, -295, -77, -197, 40, -239, 35, -105, -272, -136, 51, -179, -217, -159, -73, 169, 177, -415, -276, 185, 149, 156, 141, 241, 194, 22, -57, 13, 107, 17, 316, 186, 319, -256, -221, -241, -317, -60, -50, 175, -99, 49, -153, 29, -454, -114, 128, 129, 223, 196, 70, 151, -45, -67, -303, -53, 423, 434, 520, 196, 60, -173, -315, -385, -58, 19, 236, 186, 223, 520, -297, -533, -816, -418, -260, 101, 328, -49, 100, -18, -453, 243, 8, 177, 248, 24, 571, 444, 262, -147, -29, -243, -229, -53, -21, 381, 79, 196, 111, -157, -185, -481, -30, 155, 219, 100, 156, 347, -260, -333, 46, -95, 378, 211, 392, 454, -198]
7613a98K31kj87J83M6J26J14m17M7q0j38R2k66L73L1J84m4P3l21k04K50q4L29
7636A38p7J34l0J04k92o6J08l64J91M17L33l30k18Q8k01m9l19K42K3L25j70J48
7658A35m32N0P3M9j24K24J73lOR2k33Qk06L32K81m21K55j18j42L46o11K86n7j23
7682a60J13K72n9j59J06m04N3m9J93R6j30L44l19k87K62k17L27j94O00q6L0M9
7704C81l58l25R0J04J27O9K34j91m6j29Oj77J33RJ38K0P0j90n4J40l54N2P3L61
7728A83j46O78l58p7j51k58J29j43K54K77j21m8J5l75J16o61J58L10K04M63l29
7749A20j76J1l60k06K07J81O89m11Q4J97k30l53J05r0K30jK3M83l4l67K34m84
7771a48mN3J90M8J57r8l56Q8j04N6m54K19K31M07l21M64J06m66k75K71o96P64
$$ y = [-198, 33, 31, -156, 27, 73, 199, 313, -104, -57, -137, -275, -183, -449, -76, -45, 139, 95, 168, -153, -357, -107, -191, 138, 61, 195, 165, 269, -23, -89, 19, -345, -154, 263, 596, 266, 48, 136, -65, -114, -433, -191, -168, 157, -13, 135, -297, -247, -174, -125, -249, -25, 148, 145, 151, 243, 10, 18, -188, 144, 425, 4, 259, 141, -1, 345, -266, 20, -37, -160, -47, 225, 166, 7, 113, -291, -238, -287, -94, 2, -128, 216, -103, -390, -128, -345, -18, -212, 388, 302, 332, 381, 23, -302, -212, -108, 19, 88, 322, 131, 85, -44, -38, -215, -82, -73, 65, 85, 155, -35, -89, 51, -303, -251, -178, 183, 37, 715, 357, 280, 129, -129, 0, -143, 111, 388, 267, 219, 234, -141, -25, -686, -528, -218, -14, 449, 120, -56, -45, -405, -611, -404, -223, 466, 55, 139, 336, 106, -247, -142, -232, -2, -3, 20, 503, 469, 102, 336, -148, -152, -99, 91, 139, 296, 198, -158, -70, -174, -118, -572, -353, -122, 285, -36, 428, 534, 68, -207, 64, -632, 132]
7793A32M2r4k3K08l69r0j50J78L99l43J72M25l29k71Ln90M31J36j08J28K41j63
7815c5J89o3l37J91k56M33l6K02l26J82l99L3L25n3N3q9L76j58k63J99k42k30
7837c04L51m6j90K00P9k96L28k17k16R5mL7M82k11k69koP8J52J02J29l22N03j26
7861C27m17K17m62O8L28J48n9n0k43N0j42M6J32O7P1j63K09o6l35J13l5k17K74
7884a39N86k70J16j99J04m40rK56L7J50j35M79k33j30j80k12m8J10J12K07n5j6
7906I1k68J91l05j53K16J46K2K64J68J22k30n08l9K87j02J38K80Jjl75l54K5p2
7929d56O42j61N8R9k70N4j39j19J74k53M18j07K52J23M3j13l91L9J6J15J63l5
7951A52K63k06J4m6o4j65j60O4NM7K9q6l1n9j2k20Q0M34J34j43oJ04l73J06N3
$$ y = [132, 174, 80, 57, 265, -104, -194, -344, -166, 233, -110, 62, 487, 158, -113, -110, -700, -269, -133, -241, -113, 128, -35, 154, 91, -246, -55, -311, 122, 86, 288, -38, 144, -255, -222, 103, 50, 103, 14, 390, 232, -31, 168, -74, -304, 47, 1, -189, 11, 90, -206, 122, -95, -311, -216, -220, -183, 299, 88, -181, -183, -189, -111, 41, 143, 272, -50, 453, 327, -90, 127, -335, -267, 61, 209, 150, 100, -143, -93, -235, -189, -57, 10, 81, -82, 127, 61, -274, -161, -196, -413, -139, 447, 177, 293, 94, 198, -242, -251, 5, 42, 192, 57, 536, 303, 173, -7, -219, -267, -157, -45, 162, 107, 91, -177, 14, -291, -444, -228, -82, -60, 204, 372, 494, 264, -244, -283, 4, -98, 40, 320, 321, 320, -55, -409, -384, -456, 186, 25, 83, 182, -88, -34, -173, -292, -118, -371, 47, -60, 192, 315, 358, 245, -146, -107, -91, 24, 187, 152, 415, 209, 223, 177, 113, -52, -212, -148, -143, -96, -67, -153, -184, -243, -255, -475, -395, 39, 173, 30, 24, 128, -245, -139, -86]
7976h6J72N7M36l98l0J7k90L52k40O6J2Q9j32L7k48K16l85n1L30L65l34J01k5
7999C1j0J10k45k59K38R6L86l29j15L72k56L43n24K49k8J22L7n4l40j69L67k60
8021b38j09N09k26M49m25j53j94K36K05l41M86L0k28j06J43J32l53nN10j77l21
8042a76K93K07k60k00j10K08O7l51L17L80j78q5k10m16N36k85J27M4k5K89r2o
8064G4j97j9j26K26L32P3l2K01m81k7qN8o8k10L84NrJ09l66k06lk24M34J8P5K26
8090B39j8j32j00j37j36q0K10Q1M94l58N0n3l44J42k33K55J32M76k41l03Pj40
8112a89l25M44J08k55K10n4M61l99L7k55m01N92k66Q7M00K62k62%m89L16k52K49
8134A9Pk92P39k30p6j11j39K9J04J8jm4j05J3j14o0J4J75j84J28L16j55J34m15
$$ y = [-86, 86, 143, 579, 181, 151, 168, -122, 230, -10, 56, 68, 157, 25, 62, -186, 30, -355, -406, -76, 289, -45, 56, 31, 21, 131, -114, -373, -135, -39, 347, 18, -97, 275, 19, 362, -162, 87, 59, 181, 218, 164, -176, -345, 22, -238, -347, 162, -64, 385, -40, -193, -387, -151, 54, -287, 199, 229, 1, -105, 38, 170, -183, -188, 322, 145, -176, 117, 324, 64, -136, -246, -38, 29, -322, -5, 375, 197, 112, -98, -514, 22, -263, -136, -92, -117, 172, 80, 74, -123, -142, -268, -42, 290, 363, 331, 532, 51, 24, 16, 74, 6, -204, 180, 185, 176, 285, -81, -287, -290, -514, -80, -62, 13, 239, 221, 89, -11, -148, -284, -364, -154, -73, 421, 63, 113, 60, -284, -142, -375, -120, 12, 488, 247, -56, -49, -189, -514, -70, 38, -217, -7, -61, 400, 1, 38, -217, -618, -26, -292, -205, 195, 457, 195, 195, -294, 22, -230, 19, 26, -266, 473, 243, 167, 56, -83, -54, 50, 68, 67, 23, -82, -69, -183, -243, -229, -54, -238, -110, 206, 51, 185, -230]
8158b30J18K6J44j16L1K38mm71K14p9J62K12j19K02k53o1k86J61j41K59P1l26
8180b48K51K43l92j93L71l23L90j40O8N26q05
$$ y = [-230, -112, -86, 58, -58, -27, 211, 207, -264, -50, -129, 33, 245, 126, 328, 75, 14, -272, -111, -252, 7, 78, -248, 3, 246, -146, -339, 32, -291, 99, -41, 27, 553, -252]
8191b52
$$ Imaginary data points
##PAGE= N=2
##DATA TABLE= (X++(I..I)), XYDATA
0@%%%%%%qQqJ6j6J7j7K4l2M0n2O0p2Q6r5J12j31J48j72J96k24K56k89L27l69M15
32B20m64N19n84O49p20Q01q88R86j090J205j338J481j640J820k020K249k511K817
50A492l178L608m137M798n661O839q549J1278j6326K8856j16876k64720L3627
63c28949J46383K07964J71635J36855J5669j33596k45838k00714o0439R4771J71326
74b4933J86705J35942L2146j14532k19283k22987j11429L5828J52797J95781J62873
85B08908N4818q1696j80755j88452j17988l101J18866K05364J99887Q9839n8268
96B47422j49873j62636j23109m6643P0022J82419K01390R8499m9548j43004j60073
107c5134j33899p6187K7146J42302J85956J14735k0276j22214j49782j27077p3007
$$ y = [0, 0, 0, 0, 0, 0, 0, -8, 0, -8, 8, -8, 9, -8, 16, -16, 24, -28, 32, -40, 46, -49, 63, -68, 80, -92, 104, -120, 136, -153, 174, -195, 220, -244, 275, -309, 340, -380, 421, -467, 519, -571, 634, -704, 777, -863, 957, -1063, 1186, -1325, 1492, -1686, 1922, -2215, 2583, -3078, 3761, -4788, 6490, -9836, 19020, -97856, -362576, -328949, -182566, 25398, 197033, 333888, 349557, 215961, -29877, -230591, -291030, -196259, -24933, 161772, 297714, 329860, 215328, -3955, -226942, -338371, -302543, -149746, 46035, 208908, 263726, 182030, 1275, -187177, -305165, -308266, -189400, 15964, 215851, 305690, 247422, 97549, -65087, -188196, -234839, -164817, 17602, 218992, 317491, 267943, 124939, -35134, -169033, -245220, -218074, -75772, 110184, 224919, 204643, 82429, -67353, -194430, -267437]
118b67437J7759J27208J82657J35271J8146q5423j30416j23954p3178J7477J16761
129f5129J62598J25059L2830o3047j29342j44681r5006K831R7833J36061J06262
140A66269L5283n0702j23667j52545j07838n112R6601J39191J13926M9785k7280
151A33911r9978j39008j06927q533R8663J48888J28169O4691j5194r4270j42151
162c1739j20646k9680P6259J36987J28755P0571j6136j04638j54950j36040n2455
173b33712N0964J24943J40316R3767M555r2787j49885j37128o0256M2657J25931
184i0635J58870J26579L8357o9691j44014j45799p8175K2071J09963J56323J39164
195B23013N5857n8443j47043j65934j11880j4853Q1989J44520J44303P6122l3270
$$ y = [-267437, -249678, -122470, 60187, 195458, 213604, 128181, -2235, -126189, -199367, -181890, -65129, 97469, 222528, 255358, 192311, 62969, -81712, -176718, -173887, -76054, 60007, 166269, 201552, 150850, 27183, -125362, -233200, -238312, -141711, -2520, 111406, 161191, 133911, 33933, -105075, -212002, -220535, -121872, 27016, 155185, 219876, 204682, 110412, -31739, -152385, -182065, -105806, 31181, 159936, 230507, 214371, 109733, -45217, -181257, -233712, -182748, -57805, 82511, 176278, 180833, 88046, -61839, -198967, -259223, -216566, -90635, 68235, 194814, 233171, 163480, 19466, -126333, -204508, -182437, -72474, 83849, 223013, 278870, 220427, 73384, -92550, -204430, -219283, -137294, 7226, 151529, 227651, 194381]
206A94381j31183j69564j32091l8873O7045J46168J63167J08862N810r8128j53934
217c8340j39136o0572M6429J35830J67067J27143L2748p3757j47846j56261r6022
228b02717O253J04550J52936J31012M9268n5076j37438j61738j17649k2478P9002
239a74075J43754J42789P8774j8383j06409j45125j19748l8169O1633J35907J50974
250A11922J01593J1026q1086j34551j25744o0523L0515J07208J35844J03198K3343
261B22745o8033j29121j33895q2546J926Q2362J23041J05979L9512m4429j07193
272A0348j22366q2982o919P3681J20470J14887N9672j8284q4936j09541q3025
283a28995j7299N7357J07842J08970O0934j3074p9921j09991r3435l6539L5848
$$ y = [194381, 63198, -106366, -238457, -277330, -210285, -64117, 99050, 207912, 213722, 115594, -38340, -177476, -238048, -191619, -55789, 111278, 238421, 271169, 197412, 49566, -106695, -202717, -196464, -91914, 61022, 192034, 241302, 186226, 48788, -112950, -230599, -253077, -174075, -30321, 112468, 191242, 172859, 66450, -78675, -198423, -236592, -174959, -39052, 111922, 213515, 224541, 143455, 8904, -116840, -177363, -146848, -39640, 96204, 199402, 222745, 154712, 25591, -108304, -190850, -188924, -106562, 16479, 122458, 161970, 117541, 10348, -112018, -195000, -201919, -128238, -7768, 107119, 166791, 148507, 63571, -45970, -128995, -146294, -88937, 18905, 127875, 188809, 175735, 95814, -14177, -107612, -144151, -108303]
294a08303Q9693R8182N9308q184p1931j05323r3217m0820L1077Q8175J03003P1543
306A13203R393n5275r2613q6059l8230K9527Q7300J06183P9704J7511n1041r3900
318B5703r4537n2067J3955P4121R8895P7328J7641n1732r9767j05627o6595K187
330a60495O8057J02191Q7962L2971l6015r0879j04254o9715j466O9683J10892
341H932J05390N4658j8577q3347j08252q2403j8178N4891J05451J09024O3006
352A90595j1959q2973j19085j03418m4594L3121R4522J12179P6991O158o9187
363H2350j15561j11991n8241K1428R3116J22590J00158L5304m3920j02037j13780
374i0584p1135M063P9432J20447J10952N3103k7750r6978j22960r4895k5815N2628
$$ y = [-108303, -18610, 79572, 138880, 130696, 58765, -46558, -139775, -180595, -149518, -61343, 41660, 113203, 122596, 67321, -25292, -111351, -149581, -120054, -32754, 73429, 153133, 170644, 119603, 25703, -68834, -120901, -106946, -32825, 66070, 143398, 161039, 109307, 9540, -96087, -162682, -160495, -92438, 9753, 97715, 130686, 94671, 3792, -100462, -170177, -171643, -101960, 8932, 114322, 168980, 150403, 67056, -41196, -123599, -141777, -86886, 18565, 127589, 190595, 178636, 95663, -23422, -126840, -171434, -138313, -43791, 68388, 145379, 151537, 82350, -33211, -145202, -203443, -182015, -88899, 33691, 133849, 169153, 125233, 23196, -90584, -161719, -157656, -78224, 42223, 153175, 206278, 178528, 81550, -41410, -136305, -162120, -109492]
386a09492J06003J10407O4099j1168q4862j22389j07077m6637L4359R7451J16823
397D7517Q5682J7203n7804j06055j05351n6084J9277Q7522J18230R8746L7703
408A86586l7683r5006j08694p3679n937O1949J02991R5707M5782k5935q7124j10783
420e1826q6770k7115M2251Q9847R6258N8556n305o6140r6640q3759l2401L2668
432a30376Q4985R9860P2061J3798m7019q4270q1400m1530J8241O9643Q9552O9431
444A32976J8048m1466q2251q6946n3793R59N2291P8394O6823K3192l2353p4273
456A601q1677n3405k722N0218P9409P4190L5994j8419o0866p3073n0368l726M6024
469e6820P7014P5299L9493j4272o1030p8304n9843j5405L3850O7470O9492L8362
$$ y = [-109492, -3489, 106918, 171017, 159849, 74987, -47402, -154479, -201116, -166757, -69306, 47517, 133199, 150402, 92598, -13457, -118808, -174892, -155615, -68093, 50137, 148883, 186586, 148903, 53897, -54797, -128476, -134413, -72464, 30527, 126234, 172016, 146081, 58957, -51826, -138596, -165711, -123460, -33613, 62645, 121201, 115896, 49756, -46884, -130643, -163044, -130376, -45391, 54469, 126530, 140328, 93309, 9039, -72361, -113891, -95650, -26007, 63545, 132976, 151024, 109558, 27307, -59639, -113432, -112473, -60182, 18212, 85035, 108227, 75874, 1601, -80076, -133481, -136203, -85985, -6576, 67614, 103608, 85189, 24323, -48750, -99118, -102844, -56820, 20194, 95493, 134986, 120714, 59684, -18620, -78463, -93868, -60018, 7452, 76944, 115306]
481A15306j3159o1728q3056o7650k2394K9580O8294P5943M9273j46n0968p7270
493c7975o7290k5385L0449P3335Q5841O1222J1486m2443p7746p6729l9732J6697
505h8270O6274Q4702O4307J4893m1426q1448q9749n9041j043N6551Q6927P4064
517H6741K8302k9458p3989q8843o6214j1019N1979R3575R1695M9442j0451o1923
529E9837q7181p3766k6355L6746Q7086R6259O1720Q51n8125r1759q8710m8144
541a31541J3665O9821R3041P1383J6119m6111q8506r3251n8742L92N9034R3896
553h00Q7916M1149k2944p3989q9042o4147j0698M7464Q7832R1994N7218m655o3717
566H3581r1875p7525l0163K6966O9658Q3917O1094P499n2667r0061q4952m4443
$$ y = [115306, 102147, 40419, -42637, -110287, -132681, -103101, -34807, 41136, 90409, 90263, 39295, -37975, -105265, -130650, -100201, -26866, 58975, 120197, 131683, 89240, 11494, -65235, -104967, -88270, -21996, 62706, 127013, 141906, 100480, 19032, -70717, -129758, -130801, -74250, 12677, 86741, 115043, 85585, 11596, -77247, -143461, -154480, -102501, -8926, 82769, 132211, 121760, 59837, -27344, -101110, -127465, -90719, -3633, 92626, 154346, 155197, 97072, 5313, -83397, -131541, -117876, -48055, 44986, 116369, 132488, 86377, -2129, -95380, -154122, -153730, -94696, -800, 87116, 128265, 105321, 31332, -57710, -121857, -132555, -85091, 2741, 94735, 151953, 147298, 83581, -8294, -85819, -115982, -89016, -19358, 64559, 125653, 133152, 80485, -9576, -94528, -138971]
578a38971J0992N9203Q1287O8861K5404l1255p2823p9955m8649L815N4181Q0472
590A2562P3939L7924j4479n9357p6413n6398j0239L8502O9073O7867L7663j0047
602A10597n4082p5271o4402k4806K3328N9396O4727M0164k161m2486o5396o0264
614i0656k6193K0413N7808O8336M8295J0391l0887n7050n5073k6677J5128N0594
626a5571O4146M8919J1905l1349n8720n9692l5354M169M0112N7300M6122J2250
638H4237k8893n8069o1998l8016K205M0020N9837N3860K3249j8841n1566n8472
650e2447l6990K097M0808O3441O0491L0442j3804n1100o3515m6522r981L1174
662d5906N9213O0657L2482j2828n3645o9964n7762k1685K2785N7865O6694M3893
$$ y = [-138971, -127979, -68776, 12511, 81372, 106776, 75521, 2698, -77257, -125906, -122091, -67910, 12562, 86501, 124425, 109946, 50589, -25824, -82222, -92461, -53959, 15114, 82981, 120644, 110597, 56515, -18756, -83158, -107964, -84636, -25240, 39487, 79651, 77490, 35004, -30392, -90656, -116849, -96436, -38628, 29708, 78003, 88394, 57507, 457, -54616, -81293, -66165, -15571, 48575, 97494, 109399, 78050, 19330, -40362, -75716, -71547, -31435, 25865, 71987, 84237, 55344, -2725, -64723, -102739, -100534, -60514, -677, 53183, 76432, 57591, 6025, -52447, -89437, -87340, -46532, 16909, 77400, 107842, 94038, 42938, -20577, -67099, -77080, -45906, 13307, 73964, 106446, 93618, 39973, -29991, -87753, -109438, -86653, -28788, 37906, 81799]
674H1799n85m5045o6997n9603k7033J9044O0047P6482N8544J4198l3619o3953
686A3279o5336l9345O630N1778P4960O2592K2329k7570o5095p6340n6157j0955
698a09230L9051P0230O6580L2748j4623n5600p6317o4002k1222L2751P0815P5339
710D6520M8914M970l9192o8791o8562l2169K1663O4431P5274N6300J6256k9715
722I5899o6975p5956m8464J871M7811O7669N8302K4827k1038o0758p5817n6003
734a08632j1680L6094O4898O5878L9120m074m7088o6223n3999j7261K6057N9037
746a7873O8710N0136P206l8084o1754n6248k7517R537M3370O1423N0258J2071
758A01235l3895o0719n8532l4679j368L2400N4957N1986K1605k1765n0771n2577
$$ y = [81799, 81214, 36169, -30828, -90431, -117464, -98420, -38373, 38109, 96653, 110851, 77232, 13279, -52057, -91402, -84772, -32994, 41966, 104558, 126887, 99317, 34222, -42118, -98275, -109230, -70179, 51, 66631, 99379, 84756, 29156, -47161, -111163, -132385, -99634, -28819, 46520, 95434, 100404, 61212, -7579, -76141, -108310, -86647, -22216, 53058, 109358, 125614, 95899, 28924, -47032, -95496, -93625, -45814, 21855, 80157, 104984, 83946, 23188, -52629, -108632, -120312, -84218, -19320, 46558, 85678, 81604, 34516, -31707, -85706, -102967, -76910, -17873, 50837, 100973, 108179, 70095, 8341, -47907, -75424, -65887, -22517, 38906, 89164, 101235, 67340, 6621, -51911, -86590, -87958, -55558, -601, 51385, 72990, 51225, 454, -52123]
770e2123l3140k255K9610N4049N5384K9577r834m0750m9022l4905p671K5052M7441
783A1413M9261K6901p680l8250n1355m3112j5961J7326M1816M4089K5414n247
795E4615l3012m7603m3630j8321J7579M5196M9153L0955K230k5222m1174m0853
807e0087j9494J5979M5150N2646L4180M098k5312m4049m6839k7306O828L8125
819a6081M9608L5485N513k6258m8325n2313l2662J235L5668N2035M4325J7121
831F5351j7884m4810n1189l4527l59L5413N5641N3394K8386q808m2295n5962m2323
844e9972r903K6583N0965N3493L3324l932m2235o1689n3981k3086J5822M6214
856b8397N5243M1429P504l2287n8366n6690l0313J0340M5188O1285N2343K1533
$$ y = [-52123, -85263, -87518, -57908, -3859, 51525, 81102, 71268, 30518, -18504, -53409, -61080, -36028, 11413, 60674, 87575, 79895, 41645, -9710, -52822, -68783, -51457, -9641, 34448, 59862, 54615, 21603, -26000, -69630, -87951, -70372, -25176, 23977, 54932, 57162, 31940, -9234, -50087, -69581, -53602, -8452, 44194, 78374, 82472, 57160, 13111, -33728, -61034, -54206, -16081, 33527, 69012, 74525, 48267, -58, -52371, -85033, -83798, -48130, 3905, 48230, 65351, 47467, 2657, -48532, -83059, -83418, -48005, 7636, 61030, 89416, 80608, 38313, -17649, -59972, -69875, -43292, 7673, 61166, 94490, 90558, 48323, -13366, -67347, -90433, -74611, -28397, 26846, 68275, 75779, 43492, -14874, -71564, -101877, -91537, -46349, 14936, 67279, 88812]
868H8812j8515n0100n7826l8822o09L6976N9483N5490K8620j1343m6997o2191
$$ y = [88812, 70297, 20197, -37629, -76451, -77060, -40084, 19399, 74889, 103509, 92166, 45169, -17022]
$$ [...]
8191b71
##END NTUPLES=NMR FID
##END=
