##TITLE=1H_PR164_3E
 D2O, 8 sc, 
 11.4.2019
##JCAMPDX= 6.0         $$ Bruker NMR JCAMP-DX V2.0
##DATA TYPE= NMR FID
##DATA CLASS= NTUPLES
##ORIGIN= UXNMR, Bruker Analytische Messtechnik GmbH
##OWNER= root
$$ XWIN-NMR		Version 3.5
$$ Thu Apr 11 16:29:31 2019 Russian Standard Time (UT+4h)  she@DPX200
##.OBSERVE FREQUENCY= 200.1315
##.OBSERVE NUCLEUS= ^1H
##.DELAY= (6, 6)
##.ACQUISITION MODE= SIMULTANEOUS
##.ACQUISITION SCHEME= undefined
##.AVERAGES= 8
##.DIGITISER RES= 18
##SPECTROMETER/DATA SYSTEM= spect
##.PULSE SEQUENCE= zg30
##.SOLVENT NAME= D2O
##.SHIFT REFERENCE= (INTERNAL, D2O, 0, 15.7039)
##AUDIT TRAIL= $$ (NUMBER, WHEN, WHO, WHERE, WHAT)
$$ ##TITLE= Audit trail, XWIN-NMR		Version 3.5
$$ ##JCAMPDX= 5.01
$$ ##ORIGIN= Bruker BioSpin GmbH
$$ ##OWNER= she
$$ F:/spectra/data/she/nmr/H-F/1/audita.txt
$$ ##AUDIT TRAIL=  $$ (NUMBER, WHEN, WHO, WHERE, WHAT)
(   1,<2019-04-11 16:28:27.28 +0400>,<she>,<DPX200>,
      <created by zg, POWCHK disabled, PULCHK disabled
       configuration hash MD5:
       00 E9 B6 7A A2 85 ED C7 34 08 36 98 17 FE 4E 26
       data hash MD5: 16K
       EC 80 1D 67 15 EC CC 49 C7 B2 FB 48 00 B4 DD D5>)
$$ ##END=
$$ 
$$ hash MD5
$$ 34 44 71 F3 F7 98 F1 F5 6D 21 14 A9 33 3C 03 BF
##$RELAX= 
##$RELAX= 
##$RELAX= 
##$RELAX= 
##$RELAX= 
##$RELAX= 
$$ Bruker specific parameters
$$ --------------------------
##$DU= <F:/spectra>
##$EXPNO= 1
##$NAME= <H-F>
##$PROCNO= 1
##$TYPE= <nmr>
##$USER= <she>
##$AMP= (0..31)
100 100 100 100 100 100 100 100 100 100 100 100 100 100 100 100 100 100 
100 100 100 100 100 100 100 100 100 100 100 100 100 100 
##$AQSEQ= 0
##$AQ_mod= 1
##$AUNM= <au_zg>
##$AUTOPOS= <>
##$BF1= 200.13
##$BF2= 200.13
##$BF3= 200.13
##$BF4= 200.13
##$BF5= 200.13
##$BF6= 200.13
##$BF7= 200.13
##$BF8= 200.13
##$BYTORDA= 1
##$CFDGTYP= 0
##$CFRGTYP= 5
##$CHEMSTR= <none>
##$CNST= (0..31)
1 1 145 1 1 1 1 1 1 1 1 1 1 1 1 1 1 1 1 1 1 1 1 1 1 1 1 1 1 1 1 1 
##$CPDPRG= <>
##$CPDPRG1= <>
##$CPDPRG2= <>
##$CPDPRG3= <>
##$CPDPRG4= <mlev>
##$CPDPRG5= <mlev>
##$CPDPRG6= <mlev>
##$CPDPRG7= <mlev>
##$CPDPRG8= <mlev>
##$CPDPRGB= <>
##$CPDPRGT= <>
##$D= (0..31)
0 1.2 0 0 0 0 0 0 0 0 0 0.03 0 0 0 0 0 0 0 0 0 0 0 0 0 0 0 0 0 0 0 0 
##$DATE= 1554985706
##$DBL= (0..7)
120 120 120 120 120 120 120 120 
##$DBP= (0..7)
150 150 150 150 150 150 150 150 
##$DBP07= 0
##$DBPNAM0= <>
##$DBPNAM1= <>
##$DBPNAM2= <>
##$DBPNAM3= <>
##$DBPNAM4= <>
##$DBPNAM5= <>
##$DBPNAM6= <>
##$DBPNAM7= <>
##$DBPOAL= (0..7)
0.5 0.5 0.5 0.5 0.5 0.5 0.5 0.5 
##$DBPOFFS= (0..7)
0 0 0 0 0 0 0 0 
##$DE= 6
##$DECBNUC= <off>
##$DECIM= 24
##$DECNUC= <off>
##$DECSTAT= 4
##$DIGMOD= 1
##$DIGTYP= 9
##$DL= (0..7)
0 120 120 120 120 120 120 120 
##$DP= (0..7)
150 150 150 150 150 150 150 150 
##$DP07= 0
##$DPNAME0= <>
##$DPNAME1= <>
##$DPNAME2= <>
##$DPNAME3= <>
##$DPNAME4= <>
##$DPNAME5= <>
##$DPNAME6= <>
##$DPNAME7= <>
##$DPOAL= (0..7)
0.5 0.5 0.5 0.5 0.5 0.5 0.5 0.5 
##$DPOFFS= (0..7)
0 0 0 0 0 0 0 0 
##$DQDMODE= 0
##$DR= 18
##$DS= 0
##$DSLIST= <SSSSSSSSSSSSSSS>
##$DSPFIRM= 0
$$ [...]
##$SUBNAM2= <"">
##$SUBNAM3= <"">
##$SUBNAM4= <"">
##$SUBNAM5= <"">
##$SUBNAM6= <"">
##$SUBNAM7= <"">
##$SUBNAM8= <"">
##$SUBNAM9= <"">
##$SW= 24.9337058887773
##$SWIBOX= (0..15)
0 0 2 0 0 0 0 0 0 0 0 0 0 0 0 0 
##$SW_h= 4990.01996007984
##$TD= 16384
##$TD0= 1
##$TE= 0
##$TE2= 300
##$TE3= 300
##$TEG= 300
##$TL= (0..7)
0 120 120 120 120 120 120 120 
##$TP= (0..7)
150 150 150 150 150 150 150 150 
##$TP07= 0
##$TPNAME0= <>
##$TPNAME1= <>
##$TPNAME2= <>
##$TPNAME3= <>
##$TPNAME4= <>
##$TPNAME5= <>
##$TPNAME6= <>
##$TPNAME7= <>
##$TPOAL= (0..7)
0.5 0.5 0.5 0.5 0.5 0.5 0.5 0.5 
##$TPOFFS= (0..7)
0 0 0 0 0 0 0 0 
##$TUNHIN= 0
##$TUNHOUT= 0
##$TUNXOUT= 0
##$USERA1= <user>
##$USERA2= <user>
##$USERA3= <user>
##$USERA4= <user>
##$USERA5= <user>
##$V9= 5
##$VALIST= <valist>
##$VCLIST= <CCCCCCCCCCCCCCC>
##$VD= 0
##$VDLIST= <DDDDDDDDDDDDDDD>
##$VPLIST= <PPPPPPPPPPPPPPP>
##$VTLIST= <TTTTTTTTTTTTTTT>
##$WBST= 1024
##$WBSW= 4
##$XGAIN= (0..3)
0 0 0 0 
##$XL= 0
##$YL= 0
##$YMAX_a= 15728
##$YMIN_a= -17510
##$ZGOPTNS= <>
##$ZL1= 120
##$ZL2= 120
##$ZL3= 120
##$ZL4= 120
##$ABSF1= 10
##$ABSF2= 0
##$ABSG= 5
##$ABSL= 3
##$ALPHA= 0
##$AQORDER= 0
##$ASSFAC= 0
##$ASSFACI= 0
##$ASSFACX= 0
##$ASSWID= 0
##$AUNMP= <proc_1d>
##$AZFE= 0.1
##$AZFW= 0.1
##$BCFW= 1
##$BC_mod= 2
##$BYTORDP= 1
##$COROFFS= 0
##$CY= 11.3945322036743
##$DATMOD= 1
##$DC= 2
##$DFILT= <>
##$DTYPP= 0
##$F1P= 18.9103706918063
##$F2P= -1.10871071338519
##$FCOR= 0.5
##$FTSIZE= 0
##$FT_mod= 4
##$GAMMA= 1
##$GB= 0.15
##$INTBC= 1
##$INTSCL= 1
##$ISEN= 128
##$LB= 0.24
##$LEV0= 0
##$LPBIN= 0
##$MAXI= 10000
##$MC2= 0
##$MEAN= 0
##$ME_mod= 0
##$MI= 1.114404
##$NCOEF= 0
##$NC_proc= 0
##$NLEV= 6
##$NOISF1= 3.799351
##$NOISF2= 2.8
##$NSP= 1
##$NTH_PI= 0
##$NZP= 0
##$OFFSET= 15.70392
##$PC= 1
##$PHC0= -8938.181
##$PHC1= 18.40026
##$PH_mod= 1
##$PKNL= yes
##$PPARMOD= 0
##$PSCAL= 0
##$PSIGN= 0
##$REVERSE= no
##$SF= 200.130013532006
##$SI= 16384
##$SIGF1= 3
##$SIGF2= 2
##$SINO= 400
##$SIOLD= 16384
##$SREGLST= <1H.CDCl3>
##$SSB= 0
##$STSI= 0
##$STSR= 0
##$SW_p= 3612.71676300578
##$SYMM= 0
##$S_DEV= 0
##$TDeff= 0
##$TDoff= 0
##$TI= <>
##$TILT= no
##$TM1= 0
##$TM2= 0
##$TOPLEV= 0
##$USERP1= <user>
##$USERP2= <user>
##$USERP3= <user>
##$USERP4= <user>
##$USERP5= <user>
##$WDW= 1
##$XDIM= 8192
##$YMAX_p= 0
##$YMIN_p= 0
$$ End of Bruker specific parameters
$$ ---------------------------------
##NTUPLES= NMR FID
##VAR_NAME=  TIME,          FID/REAL,        FID/IMAG
##SYMBOL=    X,             R,               I
##VAR_TYPE=  INDEPENDENT,   DEPENDENT,       DEPENDENT
##VAR_FORM=  AFFN,          ASDF,            ASDF
##VAR_DIM=   8192,          8192,            8192
##UNITS=     SECONDS,       ARBITRARY UNITS, ARBITRARY UNITS
##FACTOR=    0.0002004,     1,               1
##FIRST=     0,             0,               0
##LAST=      1.6414764,     0,               0
##MIN=       0,             -17510,          0
##MAX=       1.6414764,     15728,           0
$$ Real data points
##PAGE= N=1
##DATA TABLE= (X++(R..R)), XYDATA
0@%%%%%%%%%%%%%%%%%%%%%%%%%%%KqJ4j6J6j6J6j6J6j6J8k4L0l2L2l4M0m6N0n6
47c0O4p0P7q8J01j18J37j61J97k51L39n08R55m233j3534K585J0192O274J164M390
67G482O311j377j2346j2571k186P202P537M299L572L615j414q694j0649m719K883
82a1055O801P327O313K363l975p974o660l110m11K973Q204J0137L722o185r477
97a007m868p10j221k58O350J1416O026n777j1076o033O5J72q04L942J0043P643
113A3903l091j0558p839j154J240Q40L668Q205O996j094p998p887l722k66K378
128f379N543P268M612j080n502o643n559k779K129P121P971L495k113m581m792
143a289n336m664N10P669R614M321k431m750m192m631m784n65O576R755N663j307
$$ y = [0, 0, 0, 0, 0, 0, 0, 0, 0, 0, 0, 0, 0, 0, 0, 0, 0, 0, 0, 0, 0, 0, 0, 0, 0, 0, 0, 0, 2, -6, 8, -8, 8, -8, 8, -8, 8, -8, 10, -14, 16, -16, 16, -18, 22, -24, 26, -30, 34, -36, 41, -47, 54, -64, 73, -88, 109, -142, 197, -311, 644, -3589, -17123, -14538, -4346, 1928, 3092, 7482, 13793, 12416, 70, -12501, -14687, -7485, 52, 4351, 7923, 11538, 10124, 1430, -9219, -13938, -11055, -4254, 3073, 9386, 11749, 7774, -200, -6860, -9970, -10381, -7408, 796, 10933, 14655, 8470, -1007, -5875, -6585, -7806, -8064, -1714, 9702, 15728, 9951, -1125, -7158, -7093, -6921, -7725, -3783, 6260, 13903, 10812, 254, -7585, -8739, -7499, -6659, -2991, 5214, 12210, 11116, 3118, -4769, -8491, -8757, -6379, -836, 6432, 11044, 9964, 4462, -2181, -7740, -10519, -8390, -1269, 6702, 10197, 8084, 3503, -1289, -6625, -11289, -10779, -3110, 6504, 10825, 8394, 3644, -548, -5179, -9963, -10528, -3952, 5803, 11466, 10159]
159A0159m993n041m766m376j023N042Q638O341M57m163n851n887m390m84M618
174e719P382O042K049k272n524o853n004j75M783O751N489K658q65m669p104n893
190h924r02M392O513N201K552m35l844o625o364k032L596O443N531K777k46l378
206D255n942n879k381K648N921N992L595L9l420n552n301k453J695N083N965M071
222H336L18l473n641n226k536J170M349N575M323R08l096n592n309k687J053M215
238c313N597M546J349k588n281n329k911P53M088N598M595J523k294m996n522
253d185l468J31L753N542M716J703j981m824n592l847l45L424N565N119K275j465
269F521m457n523m121p12L153N513N284K762q77m114n608m528j290K594N118N234
$$ y = [10159, 5166, 125, -4641, -9017, -10040, -4998, 3640, 9981, 10438, 6275, 424, -5463, -9853, -10337, -5719, 1663, 7705, 9754, 7482, 1958, -4895, -9899, -10074, -5291, 1460, 6949, 9607, 8742, 4073, -3031, -8924, -9826, -5434, 1079, 6280, 8832, 8397, 4553, -2072, -8436, -10468, -6872, -429, 5102, 7879, 7633, 4255, -1687, -7566, -9947, -7299, -1378, 4614, 8209, 8248, 4828, -724, -6025, -8478, -6783, -1700, 4265, 8336, 8654, 5181, -460, -5686, -8222, -7052, -2703, 2872, 7195, 8103, 5007, -585, -5894, -8581, -7528, -3313, 2284, 6830, 8179, 5591, 310, -5019, -7930, -7177, -3089, 2509, 7104, 8627, 6333, 1337, -4185, -7653, -7522, -3769, 1773, 6489, 8192, 6211, 1387, -4205, -8052, -8397, -4973, 592, 5711, 7986, 6521, 2064, -3459, -7580, -8292, -5139, 374, 5658, 8420, 7543, 3429, -2179, -6707, -7997, -5403, -285, 4949]
285D949L075l67l742n618m931j902K058M848N289L389J95l094n216m999k314J597
301f783M592N358L767P51k563m875n014k670R78M071N162L948J017k296m667m988
317d212k981L71L482M910M050J352j887m308m816l085P4L189M795M203J763j406
333E494l951m670l143j78K848M603M222J942j204l806m664l367n63K464M344M157
349D528K049r65l589m652l533q02K264M293M344K404n94l316m544l628r61K089
365d613M234M423K661k23l069m580l966j405J722L999M394K881O1k866m656m271
381e274j842J386L859M509L146N26k436m404m345k187J038L711M645L540R50k003
397D819m153m455k577M80L281M526L716J284j717m003m532k957o3K765M308L907
$$ y = [4949, 8024, 7657, 3915, -1703, -6634, -8536, -6478, -1630, 3659, 7048, 7243, 4149, -1067, -6066, -8380, -6783, -2191, 3167, 6934, 7685, 5122, 247, -4767, -7437, -6459, -2388, 2774, 6722, 7739, 5443, 776, -4212, -7193, -6822, -3340, 1570, 5620, 6972, 5085, 777, -4039, -7124, -7050, -3861, 934, 5137, 6900, 5494, 1543, -3127, -6270, -6448, -3600, 1003, 5225, 7167, 5963, 2157, -2507, -5874, -6437, -3973, 371, 4528, 6577, 5612, 2023, -2629, -6162, -6964, -4700, -407, 3937, 6341, 5747, 2431, -2113, -5741, -6702, -4613, -379, 4044, 6705, 6482, 3413, -1167, -5133, -6538, -4816, -817, 3577, 6458, 6519, 3653, -1003, -5274, -7116, -5730, -1871, 2638, 5784, 6310, 3874, -530, -4875, -7062, -6024, -2313, 2332, 5872, 6822, 4819, 666, -3789, -6366, -5886, -2605, 1921, 5637, 6921, 5204, 1201, -3331, -6288, -6351, -3586, 722, 4629]
413D629J687j255l681m417l097m24K454M163M073K116p48l263m264l208p23K023
429c935L887L999K314m26l005m203l407j084J587L533L875K392j62k684m048l450
445d817j298J394L359L855K599K15k270l858l480j375J255L242L785K644M72k026
461C696l776l688j684J018L065L618K625N68j770l669l878k049P65L061L737K761
477D400P73j475l363l842k293M70K970L942L079J034j342l220l791k513n6K503
493b724L930L415J308j293l317l844k630m17J935L613L770J953r37l342l918k595
509e093m55J598L215L876K637k34l134m136k822n01J418K805L536K849M08k667
525C300m316l352q93J317K614L208K695P82j957l961l675j429J120K789L307K579
$$ y = [4629, 6316, 5061, 1380, -3037, -6134, -6558, -4104, 59, 4132, 6248, 5500, 2237, -2027, -5235, -5958, -3935, -48, 3951, 6265, 5839, 2834, -1369, -4776, -5860, -4273, -740, 3135, 5527, 5365, 2681, -1367, -4817, -6115, -4721, -1362, 2493, 5092, 5307, 3037, -821, -4301, -5676, -4421, -1179, 2606, 5250, 5722, 3696, -80, -3768, -5452, -4434, -1369, 2249, 4874, 5442, 3672, 3, -3875, -5924, -5159, -2098, 1639, 4400, 5173, 3698, 335, -3507, -5800, -5330, -2360, 1582, 4661, 5695, 4353, 1133, -2658, -5171, -5227, -2724, 1206, 4621, 5929, 4636, 1319, -2525, -5155, -5572, -3637, -24, 3746, 5699, 4762, 1420, -2498, -5093, -5548, -3950, -735, 3141, 5778, 5544, 2410, -1726, -4548, -5049, -3631, -826, 2710, 5559, 5967, 3300, -1016, -4368, -5261, -3944, -1330, 1878, 4573, 5355, 3398, -563, -4238, -5667, -4547, -1758, 1549, 4128]
541D128Q20j379l204l556j985N71K786L615K618O32j341k750l202k287j94K281
557b447L721K963O11j588k717k794k114n87J711L579L407J090j486k844k705j802
573d002m51J382L188L505J635j061k947l100j934l29J322K777L186J860n75k786
589A670l491k433m28J489K757K944J833j20k198l473k880p72J573L020L024J864
605D379J27j774l188l107j296J160K983L283K035J02j711l011l140j728N77K661
621a648L418K409L57j626k992l017j732K70K199L331K914R33j401k918k969j732
637d204L6J764L114L051J320j077k843l108j988k23J503K778K947J519p40k625
653A224l091k110m49J249K678L030J692n63k231k744k097p75J017K674L121J736
$$ y = [4128, 4948, 3569, 365, -3191, -5176, -4605, -1819, 1796, 4414, 5046, 3705, 955, -2247, -4534, -4728, -2447, 1274, 4237, 4848, 3260, 543, -2251, -4365, -4952, -3241, 338, 3745, 4835, 3349, 505, -2200, -4002, -4453, -3071, 117, 3622, 5257, 4196, 1249, -1851, -3785, -4114, -2792, -15, 3171, 5031, 4456, 1670, -1821, -4254, -4682, -3193, -436, 2508, 4341, 4221, 2023, -1450, -4330, -5102, -3529, -509, 2515, 4379, 4506, 2732, -456, -3563, -4859, -3699, -716, 2567, 4602, 4704, 2993, -18, -3158, -4886, -4309, -1648, 1770, 4179, 4536, 2910, -82, -3099, -4831, -4561, -2362, 969, 3883, 4816, 3415, 497, -2472, -4204, -4168, -2404, 710, 3761, 5081, 4004, 1161, -1947, -3935, -4158, -2655, 123, 3070, 4589, 3849, 1224, -1867, -3977, -4426, -3177, -499, 2531, 4223, 3660, 1429, -1315, -3412, -4187, -3170, -496, 2625, 4361]
669D361m25k012k568k169j084P11K479L072J836l68j998k539k188j185M77K334
685a266L100J890j68j729k342k273j368M81K458L081J898Pj354k154k500j724
701c963K90K496L133J878K1j276k029k550k120p9K346L338K039L8j168j851k474
718a931k244l41K184L342K343M97r04j876k544k213m41J783L015K539J017n94
734C632k021k850k385m83J576K581K288J380K7j801l196k731m14J694K311J970
750A578J582O94j282l207l000o05J633K310J890J497Q47q16k860l196j204J260
766b879K353J978J371P25o88k511l020j461P67K055K209J730P36q74k284k432
782b225j296K61J575K333K249R34j015k362k265j085J06J098K011K416J296r73
$$ y = [4361, 3936, 1924, -644, -2813, -3897, -3186, -707, 2365, 4201, 3833, 1835, -704, -2892, -4077, -3600, -1266, 1834, 3724, 3556, 1827, -515, -2788, -4156, -3675, -1217, 1864, 3762, 3769, 2415, 261, -2239, -3963, -3673, -1177, 1956, 3834, 3855, 2579, 550, -2000, -4120, -4199, -1853, 1485, 3524, 3562, 2394, 543, -1931, -4175, -4516, -2332, 1010, 3353, 3850, 2946, 1070, -1474, -3687, -4128, -2345, 670, 3209, 4226, 3632, 1611, -1239, -3624, -4107, -2531, 50, 2338, 3718, 3745, 1944, -1252, -3983, -4397, -2703, -392, 1578, 3160, 3854, 2572, -635, -3635, -4240, -2607, -297, 1593, 3090, 3937, 3121, 261, -2935, -4139, -2879, -526, 1452, 2823, 3548, 2860, 349, -2671, -4132, -3365, -1310, 899, 2629, 3365, 2491, 207, -2225, -3521, -3260, -1685, 648, 2897, 3831, 2816, 454, -1811, -2896, -2790, -1692, 319, 2735, 4031, 3058]
798C058k643k435j010J79Q72J718K356J612o44k580k613j158K40J029J750K252
814A983J600k50k154k619j598o7J142J944K205J458j94j840k521j945o05R12K131
831d18K412J408k70j675k227j969j019N51K203K719J647j33j505k043j923j162
847c404K71J925K757J996J71j425k143j993j280j4J545K573K127M83j185k144
863B60k189j393p1J419K311K076Q75p07j957k250j516q1J322K130K072J072l88
880B985j735k271j689k97J122K019J945J058k55j540k220j826n05R51J911J928
896A581J163j09j396k106j737n42Q46J809J988J304M3j270j983j728o70O57J734
913d16K001J328N9j207j976j882q66N28J651K000J375J46j157j917j818r79L45
$$ y = [3058, 415, -2020, -3030, -2851, -1979, -261, 2095, 3707, 3063, 483, -2130, -3288, -3048, -2019, -269, 1983, 3583, 3333, 1179, -1440, -3038, -3105, -1963, -19, 2186, 3644, 3450, 1610, -911, -2856, -3461, -2549, -418, 1994, 3402, 3132, 1457, -770, -2739, -3758, -3207, -1004, 1715, 3362, 3229, 1724, -319, -2242, -3404, -3133, -1208, 1549, 3545, 3716, 2291, 148, -1845, -3125, -3139, -1594, 979, 3106, 3589, 2404, 260, -1929, -3322, -3393, -1974, 337, 2413, 3288, 2581, 624, -1626, -3142, -3223, -1901, 229, 2301, 3373, 2985, 1250, -1021, -2710, -3007, -1885, 134, 2079, 3137, 2882, 1342, -878, -2704, -3209, -2258, -347, 1581, 2744, 2635, 1239, -867, -2604, -3146, -2300, -491, 1497, 2801, 2844, 1574, -409, -2137, -2807, -2150, -416, 1585, 2913, 2972, 1765, -211, -2093, -2959, -2431, -780, 1220, 2595, 2741, 1584, -333, -2151, -3130, -2785]
930b785J617K170J616K45j065j779j771j081J39J493K229J787M32r91j869j870
946a483j214o4J219K101J949O89q82j925j993j266j63J060J966K003J035n08j733
963G91k094j441k09J042J849J929J238j14j531k191j689m11R15J697J810J215
979B806P0j247k114j908p06P30J692J831J206J76r57j815j885r04N28J644J924
996A071J336K71q54j612j711j034J95J411J951J443K59q82j582j614j070m3J135
1013a330J856J574M15q45j583j551r90n7R99J801J673O32o96j535j550r83r7R51
1031a316J705J675P13n90j503j665j169k11Q76J665J625P27m78j399j711j311
1047b367l50Q50J725J714Q64l11j246j652j403n02P76J760J800R79j63j102j659
$$ y = [-2785, -1168, 1002, 2618, 2863, 1798, 19, -1752, -2833, -2694, -1201, 1028, 2815, 3247, 2256, 387, -1483, -2697, -2761, -1542, 559, 2508, 3197, 2315, 390, -1603, -2869, -3032, -1972, -6, 1997, 3032, 2524, 791, -1303, -2744, -2953, -1911, -62, 1867, 3105, 2991, 1460, -731, -2420, -2831, -1916, -219, 1591, 2806, 2876, 1629, -485, -2393, -3099, -2369, -677, 1154, 2360, 2536, 1579, -236, -2121, -3025, -2497, -853, 1071, 2407, 2678, 1824, 212, -1499, -2533, -2338, -927, 1024, 2467, 2726, 1844, 262, -1352, -2422, -2465, -1330, 526, 2100, 2515, 1670, 87, -1464, -2454, -2511, -1512, 289, 1962, 2594, 1898, 363, -1187, -2170, -2267, -1316, 389, 2064, 2777, 2187, 684, -981, -2150, -2361, -1485, 180, 1805, 2532, 2054, 655, -1056, -2367, -2717, -1867, -142, 1572, 2436, 2125, 879, -773, -2176, -2678, -1902, -142, 1658, 2637, 2474, 1372, -287]
1064b87j582p28N82J648J810J074l3j013j672j701r03L94J550J815J206J88p99
1081A549j544j711j028K52J460J831J328M14o07j421j732j160M8J259J731J361
1097B030M89m72j354j740j283j41J032J605J407O28l24j232j650j262k25R15J540
1114c7J438P84j51j079j600j248k98P84J425J398Q43q6j037j573j327m02O38J318
1132b10J332Q41qr43j549j357m56O08J280J375R33J38q34j486j361m99N57J294
1150c45J397R81K04p54j481j482o67M48J219J392R91K62o97j461j576q12K99J202
1168h80J462J098L83n40j375j564r19J83J137J542J277N35m75j303j540j044k9
1185b052R28J477J376O59l81j331j593j091j91P00J304J455R12j95j278j622j058
$$ y = [-287, -1869, -2597, -2015, -367, 1443, 2517, 2484, 1471, -201, -1902, -2805, -2411, -861, 954, 2160, 2348, 1549, 5, -1706, -2734, -2482, -1022, 809, 2137, 2551, 1944, 523, -1209, -2369, -2321, -1062, 669, 2030, 2519, 2047, 693, -1047, -2330, -2471, -1439, 166, 1573, 2201, 1877, 645, -1005, -2267, -2492, -1577, -37, 1401, 2185, 2034, 955, -645, -1893, -2191, -1407, 18, 1416, 2259, 2173, 1136, -437, -1764, -2166, -1528, -210, 1122, 1963, 1955, 1012, -537, -1894, -2350, -1742, -462, 913, 1846, 1984, 1150, -336, -1697, -2196, -1639, -345, 1052, 2033, 2237, 1483, 2, -1480, -2147, -1699, -480, 912, 1903, 2165, 1468, 7, -1569, -2381, -2082, -880, 582, 1680, 2063, 1523, 148, -1416, -2335, -2152, -1015, 527, 1804, 2339, 1864, 561, -979, -2023, -2052, -1124, 353, 1729, 2388, 2007, 676, -917, -2008, -2199, -1499, -195, 1260, 2172, 1977, 699, -923, -1981]
1202a981j94N69J149J468J140J05j137j629j153k20M98R74J313J170K86r48j658
1219b48j326l68M49R11J150J052L92o93j488j387n66L60J000J239J010L37m93
1236A331j172j275p50J49J025J380J042K14n70j033j125q08j57P96J459J197K03
1253A906p41j084r84p19k78N66J421J434M36p05j219r86n85j54M50J250J485P32
1271B225m93j300j227o57j01M61J070J316P97k25j167j446j005j78O08J097J165
1288I40P60K2q32j423j257l92O65J272J249P11P4n79j187j352p27M16J346J397
1306A103P17qn56r93j306r44Q4J130J462R50P7o08j002j115q50j14Q28J448J211
1325A514L53n59j055j070o99j10O22J198J223N89l61j118j225p40o6N28R35J063
$$ y = [-1981, -2175, -1606, -457, 1011, 2151, 2256, 1119, -510, -1663, -1883, -1385, -411, 902, 2072, 2358, 1410, -248, -1574, -1942, -1493, -582, 568, 1620, 2012, 1319, -169, -1556, -2122, -1762, -762, 477, 1487, 1824, 1331, 159, -1116, -1866, -1717, -692, 688, 1730, 1944, 1374, 341, -784, -1592, -1749, -953, 506, 1703, 1906, 1165, 81, -903, -1622, -1900, -1334, 87, 1521, 1957, 1252, 33, -953, -1538, -1692, -1242, 8, 1493, 2225, 1732, 432, -795, -1452, -1553, -1092, -22, 1294, 2091, 1866, 699, -747, -1752, -1930, -1322, -225, 940, 1700, 1722, 890, -533, -1790, -2182, -1517, -245, 1004, 1715, 1789, 1210, 23, -1329, -2056, -1640, -294, 1103, 1820, 1812, 1256, 263, -1043, -1987, -1903, -773, 689, 1639, 1716, 1108, 106, -1009, -1859, -1973, -1145, 303, 1514, 1867, 1308, 253, -817, -1516, -1626, -1004, 194, 1417, 2006, 1645, 527, -698, -1438, -1504, -976, -41, 1022]
1343A022O89j40j017j308q88q0O09R35R72O44Rp37j215r87k04O20J078R83N59
1362A544k2o15j086j010m05M52J070J107N53j62o89r62r32n33K28J003J244P22
1380A507j12p31r64q60n05J80R00J281R37P3p16j083r04m64J39P83J161R82K21
1399A825o12j110j094o19Q5P60J090R43L53m02j003j197p99L7P87J155R63M44
1417A606k07q44j176r13j33P29J166R86M57j63p18j098j028l41N39J087J013M99
1435A461q0o31j062j025m22M13R77J071O63J8n73r83r42m24L32Q70J023P21J38
1454A545m97r89r73m46K34P45R11O99K10m50r81r86m87J76O81Q83P33K89l69q87
1474D1r57n04J39O89R23P92K98l15q57r49n54R9O26Q76P92L36l19q80r69n97k3
$$ y = [1022, 1711, 1571, 554, -754, -1642, -1722, -1113, -178, 794, 1438, 1447, 710, -505, -1492, -1696, -1076, 2, 985, 1544, 1522, 907, -179, -1189, -1594, -1142, -72, 1035, 1588, 1426, 737, -225, -1157, -1690, -1462, -459, 785, 1507, 1395, 664, -300, -1160, -1665, -1485, -585, 696, 1633, 1706, 990, -93, -997, -1461, -1322, -539, 622, 1604, 1825, 1213, 103, -991, -1610, -1525, -765, 325, 1268, 1621, 1219, 216, -981, -1780, -1743, -956, 199, 1162, 1606, 1399, 555, -621, -1534, -1667, -938, 228, 1214, 1671, 1508, 790, -308, -1336, -1677, -1138, -51, 962, 1461, 1381, 750, -312, -1337, -1759, -1346, -369, 702, 1365, 1383, 810, -173, -1115, -1539, -1207, -337, 686, 1407, 1545, 1048, 59, -914, -1360, -1126, -381, 530, 1229, 1439, 989, 8, -978, -1465, -1289, -608, 275, 1008, 1297, 928, 41, -916, -1420, -1281, -592, 331, 1123, 1421, 1106, 249, -700, -1254, -1155, -529, 347, 1139, 1475, 1156, 276, -693, -1290, -1313]
1495a313N23Q78Q61L86k75q19r58o68o3N21R37R30M98j87p50r90p00j50M74Q73
1515HR71N74j42p26r85p95l07L09Q42R97O17m7o38r64q60m08K59Q21R99P11J18
1536A354m96r17q90m46J72P40R86P69K13m24q49r13n68M8O41R35P21K34k83p70
1556B57r39o69qN90Q51P32L48j74p00q81o16p1N24Q53P84L93j67o33q03o40j63
1577a132M48P70P50L86j39o08q54o53j52L57O63P57M72m4o21q74n98j21L44O58
1597a91P63N52K6n56q50o80j50L51O63P07N25Q4m99q82p90k91L19O56P51N19Q9
1618A116m48q18q15l77K00O85Q80O21J01l93p12p65m66P1O25R47P15J94m20p25
1638B16p60m90q6M14Q91Q33L00l87p63p60m98j56L47P80Q82M53j93p30p96n12
$$ y = [-1313, -790, 88, 949, 1335, 1060, 241, -717, -1385, -1448, -927, 10, 940, 1438, 1251, 501, -489, -1189, -1339, -865, 8, 979, 1553, 1411, 685, -300, -1095, -1402, -1093, -251, 746, 1363, 1316, 678, -286, -1146, -1554, -1295, -474, 525, 1236, 1354, 858, -59, -949, -1395, -1223, -483, 503, 1272, 1485, 1061, 212, -701, -1269, -1221, -580, 355, 1076, 1310, 1027, 257, -682, -1351, -1359, -769, 82, 814, 1162, 988, 288, -593, -1209, -1280, -756, 97, 881, 1274, 1107, 474, -329, -969, -1132, -684, 86, 836, 1222, 1083, 475, -379, -1032, -1184, -827, -164, 593, 1065, 1021, 400, -474, -1072, -1193, -849, -191, 572, 1124, 1150, 594, -256, -936, -1086, -735, -72, 635, 1160, 1244, 745, -137, -927, -1218, -899, -243, 508, 1027, 1116, 668, -150, -965, -1342, -1142, -457, 423, 1044, 1145, 752, 40, -725, -1191, -1120, -495, 452, 1167, 1361, 941, 216, -544, -1034, -1120, -706, 185, 1018, 1318, 931, 168, -592, -1090, -1246, -899, -119, 763, 1216, 1023, 293, -503, -1015]
1658a015j01L06O84Q06N61k6o23q46o15j46K88O00O89N07O9m67q31p33k66K71
1678h88O10O69M36R1l25o70p39l46K30O48P13M59O9k59n95o64m05R8O01P62M75
1699I70L8l32n77o37m17OM97P43N53Q2l58o02o03l49j2M42P19O53K18l14o34o35
1721e49l38J4M00O72O67K83k33o44p31m44j4L73O25O33L38j62o11p74n38o9L83
1742g19O34O61L92m8n03p40n98j60L39O67P06M29Lm50o86o49k87K25O15P06M42
1763I79L9m11o54o56l58R0N27P31N47Q5l32o02o07l61L3M63P19N95J89k71n60
1784A85n93l82l7L80O41N83K35k38n34o40m02n7L03N68N61K62j67m97n83m21o0
1805h93L13N56N59K88j02m02n70m39j00L00N72N37K56r4l91n54n06j68K54N71
$$ y = [-1015, -1116, -810, -126, 680, 1241, 1215, 592, -254, -869, -1015, -727, -127, 562, 1069, 1138, 671, -160, -893, -1159, -888, -278, 391, 827, 918, 593, -77, -816, -1162, -932, -284, 429, 888, 957, 698, 103, -561, -966, -868, -267, 495, 970, 1008, 676, 99, -538, -955, -949, -452, 291, 844, 926, 568, -34, -637, -986, -998, -556, 163, 816, 1034, 720, 86, -549, -887, -873, -473, 199, 866, 1149, 916, 272, -459, -903, -917, -544, 81, 714, 1052, 890, 279, -495, -1033, -1102, -719, -85, 576, 968, 920, 417, -323, -921, -1081, -742, -75, 631, 1060, 1063, 613, -73, -722, -1009, -784, -169, 537, 979, 1018, 607, -47, -703, -1061, -971, -444, 287, 834, 919, 587, -15, -622, -983, -950, -487, 232, 827, 1016, 745, 185, -408, -790, -827, -447, 194, 777, 1012, 774, 240, -400, -802, -859, -556, 12, 573, 835, 668, 171, -412, -833, -893, -580, -24, 535, 823, 721, 319, -251, -690, -790, -490, 82, 619, 875, 781, 390, -164, -670, -838, -584, -13]
1825a3N52K39j14l58n28n11k29K01O16O08L11p5l45m96m92k55J70N86O67L74n0
1846H58l32n13n34l33J12N25O45M20J7l12n54o00l61O5M91O14M58J46k25n09o24
1867e46l91O4M63N86M81K30q5m88o66m61QM09N39M46K63m5m22o76n27q4L56M98
1889d8M35L01K0l37o27n31j06L01M67M61L40P8k76n68n05j32K34M13M33L63J11
1910H27k85n81m98j56J64L26M12L82J05k67n44m76j62J55L16M21M05J67k38n08
1930c5m46j60J21L18M27M38J45k46m99m47k01N0K59M48M53J27k55n02m58k26J2
1951f77K39M51N18K03k35m95m37k28J5K05M68N49K81j74m85m71k88n3J77M40N35
1972E38K95j16m52n08l78j19J52M26N22L09l1l45m73m14j96J37M56N40L40Ok57
$$ y = [-13, 539, 778, 664, 306, -222, -733, -962, -761, -145, 463, 774, 699, 354, -142, -634, -889, -719, -133, 534, 908, 858, 526, 13, -521, -854, -742, -217, 428, 848, 865, 553, -1, -601, -962, -897, -406, 208, 666, 812, 587, 78, -546, -937, -873, -410, 176, 657, 887, 802, 314, -352, -813, -805, -396, 143, 589, 852, 807, 385, -291, -818, -902, -546, -48, 387, 688, 708, 371, -256, -787, -893, -592, -125, 336, 676, 754, 478, -90, -595, -727, -493, -80, 353, 716, 827, 542, -39, -537, -693, -529, -203, 209, 591, 696, 429, -115, -591, -753, -598, -282, 139, 544, 711, 473, -35, -481, -641, -520, -202, 225, 663, 808, 562, 63, -384, -585, -535, -276, 172, 625, 752, 497, -5, -463, -689, -677, -438, 13, 531, 734, 499, 4, -433, -661, -646, -441, 27, 576, 857, 683, 198, -273, -561, -614, -437, 3, 538, 833, 717, 265, -243, -621, -740, -588, -162, 360, 669, 638, 293, -180, -594, -790, -653, -197, 343, 683, 689, 432]
1993D32l94m10l09O1M33N43L43J0k22l62m50l22l1L36N19L69P7k39l34m08k95
2014f53o2K90M84M05J28j42l21l87k69k3K53L80L77J98p9l42m23l13k0K31L44
2035E6L18J83n7l31m16l44l2K50L71L11J57l5k34l78l42p1K44M04L40J72k5k57
2057B84l50l41j36J68L81M06J97p3k84l83l39j62J24L41M19K93j8k86l84l54j40
2078f37J08L22M10L65R1k42m19l71j70O2K88M00L73J21j90m05m47k65L0K74L81
2099G9L31J49r6l43m43k95j7K61L83L57J99o3k70l80l17r0J95L75L88J89m3k49
2121C00l62l30j45J39L14L54K28l5k30l66k99j24J00K63L28K79N0k12l09l05r7
2142d59R0K50L17K48Q6j70l29l22j28R6K37K70K15N9j45l42l07j60N0K53K99K44
$$ y = [432, 38, -372, -681, -620, -187, 356, 699, 709, 487, 125, -325, -647, -678, -342, 177, 546, 623, 384, 50, -358, -653, -715, -425, 59, 464, 592, 450, 129, -258, -527, -550, -297, 83, 460, 658, 579, 237, -186, -499, -519, -288, 56, 374, 557, 500, 169, -247, -591, -623, -373, -2, 309, 466, 431, 197, -181, -523, -594, -350, 54, 394, 566, 541, 284, -66, -407, -543, -375, 6, 412, 609, 536, 252, -131, -470, -632, -508, -167, 252, 545, 527, 241, -143, -497, -637, -529, -207, 203, 568, 659, 417, -2, -373, -543, -481, -193, 207, 580, 701, 511, 106, -341, -606, -576, -302, 79, 410, 559, 463, 120, -323, -618, -635, -374, 9, 366, 565, 502, 232, -148, -465, -555, -360, 15, 403, 592, 549, 300, -62, -392, -537, -398, -84, 270, 498, 463, 233, -133, -432, -556, -456, -193, 135, 414, 464, 252, -57, -362, -459, -369, -119, 198, 446, 532, 362, 33, -289, -417, -321, -84, 186, 401, 460, 315, -27, -334, -494, -444, -191, 108, 352]
2164C52N4j60k66k94j71M0K55L56K66O7j60k67k71j92j1K00L40L24J06j77l29
2185F2l02j91n7J52L39L45J49j35l17l18j96o6J54L17L56K18l4k69l37k61p6J57
2207c10K98L20K20J2k26l36l18j66P9L11L37J97Lj38k87l42k05L9L08L53J87M7
2229C83r1k10l07k24%K64L35K56M7r1j98k72k50m2J98K88K31Q1p8k10k83k31l9
2252d43J61K55K32J11j1k10k70k05j4J81K25K06J50Kj65k79k31k0J69K23J79J16
2274C62K4k00l03k44l9J65K03K06J29jj72k78k38m6J48K41K20J68L6j52k73k60
2296c04n1J14K26K26J98N0j47l24k84r2Q2J74K37K16O2j29k86k93j37N8J99K46
2318D1K43J13p4k69k86j42J6J58K65K49J63q8k39k59j88n4R4K30K94J36o1k23
$$ y = [352, 406, 246, -20, -314, -485, -445, -190, 166, 432, 499, 339, 72, -199, -391, -402, -202, 138, 462, 568, 391, 62, -240, -431, -488, -336, 3, 348, 497, 362, 45, -273, -469, -535, -381, -64, 292, 510, 476, 207, -130, -391, -467, -310, -12, 308, 528, 540, 314, -22, -340, -506, -427, -116, 221, 418, 421, 283, -4, -346, -551, -512, -204, 149, 336, 383, 292, 82, -225, -449, -449, -185, 150, 406, 453, 362, 164, -108, -358, -400, -202, 86, 317, 398, 320, 110, -173, -404, -443, -282, -27, 205, 316, 305, 95, -175, -380, -394, -213, 12, 218, 368, 370, 205, -74, -305, -325, -156, 67, 246, 362, 386, 186, -117, -361, -400, -235, -32, 174, 303, 302, 130, -148, -386, -432, -284, -43, 177, 345, 381, 229, -44, -304, -355, -241, -15, 211, 409, 459, 312, -12, -296, -388, -306, -132, 105, 321, 383, 254, -32, -325, -462, -404, -205, 41, 284, 397, 323, 54, -232, -374, -358, -200, 65, 314, 477, 389, 150, -109, -297, -351, -257, -27, 267, 403, 342, 119]
2340A19k52j84p5L3K23K91J76qk00k15j53r4M5J82K60K13K3j69k09j65r2J9J45
2363h7K12J72N7j34k23j97j13K5J39J88J69L6r4j62j96j32M9J70K17J28N2p6j34
2386F6j87j34QJ59K27J48J2q3j45j87j50m0J48K15J92K3j09j57j88j36j5J09K13
2409a1K26J00q5j71j83j27j1Q5K14K25J32l9k07k28j65l3P2J75J98J53lj75k39
2432i7k16n2Q2J57K02J66N5r9k27k18r8P7J84J98J72M9n3j76k34j52J7J53K12
2455A02J50K5m6j40j92j93m5J26K13J60P1o0j07j64j36n9P2K18K08P5o1j05j29
2478a7j25n2L3J49J95J01m8j43j46j14l7K8J01J54J15nj31j73j02k3N0J33J34
2501G7J08K5q6j71j38k0R2J47J22O5K8n1j77j83r6P8J77J27P2j7m9j38j79j25
$$ y = [119, -133, -317, -392, -359, -136, 155, 331, 323, 123, -92, -245, -339, -294, -112, 148, 361, 384, 215, 6, -159, -251, -232, -87, 125, 297, 354, 220, -3, -200, -313, -288, -149, 39, 208, 244, 150, -12, -208, -340, -291, -121, 96, 224, 276, 200, 66, -121, -255, -247, -88, 139, 287, 299, 216, 71, -116, -266, -306, -158, 57, 249, 272, 163, 6, -182, -318, -333, -224, -11, 215, 315, 230, 59, -124, -251, -262, -177, 37, 262, 394, 355, 148, -80, -245, -278, -206, -31, 167, 320, 317, 142, -97, -313, -365, -283, -126, 76, 242, 297, 198, -29, -247, -345, -268, -84, 114, 286, 335, 282, 106, -128, -280, -263, -110, 102, 252, 277, 231, 91, -101, -294, -339, -213, 0, 160, 231, 171, 64, -100, -236, -295, -223, -5, 203, 278, 217, 112, -17, -142, -194, -161, -12, 183, 284, 236, 93, -53, -167, -204, -176, -75, 79, 194, 189, 58, -115, -217, -240, -190, -57, 77, 185, 210, 124, -47, -185, -205, -113, 34, 156, 221, 249, 198, 21, -162, -258, -180, -3, 124, 196, 179, 130, -8, -187, -312]
2525c12L5J86K01R0Jo6j14j40j30qJ69K17J43J4p5j36j49j10n7J06J87J76N6q2
2549B02j47j74j08m5N6J49J97J12l7j40j60j26l1N8J29J74J28N9j11j84j47m4
2571a90N2R0J15J30O6o8j78j87o2N1R3J00R0P2j2j34j81q9M0J07J20R1O3j0q8
2596H1j43q3QP3J15J09M6k9j04j24p5k7M9J25J09K6n2j10j12o0nM8J10J03Q3l5
2622A26j09j23l8jO7Q7J35P2j5j17j30q3j4O0R1J20O8j2j09j50j13k4M8R3J33
2647F2J09%j03j28q8m8K5J02J75J00J9o8j19j24q0J0R4J41J18K1o5j17j20j09
2671a93k0N6J43J22O5l7j15j00j08l9O4J43J32O7np3j16j04n8P7R3J26O8Lo4j14
2697A3j20o5J7J01J00N2K2m4r6j07n4J7R7Q8P9K3k6q2r5l5J1Q3R5N6L3m4q4q2
$$ y = [-312, -277, -91, 110, 200, 201, 135, 21, -119, -249, -257, -88, 129, 272, 286, 211, 75, -74, -184, -241, -135, 52, 228, 284, 202, 55, -119, -227, -272, -216, -67, 130, 242, 205, 65, -95, -221, -252, -194, -65, 109, 237, 296, 185, 1, -146, -190, -138, -48, 67, 197, 263, 195, 17, -170, -232, -181, -88, 12, 102, 174, 162, 28, -153, -242, -202, -95, 25, 116, 179, 169, 81, -62, -145, -137, -64, 51, 160, 206, 177, 73, -51, -126, -153, -104, 21, 130, 156, 104, -6, -118, -178, -183, -135, -25, 78, 161, 126, 17, -106, -144, -145, -78, 9, 144, 216, 201, 84, -46, -129, -143, -83, 8, 128, 196, 184, 75, -75, -188, -212, -164, -71, 62, 171, 171, 68, -60, -148, -196, -171, -69, 106, 206, 225, 157, 38, -86, -166, -156, -62, 79, 197, 218, 153, 36, -84, -193, -213, -157, -14, 108, 173, 136, 21, -79, -187, -226, -162, -19, 113, 180, 175, 102, -14, -118, -176, -99, -6, 120, 188, 191, 127, 13, -107, -172, -155, -54, 46, 98, 120, 76, -20, -127, -181, -164, -67, 21, 100, 123, 97, 15, -80, -115, -104, -21, 74, 130, 163, 119, 35, -47]
2725d7n1PN5Q4N5Rk5r7r3o7J8Q3P9O5L4k3q8j12k7J4Q2R3R3K3k3p7j12o6qN8J17
2756E3P1M1m1q6j15q4j6O5Q8R6P8j9j09r6p8j1L1J05J08J12j1q2r5r6m2L1P9J04
2784H1Q1M2p2j09j24n9J8O5R5Q1L7k8r0j28p1qP2J12R0N6j7n5p1j13rN1Q9Q9M8
2813A53j5m7p9p3n6J4P3Q9L2no2o2m9m9LP8Q1P3jn4n6n7qJ5L9P8P5J7o7p8m9k6
2845g3K4K9N2O0J9n2q3p8k2K4N0O6L6K7k3q6p7l0K2Q5P4N6L7m7o0o3o8rP4J10
2875G4N0Qm8n7p3p5k1M7J01Q4M2m0p8p2o2k6J9J04J13P1j4p9p8n7m0J9Q5R4P6
2904A67j0l8j06p1n2KL9Q7O9K5k7q6r6o5J0O4O8O9M0J6n0j01o5OO0P2N1L0K0l2
2934I6r1q6k1L4Q5L7K6j5j9n3q2l2J4Q1N4L1ql5m0m2k0J2O7P5L7K3o2o1n6%nM6
$$ y = [-47, -98, -91, -36, 48, 103, 112, 87, -10, -103, -170, -152, -69, 10, 75, 109, 86, -2, -114, -141, -127, -45, 48, 141, 164, 141, 64, -48, -114, -122, -64, 53, 124, 165, 124, 38, -77, -161, -177, -112, -24, 72, 150, 131, 22, -74, -152, -163, -132, -27, 81, 193, 182, 100, 5, -91, -133, -102, -23, 81, 162, 204, 132, 23, -101, -160, -142, -77, 18, 99, 136, 108, 18, -110, -181, -189, -117, -5, 85, 141, 124, 69, -2, -115, -124, -73, 16, 105, 153, 138, 91, 12, -61, -117, -103, -30, 59, 91, 86, 24, -38, -87, -136, -133, -55, 26, 99, 98, 44, -12, -69, -77, -62, -23, 55, 130, 147, 80, 2, -47, -73, -49, -20, 32, 92, 111, 59, -24, -102, -124, -100, -50, 16, 52, 79, 56, -30, -107, -137, -115, -30, 44, 100, 137, 90, 30, -33, -101, -110, -36, 74, 124, 132, 84, 27, -46, -121, -142, -95, 6, 90, 132, 92, 14, -58, -120, -146, -127, -23, 90, 161, 147, 68, -10, -67, -107, -88, -3, 91, 167, 157, 119, 13, -58, -110, -108, -69, 18, 87, 112, 85, -1, -97, -162, -152, -88, -20, 49, 89, 105, 55, -46, -111, -105, -45, 27, 78, 108, 128, 96, 5, -81, -102, -68, 17, 54, 80, 65, 46, -7, -89, -121, -107, -26, 28, 59, 51, 16, -24, -66, -86, -74, -7, 68, 105, 128, 66, 5, -51, -51, -56, -10]
2966a0O3M3K1o2q3o9rM3L8L6M6K5m9r3n0j7M6N5N1O1L0k8r4o5m0L6P7L6O5K1k5
2997I9p0r3n8J3L3R0N6L8k9o9o7q0mL2R1Q6L5Pp2o9m3m6K7Q2Q8P2qp6n3o4n0K
3029a00M9P9Q6on5o8n8m0j9L8P1Q7K9l3n3m8l9k0M6N9Q8K4j5o2n7n2kJ9N0O0K6
3060H4om4o6n5j1K2N4N8J3J1m1m1m5k8L5P2N2L3k0j7n0m7k6K4N4P0Qml9o6n3l0
3092i9J1O5O3K9Qo2m8n7k0J8O4P7M5Lk9p4n7l2K6P0P0M1K4m8o3p0n4oM5R0M5L7
3124A12k6o2r3m8j1N2N8Q8M1j1n4q0n8j6L7P0O6O3J6o5o5q4j2OL9Q2N1Rl8q0p1
3155h4m2J7M1O8N8K8l3n5o1l7jN1O4N5L4oo3n9m8ML9M9M0L4k9m3n5n4lL1N1M1
3187C2K8j4n1m0n0J0K6P1N2K0j4m7l9l5j4L9O0N3L4j4p5n3m3k5M1M7N7L6j4n8
$$ y = [-10, 53, 96, 117, 55, -28, -97, -106, -63, -25, 11, 57, 82, 33, -60, -110, -127, -81, -26, 25, 86, 116, 88, -6, -71, -111, -75, 2, 38, 103, 124, 99, 29, -64, -122, -109, -76, 14, 70, 108, 79, 10, -57, -137, -141, -109, -18, 68, 103, 110, 38, -31, -74, -120, -93, -11, 77, 149, 141, 65, 12, -52, -102, -100, -51, 28, 114, 108, 53, -15, -73, -113, -132, -94, -23, 64, 93, 60, 7, -41, -80, -100, -54, 5, 93, 117, 102, 40, -17, -69, -71, -52, -2, 58, 84, 78, 34, -32, -87, -98, -76, -22, 36, 49, 60, 19, -22, -67, -95, -60, 12, 64, 97, 77, 60, 10, -37, -63, -39, 15, 85, 93, 89, 50, -16, -69, -99, -88, -23, 40, 69, 77, 15, -33, -90, -110, -92, -28, 49, 94, 97, 68, -6, -63, -95, -69, 1, 71, 112, 136, 88, 25, -45, -99, -105, -60, 30, 75, 112, 86, 24, -69, -117, -128, -76, -18, 70, 111, 100, 46, -34, -92, -108, -71, -1, 65, 128, 144, 79, 14, -70, -82, -76, -37, 45, 96, 105, 67, -13, -84, -126, -109, -68, 0, 58, 86, 53, -2, -63, -100, -101, -50, 14, 69, 103, 97, 34, -25, -73, -69, -30, 19, 59, 93, 64, 21, -34, -88, -91, -60, -9, 32, 60, 46, -5, -45, -95, -85, -59, 12, 64, 84, 70, 23, -16, -51, -65, -26, 34, 87, 121, 107, 32, -21, -64, -89, -48, -1, 56, 92, 78, 20]
3217B0p2m2k5L3N9P0L6J3n1o5n0k2K7O2O2O1Jl2q0o7l3J4M6P8N1J7k3p0r6m6Q
3248a16N1Q4N1L0k7n2p2m8j4O1O3P2K9Nn1n8o9l6K8O4P1M3nm7o8p5j7J0O0M9M9
3279F5K6n7m9n6l1K2M4O4M1K1j7o0n4l3K6L1N5M3J6k3o7n8l8J2M9L3M8K3j3o1
3309Bn9l1NM0O3N1Rk1m1n0l5jM8N3O1K3k0o6o0m1jK2O9P2J6l2n6o5n5j1L4O2Q8
3342G3K9k0m3q4l9j0K7N9P5N6Jo0p4n7k4J7M8Q6O0nm6p0o8m9J2O4O4O3J4k0o7
3373A2o7n9K1M0P8O2L2j4n0p0o4oN0O8M0K9j0m3p8n2k4L2N8N0M1j0m3n9m5l0L6
3404g5O0O2K8kk9n8l9k6K0O5N5L3nl0p0m4j9J4M7M5O5k1k5p1m8k5J8M5O4L8J7
3435H9m1n8m6l0J1N8N8N7K2l5o5o5l8J3M2O1N5K7m2q2n7n3J2M9P2M4M2l2n3p2
$$ y = [20, -52, -94, -119, -86, -27, 43, 79, 92, 41, -24, -74, -96, -69, -7, 55, 116, 117, 85, 5, -62, -95, -81, -35, 43, 94, 111, 88, 18, -78, -124, -116, -65, 19, 70, 100, 73, 21, -51, -99, -113, -52, 11, 83, 112, 117, 66, 8, -61, -97, -69, -5, 66, 109, 104, 57, -11, -86, -103, -93, -33, 16, 65, 91, 34, -15, -71, -102, -80, -36, 28, 69, 90, 73, 13, -41, -74, -48, -17, 38, 81, 97, 74, 7, -51, -89, -77, -28, 5, 53, 76, 63, 2, -57, -88, -83, -43, 20, 71, 80, 59, 18, -32, -67, -68, -20, 33, 94, 117, 97, 31, -29, -70, -71, -49, 20, 92, 108, 76, 20, -45, -100, -111, -77, -15, 73, 102, 82, 39, -45, -84, -94, -67, -8, 67, 123, 124, 64, -10, -67, -91, -74, -26, 60, 120, 115, 69, -1, -69, -118, -106, -42, 22, 85, 99, 79, 12, -55, -114, -93, -53, 25, 87, 119, 105, 55, -15, -79, -85, -35, 33, 73, 102, 92, 49, -29, -81, -105, -73, -15, 35, 76, 66, 23, -36, -81, -111, -75, -15, 47, 75, 73, 44, -14, -53, -79, -59, 6, 61, 94, 89, 59, -11, -55, -74, -60, -13, 32, 97, 76, 51, -20, -68, -93, -75, -30, 34, 72, 89, 48, -10, -56, -86, -75, -17, 41, 98, 120, 85, 20, -45, -83, -70, -28, 33, 88, 115, 73, -9, -66, -119, -107, -58, 14, 58, 100, 68, 15, -57]
3465e7n5PM2Q2N8M9j6n8p7m5k2K3O7N9M6mn3o4o9l1K3N8P4M4J5m5o9o2k4J2N7
3496c5P1N5K3k6n9n7n7QM5P7M9K2j9o9p6k6j8M0N3O1J4j5n9o3k6j1L9N4N9K4j8
3527F0l6n1m0j4K9O3N9L2j3m2p9m9J0J9N7N4K6Np2o1m5nK3O0N1L9%l7p4n4LJ5
3559f7N2P3M8km6o7n6k3L6L8O7M8K1m5q8n3l3J1M3P7N3J3l2p5n2n1PN1P3O7J4
3590A02jp2o9n3pN1N6P2M5j6p4o6m7j9K9O8O2L4j0l1r3m8k9L3P5N5M2J9o1n3o7
3621g3j2K2M2P5M0J7l6p0n5l3OM3Q3J9K4m7m6o3l1NM3N9O0J1k8n7o1j5QL0P1N1
3653H2Rk6n5o4l5J3L9N5P5%j6p2o9m1QM7O4N7K1j9o1n6n9mM0P2O6L7j4n5o6o2
3685h9qL9P7M6M0pn7o1o7j6J8O8O4L4Pm7p2o0j8K7N1P0O0J5n2n6o1l6QM9O5P1
$$ y = [-57, -112, -105, -63, 19, 77, 126, 110, 52, -25, -70, -92, -69, -2, 57, 103, 99, 46, -18, -87, -118, -95, -37, 37, 81, 96, 51, -18, -80, -104, -92, -35, 36, 91, 114, 88, 29, -28, -85, -77, -32, 45, 94, 116, 97, 28, -48, -74, -92, -52, 1, 62, 76, 61, 2, -61, -87, -98, -59, -5, 54, 78, 60, 24, -27, -67, -81, -52, 11, 70, 102, 89, 47, -32, -81, -71, -52, 5, 59, 85, 90, 18, -43, -88, -93, -70, -10, 41, 80, 80, 43, -31, -85, -82, -67, -15, 58, 106, 104, 58, -9, -65, -88, -52, -14, 53, 101, 122, 77, -11, -64, -97, -86, -43, 34, 87, 100, 68, -7, -59, -110, -103, -52, 21, 88, 102, 101, 29, -40, -93, -100, -49, 7, 79, 124, 108, 34, -32, -79, -98, -69, -1, 61, 95, 85, 54, -39, -87, -116, -83, -8, 47, 89, 108, 47, -6, -73, -85, -63, -21, 54, 94, 111, 75, 5, -50, -83, -77, -34, 49, 68, 92, 45, -1, -64, -95, -90, -47, 12, 72, 83, 55, -2, -63, -78, -70, -40, 31, 82, 91, 65, 10, -54, -89, -76, -37, 18, 93, 93, 77, 5, -64, -105, -97, -50, 14, 71, 92, 73, 12, -44, -103, -107, -67, 5, 71, 108, 94, 39, -27, -89, -97, -58, 19, 65, 105, 98, 41, -20, -87, -103, -85, -17, 47, 81, 88, 41, -31, -91, -109, -82, -31, 39, 99, 114, 62, 6, -55, -91, -83, -34, 31, 102]
3717A02J3k5o8p2n3J4L3Q0O1K3k6o8o3m0j0M0O3N9L9l5m2m9m9j7M9M9O5L6k4l9
3747D6p1n0j4K7N9O1K5j2l1o5n5j9K2N6O2M2j2m4m8m1k1J0N6P2L1J3n8m4o3k8
3777i4K9O2O0L1J1m5p1n4l4K3M4O7M9J2l1p1o9l5K9N3P3O2rk7m4p7l2j1O3O1O6
3808I1K6l9o1o5n7kL6P4O8K6j9n2p3n2j8L6O8O9L4Qn5o9n7k4L4N7P7K6J6n5n2
3839do7k0J6O2N5L4J6l5n6o1m8K2M3O5O5Ll1n4o7l4J9L8O7N9Rk3n4o7l5LO3M7
3871C0N2J7l6n8n8l1MK8O3O6Ll3n2o0l4J6L4O1N2L4j9m9o1n0j0L9O1O5M5k4o8
3902B7p1n2j2M2O2O1L4Ln5p9n4j7K5O8P7M5qm0o7o0l5J9Q3O4O2j4m3o8n7m8J2
3933i6O8O3M8K8m5o8p0m2OO2O9N4J4j2o9o0m5PL0O8O5J4no7n9m4rL9N9N6L7j3
$$ y = [102, 115, 90, 22, -50, -103, -89, -56, 24, 85, 108, 82, 14, -49, -89, -99, -59, 4, 63, 102, 67, 25, -24, -73, -90, -41, 8, 73, 109, 85, 46, -25, -75, -89, -62, -3, 58, 83, 71, 40, -25, -80, -99, -77, -21, 41, 83, 71, 27, -21, -62, -83, -73, -17, 55, 86, 99, 41, -3, -66, -94, -65, -3, 57, 88, 99, 54, -17, -71, -105, -82, -38, 29, 78, 90, 59, -12, -81, -116, -87, -34, 39, 101, 92, 65, 21, -56, -88, -99, -36, 25, 91, 117, 78, 17, -48, -105, -107, -71, 3, 71, 97, 78, 26, -47, -99, -117, -81, -13, 56, 90, 98, 43, -26, -83, -107, -73, -16, 61, 87, 103, 48, -4, -71, -91, -75, -13, 42, 76, 92, 57, 1, -60, -108, -86, -43, 22, 87, 90, 59, 5, -62, -96, -77, -39, 28, 87, 96, 73, 19, -48, -83, -80, -17, 30, 82, 99, 63, 5, -53, -84, -80, -52, 11, 77, 80, 47, -5, -65, -99, -83, -49, 12, 64, 98, 79, 30, -31, -81, -91, -52, 9, 74, 119, 95, 27, -44, -96, -108, -66, -4, 57, 91, 94, 39, -40, -94, -111, -86, -18, 59, 104, 96, 56, -11, -71, -106, -87, -4, 60, 122, 108, 65, -3, -60, -108, -96, -28, 35, 83, 111, 66, -2, -72, -114, -108, -46, 23, 77, 91, 79, 10, -50, -95, -88, -58, 10, 75, 89, 84, 17, -42, -86, -95, -56, 3, 59, 96, 83]
3965H3m0q0o5J0K3N7O0L9mn5m4n9j3K3O6P1K5nl4q0m2j4K8M4O3L8rm7n7o4rJ9
3997g2N0O6M2Qm9o3o8k1K2N1P9M6J1m0n6o6l1J1N5P2L6J7l3n1q4l6QN8O9N9Nj9
4029G6n8q4m9PN6O4P0K4k2n3p4n7j5M4Q7O1L9ro9p2n7j4J6P5P0M6pn5o2p4j1J3
4061i4N6P7N4om1o0o4l0L4L4P3O1Pm6o2p0k1MO2N6N8nj2p3o6k8LM9P0M8J9k6m3
4094A8q4k4%L8Q9N2J1k3n3o8l8LM7M9N7K6j9o1p3l3mL4O1O1L4k9m2q0m7pK5P3
4126gP2K2oo8n3n8j0M6N1P0M1j2n2n0q4k0L7N4P0N0Km6p0n4m3K4O6N5O2Jk5n9
4158Fp3m1J1O0P1O1Mj8o7o5l8RK9O8N4K2j9n4o7n6J0K8P1O1K1k0m5o2n8J4K0N6
4190gO4L3pn0p7m0rK2P3O0L0pn2o3m8k1L7N8N7L1om7n4m3j7PO8O2L0Qm0o3m9k8
$$ y = [83, 43, -37, -102, -92, -69, -12, 48, 87, 83, 28, -16, -75, -88, -65, 1, 72, 97, 92, 58, -22, -64, -78, -50, -6, 57, 95, 86, 39, -18, -82, -91, -72, -22, 44, 86, 94, 45, -18, -86, -107, -85, -34, 45, 91, 102, 62, 6, -60, -91, -80, -25, 47, 83, 100, 67, 16, -68, -104, -96, -38, 31, 90, 95, 76, 18, -66, -115, -108, -52, 12, 82, 106, 84, 31, -43, -100, -115, -71, 16, 77, 116, 107, 38, -34, -91, -105, -89, -14, 56, 102, 95, 40, -22, -96, -107, -94, -38, 39, 93, 87, 46, -14, -78, -108, -74, -40, 33, 94, 101, 55, -7, -77, -98, -94, -32, 24, 82, 77, 65, -8, -74, -102, -99, -50, 20, 68, 87, 61, 18, -66, -90, -90, -52, 37, 89, 100, 77, 24, -44, -82, -79, -32, 17, 74, 100, 81, 20, -53, -86, -90, -56, 5, 66, 100, 71, 29, -51, -98, -105, -80, -7, 65, 87, 81, 13, -40, -98, -108, -62, -11, 59, 100, 88, 36, -14, -98, -118, -81, -27, 43, 93, 95, 49, -21, -75, -118, -94, -28, 27, 89, 90, 65, 6, -67, -108, -97, -37, 34, 95, 99, 81, 14, -51, -89, -80, -51, 17, 71, 93, 74, 20, -47, -103, -93, -65, 6, 67, 88, 68, 23, -39, -97, -83, -63, -7, 57, 90, 83, 33, -44, -84, -93, -71, 2, 62, 92, 85, 33, -30, -78, -99, -62, -4, 53, 84, 78, 31, -23, -66, -83, -76, -8, 54, 84, 92, 52, -11, -60, -88]
4224h8J5O3O3L8Om0n6n9m5L6L7P2N0J5m4q4l6o1K1P5M5P6Om5o9n6l7jM5P1P0K6
4256A09m3m8p8n2PM2O2P4J6jo6o2n2j2K7O2Q6L2k4l3p7n1k2M0M3Q4K5J7n2p5n1
4287g3k6K6O0O0M5kl7n9o9k5J3N1P1M2Qj7p4o9l2QN4P0N5J0l7n5n6k4J2L9N8M4
4319G1J4k4n3o8l0J0L4O5N8J0k3n1o1l1oN1N3N2K9k8n9o1m5jN0N7N1K4j6m7o8
4350d3l8k2M3O7N5L1nm8p4o5OJ4O3O7L7Kn0o7m5l5K5O5N9M0Ol8o8o1k4QO9N2N7
4383H3jl7n1o5l8K3L4P8N1J7l4n6n9l9nM9O7O1K3k5n4n3n4j3N2N8N7J6j0n1p1
4414d7m4QL1N0N7K7qn0n2n3j1L7M5N7L3ol8o7m9oJ8N2O0K3J1m9n2o0oK1M8O6L1
4447G7Jm3n0n6j8J7L7P5M1J6m6n6o5j1J4M7O4M6J3l8o1o8j9LM6O0N9J1k1n8o4
$$ y = [-88, -73, -10, 53, 91, 97, 57, 1, -58, -103, -67, -30, 42, 92, 107, 63, -21, -57, -118, -97, -22, 23, 99, 105, 60, -9, -65, -102, -103, -58, 13, 83, 109, 66, 18, -60, -112, -105, -63, -1, 73, 89, 88, 22, -40, -92, -104, -77, -15, 71, 103, 79, 46, -31, -82, -104, -64, -21, 63, 88, 105, 53, -22, -73, -99, -73, -13, 47, 92, 90, 53, -6, -75, -100, -87, -36, 35, 77, 85, 68, -6, -75, -107, -99, -45, 25, 80, 90, 53, -2, -58, -82, -70, -31, 27, 71, 85, 61, 8, -60, -90, -80, -46, 19, 77, 87, 64, 13, -48, -79, -85, -34, 19, 71, 100, 72, 13, -48, -93, -94, -44, 13, 64, 88, 72, 25, -43, -81, -103, -60, 7, 62, 93, 88, 40, -34, -99, -93, -79, -16, 51, 88, 90, 40, -27, -72, -107, -82, -17, 42, 82, 88, 50, -18, -79, -103, -95, -26, 26, 83, 82, 45, -6, -71, -109, -86, -52, 26, 77, 94, 60, 4, -55, -94, -99, -50, 17, 78, 101, 76, 22, -31, -85, -98, -46, 12, 69, 85, 75, 24, -47, -91, -83, -52, -2, 55, 82, 74, 24, -28, -81, -92, -55, -10, 47, 80, 74, 36, -31, -80, -86, -68, -16, 44, 67, 78, 29, -23, -83, -89, -68, -20, 46, 77, 78, 35, -15, -71, -89, -72, -35, 40, 81, 97, 51, -5, -70, -81, -67, -20, 44, 90, 103, 65, 4, -64, -83, -80, -34, 26, 85, 96, 75, 17, -47]
4478d7m3KM0O7N7K9l3m9q1k7jL7O0N1K6j9m6o1n0j6M0N5P0K5Mm3p1n9j2K3O2N6
4510D6N3k2k9p0o3j5L3M8O5L8Kl1p0n5rRN2O6K6K1l5n4o3l1J1N1O3L0Pk2n6n0
4542e4k6LM8O1L0J7l8l5m6l5nM3O8K9Rj2m8o3m0K1L1N8M5J7j9m1o2l6pL1O4O2
4574G0J7rn2n8o0kM0N4N3M3k1m0n4n5l2L1O9N4N5j0n4o1n4k4K0N3O6L8J3l3o8
4605a1n6l9K5N3N6N1%k1n5n8l6QL7O4M4J2k2m1o2l5NL7M6O1J5rn1p0j9pK5N2O8
4638F7Qk2l5n2l6nK8M6N5K2j2m3o2k1nNN7N9J6kn1l9n4lK8M7N2L7j3l9n6m5j3
4671h1K8M6M2L5pl4n0m6k0J7L5P0M1J2m6n1n6k3J0N8N2M3Kk7m5m8m2K6L6N2N6
4702H5Kk8n6l6m3QL9N6L1J8qn2m8m2qL4M2P1K5j3o1m0m3j4K4O2M4L2j1l1n8m7
$$ y = [-47, -90, -88, -48, 19, 76, 105, 72, 23, -58, -85, -86, -49, 11, 62, 88, 69, 23, -38, -88, -104, -64, -9, 61, 86, 90, 47, -24, -83, -95, -72, -10, 46, 99, 77, 48, -22, -85, -100, -67, -19, 46, 84, 86, 55, -15, -70, -79, -70, -18, 48, 74, 95, 60, 6, -57, -88, -77, -26, 37, 67, 74, 52, -4, -54, -80, -77, -29, 32, 62, 79, 41, 6, -40, -75, -80, -37, 31, 60, 69, 57, 9, -54, -94, -73, -42, 16, 61, 78, 59, 18, -44, -80, -87, -56, 8, 70, 87, 78, 26, -32, -92, -94, -54, 0, 53, 96, 75, 35, -19, -74, -106, -75, -6, 48, 103, 93, 39, -22, -76, -100, -80, -27, 39, 77, 90, 57, -11, -67, -106, -81, -28, 28, 79, 79, 58, 3, -55, -91, -83, -46, 18, 62, 74, 52, 11, -51, -86, -81, -44, 2, 63, 78, 69, 18, -52, -71, -78, -53, -1, 67, 75, 53, 18, -34, -70, -75, -47, -1, 54, 76, 64, 21, -41, -62, -67, -62, -5, 54, 70, 68, 17, -22, -76, -79, -51, -4, 48, 85, 72, 33, -23, -68, -81, -53, -7, 35, 70, 63, 29, -21, -67, -87, -70, -35, 35, 76, 88, 42, -9, -65, -88, -78, -20, 32, 75, 77, 50, 5, -43, -85, -59, -23, 29, 85, 87, 59, 3, -33, -76, -68, -29, 27, 58, 76, 68, 16, -32, -74, -82, -48, -6, 65, 90, 77, 16, -24, -67, -81, -57, 5, 49, 81, 70, 39, -19, -66]
4734f6j8J7N5M7L0lk9m6n6j0K0M9M2L6J1m2n4m7oJ2M1M3M2K1m7m2n1j7RM9L6K8
4766E4J6k5m5m3k6J2L6N6K9J0k6n7m5j4lM2M0M3J5j7n1m6l3JM5M4N7jj5l2n4l6
4798f9nL1M4N8K3j5m8n6k8k5L0N7N8J9ll8n8m5j4K1O0M5L2ql2m0o0k4L4M2N3M1
4830H0lk4n0n7k3QL2P1K4J8m0n5m2oRL3M7L3K0l5m7l0m1lL4M7L4K6rn2n2rj3L1
4864d4M3N4J8k8l2m2k4jJ2M6L9J8km3l9l4lJ1N0M9J4kl0n5l8MJ1L6N0K6k3j5n1
4897b5k7j8PM9N7J6Qm1n0l3k1K2M1L9L4J3l1m7o5j7K2M0N2K9Oj9n1m9j5J0L1M9
4929A6M3J2l2n1l0l4ML1N7M4J8k2m2m5l5OJ9M3N0L0j3m1n5l7kK6L6M9RJ0m9l6
4961b1l9k1K3N0M4K8Nm5k9l4l0J3L9M1K9Kk9l3m3rkL9M8K3Ol4k6m3j4J2K7L9M4
$$ y = [-66, -84, -67, -12, 35, 65, 62, 33, -13, -69, -79, -59, -10, 32, 68, 79, 37, -17, -64, -70, -58, -17, 26, 68, 89, 42, 0, -51, -68, -59, -10, 26, 54, 70, 45, 0, -43, -69, -57, -21, 35, 64, 74, 48, -9, -54, -68, -71, -29, 11, 54, 69, 52, 1, -45, -78, -77, -32, 12, 69, 68, 53, 21, -33, -69, -74, -43, 1, 59, 82, 67, 19, -37, -65, -90, -60, -3, 55, 74, 71, 33, -25, -70, -84, -63, -3, 42, 74, 66, 34, -6, -66, -90, -56, -14, 39, 80, 77, 53, 3, -54, -77, -69, -37, 34, 58, 76, 36, -19, -61, -67, -58, -25, 22, 55, 75, 40, -7, -37, -78, -81, -47, 0, 34, 60, 51, -1, -53, -62, -75, -44, -1, 53, 71, 43, 11, -31, -55, -56, -44, 2, 41, 59, 57, 14, -25, -59, -62, -51, -1, 48, 62, 60, 30, -25, -63, -59, -48, -12, 38, 64, 41, 26, -25, -52, -70, -63, -14, 43, 59, 67, 26, -24, -57, -78, -56, -15, 24, 58, 71, 40, -7, -72, -89, -67, -27, 25, 54, 60, 41, -10, -59, -74, -64, -33, 16, 59, 71, 39, -12, -42, -76, -72, -41, 16, 60, 78, 56, 14, -31, -66, -60, -41, 2, 52, 82, 69, 28, -27, -64, -66, -40, -4, 45, 54, 64, 15, -21, -60, -81, -58, -8, 36, 64, 69, 24, -5, -39, -69, -56, -17, 24, 53, 55, 26, -7, -50, -59, -61, -22, 26, 49, 55, 21, -5, -48, -62, -50, -23, 16, 60]
4994F0pj2n3k8j8JL6L5L6J4k4n2k7k3QL6M4K9mjm2m4k6jK9M6L9J1rm6m9m0J9K1
5028d2M6M2J6j4m5m1l0qL6M1L7J9rl1l6n2nJ9M0N3J8nl1m2l9rK1L7L2L9Jl1l3
5061fl5l0K6K7K9N8Nk8m3l7k9RJ5O6K3Pjn5m2k5J0J7M9L9%j0k0m6l0KK2M4K4J2
5095D7j5j4n5k3jK4M3L1J2j1m6k1j8k0K7M1L0J4ql0j9l9j1K6L4L1L0ql1m1l0j0
5127f1K9L1N7Kll3m1l1LMM4L4J8Rl4l7l0k1PM3L2K7Lj8m4n0j0jN5K9L6Nj8l4m5
5162d3k0QK2K9M9J2k0l4m4k3OK0M4K7K7j6l2m1l0JJ9N3J7L4j6k8k7n0J2RK7M3
5194C5K6ok9k2n9LJ8J6M8K0Lk3l7l3j2J1K6L1L5%l1k5l5l0K2K6K6M1Mj6m3m2j2
5227f4J9K4M1K6Lj3m5l3jkK3L5L1Qj7l0l4k1pL9K0L9J8j9k6m3k5RJ8L6M9j1kk9
$$ y = [60, 53, 41, -12, -40, -58, -57, -21, 14, 50, 64, 40, -12, -39, -62, -54, -18, 26, 55, 51, 50, 8, -36, -62, -63, -34, 12, 51, 62, 53, 7, -42, -82, -63, -42, 4, 46, 62, 48, 3, -38, -68, -76, -40, 1, 38, 57, 48, 17, -19, -71, -76, -57, -17, 36, 54, 49, 18, -24, -63, -72, -51, -14, 18, 57, 58, 27, -6, -41, -71, -45, -18, 11, 69, 74, 46, 3, -34, -63, -54, -39, 27, 50, 57, 56, 1, -41, -66, -56, -39, 10, 49, 49, 39, 19, -27, -57, -55, -33, 11, 35, 47, 32, 18, -37, -60, -61, -37, 6, 37, 49, 38, -8, -29, -47, -67, -40, 1, 31, 45, 37, 7, -12, -51, -62, -36, -2, 29, 59, 51, 20, -21, -51, -61, -32, -1, 56, 58, 55, 22, -19, -50, -47, -43, 1, 35, 53, 62, 28, -9, -39, -60, -53, -10, 22, 49, 52, 34, -10, -60, -70, -71, -16, 13, 49, 54, 36, 2, -43, -63, -55, -33, -4, 45, 57, 37, 3, -41, -64, -58, -38, 6, 33, 60, 44, 12, -29, -59, -58, -39, 14, 31, 65, 49, 21, -6, -56, -44, -35, -8, 35, 61, 55, 26, 4, -55, -52, -34, -18, 30, 50, 53, 30, -7, -40, -52, -41, -15, 16, 51, 51, 20, -5, -40, -70, -48, -22, 4, 45, 49, 33, -10, -52, -64, -45, -21, 20, 46, 49, 36, -9, -42, -43, -45, -22, 13, 44, 52, 35, 5, -29, -50, -57, -18, 2, 41, 59, 40, 14, -29, -54, -45, -27, 9, 58, 47, 45, 16]
5261A6m1k3j2K0M8K8K6k3k4l9l4%K4L2L5K0ql4l8k2j4J5L6L3J7J4k5l1m9mPL4
5293a6L4L2j3jl2l7j4oM1L0K7%j6k4l0j5jPO0K1pJl5k9l2J1K3K4L7J2j3l3k5l7
5327e6J2J5M8K1Ork9l4k4JK0L9J8J5j1k3l4k5j4L9RL9K8qm9k7%j3K1L6K1K6ol2
5361B0l6j8rPL5L7K2j6k1k2l7j3MK6M6K1Kj6l8k3k7J1L3L2L3Qk8k5m6j4MK5L0
5394GK8K0k2k5l5k4jK5K6K5J3%k0l8l6KK5M0NM1k3j8l7rj0RK1M5NJk4j6k7pJ2
5429b2J7L5J1mk3k7j7LmK9J9J8lj6j7l2kjK5K8K3Jj5l5k4j1J5OK5M2j4j3l5j1
5463b9nmK6K9K3Mk6k1k0k6QJ9M1J4OKl2k3l1J3J6K5K7J0ml8k8j4QJ2L9K0J0J0
5497F1l9l3k2jJ7K6K8kJ5k5l1l2j9J4M8K0ONj1k6m8KJ2J1L6RNpk9k0j9PM3J6J2
$$ y = [16, -25, -48, -60, -40, 8, 36, 62, 39, 15, -24, -58, -58, -34, -2, 33, 53, 45, 11, -27, -49, -63, -48, -12, 21, 38, 52, 27, -4, -53, -57, -50, -16, 18, 50, 37, 36, 4, -33, -47, -53, -12, 18, 45, 45, 29, 5, -25, -40, -41, -34, 26, 47, 40, 41, 6, -23, -55, -44, -21, 3, 40, 52, 39, 6, -19, -56, -44, -29, 19, 40, 46, 37, 8, -26, -50, -49, -29, 10, 28, 43, 32, 9, -25, -50, -64, -25, -16, 23, 51, 43, -6, -33, -33, -46, -25, 11, 32, 58, 52, 20, -16, -34, -43, -36, -1, 36, 58, 42, 21, -1, -38, -51, -47, -21, 25, 46, 48, 32, -6, -29, -56, -45, -12, 20, 53, 61, 33, 8, -38, -52, -48, -23, 7, 35, 55, 33, 8, -27, -51, -52, -27, -1, 24, 37, 37, 17, -21, -57, -55, -30, 10, 15, 56, 33, 15, -22, -31, -41, -32, -11, 34, 39, 40, 16, 0, -27, -34, -22, -5, 30, 41, 37, 14, -13, -30, -27, -31, -2, 17, 35, 32, 16, -1, -33, -35, -36, -11, 17, 40, 41, 26, -9, -33, -44, -29, -23, 2, 44, 30, 17, -18, -29, -34, -38, -12, 17, 40, 44, 18, -3, -23, -49, -41, -22, 19, 33, 39, 41, 9, -14, -45, -32, -16, 9, 36, 46, 42, 4, -24, -38, -30, -18, 21, 41, 51, 61, 22, -11, -33, -34, -17, 9, 37, 35, 50, 25, -6, -38, -57, -43, 5, 25, 31, 36, 25, -1, -49, -47, -35, -24, 12, 21, 26, 19, -10, -30, -49, -42, 1, 17, 29]
5532B9Pj3k0j9k9J6K1J9J3J2Jk9l3J5k2J5L3RPj4pk5k2J4LL1K6Kkl5j4j5lJ5K7
5567A3J7JKl5k6j6QK4J6J1J9nk3l0j2rRL0L4J0j3rk4k3koK6K5K2Rk0k0l6rK2O
5603a4M4J6mk3j3l4oJ0K9J3J4Rk1k6j2j7NJ2K4L8j1%l4k9kpJ5L7J4Jrj3l1ppJ8
5639b1K6J0J8rj7l3qlMK9LK1j3nk0j2lJ3K4RK4rj4j7k6oK2RL7%mnl5j6j5K4J8
5676@J4K0Ml4nl3OJ3LK5K7%m4oj2qLK1J3L1j0k1j1k5j0PK5K6Okrk4k7rJ2K8J8
5713A2J4J5l4ml2qJ2K1J1J7K1nk3l8k2OK9J3J2K3Jl2j6l0KJ5J7J9K2kqm3j4kR
5748b2J8J8K2oj5k0j2k3K0KK8J2Kk1j0j0k1J3J3K7JmLj4k8jNMK5J4Qrk5j7mKK7
5785BRK2pkl5%nmJ3J7J9oJj8k5pJ4LJ9J3Oj6qj4Jj9K2J8MOpj5k3kj0K4K3OJ6j3
$$ y = [29, 36, 23, 3, -16, -45, -29, -8, 11, 24, 36, 37, 8, -25, -10, -32, -17, 16, 25, 32, 18, 11, -14, -36, -22, -19, 12, 38, 40, 38, 3, -11, -26, -29, -14, 13, 30, 31, 33, -2, -28, -44, -36, -12, 4, 15, 34, 29, 6, -24, -36, -45, -36, -6, 28, 38, 25, 16, -8, -31, -33, -39, -13, 12, 34, 43, 23, 3, -33, -42, -20, -14, 30, 46, 42, 19, 6, -28, -34, -24, 5, 18, 32, 41, 20, -6, -18, -35, -30, -18, 6, 44, 33, 33, -1, -30, -32, -39, -24, 13, 27, 28, 19, 6, -25, -32, -39, -21, 5, 15, 33, 24, 7, -26, -34, -37, -33, -4, -1, 20, 7, 2, -18, -30, -33, -20, 4, 13, 37, 28, 14, -3, -29, -35, -13, -4, 33, 33, 29, 24, -11, -27, -42, -18, 0, 14, 34, 38, 4, -1, -34, -28, -15, -12, 13, 40, 40, -4, -10, -22, -30, -27, -6, 7, 38, 28, 7, -4, -29, -39, -32, -7, 19, 25, 23, 14, -10, -37, -46, -34, -6, 12, 26, 41, 7, 3, -29, -37, -25, -4, 7, 24, 45, 40, 17, -21, -43, -37, -8, 5, 17, 40, 41, 9, -7, -37, -35, -20, -3, 16, 38, 36, 28, -15, -29, -31, -22, -4, 14, 36, 30, 15, -5, -17, -40, -20, -18, 10, 22, 24, 3, -7, -17, -38, -25, -12, 15, 16, 12, 15, 1, -27, -28, -23, -19, 6, 20, 28, 19, -6, -23, -27, -25, 2, 11, 33, 26, 24, -11, -11, -16, -20, -7, 10, 29, 23, 24, 6, -19, -26, -12, -9, 10, 23, 29, 13, 5, -9, -8, -27, -5, 13, 17, 23, 16, 1, -22, -24, -34, -10, 13, 19, 35, 22]
5825B2k3l1OjoL3J1J5mk1nk6jLL0QJ9Rl0j3k3nJK1L1KJnj8k5kJJ9J4K3Pj1j1l2
5864a7Mj1J7J6PJ7j2j5k1j6PKK0K2J0j7nj9qqJL0J4Mnj6j1j9jRL6pJ5lpj8j7%
5902b2K0LJ7Nrlk6mLj0K7K2npQk6j6OJ0J5J8qQj8j2j4PRnL0Jj2Rl3j9J7NlL0J0
5942B8qpj8j4j1nJ4K5POj6jk3mj1K2J9J2J7k0%j1j6j0NL4%J5lj1k8o%lK9J1ll
5980A2Kj9j6KJ0LK3J2nj3k4Jj3J4J0J5O%j2jk5j3J4QJ5Ronj7mkkML2J2j5j3pj1
6019a9qJ4RJ4J9nj4j8rMOJ4KJ3Mj0j2j3oqK1J5J8jj4j8nk0LK2OJ3Mnk2mrj2QK6
6059CK3rJj7k0mj7J9J9NJ4kj1k0%JlJ3QK0j1j2lj5nMJL1KPk3Lj8MkKK9pNPnl1
6101a4mjJ7NJ2Kk2Rj0k0J6JJ0nNJkj3j6QJ7J1Lklk3qkJ1J4KOLmk0Kj0J4LRJ1J3
$$ y = [22, -1, -32, -26, -27, -33, 0, 11, 26, 22, 1, -4, -30, -31, -28, 2, 10, 29, 38, 8, -5, -28, -33, -32, -11, 20, 22, 23, 18, 0, -25, -27, -26, -7, 7, 30, 37, 26, 15, -17, -13, -24, -7, 9, 16, 33, 21, 6, -15, -31, -24, -22, -2, 20, 30, 13, 8, -11, -19, -27, -26, 4, 18, 22, 17, 1, -10, -29, -30, -21, 15, 8, 23, 20, 13, -5, -22, -22, -2, 1, 18, 23, 14, 11, -15, -19, -16, -26, 1, 23, 18, 11, 19, -7, -23, -17, -7, 8, 26, 18, 26, 8, -4, -18, -11, -2, -7, 23, 24, 12, 21, -12, -31, -14, -9, -12, 18, 28, 20, 13, -5, -19, -30, -35, -21, 4, 11, 17, 1, 0, -23, -27, -38, -16, 3, 15, 32, 12, 12, 1, -15, -25, -20, 14, 14, 29, 26, 15, -13, -19, -19, -22, 7, 18, 15, 12, 14, -5, -21, -19, -9, -6, 17, 29, 24, 11, -13, -12, -25, -11, -1, 14, 20, 20, 8, 7, -18, -31, -17, -9, 6, 15, 9, 4, -13, -17, -19, -21, -17, 15, 27, 12, -1, -8, -19, -27, -13, -4, 10, 29, 24, 10, -8, -17, -13, -7, 7, 9, 22, 26, 16, 4, -9, -15, -23, -2, 13, 31, 30, 16, -2, -7, -27, -24, -2, 4, 17, 21, 16, -6, -10, -19, -31, -23, 3, 26, 17, 18, 1, -19, -23, -40, -21, -2, 3, 17, 15, 4, -16, -16, -15, -18, -5, 3, 23, 12, 0, -3, -18, -23, -19, -18, 13, 15, 22, -1, 2, -16, -12, -14, -12, 17, 10, 15, 22, 17, -14, -18, -19, -2, 3, 15, 17, -5, 4, -6, -26, -10, -9, 1, -4, 1, 2, 0, -13, -29, -21, -4, 7, 10, 8, 5, -18, -26, -28, -17, -3, -1, 5, 8, 4, -16, -14, -24, -10, -7, 2, 13, 26]
6143B6j3j8j0%j0J9J6Pjkj2kk2oJ0KL9rKok7OJmK1MKLlk5j1KjJ9PLJ2j4rk1Rj3
6185b9K0K0nNoqj6j0JJ5K1Rkj0j2Pj9j0K1RJ5nrnNj7RONOLrPk0j0J5lK1%jooj2
6228a0lMlK1JNj7nj2LRj6RJ2OPk8jMj2J5ORMjrnj1oJ3J4LONj2j1rj0K0PK0j8J6
6271B0oj5k0LRPpK8j2J1j0k0jMNQJ5qMj4pj2QPRJNnQk3mNrJ6Njjlj5jllJ1J4%
6316C%loqNLkRK3pj0j4qK3k7K2J6qmk5J0qmK4%J1j2J4j2j7J3j0jPJ8lmj0kj1L
6357a2J3pK3j1j0Lk6J1%jNJ0JMrqlj1PJ4PJ2okj5lrJ3NNJ4j1Oj0j7K%J5KJ1No
6399A1romrJ6J6pJ0Mk2J1k3oJ2LJ9j1OLj8Mj2J1NnqJ2j0lqpQJ5qKJ0pmj0OL%J6
6442FJ1j2rNj5%LPJ1nLrjlrRNJ1LPj7kKj9K0jJ6Mj8mj1JLlRJ8Jj2njj5%OnJ6J0
$$ y = [26, 13, -5, -15, -15, -25, -6, 10, 17, 16, 14, 2, 0, -22, -28, -18, -16, 23, 14, 16, 10, -17, -11, -10, -14, 7, 11, 13, 16, 13, -12, -23, -21, -22, -3, 4, 7, 19, 5, -4, -25, -16, -29, -9, 11, 6, 11, 5, -3, -19, -29, -28, -13, 8, 17, 15, 5, -7, 0, -19, -29, -8, 1, 16, 11, 2, -3, 2, -15, -6, 0, 5, 11, 14, 5, 12, -8, -18, -3, -6, 15, 15, 14, 8, 2, -10, -13, -9, -12, 9, 10, 15, -2, -7, -19, -16, -7, -23, -14, -2, 4, 11, -17, -18, -14, -26, -11, -5, 4, 8, 7, -2, -7, -18, -24, -11, 3, 6, 12, 17, 5, -6, -15, -25, -5, 2, 22, 4, 20, 14, -1, -21, -18, -9, -2, -9, 19, 7, 18, 8, -12, -13, -9, -4, 4, 19, 11, 15, 1, -6, -18, -10, -3, 6, 7, 12, 7, 15, -8, -12, -7, -16, 0, 5, 4, 3, 0, -15, -16, -19, -22, -11, 3, 3, 3, 0, -6, -14, -9, -6, -8, 1, 24, 17, 7, -7, -15, 8, -19, 3, 19, 11, 7, -18, -8, -16, -20, 4, 4, 15, 3, 17, 5, -12, 1, -9, -10, -3, 15, 12, 8, -2, -4, -15, -12, 1, -6, 17, 6, -4, -1, -27, -16, -16, -17, -12, -2, -1, 3, -6, -14, -17, -28, -21, -7, 0, 12, 6, 4, -11, -14, -23, -10, -5, 0, 14, 3, 9, -1, -18, -16, -16, -1, 1, 12, 17, 11, 2, -4, -8, -17, -1, 15, 8, 18, 22, 0, 11, -12, -18, -6, -3, 16, 5, 11, 14, -4, 0, -12, -1, 4, -1, -9, 3, -7, -10, -18, -25, -17, -2, -10, -8, 2, -5, -9, -19, -13, -10, -10, 6, 17, 5, -4, 1, -14, -14, -11, -4, 7, 2, 5, -4, -5, -8, -17, -8, -3, 8, 11, 18, 1, -1, 1, -18, 2, 1, 17, 21, 3, -1, -12, -11, -8, -11, -2, 16, 17, 5, 0, -1, -16, -16, -10, -15, 1, 11]
6488A1k1J6j4qLoJ0J9jrMNqk2LJ7J7pQrj1qJ4lqLJ0Nnjj1pJ2j2K2j3K2lLoj0l
6530bmJ1J2Orqj0qNJ2j2J1jj0J3j1k0PJ4pOjJ0lj7KLRoPJJ2rj6QLLkJ3Mj1kj0
6573gJKj3J4LRj4J8j4qoRMKRKkj9lpJ0J3OJ3kj1j2plJPKJJ5lk0Omj7MRK3Oj3j0
6618fJj3KJ0RLQmnj2rKQQQQj4jjj4O%NOkKj0ProJ4J6Jqj2rLOj7J2K4mjommk1J7
6666fj6L1prJJkpNj0K3N%Mj8qLkMJ5PJ%j4pjpJ3lJ1OkjnKj2lOJ4J3llj3j7J0N
6712DlJ1Pj1Pk0Mj2JKJ0M%Jpr%j1J4QJ1krnolnJ4%QJ2J0k1j5RpNMNNj1J0j2k1
6756b4K1LlPRJj0J3j6Pj7J3R%jLk3jMJ1mPpJ4Nj9j6MLpK1Kj3oJLj7J2J4rPjKj2
6800a0koOPJ5Okj0Pk4LJ0k1K0MJ5qj2ooJJ3JJ7kmMk0JqJ7jJ5J7k8j0qj0mJ8rK6
$$ y = [11, -10, 6, -8, -16, -13, -19, -9, 10, 9, 0, 4, 9, 1, -21, -18, -1, 16, 9, 17, 8, -3, -11, 3, 0, -8, -5, 5, 10, 5, 4, -7, -14, -2, -14, 8, -5, 17, 14, 17, 11, 1, -2, -6, 5, 17, 23, 14, 6, -4, -12, -7, 5, -7, 4, 3, -7, 6, -5, -25, -18, -4, -11, -5, -6, 4, 1, -16, -14, -11, -2, -8, -1, 0, 12, 3, -13, -5, -2, 1, -1, 12, 16, 5, 3, -7, -6, -4, -17, -3, 0, 9, -5, 13, -1, -9, -15, -6, -2, 0, 9, 11, 9, -10, -13, -20, -10, 3, 9, 22, 20, 9, -3, -10, -13, -12, -5, -3, -2, 13, 10, -10, -4, -8, -25, -21, -12, 11, 17, 4, -6, -5, -18, -16, -6, 3, 6, 14, 10, 5, -7, -16, -14, -6, 2, 10, 18, 4, 3, 2, -12, -6, -6, -1, 5, 3, 5, -5, 2, -7, -13, 1, 17, 18, 10, -2, -11, -8, -2, -19, -7, 17, 13, 12, 6, 2, -2, -23, -6, -22, 9, 2, -7, -6, -5, -7, -14, -9, -19, 4, 9, 9, 13, -5, -13, -10, -12, -8, 7, 14, 15, 15, 1, -6, -7, -14, -1, -4, 7, 13, 11, 10, 5, 7, -5, -8, -2, 12, 25, 22, 19, 6, -11, -1, 4, 1, 12, 19, 8, 15, -5, -1, -13, -12, -10, 0, 4, 4, 5, -2, -11, -11, -22, -8, 0, 11, 9, 0, -5, -11, -14, -19, -5, -5, 3, 15, 25, 4, -11, -2, -9, -4, 0, 5, 10, -1, 9, -3, -24, -3, 0, -3, 4, 13, 14, 4, 17, 1, 8, -9, 4, 13, 13, 12, 15, -8, -9, -5, 6, 2, 9, 2, 16, 21, 2, -14, -10, -7, -14, 7, 9, -4, -10, -9, -6, -23, -11, 3, -6, 1, 0, 2, -10, -12, -18, -12, -5, 10, 16, 14, 4, 11, -13, -10, 0, -21, -1, 3, 18, 10, -2, -8, -14, -13, 0, 1, 18, 16, 12, 16, -4, -3, -11, 6, 5, 20, 37, 9, -1, -9, -19, -23, -5, -14, 12]
6842A2Oj3kj8J%rOK1KKj1J2k7LJ3j5RRrQqopJ7J3j2%J7j2LqopK1J5j3mJmqqJ2
6885doJ3J2Lj2om%K%J2J1k2J3k6NKoJ3kOLPk7nj0PPRJ0Jj5JolpJ7J9j1ROj8mj6
6929b2RQJ4LMjrLj5j6K5J3LkPj8nMk2jK1J1qK4j9j3jJ%%J3J3j0jnj6j5KJ5%QJ1
6971A3j0%j7j2J7PjNpJ3nj8J3j2J0RNJ3j2kqonKJ8NMj0qj4K%J1MJ1Llkl2M%%K7
7014A2lNj0qjnknJ1NJ3lmk1NpNJ6RpJ4j7j8knJ0J2nJ6J4j7j3j3oMJ5J4jMrjj6
7056a5J0nnK3R%Jj2j3MmLJ9oJ1j1k2j0mK1lJ8J4k1J4j5j3jp%J9J1o%j1Qj2KlM
7096hJ5P%kk6KklK6n%mmj3J0rL%K0NNk2KolKJ5MJ3Joj3j4j1J6J2J2OqJ1k5ql%
7140h%K8nojk3j4KPKK3kJ6k2Jk7J2kKJ8Qj%%k3kkJ9J1JJ1j6lj4j3NkJ2J9%%%j9
$$ y = [12, 18, 5, 3, -15, -14, -14, -23, -17, 4, 6, 8, -3, 9, -18, -15, -2, -17, -8, 1, -8, 0, -8, -14, -21, -4, 9, -3, -3, 14, 2, 5, -3, -9, -16, 5, 20, 7, 3, 4, 0, -8, -16, -4, -10, 3, 15, 18, 6, 0, -4, -4, -2, -2, 10, 21, -1, 12, -14, -9, -7, -13, 0, -2, 4, 7, 14, -13, -18, -28, -21, -14, -5, 5, 6, -9, -8, -14, -17, -24, -7, 12, 1, 10, 16, -2, -6, -22, -13, -5, 9, 12, 16, 15, 6, 9, -6, -22, 3, 16, 19, 17, 24, 6, 1, 5, -17, -18, 3, 14, 6, 30, 11, -2, -3, -2, -2, -2, 11, 24, 14, 13, 8, -8, -23, -21, -6, -6, 2, 13, 3, 3, -14, -26, -9, -2, -3, 2, -5, 8, 3, -15, -2, -14, -4, 5, 10, 23, 11, 9, 1, -5, -10, -8, 10, 15, 19, 9, 1, -13, -11, -11, 0, 4, 15, 18, 15, 13, -19, -15, -15, -15, 12, 9, 14, 4, -4, -5, -10, -12, -17, -6, -1, 12, 9, 5, -16, -11, -18, -13, 3, 12, 5, 19, 2, -16, -18, -23, -13, -1, -6, 10, 24, 7, -6, -19, -25, -21, -6, 8, 7, 11, 2, 1, -15, -5, -10, -15, 8, 17, 17, 18, 6, -7, -3, -7, -4, 15, 9, 20, 9, -13, -23, -27, -6, -9, 9, 23, 2, 16, 1, -12, -13, -20, -20, -1, 10, 4, 4, -7, 1, -11, -9, -12, -8, 7, 14, 14, 12, -14, -12, -14, -17, 9, 4, 4, 0, -4, -17, -7, -16, -13, -13, 7, 12, 17, -5, -3, -9, -12, -10, 5, 9, 22, 23, 17, 4, -10, -21, -5, 7, 19, 25, 17, 28, 3, -5, -8, -8, -8, 20, 15, 9, 8, -15, -29, -27, -20, -18, 5, 3, 19, -3, -2, -29, -17, -19, -17, 1, 9, 8, 8, 8, -15, -17, -19, 0, 11, 12, 23, 7, 4, -10, -23, -18, -20, -8, 11, 11, 11, 11, -8]
7183hj6jJ4J9LPMj4j3%nLMJ5J1rqnk8K1j1J7PJj0oj2J0j5%J4J1Ro%k2rKJ0QPJ0
7225INoj4j3K%J2J1Oj4J1j9Nj%J2kNJ8j0qj8JoJ4KNQ%k2j1jJ2LJ2j2J6Knj9oO
7267a0QOnJ0Mj9prMLJ5PJ0pk2Oj9NJ0J0J2%Rj1j5k4J4J2MQJ0jrj1rLkJ3J8Oj6
7308A1qLpj4J2oJ4PlJj1k%j8K2QJRrk2Oj9J0RJ3J1p%j7nKk1L5pJ0KoNl8J2mJ3
7350hMJ6J3j6pj2rMkK4%K4j9j2%%j4nJ6K2Okj5j4j6QLJ6oJ3Opk4Nj5nK9J8kj8
7390aQk8J6j0pNK3J1oj1pqj4PRJ5MmJ7k4k%k0J0K3qJ1J2k7J0k3lK5J4lkJ0j4j0
7429bj3rJ6PK1lQkl2pLK4kpK6rk4k4PLNJ2J6q%j3oOj0jOJ2J1lkk9pJ0rJ9K5kk
7472A1oj4jj8QK3J7kkrpj0j7J4qL4J2pJj3k0MkmJ8K6Ol2pmkj0kK3K0%pj0k0j7
$$ y = [-8, -24, -25, -11, 8, 11, 18, 22, 8, -5, -5, -10, -7, -3, 12, 23, 14, 6, 1, -27, -6, -17, 0, 7, 8, -2, -8, -20, -10, -25, -25, -11, 0, 9, 3, 3, -19, -28, -26, -16, -8, -1, 9, 14, 8, -6, -19, -17, -17, -5, 6, 12, -2, 9, -10, -5, -6, -6, 6, 4, 9, 27, 17, 9, -9, -8, -14, 0, 2, 7, 15, 15, -7, -18, -19, -7, -4, 8, -4, 12, 14, 9, -10, -16, -10, -2, 4, -1, 9, 13, -6, -13, -22, -18, -15, 0, 7, 17, 10, -12, -6, -25, -20, -10, 0, 12, 12, 21, 10, -5, -29, -15, -3, 1, 9, 19, 18, 9, -2, -11, -8, -10, 3, 21, 27, 11, 3, 6, -1, -15, -3, -9, 5, 12, 9, 10, -1, -3, -3, -21, 1, 9, 10, 19, 10, -12, -6, -25, -15, -6, 7, 18, 11, 11, -6, -11, -9, -30, 5, -2, 8, 10, 4, 9, -29, -17, -21, -8, -4, 12, 25, 9, 2, -10, -19, -15, -17, 7, 7, 31, 12, 0, 0, 0, -14, -19, -3, 19, 25, 23, 8, -6, -22, -14, -11, 5, -1, 12, 18, 11, -13, -8, -23, -28, 1, 19, 17, -1, 7, -21, -5, -15, -22, -17, 6, 17, 11, 0, -7, -15, -29, -22, -13, 2, 6, 2, 19, -5, -7, -7, -27, -17, 6, -2, 9, 21, -6, 4, -19, -22, 3, 17, 14, 12, 22, 8, -2, -15, -24, -8, -1, 20, 17, 25, 23, -9, -16, -13, 11, 9, 2, 28, 19, -5, -29, -22, -19, -14, -2, 14, 6, 6, -7, -13, -7, -17, -18, -12, 0, 11, 8, 6, -23, -30, -20, -29, -10, 15, 13, 11, 5, -9, -10, -28, -20, 3, 20, 18, 16, 7, 0, -10, -27, -13, -21, 13, 25, 18, 19, 6, -14, -10, -12, -16, 2, 28, 34, 2, -5, -9, -11, -21, -23, 0, 20, 20, 13, 3, -17, -34]
7512c4J3LK4oJ1JKl1lpJ0J4K1Nj5j0jj1j1J9J0J9qPk0mj3JnK9pJ2jj8Nk2J1mJ5
7551AJ8Lj0pj2jj%OJ1LMJj9j1lLOL0omjj0j9MOJMK2pJk1opJK0LK3oj3Nk9k%J4
7596eK1Mjqmj7mKJ2J0QJ3j6oj6jpOjK7LKj1j7rMJ0PJ3Qrmk6%nJRJ8Nmrqj9kpK2
7642a1K6Orj0nj5qMJ9PJ9k0%qmj1J2kL2J1j5lj6pqqK7JK8j0nj5nj9J9qJ6K0qR
7682B6k3mj0KKJ4NRJk0j0j3OkJ8J4mJ0j7j0k0J1lJ3J7NPj3j4j6j0jL1QJ8%j7p
7720Cj0j6J6J3PQOj8olj1mJ7J4jJ4j2ml2lOMK2OkKk6Mj7kkL2J0%rj4m%kkJ2J8
7762A4Nrrk2ooK1K0jLLk3jj2j2K5RJ7mJ6l6Lj0%NLK8NMj8j2mJJQJ0jJ3j2k0Mk1
7804b1LOJ6POj5r%j0mJ4J4Qjqqk5KkK4J2J4oj6kk2OqJ9oK7Jj0j0j4oLJ0K3Rj3
$$ y = [-34, -21, -18, 6, 0, 11, 12, 14, -17, -20, -27, -17, -3, 18, 23, 8, -2, -3, -14, -25, -6, 4, 23, 15, 22, 2, -2, -15, -14, -19, 10, 3, 15, 14, -4, 1, -21, -10, -14, 1, 19, 22, 12, 5, -7, -8, -9, -9, -3, 8, 11, 15, 16, -3, -14, -17, -14, -8, 22, 16, 12, 11, 1, -18, -14, -8, -7, -3, 19, 12, 13, -8, -14, -21, -20, 0, 3, 26, 20, 7, 12, -17, -19, -19, -5, 16, 20, 19, 11, 7, -10, -14, -12, 0, 10, 18, 31, 15, 9, -7, -8, -15, -9, -10, 17, 20, 22, 11, -6, -15, -11, -1, 6, 19, 27, 18, 14, -12, -12, -17, -16, -7, 11, 16, 12, 3, -5, -24, -26, -33, -11, 15, 21, 12, 2, -3, -18, -26, -22, -3, 4, 23, 3, 3, -5, -9, -20, -8, -10, 22, 33, 18, 15, -1, -8, -16, -24, 3, 4, 32, 22, 17, 2, -3, -22, -3, -11, 5, 25, 17, 26, 3, -1, -11, -9, -7, 7, 12, 21, 22, 2, -8, -21, -15, -17, 1, 15, 11, 21, 4, -6, -26, -15, -18, -5, 12, 17, 24, 11, -3, -19, -29, -30, 1, 9, 27, 27, 10, 3, -7, -23, -7, 6, 13, 21, 27, 9, 3, 0, -11, -15, 2, 16, 15, 29, 17, 13, -19, -22, -16, -12, 10, 16, 14, 16, -10, -6, -23, -25, -27, 5, 15, 15, 6, -8, -12, -12, -14, -16, -4, 14, 19, 10, 1, -21, -27, -33, -12, 8, 7, 10, 13, -10, -11, -23, -35, -10, -1, 16, 12, 28, -8, -5, -15, -15, -10, -7, 21, 26, 30, 12, 0, -4, -3, -2, 6, 16, 15, 28, 16, -4, 0, -21, -18, -12, 4, 11, 17, 2, -7, -7, -17, -21, -7, 7, 15, 14, 6, -2, -27, -25, -27, -3, 9, 23, 17, 1, -1, -23, -17, -25, -6, -12, 15, 16, 6, -4, -18, -24, -21, -11, 12, 21, 8]
7845HNj3nj6nJ6J2K2j1J3j8Jj8QNnPJ2Jpj4j6%rK4PPPj4j8lojK6RKjj4j2m%mJ7
7888eJJ9jj0pok1K9Pj0K3Ok4j1j6J2j5K9J2oJ8pk0kr%QJ6MMNk2jj7JJK5J5kj5
7928Hpqj2n%L4kNrPj2l0KQJ4K4j3J5k3qj0j2J0K5J3nJ1k2Kj7j0NJ9K7Mj5jj0j7
7967a5oJ9ROqK2oj5j2JnPJ2J7rMj1k3lPlNK6%j6nj1j4kJ3K4LK1l9J2j2rrJ3J3
8007AJ8%pk0nk1J2RJ7K7rkj7j1oKNJ9J1jJ3k5j6mk0K5K9j4MPj0j1rj1kK7J4Mj8
8046EJj6j3mNJ8J4PKj8mrk1J8%K5J0lj0l0j1kK1OMK3nLj7j4j4J5J7J1LnoQj3k4
8086b3QJ5J3J3mnj2rjmKJ4J1Qlj8j6J2j6QNJ6LQj5k1jj2NJ2J9J4mj1qj3j6QL0
8125A2oJ1pn%k9%MmM5Kj6pj1ppMJ2J7mJ0Kk2pj4RQJ2J3J2nok8j3QJ6J0J2Jpj3
$$ y = [8, 13, 0, -5, -21, -26, -10, 2, 24, 13, 26, 8, 9, -9, -1, 4, -1, 6, 18, 19, 12, -2, -18, -18, -27, -3, 4, 11, 18, 4, -14, -17, -23, -24, 2, 11, 13, 12, -2, -14, -18, -18, -22, -5, -4, 15, 14, 4, -3, -9, -30, -1, 6, -4, 19, 25, 1, -10, -26, -14, -29, 0, 12, 6, 24, 17, -3, -5, -14, -14, -6, 10, 14, 18, 23, 1, 0, -17, -16, -15, 10, 25, 23, 8, 1, -7, -19, -24, -24, 10, 8, 13, 4, 11, -1, -31, -29, -21, -7, 17, 4, 19, -4, -12, -22, -34, -24, 1, 14, 9, 20, -2, 0, -17, -27, -22, -3, 24, 28, 13, 12, 2, -15, -21, -2, 7, 13, 5, 27, 21, 6, -6, -5, -10, -3, 9, 26, 17, 21, 10, -13, -16, -9, -12, -7, 19, 19, 3, -2, -13, -27, -29, -16, 8, 11, 32, -7, 5, -7, -16, -25, -12, 1, 19, 19, 12, -8, -13, -34, -22, -13, 4, 31, 22, 20, 3, -8, -14, -12, -7, 12, 23, 22, 35, 10, -6, -10, -30, -5, 24, 10, 14, 21, 11, 0, -9, -20, -22, 5, 19, 23, 5, 6, -10, -23, -27, -22, -4, 10, 17, 19, 1, -3, -12, -33, -15, -15, 10, 20, 17, 7, -23, -34, -36, -15, -9, -5, 18, 13, 16, -1, -15, -29, -14, 3, 14, 17, 12, 6, 14, 1, -23, -15, 0, 13, 26, 22, 17, 5, -4, -5, -9, -7, 7, 18, 26, 23, 5, -11, 1, -15, -7, -2, 14, 17, 25, 10, -11, -12, -24, -19, -7, 12, 26, 22, 11, 3, -10, -26, -18, 12, 6, 17, 10, 5, 5, -24, -24, -20, -24, 21, 23, 7, 0, -11, -18, -25, -21, -9, 8, 4, 14, 16, -6, -13, -27, -18, -10, 2, 15, 27, 22, 16, -12, -25, -17, -1, 9, 21, 22, 15, 2]
8166Bqrj4K2J4P%jj2j4j9J5PLJ3J7j7rMk4NKJ1J2j
$$ y = [2, -6, -15, -29, -7, 7, 14, 14, 13, 1, -13, -32, -17, -10, -7, 6, 23, 6, -3, 1, -23, -18, -16, -5, 7, 6]
8191F
$$ Imaginary data points
##PAGE= N=2
##DATA TABLE= (X++(I..I)), XYDATA
0@%%%%%%%%%%%%%%%%%%qJ6j6J6j6J6j6K0k8L2l2L5m3M8n3O1o7P5q3R1j04J15j25
41f6J38j53J71j89K09k33K61k91L24l64M13m74N47o40P67r47J224j714K837r965
61h145k850J7784L140j855k315J191o423j1213o824P047J2605Q353J36j916k573
76F142n152q908n657K706R470Q595M320l93m402q221p788k764L086N267N935O459
92H695M115l817j0859r188n63N039L996L026O120O714j272j1170j1162j553O011
107e868M981K089L954O212Q00r085j1902m173M793O211L413L263M505Q16o895
122C114j0054n190K144N554N675N260L545j079o164p448m506k16L479O386P363
137G863M078k475p138o609l307r46J197N215Q518N863k193q113p153k952n92P93
$$ y = [0, 0, 0, 0, 0, 0, 0, 0, 0, 0, 0, 0, 0, 0, 0, 0, 0, 0, 0, -8, 8, -8, 8, -8, 8, -8, 12, -16, 16, -16, 19, -24, 24, -29, 32, -35, 40, -43, 48, -56, 59, -66, 72, -81, 90, -99, 110, -123, 138, -153, 171, -193, 220, -254, 293, -347, 420, -527, 697, -1017, 1820, -8145, -10995, 6789, 9929, 8074, 5759, 6950, 527, -10686, -17510, -10463, 2142, 10495, 10631, 8715, 6142, 990, -7918, -13575, -10869, -1399, 7196, 11516, 11123, 6721, -1500, -9288, -12052, -8966, -3699, 2236, 8695, 12810, 8993, -1866, -11054, -11617, -6578, -2582, 444, 6564, 13278, 12006, 836, -10326, -11879, -5868, -887, 1202, 5156, 11368, 12168, 3083, -8819, -12992, -8199, -1988, 1425, 4688, 9193, 10009, 3114, -6940, -12130, -9986, -4432, 1243, 6503, 10048, 8969, 2805, -4643, -9149, -9365, -5886, 500, 7863, 11941, 9466, 2328, -4281, -7588, -8534, -7337, -2122, 6396, 12259, 10066, 1953, -5200, -8152, -8744, -7951]
153g951M350Q222O854m97p263p785l939n98J328M143P310O676Q72n625p768n519
169g190j997J332M670O894N745J031m092o649o292l713N67N167P330N457J030
184I290l072n326n946m559m57M886P650N893J322k712m753n453m703j425L678
199e687P209O308J913k520m832n438m619j693K861O310O169K756j574m668n682
214c187m458j370K625N556N929L439o22m239n775m636j386K438N112N461L467
229H354j04l788n811n097j886K083M893N339L520J30l465n623n160k186J805M817
245b179N579L875M83l121n315n021k418J312M546N709M274Q35k960n301n230k862
261g794P26M078N618M483J251k641n261n445l308K78L790N650M880J744k073m810
$$ y = [-7951, -3601, 4621, 11475, 10978, 3715, -4070, -8009, -8607, -7279, -3136, 4174, 10850, 11722, 6097, -1671, -7190, -9187, -7855, -3185, 3709, 9454, 10485, 6393, -256, -6548, -10261, -9694, -4527, 2803, 8260, 9290, 6218, 892, -5054, -9613, -10070, -5184, 2466, 8359, 9681, 6969, 2216, -3237, -7940, -9365, -5687, 1522, 7830, 9743, 7223, 2391, -3047, -7666, -9359, -6498, -188, 5981, 8737, 7163, 2495, -3187, -7645, -9015, -6390, -834, 5095, 8534, 7912, 3673, -2102, -6738, -8124, -5686, -574, 4887, 8354, 8250, 4462, -1349, -6446, -8332, -6249, -1356, 3983, 7503, 7633, 4168, -1455, -6615, -8801, -6996, -2179, 3400, 7275, 7758, 4637, -678, -5699, -8117, -6805, -2259, 3450, 7724, 8559, 5599, 298, -4932, -7794, -7068, -2990, 2628, 7111, 8362, 5721, 460, -4985, -8293, -8015, -4225, 1425, 6305, 8049, 5976, 1166]
277A166n397l632k00L513N673N110K237j498m389n412m095q71K902N378N211K572
293H268j134m133n321m394j489K233N027N304K996n43l614n061m452j783J825
308f271M717N341L453N6l135m867m461k024J354M204N069L571M35k810m744m580
324d692k372Q59L704M846L636P58k388m479m514k540O30L501M792L811J155j965
340D742m167m421k622M08L267M643L881J367j772m040m514k894RK900M475L924
356E186J502j545l931m579l141k47K733M480M130J831j146l620m491l310n47K549
372d146M525M346K185q24l395m549l670j035K138M367M422K411n78l254m556l934
388e547j514J661M125M602K835r0k879m421m007j803J315L908M712L280M56k456
$$ y = [1166, -4231, -7863, -8063, -4550, 1123, 6233, 8470, 6972, 2583, -2829, -6924, -7795, -4893, 485, 5696, 8268, 7134, 3001, -2320, -6714, -8203, -5970, -943, 4361, 7357, 6814, 3200, -1861, -6313, -8096, -6271, -1554, 3787, 7240, 7296, 4161, -706, -5167, -7191, -5837, -1633, 3436, 7007, 7442, 4632, -112, -4692, -7064, -6205, -2501, 2345, 5981, 6739, 4351, -128, -4642, -7182, -6552, -3051, 1741, 5552, 6707, 4742, 575, -3846, -6468, -6060, -2793, 1850, 5731, 7098, 5326, 1286, -3228, -6122, -6113, -3213, 1262, 5186, 6688, 5143, 1212, -3367, -6508, -6755, -4022, 458, 4588, 6419, 5273, 1653, -2838, -6148, -6695, -4146, 379, 4725, 6910, 6086, 2691, -1858, -5528, -6563, -4425, -58, 4364, 6775, 6197, 2943, -1613, -5547, -7061, -5400, -1275, 3327, 6162, 6072, 3193, -1228, -5235, -7038, -5723, -1815, 2897, 6177, 6633, 4177]
404D177m243m143k157Q51L476M540L456Q32k087m134m335k540L44L042M299L579
420D957J219j640l812m244k747M8K754M204L718J621j140l405m118k861k40K388
436c298L992L699J798q83l172m077l061o49K010L728L625J848o64k894l944l197
452e139q96J845L656L700K026l79k537l701l222j095J644L663L831K142k52k373
468B913l589l332j473J236L481L899K308k19k352l555l387j761Q58L256M048K692
484E023J66k176l545l393j793O77K994M048L118P45j894l645l657j969N02K678
500b121L717L183J220j400l669m133k412L34K540L444L049J610p03l243m339k916
516e839Q7K620L504L034J709j80k515m108l400n29K378L649L088J637j04k103
$$ y = [4177, -66, -4209, -6366, -5515, -2039, 2501, 5957, 6789, 4702, 568, -3767, -6307, -5963, -2921, 1378, 4957, 6176, 4536, 724, -3520, -6267, -6219, -3465, 739, 4457, 6078, 4938, 1533, -2585, -5446, -5686, -3298, 694, 4393, 6191, 5308, 2136, -1941, -5002, -5651, -3641, 87, 3712, 5560, 4896, 2002, -1942, -5139, -6035, -4190, -534, 3166, 5192, 4813, 2276, -1425, -4647, -5742, -4098, -435, 3396, 5538, 5286, 2913, -676, -4008, -5481, -4245, -764, 3135, 5443, 5224, 2872, -683, -4070, -5831, -4973, -1717, 2331, 5023, 5189, 3013, -532, -3925, -5718, -5041, -2047, 2001, 5119, 5864, 3970, 325, -3332, -5301, -4799, -2121, 1596, 4779, 5999, 4599, 930, -3203, -5615, -5281, -2741, 703, 3752, 5362, 4659, 1416, -2923, -5839, -5752, -3132, 372, 3406, 5115, 4935, 2420, -1688, -5088, -5617, -3239, 410, 3498, 5135, 5031, 2928]
532B928l735l573j267J685L520L387J807j96k048l303l203j541R64L116L736K413
548D690J1k100l143k802j350N58K474L609K907N04k141l429k833j182M61J913
564a853L091K975J005j819l634l183j230O08J884K765K814J336j176l317l457
579c191j615O51K195K849K614J305p74k819l523k190J88K226L134K599J081q38
595C892k495l321k551m87J923L362K990J178q29k347l050k547q14J535L302L392
611C133J735n86k348l056k532r45J112K916L454K122j73k299l282k792j124R10
627c755K514L165K316L84j861l331l077j269Q35K362K992K493Q49j343l069l192
643b987j546O06K254K929K492J005j038k798l245j863K55J932K738K509J183q98
$$ y = [2928, -807, -4380, -5647, -3962, -442, 2945, 4752, 4556, 2508, -795, -3998, -5539, -4575, -1459, 2277, 4690, 4701, 2601, -542, -3344, -4694, -4136, -1662, 1947, 4854, 5358, 3217, -212, -3045, -4227, -3766, -1853, 1238, 4213, 5218, 3399, -235, -3418, -4648, -4040, -2156, 609, 3423, 4759, 3583, 266, -3191, -4806, -4155, -1960, 889, 3503, 4808, 4034, 1215, -2308, -4498, -4310, -2084, 1050, 3649, 4730, 3892, 1397, -1924, -4475, -4962, -3039, 323, 3313, 4491, 3662, 1315, -1735, -4282, -5096, -3561, -259, 3133, 4868, 4282, 1934, -1122, -3654, -4599, -3487, -571, 2883, 5005, 4832, 2533, -749, -3541, -4665, -3755, -1241, 1924, 4240, 4624, 2763, -568, -3645, -4914, -4079, -1717, 1275, 3768, 4617, 3274, 205, -2987, -4533, -3927, -1673, 1256, 3748, 4753, 3715, 917, -2328, -4191, -3936, -2004, 734, 3243, 4426, 3528]
659C528k704l113j846QJ532K565K715J505o89k534k904j781j51J326K443K807
675B707J704m82k408k947j862k87J118K245K705J771m12k347k905j927n50Q35
691c042K221K884J862l70k187k607j897q38O26K286L179K094k97k094k532j857
707b569r97K78K055L290K421j80k226k629j896j156n6J789L262K575J59j920k612
724d12k165j339k8J773L078K629O69j351k424k492j702j11J877L014K446P26r08
741C280j999k623k364n39J881L132K269N17o26j433k467k760j020J717L268K410
757B643O46m93j141k056k630j385J216L134K783R50m93j215j918k424j506P65
773c124K658K640J285j73j303k221k348j193O63K033K282J689M37j159k444k440
$$ y = [3528, 824, -2289, -4135, -4127, -2595, -30, 2685, 4190, 3501, 967, -1937, -3718, -3869, -2543, -100, 2707, 4411, 3929, 1521, -1426, -3288, -3575, -2457, -212, 2493, 4264, 3852, 1505, -1400, -3327, -3877, -3042, -821, 2063, 3925, 3555, 1368, -1239, -3136, -3974, -3348, -1062, 2117, 4211, 3914, 1820, -712, -2569, -3566, -3288, -1233, 2057, 4478, 4298, 2072, -557, -2453, -3609, -3665, -1876, 1386, 3961, 4120, 2200, -412, -2577, -3916, -3944, -2171, 907, 3536, 4205, 2854, 430, -2062, -3764, -3875, -1998, 1016, 3462, 4188, 3280, 1281, -1342, -3706, -4245, -2364, 768, 3037, 3554, 2928, 1495, -972, -3732, -4752, -3035, 233, 2643, 3289, 2796, 1655, -401, -3031, -4416, -3200, -66, 2717, 3667, 3174, 1959, 41, -2383, -3889, -3124, -466, 2174, 3459, 3286, 1983, -238, -2586, -3779, -3116, -1083, 1199, 2888, 3325, 2166, -278, -2718]
789b718r52Q29J866J998J668Q67p27k458k768j168R85J927J778J388R32m39k325
806F83l000j495P44J990J903J408P99l79k016k735j713L05J869K243J807Q60m63
823B810j845k488j728r2J511K314K171J134n77k039k465j658l37R96K039K435
839B181J484m30k120k499j672m34P94J860K457J807M0j819k558j869n46P42J753
856h29K344J917L67j514k504k128q94N37J687K241J787M50j159k251k253j257
872c459K87J641K237J796N94q42j922k171j398Q7J533K248J891P28o71j734k094
889a249j492j53J291K121J891P47n78j666k081j580k91J111J982J837R01m11j553
906H27k039j541l16J024J913J947J076k61j463j966j559m44Q91J865J980J116
$$ y = [-2718, -3670, -2841, -975, 1023, 2691, 3558, 2831, 373, -2395, -3563, -2578, -651, 1127, 2515, 3447, 3008, 683, -2317, -3812, -3068, -1078, 825, 2233, 3032, 2653, 637, -2098, -3811, -3506, -1637, 606, 2413, 3273, 2810, 965, -1523, -3251, -3343, -1832, 482, 2653, 3787, 3210, 1171, -1294, -2952, -3289, -2293, -254, 2181, 3665, 3235, 1115, -1384, -3056, -3490, -2696, -836, 1621, 3428, 3468, 1649, -909, -2778, -3324, -2582, -829, 1515, 3432, 3799, 2285, -219, -2347, -3241, -2704, -1017, 1224, 3011, 3461, 2302, 51, -2202, -3459, -3172, -1531, 706, 2502, 3096, 2254, 332, -1839, -3237, -3150, -1617, 631, 2522, 3250, 2579, 845, -1249, -2741, -2894, -1603, 518, 2409, 3156, 2578, 912, -1169, -2749, -3040, -1929, 53, 1890, 2791, 2380, 827, -1212, -2753, -3069, -2045, -132, 1815, 2891, 2630, 1167, -799, -2358, -2802, -1911, -46, 1934, 3050]
922C050k01j455k019j667n86O97J691J998J337p5j472k100j665o09N81J588K078
939A171J572K10j288k106j770p11N38J533K020J667M89j087k127k048r56L98J452
956a043J891J636O15q01j999k167j284J66J418J985J687P28n03j660k091j536
972b958r2J361K074J774P96l59j407j968j653m50J031J984J868Q78l39j361j838
989f59j626o95O95J794J944J103j87j253j782j503o24N26J548J929J364P9j179
1006A474j775j487n92M21J323J741J414K68j074j868j625o49L62J209J588J359
1022B089M21r29j792j691p17L69J196J624J422N36p37j673j671q56K73J195J677
1039G36J474N32p05j607j719j024M0J054J693J549O14o74j602j732j127j24R44
$$ y = [3050, 2849, 1394, -625, -2292, -2878, -2181, -490, 1508, 2845, 2770, 1298, -802, -2467, -3076, -2495, -907, 1171, 2743, 2953, 1665, -441, -2211, -2922, -2384, -851, 1169, 2836, 3325, 2238, 111, -1937, -2893, -2495, -1043, 848, 2484, 3099, 2298, 299, -1868, -3152, -2986, -1568, 417, 2104, 2832, 2329, 669, -1422, -2958, -3050, -1689, 385, 2159, 2955, 2596, 1189, -779, -2432, -2882, -1851, 133, 2001, 2879, 2540, 1179, -659, -2285, -2980, -2285, -491, 1453, 2556, 2369, 1116, -666, -2169, -2793, -2267, -719, 1210, 2574, 2653, 1474, -301, -1788, -2380, -1959, -636, 1105, 2519, 2787, 1713, -155, -1780, -2429, -2067, -858, 730, 2089, 2510, 1581, -211, -1902, -2619, -2250, -1054, 570, 1992, 2528, 1791, 118, -1553, -2409, -2136, -941, 736, 2210, 2742, 2037, 430, -1289, -2313, -2273, -1219, 474, 2023, 2637, 1963, 361, -1371, -2498, -2622, -1678]
1056a678J733J723P98n29j495j668j195k68Q19J750J842R74l66j377j698j348
1072a983n09O51J625J858J053k40j268j698j460p13M30J505J901J200k3j083j572
1089c26j486q27K96J433J909J328J75q75j460j492r48J08J250J766J361L10p41
1106A781j430j549j054n3J069J647J358M27n86j296j509j083j12J000J597J392
1122A599N69m03j163j454j108j46Q96J531J366N90l48j095j471j174l16P91J454
1139A18J337O07k90j067j449j239l79P30J471J432O98j91r43j385j237m67O46
1156a608J493J507Q16j16r26j383j326o30M87J396J543Q80m2r10j418j397p62
1173b396L41J306J577J092J32p77j404j431p81K52J206J581J226M02o17j372j524
$$ y = [-1678, 55, 1778, 2576, 2047, 552, -1116, -2311, -2579, -1760, -10, 1832, 2806, 2440, 1063, -635, -1983, -2492, -1841, -216, 1642, 2695, 2455, 1187, -511, -1971, -2684, -2254, -749, 1152, 2352, 2329, 1246, -326, -1812, -2639, -2343, -910, 999, 2327, 2502, 1627, 167, -1325, -2273, -2165, -915, 851, 2212, 2522, 1781, 351, -1198, -2252, -2305, -1236, 411, 1769, 2196, 1610, 314, -1195, -2278, -2390, -1390, 207, 1599, 2168, 1765, 602, -852, -1960, -2106, -1210, 321, 1687, 2277, 1929, 834, -637, -1811, -2127, -1336, 118, 1455, 2062, 1772, 705, -744, -1983, -2362, -1632, -161, 1271, 1969, 1778, 835, -550, -1787, -2254, -1608, -115, 1392, 2208, 2092, 1166, -217, -1543, -2173, -1686, -290, 1253, 2133, 2091, 1181, -237, -1634, -2396, -2055, -749, 828, 1920, 2052, 1275, -129, -1560, -2341, -2089, -883, 698, 1924, 2326, 1709, 337, -1187]
1190a187r13J43J077J458J198N52l86j341j681j122M9R89J306J166O67j25j118
1207G32j707j265o1R74J362J140P02M5q19j567j391k87Q81J370J134O60M0p21
1225A222j392j393n42N99J268J244P11k8p40j258j179n91L36J113J386R45P8q22
1243I57j229j006m39K34Q59J323J162K85q79j409j075l26K40O60J093J171M82
1260B103p36j546j303l75L55P27R67J089O35m33j404j482n99L98R06J062J013
1277A377N78k42j161j464r22R1R18J271J056M20l03r77j339j106k98P33J420J274
1295A326N07l76r46j146j006m60M41J366J556P83l11j008j105q61n06K07J104
1312d35J508J022p3j000j260r83m89J53Q31J284J119K35p90j341j159m84K54Q11
$$ y = [-1187, -2100, -1957, -880, 578, 1776, 2328, 1942, 601, -1080, -2202, -2153, -1164, 142, 1308, 1975, 1850, 732, -975, -2240, -2301, -1327, 35, 1175, 1877, 1922, 1103, -464, -1855, -2142, -1261, 109, 1243, 1903, 1943, 1222, -170, -1563, -2105, -1506, -238, 1006, 1717, 1689, 949, -309, -1488, -2079, -1743, -630, 756, 1701, 1779, 957, -272, -1278, -1717, -1483, -624, 699, 1861, 2146, 1267, -142, -1217, -1543, -1303, -643, 450, 1621, 2103, 1367, -179, -1482, -1857, -1502, -775, 192, 1281, 1916, 1483, 79, -1403, -2002, -1604, -698, 364, 1377, 1955, 1713, 552, -912, -1834, -1743, -825, 446, 1502, 1922, 1619, 642, -697, -1803, -2101, -1368, 52, 1326, 1833, 1457, 511, -635, -1641, -2101, -1660, -294, 1262, 2045, 1734, 726, -379, -1240, -1746, -1539, -435, 1073, 2095, 2022, 1022, -238, -1221, -1710, -1557, -726, 558, 1677, 1912, 1122, -219, -1378, -1862, -1608, -797]
1330g97J129J039M19m51j178j257o48K40R08J066Q70M02k57r41j302q67M5Q59
1348g21J115Q38L01k93q34j120r19j73P36J208R97L36l39q03r71p74k19N63J158
1367H6J128N26l22r17j005p01j84L99R42J148O77k27r91j175p64j77L75Q71J080
1386G69P70j3q75j243r10j93M83R04J044Q12J32o97j190j030l64L75R41J118P74
1405A607J08n97j076j105o33J58R06J208Q52J42n47r78j059p18j9Q23J254J024
1423A350K92m88q89r85p16j42O39J200J116L99l92q66r90q01k56M95J062J055
1441A083M78k32q13j021q63k69M44R67J022N74p9o58r73q59l06M27R27R85N69
1460A403Kn44r16r03m20L42Q68R10N58J5n22r05r31m44K59Q11R15O34P2m71q87
$$ y = [-797, 332, 1371, 1790, 1339, 161, -1096, -1744, -1504, -596, 470, 1340, 1742, 1485, 544, -758, -1625, -1580, -721, 394, 1232, 1533, 1240, 406, -714, -1633, -1806, -1070, 138, 1135, 1471, 1132, 329, -642, -1416, -1635, -1072, 86, 1214, 1740, 1418, 501, -504, -1205, -1389, -990, -48, 1100, 1777, 1550, 559, -616, -1380, -1557, -1182, -311, 769, 1539, 1526, 651, -592, -1502, -1695, -1212, -308, 736, 1548, 1680, 983, -207, -1237, -1601, -1226, -285, 833, 1607, 1715, 1118, 42, -1063, -1696, -1538, -632, 576, 1428, 1570, 1023, 45, -1014, -1732, -1751, -928, 326, 1350, 1642, 1154, 265, -720, -1436, -1578, -939, 261, 1377, 1776, 1384, 518, -472, -1273, -1529, -1034, 28, 1083, 1561, 1329, 516, -505, -1368, -1637, -1193, -226, 796, 1370, 1291, 633, -340, -1199, -1505, -1078, -151, 834, 1403, 1405, 861, -55, -958, -1378, -1036, -168, 742, 1300, 1315, 793, -112, -1043, -1487, -1228, -417, 498, 1132, 1204, 733, -154]
1481a54q87m43K58Q13R48O68J52m18q61r10m72J94P29R27O98K26m15r10r63n70
1501a390Q4O75R33P72K84l53q81r86o22M6O49R62Q55L97k36q16j004o46m6N44
1521g79R19R27M95j75q08j013p42k10M14Q75R47N37j04p03r85q23l12L47Q45R76
1541F28O23M6n85r13q30l51K53P77R74P00Q7m87q46q22m72P9O90R51O50J34m27
1562H59p59q52n45L6O09Q69P18K36l47p31q02m79K5N44Q39P57K64k66o63p92n54
1583a034pN16P76O60K84j73o61q74o24l7N02P54O34L03j30n96q43o55p8N12Q03
1604C2P20L34r3n34p79o84j83M53Q36P70L58j00n48q08p18k77L36P31Q24N12p9
1625A103n82q37o85k76J90O89Q76O62Q2n32q53p33k66J99N69Q12P43K40m10r09
$$ y = [-154, -1041, -1484, -1226, -413, 535, 1203, 1355, 937, 76, -834, -1306, -1112, -383, 544, 1242, 1468, 1053, 143, -820, -1390, -1306, -631, 302, 1074, 1358, 1005, 124, -862, -1484, -1438, -789, 173, 1028, 1425, 1189, 373, -631, -1277, -1323, -779, 140, 1067, 1562, 1387, 579, -434, -1176, -1386, -972, -97, 850, 1387, 1283, 580, -405, -1228, -1540, -1193, -348, 628, 1251, 1297, 712, -201, -1031, -1382, -1129, -352, 622, 1322, 1409, 922, 76, -746, -1218, -1139, -449, 502, 1152, 1286, 859, 100, -752, -1297, -1261, -652, 217, 935, 1171, 824, 93, -709, -1188, -1163, -619, 220, 977, 1241, 975, 312, -480, -1034, -1041, -525, 251, 911, 1195, 1022, 361, -513, -1137, -1174, -672, 82, 716, 1019, 889, 293, -550, -1205, -1283, -771, 32, 752, 1086, 993, 459, -320, -1004, -1187, -734, 102, 872, 1230, 1130, 582, -226, -944, -1221, -885, -154, 670, 1182, 1103, 521, -316, -1001, -1277, -1087, -398, 478, 1140, 1222, 690, -163, -896, -1162, -963, -394, 418, 1161, 1401, 991, 82]
1645H2q32l59J56M85P11P10L29k98q11r14n07Q1N10P14O62L56j31o49q76n71k3
1666a175N12P46O74L51p6n00p81o43j96M01P55P02L05j42m68o62o32k98K38P04
1686a85P46L78j03m89o14n44k58J86O15P88M96n4m74o47m89k17J42N26P17N20
1706A040M0m72p21n82k34J63M68O39N17J03l89p49o64k59K05N26O50N17J84k77
1726G05o76p30l39J79N47O78N51J89k47o39p32m79M4N05O94N79K16k29o03p49
1746e36n17o3M23P29O62K94j56n54o82n26j34L45O78P46L89r4m92p02n62j95K37
1767g10N87O96M62j3m89p14n97k33J57N06O56N14Q8l92o73n78k56J43M70O41N30
1788G95J78k88o12n97l00J03M28N82N10J63k43n77o25l56M7L77N68M78J67k05
$$ y = [82, -750, -1109, -953, -468, 243, 953, 1282, 984, 173, -741, -1248, -1167, -657, 57, 719, 1075, 944, 295, -581, -1152, -1175, -663, 83, 757, 1108, 1032, 532, -249, -892, -1088, -687, 68, 770, 1075, 933, 465, -197, -829, -1127, -889, -185, 561, 939, 836, 347, -267, -811, -1069, -883, -268, 520, 1016, 962, 488, -159, -648, -865, -723, -197, 520, 1040, 1080, 608, -113, -695, -929, -766, -298, 341, 858, 961, 572, -177, -841, -1100, -895, -369, 281, 798, 982, 705, 29, -701, -1040, -861, -314, 364, 915, 1104, 857, 218, -514, -993, -949, -444, 250, 829, 1045, 816, 213, -536, -1053, -1116, -693, 36, 698, 992, 836, 282, -400, -926, -1060, -715, -37, 709, 1098, 1004, 512, -190, -752, -947, -710, -123, 573, 1035, 1022, 533, -181, -778, -1011, -854, -348, 308, 822, 910, 518, -155, -733, -989, -846, -376, 265, 795, 973, 685, 73, -524, -824, -721, -293, 289, 799, 962, 719, 142, -483, -839, -792, -415, 153, 631, 798, 593]
1808E93n23n67l63mL70N92N31K02k06m77m98l58o3L29O02N76K13k27m97n34l45
1829f54j05K42N57N99K55k23n01n72l73j30K27N41O40L62j22n06n62l95j20K03
1849f37N20O69M00n1m35n99m88k07J65N01O44M16k2l84n72n60l05R1N20O48M15
1870G29N7k84m78n78l78L0N16O80M72Q4k20m06n38m57n9M47O51M48J23j65l92
1891B82n36m98j29L43N92M84J47j10l39n03m93j32L22N41M84K04k6k76m91m86
1911f20j23K83N14M12K39mk67m98m96j67K26M61L95K25K4k60m86m87j77K43M34
1932a29M07K78O5k26n13m56j41K26L97M23L25J07k22n41m87j82J85L49M01L46
1952F12J26k19n52n47k06J48L41M06L87K00j63n15n69k36J28L59M33M16K53j28
$$ y = [593, 70, -497, -860, -864, -494, 98, 629, 831, 625, 148, -350, -708, -771, -442, 160, 736, 949, 722, 225, -309, -654, -759, -517, 40, 639, 894, 671, 170, -402, -775, -905, -678, -137, 503, 865, 743, 237, -325, -720, -840, -637, -117, 552, 952, 901, 466, -133, -621, -828, -663, -162, 482, 898, 876, 492, -80, -640, -945, -854, -334, 314, 729, 786, 502, 24, -554, -932, -902, -386, 294, 766, 850, 630, 224, -314, -771, -830, -383, 268, 716, 839, 674, 282, -254, -752, -881, -538, 54, 538, 685, 575, 236, -267, -760, -892, -570, -29, 455, 659, 633, 357, -134, -620, -743, -460, 54, 466, 705, 701, 434, -64, -560, -727, -501, -40, 355, 580, 604, 344, -142, -629, -806, -563, -129, 278, 556, 621, 395, -118, -574, -715, -489, -92, 331, 656, 763, 541, 0, -487, -669, -484, -135, 266, 612, 738, 519, -33, -580, -786, -638, -297, 109, 496, 696, 533, 18, -551, -787, -659, -300, 133, 549, 802, 674]
1972F74m78n36l18J7K98M51M47K43j10m49n20l84p7K13M26N06K95q1m11m72l46
1993f12j24J31M06N57L61k5l42m46l37j58P0L30N21M05J8l26m60l75j85M3K84
2014b64M15L99O7k74m15l78k02N4K91M01L55J03j47l51l86k35L0L20M16L09R3
2035F01j44k94l87k95j3K74M36L06N7j72k90l44l01o2K48M35L48J15j71k85l28
2056b66k57m8K17M17L99J91j13l62l73k63m1J86L51M17J99p1l58m47l32o3J78
2077d39L59L59K51pk65m49l92j08J92L74L85K91N6k11l99m08k01J33L38M33L07
2098E99L8j99l66l99k72K1L06M28L12O9j64l28l72k76j0K29M23L52J75j24l09
2119A33l42k41n2J88L68L71J83q1k82l75k66o8J60K96L01J75j6k46l90k85o8J68
$$ y = [674, 196, -340, -658, -641, -343, 108, 555, 798, 688, 239, -281, -665, -742, -529, -103, 403, 698, 617, 206, -266, -612, -736, -605, -199, 358, 719, 694, 352, -94, -431, -589, -519, -189, 332, 737, 755, 429, -31, -406, -591, -548, -264, 151, 550, 617, 343, -72, -450, -652, -598, -307, 94, 449, 552, 405, 54, -332, -567, -537, -217, 199, 508, 601, 457, 163, -224, -519, -532, -258, 178, 484, 541, 369, 79, -265, -566, -628, -380, 55, 403, 518, 347, 62, -266, -523, -571, -354, 63, 462, 653, 540, 178, -195, -458, -499, -313, 38, 455, 654, 583, 225, -222, -554, -617, -439, -80, 279, 530, 523, 258, -191, -583, -691, -499, -125, 260, 551, 607, 396, -3, -411, -612, -479, -141, 292, 599, 637, 438, 72, -327, -599, -578, -272, 156, 468, 537, 373, 45, -327, -603, -613, -384, 39, 391, 566, 442, 133, -209, -450, -502, -314, 54, 425, 608, 527, 245, -130, -396, -464, -304, -8, 293, 468, 452, 206, -184, -469, -537, -369]
2141c69K83K87J81kj79l11k99r3J67L19L04J73j1j76k94k82j34J35K76K96J86
2162D57kk36l10k67j14P0K41L45K16L0k15l40k62j02R8K38L16K75R0j70l51l18
2184c11j20R4K35K64K89J32j53l65l89j82M8K39K69K86J31j03l05l54k69J9K21
2205c24L32K95J76m7k57l31k58o0J47L34L67J87q9k31k92k63j56O9L06L41K25
2226D71n2k43k67k48j49K0K38L62K63K0j88k49k22j45%K06L46K83L0j56k47k41
2248a68j60j8K05K74K17N3j33k27k50j95j2J72K68K21N5r5j75k30k01nJ93K92
2270H1K23M4p4j45k30k16k6J84K87K06M9q6j66k63k19n2J68K58K19P8p2j67k45
2293a64k36n7J67L06K25J15j3j41k61k74p3J69K73K46J37Rj45l04k89j14J08K44
$$ y = [-369, -86, 201, 382, 380, 201, -110, -409, -502, -335, -16, 288, 461, 450, 274, -20, -302, -436, -301, -25, 271, 457, 455, 219, -91, -358, -472, -402, -161, 184, 400, 430, 215, -125, -387, -489, -391, -153, 163, 438, 528, 358, 7, -311, -431, -337, -102, 162, 451, 583, 430, 65, -324, -506, -458, -219, 50, 336, 467, 364, 59, -295, -564, -545, -324, 8, 303, 479, 432, 175, -156, -414, -474, -327, 7, 374, 561, 472, 241, -51, -314, -470, -401, -95, 246, 471, 419, 176, -91, -339, -488, -468, -230, 132, 395, 415, 227, -22, -244, -389, -389, -183, 163, 446, 476, 320, 73, -168, -328, -346, -141, 133, 350, 403, 270, 43, -207, -402, -414, -242, 26, 247, 302, 207, 32, -198, -399, -404, -211, 81, 304, 348, 274, 129, -101, -317, -343, -159, 128, 334, 383, 297, 131, -132, -351, -403, -235, 23, 242, 320, 248, 81, -164, -400, -457, -290, 16, 241, 356, 343, 202, -59, -333, -406, -237, 36, 282, 419, 428, 283, -21, -310, -424, -316, -72]
2315g2K34J67L3j35k67k91j48O9K22K65K00J06q3k67k77j47L9J78K47K56J19o3
2337C85k52k81j65mJ32K07K21J34k1k27l03j86OJ02J80J92J79L2k03k53j68l5
2359c28J21J62K04J46N0j34k36j74p7Q3J64J94J35j0j24k02j94r9M7J74K03J20
2381B25Nj37j79j64q3M9J52K37J71J2j47j75j44n6K1J29K22J92K4j51k21j58q2
2404b58K2J10K01J76O3j21k31k19q6L1J42J88J81J14m0k07k40j28J7J66J95J89
2426B65Q7k4j73k40j83m2J17K12J81J01l1j28k23k13j00R1K10K31J10Oj16j77
2448c9j72j24L9K07K24J67K7j26j60j57j18j1J12K24J88K8j01j84j55j19j9P2
2470a97J74J88Q5n8j95j72p1J9P9J33J67J08j7j54j77j05L7Q8J12J13R7rj39j80
$$ y = [-72, 162, 329, 362, 227, -40, -331, -479, -410, -188, 77, 277, 383, 300, 33, -244, -391, -352, -174, 73, 329, 448, 385, 133, -148, -313, -317, -185, 22, 243, 377, 356, 129, -174, -360, -354, -252, -72, 120, 299, 331, 128, -125, -293, -328, -207, -45, 159, 305, 355, 221, -15, -189, -266, -183, -19, 175, 310, 300, 176, -26, -220, -319, -272, -98, 105, 225, 230, 93, -86, -250, -333, -284, -132, 105, 276, 288, 141, -34, -178, -234, -213, -84, 138, 330, 354, 203, -18, -176, -258, -236, -126, 75, 251, 314, 193, -38, -257, -343, -312, -170, 18, 199, 313, 273, 66, -174, -302, -285, -119, 76, 265, 352, 328, 155, -85, -268, -310, -193, 19, 200, 301, 270, 142, -81, -294, -394, -303, -93, 138, 248, 254, 138, -39, -211, -335, -296, -89, 135, 302, 329, 203, 43, -114, -232, -243, -131, 93, 281, 309, 208, 24, -131, -250, -269, -197, -23, 165, 250, 192, -3, -175, -246, -227, -148, -15, 152, 260, 243, 89, -88, -193, -156, -68, 44, 157, 254, 245, 106, -74]
2494g4j37j1R7J27J08M9l2q0j55j44l6J07J73J28N2j4r1j16j18n9O8J94J76O2
2518B74n3j10j22j27p8K1J48K10J03n5j54j38r9p7OJ25K08J61pj21j70j15o1K4
2542b07J07J80J85O1r0j89j64r4L5R4J29J56O5l6j65k10j35%R6J49J19R9Kr7j85
2567i5j52l8J17J58J28P3J8m6j33j74p0N4J56J43N0Mn3r6j75r7J3J42J43P1j6
2592A25m1j09r5r8MJ28J33R2L0n0r6r8n7J1P5J16R0M6m5j26j12p3K6P0O6Q8M7
2619A47l2j23j45p0M1J09P6P5O6j3j22j34p0L9R6J15R6M6qj06j41r9j9R5J24R9
2645A42P5m0j23j49j18kN6J23J26Q8j0j03j34j07k9M6J06J50J28K1r7j32j16m1
2669a40PQ6J30J29J9o7j48j37p1KP2J02J14O1n2j07j08r2j3O6J19J32O5j4q7r3
$$ y = [-74, -211, -222, -125, 2, 110, 159, 127, 47, -108, -252, -288, -181, -8, 120, 172, 158, 67, -49, -167, -226, -158, 36, 212, 274, 221, 111, -11, -138, -216, -195, -47, 163, 266, 211, 57, -81, -180, -257, -251, -126, 82, 243, 236, 115, -55, -170, -231, -207, -100, 80, 265, 326, 236, 47, -117, -211, -176, -82, 47, 203, 268, 232, 67, -143, -278, -278, -182, -33, 86, 185, 187, 90, -95, -247, -285, -168, -10, 118, 191, 209, 163, 30, -144, -214, -160, -4, 139, 189, 193, 140, 44, -131, -228, -215, -73, 70, 141, 125, 84, -25, -120, -218, -214, -86, 47, 139, 169, 119, 23, -75, -132, -121, -46, 70, 160, 206, 161, 35, -77, -150, -124, -54, 12, 100, 147, 115, -8, -153, -223, -182, -73, 3, 78, 144, 131, 9, -125, -195, -156, -60, 55, 151, 197, 189, 83, -58, -157, -176, -81, 43, 142, 217, 177, 54, -95, -213, -215, -159, -36, 90, 178, 168, 65, -69, -176, -205, -159, -53, 97, 225, 246, 149, 17, -99, -140, -133, -47, 83, 212, 231, 164, 16, -121, -192, -190, -118, -16, 98, 159, 107, 0, -108, -200, -213, -147, -28, 104, 169, 155, 68, -25]
2695b5q6l7N6R7J13O8k0q5q3j00m0NJ04J08M1Jq2q0q2m8L8Q5R4N9Rl6p9p1m2M2
2725g6P5J07N2j8j8r8q7m8K7P5Q2N8j8n5p7j06l2K2O7R9O4J3m8r2r0k7K9O7J15
2754F2P1N2o2r6r3o3j1Q5J10P9M7l5j08j27q4%O8P7J01O0nr9j33p2pO1R9J04R0
2783A71mo1j07j05l3L8R1J02P0K2m9j06j29n4PP1J05O8K8l3j16p0p5mM8J23P5
2810G3M8l5o2o0p2j6N0P5R7O3l1p1p0o9k7L4N1P5N1Pq3q1o4j2K4P1N2N2J7l0q1
2841b4q4J7M5O8N9K8J4l3r2o9j6L9P0N9L4l4m2o3o6n3K0P9R2L8ko2o4o1l3J9O4
2872e3J00P7K4q2p9n8j7mM0R6J02L0o0j12q7m1kL0P2R5N6j8j03j00o4J3M2P1J02
2901G0O3lo5q5p6k4M8P4R1M4J3l8r4r8n6J8O9O9P5nl0o2p9o0k1P3R9P7rj9l6m1
$$ y = [-25, -111, -148, -92, 5, 118, 186, 166, 81, -2, -102, -142, -137, -33, 75, 116, 117, 35, -45, -127, -175, -137, -52, 42, 101, 110, 74, -5, -76, -118, -76, -1, 106, 158, 140, 122, 24, -63, -111, -84, -9, 73, 131, 113, 58, -19, -125, -157, -135, -68, 31, 95, 108, 60, -32, -122, -149, -120, -53, 62, 133, 185, 123, 27, -66, -129, -140, -55, 55, 134, 181, 146, 38, -89, -173, -173, -105, -28, 73, 133, 128, 29, -104, -176, -183, -122, -23, 81, 171, 167, 106, -1, -106, -139, -101, -10, 92, 162, 184, 135, 29, -100, -154, -147, -76, 29, 97, 125, 92, -24, -94, -169, -173, -125, -2, 73, 121, 86, 24, -36, -108, -124, -74, 1, 98, 161, 130, 59, -11, -80, -107, -73, -22, 53, 104, 111, 28, -53, -117, -129, -105, -34, 18, 70, 87, 57, -24, -108, -91, -46, 22, 81, 109, 123, 90, -2, -71, -87, -48, 22, 81, 115, 81, 39, -24, -90, -143, -123, -44, 48, 86, 84, 22, -42, -103, -136, -117, -53, 47, 124, 148, 66, -13, -71, -88, -92, -52, 44, 146, 176, 116, 4, -83, -124, -126, -96, -24, 71, 127, 109, 6, -94, -158, -145, -103, -32, 70, 133, 130, 65, -20, -96, -120, -72, 2, 93, 137, 150, 112, 18, -80, -136, -118, -49, 20, 95, 90, 60, -2, -81, -141, -162, -89, 10, 87, 78, 59, 23, -18]
2933a8q5j6N9Q8P5J6l2l2n3m9k6lP9N8L0j8o0o0l4k5RO5P2L0j3m5n7n4J4M6M1
2964BN8L6J6m8o5p4kM6O8M8QRm2q6o7l7L8R3M2J0%j2o6q3l8M4P8Q0L0K1k8p6o6
2997f3m3K2O8P8N7J5m3p1q0m5j0N0Q5O1K9j7q9r3m0nN1O1Q1P5pp5r5n5ML3O3O4
3029F6P3J2n7q5o9k2J1L8N8O4K6m0r1p6j7ML8O3O0K7k0o2o5k6kM9N6N9L1ro3m4
3061a3n3LK3N8O6j0qo3n0l3j5L2M8N6K3k7m2m0m7J2J2Q6N2K5k0m7m5m6J4K3N5
3092B9O3K7k4o0o4m5l2K6O8N6L4ln3q3m2k1K3P2P7N0j1m9o2n8k8K5Q0O0P6jm7
3123H3o6p6m1j0O0Q0N5J6k1q1p7n7J0M5P8P0L8k0m5o4m9l8M5P4P6L7Jm2p1q2j6
3154h8K3N8N8M3Ml9q4o2j9PM2P1M6J0k5n7n9l7K5L7P1N1Nk1n1m3l4PL6O6L4J1
$$ y = [-18, -103, -119, -60, 28, 103, 119, 87, 55, 2, -47, -73, -76, 3, 61, 91, 73, 13, -47, -81, -106, -97, -32, 40, 70, 57, 12, -45, -99, -85, -39, 2, 60, 96, 112, 64, -1, -75, -77, -31, 37, 85, 93, 102, 60, -26, -93, -130, -92, 1, 43, 53, 53, 41, -25, -108, -146, -102, -24, 56, 86, 107, 79, 3, -63, -106, -84, -16, 62, 119, 134, 91, 20, -60, -105, -115, -65, 20, 81, 110, 93, 4, -89, -129, -134, -83, -22, 59, 134, 127, 52, -43, -98, -94, -61, 2, 66, 139, 151, 94, 9, -60, -82, -71, -33, 25, 89, 115, 75, -16, -92, -109, -105, -67, -4, 56, 83, 63, 1, -64, -90, -92, -43, 13, 72, 103, 94, 31, -13, -66, -63, -40, 18, 84, 74, 66, 3, -47, -80, -95, -63, -15, 41, 64, 37, -5, -45, -92, -80, -68, 18, 70, 95, 75, 28, -17, -63, -49, -26, 29, 92, 119, 95, 35, -29, -74, -106, -80, -12, 44, 78, 75, 22, -61, -103, -124, -101, -29, 48, 98, 87, 38, -24, -82, -110, -85, -5, 55, 131, 130, 83, 17, -59, -100, -110, -50, 30, 85, 101, 80, -1, -78, -135, -125, -80, -2, 68, 106, 86, 41, -23, -72, -110, -65, 9, 85, 122, 123, 81, 10, -72, -88, -65, -7, 51, 94, 98, 59, -25, -87, -106, -99, -57, 14, 60, 70, 45, -12, -71, -108, -83, -46, 25, 76, 81, 60, 9, -34, -68, -61, -25, 41, 75, 86]
3186H6k8m5o0n0J4L3O1L2K8k0p5l9l5J6K5O7O7J5l6m1n1k7RK7N7O9J6k9n4n4n6
3217g8j0M4O6M6K3k7m4p1o0j1L2Q1O6K4Jl6p1o6m1N5P3Q2L8Jm5o7n8n5RP9O1O1
3249A02Mk9q3o5n7QN0P3O6K4k6o2o0m0rM4P9N8M4j2o3n5n8j8L6N1O1L5jm4q5o3
3281i5NJ6M2N3L9K2l7p4o7j4L0O3M3M3J1k5n1p7rK4N6N7L2kj7p0n1l3QL9N7M9
3313F7Kk8o2n1l7K3M4P1M7Nk0o8m6k0J7K7O7N6J7k7o1p0m1K5K1N6O1L2k4p3r3
3344h3l2NL2O5O5M7j8p2n2n5j1L0Q2P1M6nm0r1o1l6K7O8O6N5Kn4n8q1k2PM6O7
3376A0N2K3l6n2p0k2mM4Q8O2L5m3m8o9m1k1M7P8M1J7rn5o7m5j4M4M0P2K0j2n2
3407A3o7k8mJ1O3O6K0j6l3m9n1j2K4P2L9M3pm7n3m7j8L3M3N2K7kn8l9p2j7L5P3
$$ y = [86, 58, 13, -47, -97, -83, -50, 11, 43, 71, 51, -24, -63, -98, -82, -57, 10, 77, 92, 56, 15, -36, -63, -54, -27, 30, 99, 115, 86, 32, -22, -78, -88, -44, 22, 68, 91, 64, 20, -51, -111, -122, -90, -9, 57, 81, 82, 46, -25, -91, -132, -77, -4, 78, 116, 117, 72, 5, -53, -108, -99, -20, 41, 102, 106, 77, -6, -71, -128, -120, -70, 3, 69, 93, 67, 5, -55, -95, -104, -60, 19, 77, 121, 109, 46, -9, -67, -85, -49, 2, 63, 98, 97, 53, -32, -95, -90, -74, -32, 21, 60, 82, 45, -29, -96, -110, -80, -17, 26, 69, 80, 55, 4, -73, -82, -58, -2, 55, 87, 85, 68, -2, -53, -86, -78, -39, 18, 67, 69, 41, -21, -72, -109, -86, -42, 29, 76, 81, 61, -7, -53, -73, -56, -29, 38, 94, 111, 84, 23, -47, -88, -63, -42, 14, 75, 107, 83, 10, -83, -115, -110, -78, -13, 52, 99, 81, 9, -43, -98, -109, -79, 3, 74, 120, 115, 75, -16, -77, -113, -86, -18, 48, 103, 105, 51, -7, -88, -110, -103, -57, 10, 62, 85, 49, -3, -73, -95, -99, -55, 33, 95, 130, 87, 39, -30, -71, -92, -45, 33, 74, 91, 82, 27, -40, -85, -99, -55, -15, 57, 77, 65, 13, -54, -82, -86, -75, -12, 54, 74, 58, 25, -24, -75, -87, -63, 9, 48, 91, 84, 37, -16, -63, -81, -48, -5, 47, 74, 72, 14, -25, -97, -114, -79, -6]
3439fN2L3J0m4o3n6k1J9Q0O6L4Kk9p9n4k6KO7M0O9Ll9o4o6m6KN4O6O5K2k2o6p7
3472g2m3nO2O6O3L4j4n9n9n8j6L0O1Q3L1Lo0p6o1l0M3M4O0M5jl7o1m9k9K3M7P2
3504C7M9J0l3n7n8k0kN9N8M6K1l5o3p0l1J7L5N6M3K0k7o2m9l0nM3N4M2K0j8m1
3535Io4l3OL5P7M9J4k5m4o4l9LL8O1L7L0k2n4o4n2j3N6O1N9K6j0m6p2m2j2M1O2
3567HO9K2Nn3o6n5l0M3M5P6M1Rn5q2o9k0J3O5P1N4Nm9o1o7k7J6M2P0P0J6k1p0
3599A5p5l9KM5P1O5K4k4o8n4o2oM2N9O0L7j2n8o6n1oL5N2Q2K3j2l9n9n0j3L1N3
3631BN7M5rm0o5m7k1J2O3L7M7Rm6o3m9l1J8N4O9L1Ol0o3o1k6K1N3P4L8J4m1n1
3663Gp5k9K4N9N3N0J1l3o3p4l4NN6O7M8J6k6n2p6l1OM5Q2M9K9k1p2n7m1lL2O1
$$ y = [-6, 46, 79, 89, 45, -18, -74, -95, -76, 4, 70, 104, 106, 77, -2, -56, -82, -80, -13, 27, 96, 99, 60, -4, -70, -116, -114, -60, 6, 71, 93, 71, 5, -72, -115, -120, -58, 8, 71, 105, 91, 32, -27, -85, -101, -71, -10, 73, 104, 107, 47, -29, -90, -120, -77, -33, 27, 72, 71, 34, -27, -76, -105, -82, -35, 37, 86, 96, 63, 6, -52, -72, -74, -15, 43, 89, 110, 75, 12, -58, -89, -72, -37, 19, 62, 82, 55, -7, -56, -86, -91, -48, 6, 48, 68, 50, 9, -55, -88, -82, -47, 30, 79, 93, 68, 24, -40, -79, -76, -38, 23, 60, 90, 68, 14, -50, -102, -115, -59, 2, 61, 87, 77, 31, -41, -83, -95, -54, 8, 77, 99, 104, 51, -15, -70, -100, -57, -12, 64, 105, 114, 59, -23, -92, -112, -99, -34, 37, 91, 96, 47, -14, -81, -108, -92, -50, 20, 90, 106, 85, 15, -60, -99, -97, -52, 19, 84, 108, 84, 16, -38, -100, -106, -64, -5, 55, 92, 80, 22, -44, -95, -101, -66, -14, 68, 91, 79, 40, -19, -69, -82, -51, 2, 59, 104, 95, 55, -10, -57, -78, -66, -3, 34, 81, 90, 44, -19, -68, -99, -81, -27, 42, 73, 79, 49, -14, -75, -101, -80, -27, 47, 85, 99, 58, 7, -68, -97, -73, -14, 39, 89, 100, 67, 4, -70, -104, -99, -43, 24, 72, 88, 62, 10, -66, -97, -91, -46, 36, 85, 114, 93, 21, -36, -77, -80, -48, 13]
3695A3P2L7k5m7q6n9j1L4O4N7N3j3l7q1p1j3L0N8O7O0j4k4p8p7nQO4O4N6J4l5
3726G5o1p1m2QM5P0N1J7k8o1n7l9kM4P2N5J6k0o8l9l9NK9N5P4K3k7n1p0m1J4J6
3758d7N8N4K7j7n8o2m3nM0N7N1K9k1m8o5l4j4M6N2N8K7jm0p0n0k6L6O7N2N1oo1
3790C7n4p3k1K9N6P1M4nm5o8m9l0J7O4P2O0J1n6o6m7m5K5L4P1P9Nk4o8p4m0nN2
3822d3O8N4K0j4o1o7n3nM1O4O7L1qn3p1o1kL8M7O9M5j2l6q6m5k7M2N1N4M0%n5
3854C2n7n3k5J6O2O8L0Nm7m4n4j9J4N4N4N6Nm6n5l6m3MN9O4M2Qk6o2p1l7J4M6
3886d2Q5L7J7m0n8o4l3J9L6O2O8lqo6o8m5NO2N6N6L0l9m8o6m9j6M4P3O5L0Lo9
3918C4o9n4j1K6P1P2L2nm5p5m2l7L7O7O0M6Rm0p5o4m0J7O3O6N5Pm3o8o3m6K8M6
$$ y = [13, 85, 122, 97, 50, -36, -95, -106, -72, -8, 49, 102, 89, 52, -29, -100, -113, -83, -25, 42, 102, 88, 64, -14, -91, -96, -88, -24, 40, 96, 110, 75, 14, -57, -99, -91, -46, 24, 75, 92, 64, 3, -54, -93, -95, -51, 21, 76, 92, 72, 4, -35, -74, -69, -40, 15, 89, 112, 85, 34, -36, -77, -63, -47, 11, 65, 92, 75, 17, -45, -88, -93, -53, 4, 55, 84, 63, 15, -50, -84, -98, -52, 0, 58, 85, 84, 44, -26, -76, -102, -66, 1, 53, 104, 98, 37, -17, -90, -111, -82, -26, 45, 89, 84, 39, -29, -78, -108, -91, -27, 45, 105, 116, 60, -6, -53, -98, -73, -39, 32, 111, 116, 92, 24, -50, -90, -95, -43, 25, 79, 99, 85, 24, -43, -96, -101, -60, 4, 71, 102, 94, 41, -30, -91, -93, -55, -8, 61, 106, 94, 58, -28, -73, -100, -58, -7, 47, 87, 87, 32, -25, -78, -103, -87, -25, 43, 73, 78, 31, -13, -67, -86, -72, -18, 36, 92, 97, 51, -4, -40, -83, -79, -20, 44, 86, 94, 68, 6, -65, -102, -88, -42, 43, 80, 97, 57, -1, -65, -98, -79, -43, 19, 87, 84, 76, 10, -58, -103, -98, -36, 20, 76, 106, 67, 19, -47, -96, -112, -68, 5, 70, 100, 103, 34, -35, -89, -100, -74, -3, 69, 101, 96, 51, -24, -66, -103, -66, 1, 61, 107, 116, 76, 1, -63, -103, -86, -23, 43, 98, 105, 62, -6, -69, -115, -87, -41]
3950d1P2N7Kj9o8o0l4pN7O9M1K8j9n9n9l8j1M4N9M4L4j8o7n9l1pL7N9M7L2k0n2
3982A3o8k4mL9N2N3L6k9l9m4n8j7M3N3P3K6j9n3n0n8k1L6O5O1K1mn1n5n6l3L5
4013g7O7O3N3nm5o7p5k1K0O7P1M8Kl5p8p3k2J7N9P0M5J2l4n9p5l8PM9P1N9L9l8
4045G7o6o8l2kL5P6N6M6j8o4p2o0OL1O2O7L2k1m2o9o4oK5N7N9N1Jo4n4n9l6M4
4077g2N6N0N6Km1n5o0l3J5O3N7M5Nm7m6o9j9J8M8O0N7nl4n5n6k3nN6P2O7ok9p0
4110Bn7l2J0P1M7O3nj8p0o1m1NL8P2N2L4k7p6n8n2jM9O1O3L5k0n3q2n5PL4P7P2
4143H4K3j7m6o0q0qK9N7P1N8j2n8o7o8k3K3P1O7O2Nn1p2n1l7QO3P2N0K0m4n2p3
4175e6l8J7M5M9O7J2k1m9p9m8RM5O7N7J1j3o5p4l7J9M0M4O0L7l6n3m7n5NL1O7
$$ y = [-41, 31, 88, 90, 71, 3, -57, -91, -98, -41, 28, 69, 97, 78, 19, -40, -78, -89, -45, 14, 58, 92, 74, 7, -52, -83, -90, -53, 6, 53, 85, 65, 13, -55, -79, -83, -44, 8, 61, 97, 68, 29, -15, -73, -90, -47, 6, 79, 105, 86, 33, -17, -75, -96, -60, 5, 66, 87, 83, 32, -23, -79, -112, -77, -10, 53, 106, 101, 56, -11, -86, -107, -87, -20, 51, 99, 101, 66, -12, -85, -107, -90, -31, 39, 84, 96, 62, 3, -72, -110, -103, -54, 17, 76, 115, 77, 11, -57, -89, -91, -56, 20, 76, 122, 104, 40, -32, -92, -86, -55, 7, 74, 106, 85, 43, -26, -90, -96, -71, -14, 45, 96, 97, 33, -21, -80, -116, -72, -16, 34, 90, 92, 51, -4, -64, -97, -82, -19, 38, 83, 88, 41, -5, -74, -93, -75, -27, 33, 90, 85, 51, -4, -60, -83, -88, -32, 40, 107, 101, 72, 2, -55, -87, -77, -6, 41, 104, 99, 81, 11, -50, -91, -86, -48, 24, 76, 110, 83, 7, -51, -103, -104, -55, 6, 69, 104, 84, 31, -51, -106, -99, -65, 12, 84, 107, 90, 44, -16, -96, -104, -75, -18, 53, 111, 99, 41, -26, -94, -117, -94, -23, 44, 106, 111, 60, -12, -63, -100, -92, -29, 43, 93, 113, 69, 17, -56, -94, -77, -32, 17, 84, 96, 75, 26, -53, -101, -92, -47, 20, 77, 88, 75, 10, -64, -101, -82, -42, 2, 62, 99, 63, 10, -37, -92, -87, -56, 11]
4206A1L5M3lo2n6n9mL1P0N8L1l0l5o9m1kJ7O4O3M6j5o0o9l2l4M7M6O8L1Km0q4
4238c2m5j4J7O6M5O2%m2o5p0k5K1N1P5M7J3m4o5p2k0NM8O6O2L0m3n6o9n1RM8O9
4270B1N7L1l4n6p4m0j2N0O9N7L2j0n2p9m5oL8N3P5K4om6o7m2j7J7O4N3L9j0l9
4301D5n4n6j4J6M1P7K2J7m4o7n2k3K4M9O7L5J3m7n3p2knO8M4O7%m2n6n2k2pO0
4333b3N9L8Lj7o8n2l9J5M8O2O1L0n6m8n3m2jN2P0L6L2k0o1p6l5mL7R1M2L5l3n7
4365B6n5n6rK5O5Q0K7j5m6o9o4j0L2N8Q4J6ol0o7n8k3K1M7O1M1K1m3o8o0l0J8
4396h7N4O5N7ml7m4o2k3oN2P2M2K6l6n9n1m8J7M2M7O1J6k8n1o1m0QK5O9N4L1k3
4428G8o3m9m4mL5N7N4J8j9m8n3m8oN4L5N4L0j2l7p5l1j3K6O3N3L6k6m8o9k4k2
$$ y = [11, 46, 89, 86, 24, -32, -91, -95, -64, 6, 64, 95, 65, 30, -39, -80, -82, -65, -1, 62, 108, 93, 33, -36, -68, -102, -55, -9, 59, 90, 92, 52, -32, -77, -91, -74, -8, 37, 99, 99, 57, -8, -78, -103, -82, -31, 44, 91, 104, 60, -5, -77, -97, -92, -44, 22, 84, 114, 71, 15, -54, -105, -96, -48, 21, 78, 109, 75, 19, -55, -95, -107, -57, 12, 69, 101, 91, 39, -40, -85, -91, -53, 0, 75, 99, 93, 47, -20, -62, -79, -62, 2, 55, 94, 84, 45, -9, -65, -79, -63, -22, 55, 77, 94, 50, -17, -69, -92, -68, -19, 48, 83, 96, 49, -4, -76, -78, -83, -15, 29, 96, 96, 54, -2, -54, -76, -83, -23, 36, 74, 77, 60, -8, -60, -99, -84, -36, 26, 87, 117, 61, 13, -40, -82, -83, -31, 39, 75, 107, 87, 26, -50, -85, -89, -52, 39, 81, 116, 83, 26, -29, -85, -94, -69, -4, 76, 103, 88, 42, -27, -91, -101, -69, -11, 73, 89, 83, 53, -14, -72, -95, -74, -27, 34, 75, 96, 53, -15, -75, -105, -87, -33, 32, 89, 85, 48, 4, -58, -81, -87, -35, 37, 79, 105, 69, 10, -41, -89, -72, -30, 17, 78, 94, 66, 15, -46, -86, -78, -53, 16, 70, 101, 78, 15, -34, -78, -82, -47, 10, 64, 82, 63, 15, -38, -86, -92, -38, -3, 51, 81, 69, 32, -43, -74, -87, -61, 2, 55, 91, 65, 17, -52, -76, -98]
4459i8L2N0O3L9rm6n0o5rJ7O0O5N0Mm4p0o2k6K0M7O9N6ok1n5p6k8NN0O0N5Rl1
4492E5n2n9m0JM3N5O3J4pn8n9m5j0L5O5N4L1mo9o1l0j8K9P1N2K4Mn1p2l5mJ7O4
4525CN0L3Mm0o3m5k1K6N2M2M1pl5n5m5k0L0M5N2K4J8m6l8o4j5QN6M0N3Kn2l2o7
4558f6k3K0M3N2M6J2k6o4m7m9J9M8M9N8K1l1o4n9k7mM7O5M6L0k0m9p3l9kL4O0
4589GO2K2j5m9n7l9k0L7O2N0L5rm4n2n1k4J0P4N2K8Om0n9n8k5L2L6N6O2ml8n1
4621dn4l3J5N3N6M5Ol1m2o3k2OL3N4M3J6j5n9n6k5MK6P5L5J7k0n4m2l4QK3O1M9
4654G1K4k0n8m0m9JM0N3M2J8j9m9n3k9oL8M3N3K6j8l7n1n5j0L8M5O5J6%m0o6l9
4686f6j4K0M6N8N1l3k8o5m6%QM9O0K6J6m0n0n4k6K5N2M2N2J3l2n2o9k4J7M6M9
$$ y = [-98, -66, -16, 47, 86, 77, 31, -19, -84, -93, -76, -16, 49, 99, 103, 59, -11, -73, -99, -79, -32, 37, 93, 87, 66, 11, -65, -93, -88, -38, 22, 77, 86, 55, 3, -56, -96, -95, -52, 3, 66, 80, 73, 15, -44, -89, -99, -64, 1, 55, 86, 82, 13, -48, -78, -96, -67, 4, 56, 80, 84, 33, -39, -74, -78, -61, 3, 53, 86, 90, 50, -13, -58, -79, -53, -1, 41, 82, 75, 40, -15, -60, -80, -50, -5, 47, 71, 89, 43, 5, -59, -74, -66, -10, 30, 83, 85, 33, 1, -66, -89, -69, -26, 26, 72, 84, 58, -6, -53, -102, -83, -35, 14, 72, 93, 62, -2, -61, -88, -92, -45, 20, 66, 96, 76, 27, -46, -85, -87, -53, 7, 69, 91, 76, 27, -30, -69, -89, -52, 10, 60, 95, 86, 42, -10, -61, -85, -75, -1, 51, 79, 85, 45, -14, -72, -97, -65, -29, 27, 89, 85, 47, -4, -58, -91, -76, -23, 33, 78, 84, 53, 11, -52, -74, -68, -35, 19, 62, 78, 63, 4, -52, -77, -73, -47, 28, 63, 80, 60, 6, -36, -70, -62, -39, 22, 71, 95, 75, 17, -23, -72, -71, -31, 22, 64, 82, 63, 14, -39, -68, -74, -36, 7, 60, 86, 68, 31, -20, -75, -85, -47, -2, 63, 79, 79, 39, -27, -66, -80, -60, -14, 44, 95, 62, 34, -31, -77, -77, -69, -20, 40, 66, 82, 42, -8, -62, -88, -63, -11, 31, 83, 96, 64, 12, -57, -81, -64, -18, 31]
4717C1M3J7l1m7n8l1JL4O6M7J1k2m1o0l0j1M4M0O6Rj5l9m4m2j6K4M8N2L6j6k6
4748D0o2m0k3K8N3M6L7j5l1n8k7j3%O5M5J7Rl3n1m7mJ0M5M2L8ll0m6n2j2RM4O0
4781D1K7Pl2l9m9k3K1K4M8K9K1k2n3m5k5J8K2O1M2kj0n5o4k3OL9M9M3J5j4m8n2
4813d3l8j3M3N6M3J5%l6p1l1kL3M8O2K5k1l7o1l5j0RN7M2M8kl3n3n7jJ0L9O1J2
4846E9K0l1n8l1k7J0L3M4L5J4l2l9l7l1QK8O1K8J4l7l1l9l8JM0M9L6J4j8m5l9
4877c9l3kM2L8M2J4j2m7l0n2PL6N1L6Nnl1n0l2j1L4N7L0K1mm8l9m3RNO0M9J3j6
4911E5l4k9o5LK0M4N1J7Kl1m0n2k0K9K9N6L6Pn0m6m0k6RO3K8L8J5k4m0n4k1%M6
4944b4N4L5kjm0n6l0ML2M1L9J3om0m4l7jN0K1M0K4Km3n8l2j9M5L4M0K6j7j4n6
$$ y = [31, 74, 91, 60, 13, -45, -76, -75, -41, 25, 72, 83, 61, 20, -40, -70, -81, -37, 3, 69, 78, 63, 24, -20, -62, -78, -54, -6, 46, 82, 66, 40, -22, -62, -85, -57, -4, 42, 79, 64, 33, -25, -52, -65, -65, 0, 45, 62, 71, 38, -13, -60, -64, -54, -9, 33, 71, 68, 38, -8, -60, -72, -63, -19, 41, 68, 75, 43, 4, -45, -68, -47, -23, 25, 54, 75, 53, 0, -45, -70, -52, -30, 31, 73, 71, 61, 6, -58, -81, -75, -36, 13, 56, 71, 57, 9, -43, -81, -94, -51, 5, 48, 63, 63, 27, -44, -75, -77, -44, 4, 66, 91, 70, 33, -28, -63, -73, -64, -7, 35, 83, 81, 48, -5, -62, -63, -53, -14, 47, 59, 79, 48, -10, -41, -68, -58, -25, 19, 54, 68, 36, -3, -40, -71, -63, -35, 26, 54, 68, 31, 0, -39, -77, -76, -36, 13, 49, 63, 45, 0, -39, -72, -74, -32, 6, 48, 62, 50, 3, -27, -79, -72, -36, 15, 51, 56, 51, 20, -30, -62, -73, -39, 18, 48, 69, 65, 17, -22, -65, -56, -51, 9, 58, 71, 55, 21, -8, -73, -70, -50, -6, 45, 62, 64, 33, -7, -59, -79, -50, -21, 35, 71, 78, 28, -18, -58, -84, -75, -12, 16, 54, 69, 45, 5, -49, -70, -70, -24, 30, 65, 63, 62, 22, -34, -64, -60, -28, 13, 52, 65, 59, 19, -25, -62, -63, -13, 8, 48, 72, 74, 31, -27, -59, -78, -33, 1, 41, 67, 50, 36, -20]
4977b0m1MJ9L0M0L1j1l0l3l3qJ0K8M3J5Jk7l4n0jJ3M8K3L8nk6l9k6l1K4M2L2K3
5010D9J2k3m1l9k0J7K9M1L2Jk1l2m9j3mM9M0M6j3j8k9m8k1nK8N5L2K4k8l7m6l2
5042f4LK6L7N2J9k3k7n1l5kJ6L5O6J9j6l9l9l9j0K0N0M0K5mk6m0l6l2L5M0K7M2
5074F9Kl6l5m4j5RM3L6L0jk7l0m1j6J1L8K5M3Lk2l1l4k9QJ9L7K4K3k2n1j2l3J7
5107d2J1M8L0Kk5k2m9orK5M4K0J3Qm4l9k0LK5M2K7K7j2n0k1l2j6L5L2M5Rpk9m6
5141b3k7j3K9L9M8Pkl1n0l5LQM0M4L5ol1n2l4j6K7K5M1K9J5l2m7m6oMK4N2K2N
5175D6qn0k0k7qN1K3L4L0l0k2l9l6KJ5L3M5K9k5k2l7l3nK3M2J8K9j1k1n8KrRL9
5209IL3J4qk9l6k1pJ9K5L0L4j0k6m5j9rJ6K7K7K4Ml3l1l6qJ7L5L5K2Nk7l8l6r
$$ y = [-20, -61, -57, -38, -8, 32, 63, 52, 22, -11, -44, -52, -42, -14, 29, 44, 45, 18, -16, -66, -67, -54, -6, 17, 55, 50, 24, -15, -41, -72, -48, -6, 26, 49, 61, 38, -3, -42, -62, -45, -16, 25, 57, 58, 37, 5, -44, -57, -61, -12, 28, 74, 61, 43, 14, -34, -55, -60, -32, 23, 55, 79, 51, 14, -32, -64, -61, -35, 2, 54, 73, 50, 23, -28, -63, -65, -49, -14, 52, 71, 55, 16, -23, -62, -72, -52, -2, 38, 63, 59, 33, -7, -43, -75, -40, 0, 27, 69, 71, 35, 0, -44, -59, -50, -7, 29, 59, 58, 31, 1, -40, -56, -45, -7, 18, 61, 64, 42, 11, -23, -52, -44, -25, 12, 36, 59, 37, -14, -26, -59, -42, -31, 17, 47, 49, 24, 2, -47, -53, -62, -37, 7, 27, 40, 48, 4, -35, -55, -52, -27, 15, 42, 69, 57, 7, -14, -46, -62, -27, 5, 50, 59, 52, 23, -23, -50, -63, -34, 5, 53, 60, 58, 27, -23, -58, -55, -47, -7, 37, 72, 66, 35, -17, -51, -67, -40, -15, 26, 55, 70, 38, -9, -55, -61, -57, -33, 19, 41, 46, 38, -12, -32, -59, -67, -16, 7, 41, 71, 41, 19, -20, -56, -54, -39, -6, 39, 68, 43, 21, -16, -49, -54, -31, 11, 29, 58, 47, 26, -32, -30, -39, -30, 9, 42, 56, 48, 19, -17, -38, -45, -26, -1, 29, 63, 53, 27, -18, -37, -46, -30, -3, 24, 48, 52, 19, -12, -48, -56, -39, -4, 31, 53, 58, 31, -7, -43, -52]
5243e2K4PN6J9Rm2j4m3j6J0L2M5J3Pj9l6l6onM3K8K9J4k3l1l6l3QK2L0M5J0j6
5276D3l8l9j2j0K7L2L0J9pk4m1l5j1J9L4L2K8qk2k4l7j1RK7L8L0rj5k6l4j4J2
5308c7L8K4J9Mk1j4n5j0J5K0L4K4J2j6k7l7mLJ7L0K7Rk1l2k1j0KJ3M1J9nj4k7
$$ y = [-52, -28, -21, 35, 54, 63, 21, 7, -36, -52, -42, -10, 35, 48, 55, 36, 0, -36, -42, -47, -4, 24, 53, 67, 44, 13, -23, -56, -48, -26, 4, 49, 59, 43, 5, -34, -46, -56, -29, 3, 33, 52, 45, 21, -20, -55, -66, -47, -13, 19, 47, 39, 17, -7, -44, -55, -46, -19, 19, 49, 40, 25, -1, -35, -49, -37, 1, 25, 44, 48, 27, 13, -42, -52, -37, -17, 17, 41, 53, 37, 10, -27, -31, -28, -11, 19, 46, 55, 34, 2, -19, -29, -27, -14, 27, 46, 41, 27, 0]
$$ [...]
8191a0
##END NTUPLES=NMR FID
##END=
