##TITLE=1H_PR164_2E1
 D2O, 8 sc, 
 5.2.2020
##JCAMPDX= 6.0         $$ Bruker NMR JCAMP-DX V2.0
##DATA TYPE= NMR FID
##DATA CLASS= NTUPLES
##ORIGIN= UXNMR, Bruker Analytische Messtechnik GmbH
##OWNER= root
$$ XWIN-NMR		Version 3.5
$$ Wed Feb  5 14:23:05 2020 Russian Standard Time (UT+4h)  she@DPX200
##.OBSERVE FREQUENCY= 200.1315
##.OBSERVE NUCLEUS= ^1H
##.DELAY= (6, 6)
##.ACQUISITION MODE= SIMULTANEOUS
##.ACQUISITION SCHEME= undefined
##.AVERAGES= 8
##.DIGITISER RES= 18
##SPECTROMETER/DATA SYSTEM= spect
##.PULSE SEQUENCE= zg30
##.SOLVENT NAME= D2O
##.SHIFT REFERENCE= (INTERNAL, D2O, 0, 15.7039)
##AUDIT TRAIL= $$ (NUMBER, WHEN, WHO, WHERE, WHAT)
$$ ##TITLE= Audit trail, XWIN-NMR		Version 3.5
$$ ##JCAMPDX= 5.01
$$ ##ORIGIN= Bruker BioSpin GmbH
$$ ##OWNER= she
$$ F:/spectra/data/she/nmr/H-F/1/audita.txt
$$ ##AUDIT TRAIL=  $$ (NUMBER, WHEN, WHO, WHERE, WHAT)
(   1,<2020-02-05 14:21:59.82 +0400>,<she>,<DPX200>,
      <created by zg, POWCHK disabled, PULCHK disabled
       configuration hash MD5:
       00 E9 B6 7A A2 85 ED C7 34 08 36 98 17 FE 4E 26
       data hash MD5: 16K
       A0 BC 81 3E 63 83 F3 3C 18 F7 BA 40 34 8E 5F CF>)
$$ ##END=
$$ 
$$ hash MD5
$$ 41 EC 5E 4A 2B 56 D6 7B 40 7D EE 26 DE EB 69 3E
##$RELAX= 
##$RELAX= 
##$RELAX= 
##$RELAX= 
##$RELAX= 
##$RELAX= 
$$ Bruker specific parameters
$$ --------------------------
##$DU= <F:/spectra>
##$EXPNO= 1
##$NAME= <H-F>
##$PROCNO= 1
##$TYPE= <nmr>
##$USER= <she>
##$AMP= (0..31)
100 100 100 100 100 100 100 100 100 100 100 100 100 100 100 100 100 100 
100 100 100 100 100 100 100 100 100 100 100 100 100 100 
##$AQSEQ= 0
##$AQ_mod= 1
##$AUNM= <au_zg>
##$AUTOPOS= <>
##$BF1= 200.13
##$BF2= 200.13
##$BF3= 200.13
##$BF4= 200.13
##$BF5= 200.13
##$BF6= 200.13
##$BF7= 200.13
##$BF8= 200.13
##$BYTORDA= 1
##$CFDGTYP= 0
##$CFRGTYP= 5
##$CHEMSTR= <none>
##$CNST= (0..31)
1 1 145 1 1 1 1 1 1 1 1 1 1 1 1 1 1 1 1 1 1 1 1 1 1 1 1 1 1 1 1 1 
##$CPDPRG= <>
##$CPDPRG1= <>
##$CPDPRG2= <>
##$CPDPRG3= <>
##$CPDPRG4= <mlev>
##$CPDPRG5= <mlev>
##$CPDPRG6= <mlev>
##$CPDPRG7= <mlev>
##$CPDPRG8= <mlev>
##$CPDPRGB= <>
##$CPDPRGT= <>
##$D= (0..31)
0 1.2 0 0 0 0 0 0 0 0.06 0 0.03 0 0 0 0 0.0002 0 0 0 0 0 0 0 0 0 0 0 0 
0 0 0 
##$DATE= 1580898119
##$DBL= (0..7)
120 120 120 120 120 120 120 120 
##$DBP= (0..7)
150 150 150 150 150 150 150 150 
##$DBP07= 0
##$DBPNAM0= <>
##$DBPNAM1= <>
##$DBPNAM2= <>
##$DBPNAM3= <>
##$DBPNAM4= <>
##$DBPNAM5= <>
##$DBPNAM6= <>
##$DBPNAM7= <>
##$DBPOAL= (0..7)
0.5 0.5 0.5 0.5 0.5 0.5 0.5 0.5 
##$DBPOFFS= (0..7)
0 0 0 0 0 0 0 0 
##$DE= 6
##$DECBNUC= <off>
##$DECIM= 24
##$DECNUC= <off>
##$DECSTAT= 4
##$DIGMOD= 1
##$DIGTYP= 9
##$DL= (0..7)
0 120 120 120 120 120 120 120 
##$DP= (0..7)
150 150 150 150 150 150 150 150 
##$DP07= 0
##$DPNAME0= <>
##$DPNAME1= <>
##$DPNAME2= <>
##$DPNAME3= <>
##$DPNAME4= <>
##$DPNAME5= <>
##$DPNAME6= <>
##$DPNAME7= <>
##$DPOAL= (0..7)
0.5 0.5 0.5 0.5 0.5 0.5 0.5 0.5 
##$DPOFFS= (0..7)
0 0 0 0 0 0 0 0 
##$DQDMODE= 0
##$DR= 18
##$DS= 0
##$DSLIST= <SSSSSSSSSSSSSSS>
##$DSPFIRM= 0
$$ [...]
##$SUBNAM2= <"">
##$SUBNAM3= <"">
##$SUBNAM4= <"">
##$SUBNAM5= <"">
##$SUBNAM6= <"">
##$SUBNAM7= <"">
##$SUBNAM8= <"">
##$SUBNAM9= <"">
##$SW= 24.9337058887773
##$SWIBOX= (0..15)
0 0 2 0 0 0 0 0 0 0 0 0 0 0 0 0 
##$SW_h= 4990.01996007984
##$TD= 16384
##$TD0= 1
##$TE= 0
##$TE2= 300
##$TE3= 300
##$TEG= 300
##$TL= (0..7)
0 120 120 120 120 120 120 120 
##$TP= (0..7)
150 150 150 150 150 150 150 150 
##$TP07= 0
##$TPNAME0= <>
##$TPNAME1= <>
##$TPNAME2= <>
##$TPNAME3= <>
##$TPNAME4= <>
##$TPNAME5= <>
##$TPNAME6= <>
##$TPNAME7= <>
##$TPOAL= (0..7)
0.5 0.5 0.5 0.5 0.5 0.5 0.5 0.5 
##$TPOFFS= (0..7)
0 0 0 0 0 0 0 0 
##$TUNHIN= 0
##$TUNHOUT= 0
##$TUNXOUT= 0
##$USERA1= <user>
##$USERA2= <user>
##$USERA3= <user>
##$USERA4= <user>
##$USERA5= <user>
##$V9= 5
##$VALIST= <valist>
##$VCLIST= <CCCCCCCCCCCCCCC>
##$VD= 0
##$VDLIST= <DDDDDDDDDDDDDDD>
##$VPLIST= <PPPPPPPPPPPPPPP>
##$VTLIST= <TTTTTTTTTTTTTTT>
##$WBST= 1024
##$WBSW= 4
##$XGAIN= (0..3)
0 0 0 0 
##$XL= 0
##$YL= 0
##$YMAX_a= 686060
##$YMIN_a= -616183
##$ZGOPTNS= <>
##$ZL1= 120
##$ZL2= 120
##$ZL3= 120
##$ZL4= 120
##$ABSF1= 10
##$ABSF2= 0
##$ABSG= 5
##$ABSL= 3
##$ALPHA= 0
##$AQORDER= 0
##$ASSFAC= 0
##$ASSFACI= 0
##$ASSFACX= 0
##$ASSWID= 0
##$AUNMP= <proc_1d>
##$AZFE= 0.1
##$AZFW= 0.1
##$BCFW= 1
##$BC_mod= 2
##$BYTORDP= 1
##$COROFFS= 0
##$CY= 11.3945322036743
##$DATMOD= 1
##$DC= 2
##$DFILT= <>
##$DTYPP= 0
##$F1P= 16.9975609425685
##$F2P= -3.02152046262296
##$FCOR= 0.5
##$FTSIZE= 0
##$FT_mod= 4
##$GAMMA= 1
##$GB= 0.15
##$INTBC= 1
##$INTSCL= 1
##$ISEN= 128
##$LB= 0.24
##$LEV0= 0
##$LPBIN= 0
##$MAXI= 10000
##$MC2= 0
##$MEAN= 0
##$ME_mod= 0
##$MI= 1.114404
##$NCOEF= 0
##$NC_proc= 0
##$NLEV= 6
##$NOISF1= 3.799351
##$NOISF2= 2.8
##$NSP= 1
##$NTH_PI= 0
##$NZP= 0
##$OFFSET= 15.70392
##$PC= 1
##$PHC0= -9791.279
##$PHC1= 14.20081
##$PH_mod= 1
##$PKNL= yes
##$PPARMOD= 0
##$PSCAL= 0
##$PSIGN= 0
##$REVERSE= no
##$SF= 200.130013532006
##$SI= 16384
##$SIGF1= 3
##$SIGF2= 2
##$SINO= 400
##$SIOLD= 16384
##$SREGLST= <1H.CDCl3>
##$SSB= 0
##$STSI= 0
##$STSR= 0
##$SW_p= 3612.71676300578
##$SYMM= 0
##$S_DEV= 0
##$TDeff= 0
##$TDoff= 0
##$TI= <>
##$TILT= no
##$TM1= 0
##$TM2= 0
##$TOPLEV= 0
##$USERP1= <user>
##$USERP2= <user>
##$USERP3= <user>
##$USERP4= <user>
##$USERP5= <user>
##$WDW= 1
##$XDIM= 8192
##$YMAX_p= 0
##$YMIN_p= 0
$$ End of Bruker specific parameters
$$ ---------------------------------
##NTUPLES= NMR FID
##VAR_NAME=  TIME,          FID/REAL,        FID/IMAG
##SYMBOL=    X,             R,               I
##VAR_TYPE=  INDEPENDENT,   DEPENDENT,       DEPENDENT
##VAR_FORM=  AFFN,          ASDF,            ASDF
##VAR_DIM=   8192,          8192,            8192
##UNITS=     SECONDS,       ARBITRARY UNITS, ARBITRARY UNITS
##FACTOR=    0.0002004,     1,               1
##FIRST=     0,             0,               0
##LAST=      1.6414764,     0,               0
##MIN=       0,             -616183,         0
##MAX=       1.6414764,     686060,          0
$$ Real data points
##PAGE= N=1
##DATA TABLE= (X++(R..R)), XYDATA
0 0 0 0 0 0 0 0 0 8 -8 16 -16 16 -24 24 -32 40 -48 58 -64 80 -94 106 -128 142 -166 192 -215 251 -280 319
30 319 -361 401 -454 506 -565 631 -699 780 -864 958 -1065 1173 -1304 1442 -1594 1773 -1966
47 -1966 2192 -2445 2740 -3091 3504 -4015 4652 -5475 6602 -8214 10757 -15385 26500 -109943
61 -109943 22709 411683 492653 401303 114463 -219641 -529859 -616183 -441943 -62210 301936
72 301936 514026 489035 272896 -64783 -371968 -518182 -409105 -98099 275014 530925
82 530925 574381 388735 58821 -281227 -475098 -443754 -210621 111161 391634 504664
92 504664 385467 72946 -279298 -503424 -515887 -340730 -49292 257858 448481 409507
102 409507 151137 -180415 -413081 -462165 -332074 -71731 236725 467778 497585 299843
112 299843 -15173 -282521 -391348 -320489 -107488 173193 408039 475287 324982 32303
122 32303 -255033 -417689 -406218 -235062 30894 274295 377356 290100 58395 -212946
132 -212946 -406798 -437215 -285701 -19222 238188 375613 347415 174470 -72003 -285958
142 -285958 -362012 -254115 -13971 238091 390430 390400 247244 13022 -223007 -351850 -303527
153 -303527 -103531 137560 301233 326051 212565 1055 -232373 -384711 -373246 -202338
163 -202338 36424 229873 302794 235465 55879 -162998 -318413 -331650 -191918 35711
173 35711 248581 357875 320859 156384 -60975 -234090 -286105 -194623 -1618 205981 333416
184 333416 319651 167536 -56125 -250478 -334337 -277876 -110254 96892 251036 276503 157615
195 157615 -47753 -242077 -340132 -303484 -147644 66979 251126 319645 240971 55588 -145158
206 -145158 -268511 -262968 -131184 73899 264024 353570 297532 121692 -93398 -253915 -294021
217 -294021 -198453 -12774 181128 292359 267913 114848 -100138 -282875 -352810 -280781 -98806
228 -98806 111814 258803 280010 165972 -30229 -219418 -314550 -270549 -104071 113814 289665
239 289665 347326 263194 75660 -132285 -267966 -269901 -138851 66242 251338 333716 274771
250 274771 98103 -121888 -290953 -336273 -240505 -48687 154340 277126 263047 118899
260 118899 -91685 -274306 -347494 -278072 -94340 126058 287631 321076 214948 20179
270 20179 -176593 -286705 -259943 -105398 108351 287884 353679 276969 89446 -127077 -279380
281 -279380 -302812 -189439 7791 199167 297325 258716 98091 -115660 -290723 -351176 -269039
292 -269039 -81183 128240 268750 282372 164742 -31640 -217687 -307665 -259311 -93376
302 -93376 118042 285132 337263 253441 70334 -130659 -260286 -263012 -139237 54782 231882
313 231882 311348 257392 92528 -114321 -274140 -318593 -230054 -51495 136771 251773 243995
324 243995 117043 -72923 -240686 -310826 -251807 -88519 109008 256609 292274 202081 29178
335 29178 -146700 -246752 -227858 -96626 87528 244028 303607 239975 81118 -104490 -237366
346 -237366 -261016 -168497 -3588 158214 243015 213241 79690 -97881 -241919 -289923 -221883
357 -221883 -67803 103456 218757 229035 132725 -25158 -171447 -239899 -198802 -65557 103465
368 103465 234194 270414 197321 49356 -106687 -202828 -198560 -97557 53615 185615 237550
379 237550 184751 50351 -106946 -221607 -244546 -167849 -26509 114707 192221 171673 63957
390 63957 -80803 -197520 -233198 -171318 -37315 110735 209342 216139 131412 -3707 -127212
401 -127212 -184074 -148831 -36024 104237 208111 227780 154686 21245 -114409 -195051 -186518
412 -186518 -95422 35618 145215 182485 130267 11049 -123103 -213418 -218548 -136785 -4259
423 -4259 120836 183806 158525 58669 -69254 -165426 -184986 -117314 8502 138332 215292
434 215292 206541 115726 -15902 -130033 -175755 -134079 -25030 101344 186162 189890 108571
445 108571 -23506 -149042 -214389 -191429 -91343 38842 141544 171431 114841 -3195 -129382
456 -129382 -205478 -195117 -101604 34861 155573 209735 175321 67911 -63969 -158482 -172301
467 -172301 -99431 27094 151591 219085 199284 97699 -43060 -161557 -205037 -156687 -41502
478 -41502 87742 173192 176471 93494 -42169 -169507 -231130 -199142 -88703 50881 162198
489 162198 196724 141180 19630 -112047 -192249 -182900 -87895 51919 177840 234155 196761
500 196761 81884 -59481 -165393 -190968 -125145 1762 133064 207361 189893 87486 -55375
511 -55375 -178792 -231984 -191148 -72880 69528 170525 184987 109336 -19843 -146736 -216655
522 -216655 -197289 -91506 56030 179912 224638 175576 57550 -76442 -170024 -182076 -103799
533 -103799 31877 162485 226168 196382 87805 -53336 -169514 -211547 -162308 -43835 89521
544 89521 176440 177951 93008 -40619 -165396 -225422 -195344 -87831 50530 161793 197883
555 197883 143653 25097 -102339 -179857 -173282 -86508 43531 162503 220565 190063 82874
566 82874 -52750 -154584 -179018 -120713 -8398 109679 182364 174148 84295 -47661 -161281
577 -161281 -208247 -171799 -71168 51204 143281 164342 105188 -8572 -122809 -184803 -166744
588 -166744 -76865 45583 149374 192035 155838 57384 -58986 -139810 -148707 -83656 24987
599 24987 128992 181484 159717 72619 -43571 -139881 -174758 -132855 -36051 69486 135192
610 135192 133872 67502 -36597 -133597 -179056 -151074 -62509 46444 129159 151944 106397 15100
622 15100 -79639 -135238 -125379 -53960 49386 137518 170618 135363 49692 -49051 -119486 -131950
634 -131950 -81662 8459 94922 137390 115501 39363 -58445 -135020 -158604 -119934 -35839 57024
646 57024 116178 113848 54110 -33672 -108547 -138397 -109592 -30488 65479 134608 146334 98474
658 98474 15691 -66558 -112080 -99727 -33765 54965 124126 141867 101078 19302 -69939 -129958
670 -129958 -133226 -78591 7051 82411 112964 87103 15977 -70944 -135431 -146305 -95875 -7551
682 -7551 77930 124511 116518 57663 -26916 -97837 -120067 -81169 -519 86225 142168 144469 89958
695 89958 -407 -84348 -123998 -103428 -35789 48455 112177 126740 80477 -7402 -97837 -149079
707 -149079 -140114 -78500 9036 87470 123129 97136 18981 -71882 -130257 -131368 -77182 10662
719 10662 99207 151801 140302 69144 -25272 -98121 -120332 -84801 -6670 83181 144012 143476
731 143476 80044 -16391 -104519 -148126 -129860 -58822 34624 107500 125296 80439 -5858 -96277
743 -96277 -151801 -147930 -82363 17309 105426 143549 119480 46334 -44755 -115496 -131624 -81065
755 -81065 13920 107404 156792 145624 80754 -13869 -101365 -141859 -113950 -31760 62135 124242
767 124242 129857 78429 -11681 -105151 -160754 -149442 -76659 21194 100393 130450 100829 23147
779 23147 -69074 -132878 -137310 -79655 14225 104697 154374 141600 72624 -22219 -99551 -125561
791 -125561 -90780 -11958 77448 137838 139833 80034 -14273 -100402 -143732 -129665 -64597 24524
803 24524 99529 123110 83181 16 -85927 -137224 -135647 -80552 7955 93738 137231 117991
815 117991 49317 -35448 -97960 -113655 -75469 2501 86837 138856 134216 75400 -10363 -86089
827 -86089 -120780 -101631 -37634 42262 101185 111271 67616 -9426 -87526 -132908 -125629 -68744
839 -68744 11708 79722 108017 85465 22520 -51913 -104307 -107865 -61011 14624 85473 123430
851 123430 113801 60018 -14680 -76736 -97804 -68435 -5222 62220 104562 102998 56410 -15632
863 -15632 -82711 -115295 -99242 -44096 23795 73917 85653 54147 -7688 -71352 -107627 -98564
875 -98564 -48828 19706 78625 103001 83075 28648 -33792 -76255 -78813 -41064 21037 79585
887 79585 107523 92612 41012 -23832 -75121 -91482 -65952 -11403 46259 79800 74225 30670
899 30670 -31699 -85544 -106153 -85000 -32442 29575 73620 81260 48906 -6847 -59914 -85755
911 -85755 -71750 -23116 39845 88904 103213 76416 21793 -36889 -74096 -72766 -33390 24237
923 24237 73352 92289 70878 17163 -45898 -91021 -98801 -67007 -9864 46477 76755 66696
935 66696 21149 -38446 -85672 -98809 -70978 -12687 50274 91533 93327 55530 -3268 -56815
947 -56815 -80522 -63781 -12897 49602 96650 104855 70359 8337 -53945 -90623 -87067 -45193
959 -45193 16254 68454 87147 63074 6503 -58174 -102734 -107164 -69740 -5994 56111 90387
971 90387 82049 35177 -28801 -79412 -93374 -64216 -4309 61623 105764 108180 67833 1748
983 1748 -59056 -89337 -76404 -25672 39072 88498 100404 67981 4254 -63736 -106870 -105797
995 -105797 -63129 2778 61755 89000 72278 19157 -47420 -96687 -105754 -70534 -5204 62197
1007 62197 103373 100949 57372 -7978 -65281 -89843 -69661 -13083 53451 100652 107981 71790
1019 71790 7309 -58674 -98495 -94772 -49508 15052 69223 89771 66899 10709 -55518 -102439
1031 -102439 -108711 -71724 -7340 55919 91511 85253 41164 -21178 -73468 -91093 -65650 -8550
1043 -8550 55997 100218 104964 68707 7106 -53144 -84755 -76136 -31463 28725 76789 90905
1055 90905 64726 8288 -54380 -95211 -98137 -62713 -4423 50622 78531 67486 21960 -35775
1067 -35775 -79620 -90075 -62421 -7923 50788 88721 89327 53501 -1141 -50298 -72345 -58063
1079 -58063 -13812 41050 81499 88629 59123 6391 -47215 -79360 -77874 -43074 8146 52054
1091 52054 68608 50300 5790 -44942 -80381 -84456 -55320 -4547 44532 71411 64869 29852
1103 29852 -16655 -54311 -65311 -44430 263 48133 78980 78263 47923 1313 -41885 -63143
1115 -63143 -53016 -17420 26742 58777 63423 38624 -5354 -49820 -75571 -71120 -39916 4979
1127 4979 41992 56020 41228 4818 -36813 -63527 -62908 -34104 9895 50525 70616 62205 29137
1140 29137 -12869 -44747 -51877 -31383 7406 46013 67666 61690 30142 -13897 -51451 -66119
1152 -66119 -52178 -17315 22161 48467 49497 24482 -17017 -54637 -71878 -59934 -25753 17452
1164 17452 51222 60945 43269 5824 -33253 -54842 -48904 -18331 23665 59906 74111 59531
1176 59531 21510 -22267 -52633 -56409 -33464 5537 42386 61420 51272 16302 -29226 -64770
1188 -64770 -74847 -55712 -16497 26475 53960 54350 26354 -15744 -53044 -68036 -53635 -15034
1200 -15034 31602 66488 74543 52157 10401 -31422 -56577 -52733 -21366 24149 61869 74149
1212 74149 55669 15180 -32132 -66129 -72456 -48046 -3965 39025 60215 50889 16639 -28903
1224 -28903 -66065 -79268 -60232 -15524 33565 66062 68213 41279 -1683 -42774 -64205 -53803
1236 -53803 -15888 33097 70776 80743 59038 15646 -31759 -63277 -65094 -36740 8692 49415
1248 49415 67902 54616 14931 -34163 -70894 -80436 -58710 -15265 31087 61348 61329 30828 -15178
1261 -15178 -54881 -70339 -55588 -16512 31440 69048 79365 56563 11911 -33106 -58326 -55428
1273 -55428 -25744 17836 57096 73841 58641 17156 -31180 -65420 -72417 -50275 -9762 32037
1285 32037 57524 53349 21556 -23130 -60203 -72837 -56982 -17970 26785 60012 66560 44549
1297 44549 4669 -35084 -56641 -49459 -17467 25168 59380 71340 55723 18818 -24252 -54793
1309 -54793 -59362 -36133 2401 37496 54519 46016 15925 -24870 -58949 -69105 -52013 -15191
1321 -15191 23406 48102 49622 27918 -7237 -40116 -55599 -44930 -12625 26376 55401 62293
1333 62293 45618 12731 -21984 -44218 -43296 -19734 15065 44240 54300 41112 10638 -24985
1345 -24985 -50858 -55984 -39105 -7194 24599 41194 35456 10590 -21061 -46098 -53426 -38937
1357 -38937 -8895 25040 47382 48441 28685 -884 -27343 -38566 -29801 -4855 26114 48862
1369 48862 52556 35229 4626 -25943 -42638 -39644 -19511 8913 31719 39419 26458 -1461
1381 -1461 -31376 -50079 -49221 -30192 -960 25536 39045 33004 10293 -18294 -38553 -39967 -22789
1394 -22789 5923 33875 49605 46859 25719 -3986 -28919 -37089 -25471 -680 25888 43167
1406 43167 41990 21977 -8708 -36902 -49710 -42415 -19123 9979 31672 36096 20830 -6573
1418 -6573 -33706 -48860 -44038 -20862 11320 38088 48704 38227 12107 -16531 -36170 -36601 -17973
1431 -17973 12419 40918 53836 45257 18987 -12720 -38006 -46577 -34025 -5868 24197 41824
1443 41824 38069 16086 -15835 -44487 -56490 -46999 -18726 14645 39435 44838 28826 -355
1455 -355 -30155 -46363 -41782 -16731 17804 46842 57677 46300 17674 -16023 -40064 -44028 -25088
1468 -25088 6067 35602 50998 44261 18141 -17686 -47295 -57255 -44821 -15396 18093 41012
1480 41012 42678 22649 -10121 -40777 -55072 -46714 -19093 16868 45635 55415 41937 11915
1492 11915 -21239 -42172 -41921 -20683 12590 43258 57539 48734 20415 -15572 -43375 -51678 -37841
1505 -37841 -8450 23825 43640 41899 19221 -14081 -44293 -57829 -48657 -20835 14052 40316
1517 40316 47667 33336 4043 -26597 -45121 -41934 -19161 13797 43228 56426 47319 20192
1529 20192 -12551 -37470 -43314 -28501 20 29657 45953 42075 19187 -13038 -41563 -53244
1541 -53244 -43771 -18094 12411 34816 38837 23631 -4346 -32250 -46089 -41468 -19227 12066
1553 12066 38243 48683 38743 13964 -13560 -32707 -35015 -18882 8160 33884 46190 40177
1565 40177 17814 -10692 -34364 -42496 -33002 -9860 15729 32281 31912 14202 -11046 -34276 -44490
1578 -44490 -38035 -16202 10494 30638 36450 25166 3587 -18893 -31879 -29049 -11348 13591
1590 13591 34620 42701 34057 13706 -10748 -27831 -30085 -17643 3098 22770 32584 26966 8575
1603 8575 -15221 -34296 -39521 -29306 -9303 12096 25120 25125 11442 -9752 -27568 -34043 -25092
1616 -25092 -5614 16908 32151 35200 24607 4658 -15564 -25208 -21018 -4744 15541 31138
1628 31138 34368 24408 3662 -18098 -31415 -31156 -18031 2262 19219 25491 18266 238 -20183
1641 -20183 -34509 -35625 -22884 -1560 19379 30094 26447 11105 -8378 -23126 -27241 -17120
1653 -17120 3005 24584 37281 35334 20386 -1330 -20284 -28633 -23520 -5945 15000 29111
1665 29111 30058 16051 -5832 -26720 -38140 -34848 -18788 4133 22794 28972 20042 571 -20735
1678 -20735 -33767 -32659 -17258 6315 28309 38922 34037 15424 -7785 -24689 -28862 -17997
1690 -17997 3110 25113 38241 35840 18529 -6571 -28893 -38639 -31558 -12281 10768 27668
1702 27668 30339 17577 -5692 -29004 -41864 -37638 -19188 6391 27797 36810 29833 9349 -14516
1715 -14516 -30964 -31893 -17289 7138 30461 42739 38801 20236 -5767 -27288 -35602 -26672 -5310
1728 -5310 17893 33234 33540 18249 -6673 -31004 -43286 -38708 -19501 6274 26618 33280 24144
1741 24144 2744 -20791 -36275 -35690 -19333 6130 29832 41694 37043 18177 -5906 -26078
1753 -26078 -32253 -21665 70 23306 37675 36550 20257 -4847 -27719 -39162 -34360 -15867
1765 -15867 7548 26123 30343 19540 -1774 -24441 -38119 -36946 -20678 3486 25340 35507
1777 35507 30228 12476 -9453 -25979 -29519 -17854 2895 25103 38271 36039 20199 -2647
1789 -2647 -22435 -31414 -25930 -9257 11907 26531 28683 16238 -4137 -24608 -36061 -33662 -18784
1802 -18784 2280 20274 27464 21353 4570 -14420 -27282 -27818 -15521 4570 23359 33352 30256
1815 30256 15987 -3063 -18502 -23656 -16355 -445 17194 27804 27054 14439 -4784 -21771 -30046
1828 -30046 -25997 -11851 5342 17782 20414 12039 -3618 -19674 -28476 -25598 -12579 4954 19944
1841 19944 26229 21032 7610 -7992 -18590 -18622 -8514 7194 21424 28188 24182 11140 -5944
1854 -5944 -18653 -22409 -15471 -1800 11739 19298 17277 5960 -9884 -23265 -28054 -21614 -8040
1867 -8040 7142 17527 19168 10040 -3558 -16285 -21324 -16575 -3920 12196 24155 26798 19316
1880 19316 4752 -9704 -17678 -15873 -5755 8437 20369 23810 16965 1960 -13682 -24042 -25186
1893 -25186 -16395 -1682 12264 18809 14846 1421 -13165 -24048 -25799 -17312 -1439 14998 24703
1906 24703 23340 12318 -2407 -15438 -20129 -14169 268 16784 27614 27697 17164 591 -15284
1919 -15284 -24330 -21755 -9142 7135 19413 22198 13969 -1640 -18622 -29684 -29198 -17473 322
1932 322 16250 23713 19583 6459 -10346 -22833 -24935 -15357 2719 20147 30411 29446 17422
1945 17422 -1195 -17086 -23764 -18212 -3403 13970 26449 27499 17033 -2026 -20621 -30575 -28476
1958 -28476 -15899 2333 17610 23949 17621 1328 -16631 -28718 -29171 -17891 542 18886 29774
1971 29774 27499 13839 -4167 -19111 -24036 -16847 -631 17528 30351 31085 19130 -15 -18122
1984 -18122 -27728 -25382 -11955 5775 20476 24878 17061 -132 -18520 -30473 -31015 -19393 -1058
1997 -1058 16238 25560 22601 9719 -7701 -21658 -25260 -17181 -262 18098 29613 29965 19149
2010 19149 1786 -15110 -23483 -20209 -6611 10134 22682 25429 17207 1147 -16597 -28090 -28124
2023 -28124 -17285 -726 14368 21196 17236 4349 -11450 -23784 -25538 -17001 -984 15366 25448
2036 25448 25092 14931 -608 -13822 -19770 -15062 -2172 13340 23952 25079 16564 1291 -13310
2049 -13310 -22178 -21449 -11270 2441 14109 18305 12841 -164 -13979 -23452 -24053 -15562 -1510 12081
2063 12081 19301 16978 7456 -5294 -15144 -17278 -11221 1212 14395 22639 21871 13564 302 -10565
2077 -10565 -15853 -13148 -3468 8033 16369 17311 9302 -2959 -14654 -21193 -19434 -10493 1230 10498
2091 10498 13927 9484 -401 -11691 -17913 -16506 -8167 3368 14665 19490 16284 7390 -3485 -11349
2105 -11349 -12270 -6260 4133 14074 19181 16491 7358 -4709 -14208 -17804 -13422 -3542 6751 12754
2119 12754 11764 3985 -7168 -16687 -20334 -16449 -6438 5818 14249 15603 9889 -494 -10182 -14549
2133 -14549 -11967 -2539 9449 18746 20954 15765 4843 -6952 -14201 -13842 -6527 4301 13604 17042
2147 17042 12597 1904 -10866 -19939 -21222 -14551 -3204 8177 14912 13268 4269 -7795 -17062
2160 -17062 -19720 -13677 -1645 11415 20491 21041 13523 1123 -10397 -16055 -12722 -2509 10185
2173 10185 19936 21972 15225 2095 -11665 -20154 -20109 -11844 1008 12202 16900 12959 1666 -11691
2187 -11691 -21694 -23587 -16118 -2407 11520 19729 19072 10023 -2903 -14423 -18752 -13843 -1281
2200 -1281 13026 22931 24422 17109 2955 -10490 -18829 -18118 -8313 5416 16480 20024 15097 2283
2214 2283 -12348 -22924 -24718 -16477 -3020 10586 18012 16466 6789 -7010 -18092 -21879 -15593
2227 -15593 -2835 11811 22085 23637 15873 2460 -10640 -17148 -15464 -5294 7903 19251 22763
2240 22763 17082 3628 -10806 -20435 -21526 -14564 -1774 10576 17277 14634 4359 -9123 -19533
2253 -19533 -22802 -16956 -4851 8960 18263 19604 11972 -28 -10943 -16405 -13917 -3910 9864
2266 9864 19758 22250 16763 5256 -7731 -16085 -17192 -9603 1672 12042 16265 13073 3444 -9008
2280 -9008 -18959 -21063 -15704 -4565 7088 13760 13843 6929 -3592 -13189 -16971 -12680 -2536 8692
2294 8692 17137 18865 13716 3920 -6505 -12338 -11389 -4122 5947 13456 16373 12006 2662 -7910
2308 -7910 -15410 -16339 -10862 -2127 6719 11394 9539 1801 -7551 -14508 -16086 -11103 -1951 7328 13570
2323 13570 13585 7976 -667 -7863 -10540 -7169 187 8935 15184 15741 10117 1101 -7156 -11939 -10371
2338 -10371 -4328 3464 9523 10519 6059 -2309 -10087 -15264 -14427 -8434 -13 7350 10247 7727 1239
2353 1239 -6216 -11247 -11098 -5460 3315 11336 15180 13185 6499 -1692 -7561 -9582 -5795 1811 9519
2368 9519 13398 11459 4638 -3840 -11509 -14505 -11857 -4353 3719 9192 9058 3472 -4639 -11837 -15060
2383 -15060 -12321 -4875 4650 12005 13994 9718 2212 -6209 -10858 -9543 -3133 6377 14148 16588 13014
2398 13014 4905 -5447 -12049 -13191 -8028 407 8416 12656 10586 2725 -7681 -15330 -17817 -13419
2412 -13419 -4388 5379 12251 12633 7105 -2879 -11254 -14728 -11392 -2650 7682 15902 18372 13713 4426
2427 4426 -6241 -12777 -11874 -5547 4293 12920 16181 13075 3569 -7878 -16137 -18255 -12812 -2959 6661
2442 6661 12766 11917 5100 -5402 -14878 -18141 -14145 -4385 7012 15070 17151 11914 2571 -7805
2456 -7805 -13321 -12232 -4510 6622 15624 19028 15184 5386 -5694 -14502 -16165 -10926 -1090 8788
2470 8788 14083 12182 4109 -6097 -15628 -19182 -15903 -5516 5104 13139 14457 9047 -182 -9512
2484 -9512 -14562 -12668 -4914 6341 14897 18647 14778 5970 -4550 -11609 -13169 -7891 1311 10805
2498 10805 15315 13151 4978 -5587 -13676 -17067 -14126 -5202 4269 11098 11683 6009 -2757 -11309 -14920
2513 -14920 -13423 -5644 4168 12338 15084 12046 4263 -4694 -10100 -10400 -4860 3871 11758 15162 12832
2528 12832 5840 -3734 -10884 -13069 -9873 -2558 4855 9731 9364 3666 -4727 -11872 -14710 -11985 -5022
2543 -5022 3006 9389 10760 7543 353 -6346 -9711 -8291 -2381 5165 11244 13789 11090 4282 -3034
2558 -3034 -8087 -8122 -4651 1995 7209 9894 7779 1783 -5484 -10553 -12190 -8877 -2827 3149 6879
2573 6879 6589 2236 -4193 -9054 -10300 -7306 -1340 5633 10060 10536 6770 691 -4132 -6441 -4716
2588 -4716 -98 6010 10029 10382 6616 518 -5616 -9338 -8802 -4712 1407 5826 6734 3786 -1798 -7682
2604 -7682 -11197 -10698 -6646 65 6273 8404 6898 2200 -3520 -7669 -7589 -3612 2609 8717 11910 10784
2620 10784 5936 -686 -6356 -7718 -5549 178 5676 9615 8664 3630 -3389 -9919 -12332 -10493 -4850
2635 -4850 2010 6683 7993 4523 -1733 -8222 -11490 -9670 -4093 3476 10162 12311 9997 3672 -3334
2650 -3334 -8100 -8107 -3817 3396 9938 12695 11172 4723 -3434 -9916 -12012 -9341 -2639 4772 9341 8878
2666 8878 3659 -3978 -11206 -14068 -12014 -5127 3023 9768 11407 8215 1354 -5963 -10340 -9770 -4066
2681 -4066 4239 11700 14924 12508 5237 -3235 -9241 -11066 -7623 -24 7350 11522 10474 4625 -3814
2696 -3814 -11729 -14759 -12459 -5613 2523 8873 10255 6698 -820 -8368 -12411 -11754 -5447 3146 10855
2711 10855 14301 11888 5218 -2831 -8746 -9875 -5853 1813 9292 13112 12243 6275 -2558 -9695 -12984
2726 -12984 -11020 -4652 3105 8550 9469 5230 -1990 -9306 -13223 -12168 -6178 1788 8713 11797 9450
2741 9450 3436 -3768 -8592 -9114 -5150 2184 9076 13035 12016 6617 -1138 -7336 -9803 -7578 -1974
2756 -1974 4552 8938 8895 4713 -2249 -8694 -12302 -11111 -6065 685 6406 8343 6047 854 -5216
2771 -5216 -9113 -8782 -4617 1906 8059 10984 9710 5066 -618 -5353 -6695 -4491 599 6159 9218
2786 9218 8487 4422 -1708 -7235 -9687 -7983 -3750 1362 5572 5767 3028 -2173 -6898 -9189 -8075
2801 -8075 -3850 1463 6003 7641 6028 2060 -2377 -5388 -4984 -1580 3282 7578 8819 7606 3464
2816 3464 -1761 -5500 -6400 -4238 -18 3711 5641 4678 1062 -3929 -7734 -8964 -6658 -2383 2155
2831 2155 4726 4835 2089 -2136 -5294 -6494 -4476 -478 4638 7871 8207 5469 1346 -2765 -4763
2846 -4763 -3908 -381 4057 7012 7340 4643 -272 -5071 -7479 -7332 -4285 -113 3750 5046 3325 -799
2862 -799 -5663 -8262 -8136 -4902 428 5203 7641 6574 2891 -1737 -5280 -5834 -2813 1679 6745 9397
2878 9397 8954 5455 -531 -5408 -7354 -6126 -1818 3256 6559 6576 3185 -1769 -7191 -10565 -9259 -5068
2894 -5068 985 5301 6835 5174 535 -4446 -8105 -7938 -3806 2079 7552 10361 9387 4781 -769
2909 -769 -5589 -7372 -4796 432 6024 9344 9134 4577 -1660 -7419 -10390 -9616 -4419 1633 6384 7521
2925 7521 4625 -842 -6692 -10417 -9673 -5204 950 7048 10044 8856 3810 -2211 -6590 -7398 -4511
2940 -4511 1239 7167 10805 10182 5553 -433 -6246 -8971 -8011 -3502 2602 7101 7925 4661 -1152 -7100
2956 -7100 -10814 -10472 -6387 -448 5616 8136 6599 2110 -3378 -7749 -8124 -5279 759 6778 10425
2971 10425 9807 6547 206 -4921 -7215 -6158 -1393 4001 7810 8359 5177 -180 -5954 -9535 -9177
2986 -9177 -5603 -304 4442 6600 4991 552 -4518 -8247 -8577 -5499 -337 5307 8140 8345 4975
3001 4975 -307 -4585 -5914 -3984 0 4851 8271 8735 5627 743 -4309 -7228 -6654 -3296 664
3016 664 4499 5481 3035 -402 -4952 -7956 -7971 -5225 -631 3370 5743 5361 2080 -1809 -4738 -5447
3032 -5447 -3227 1212 4997 7471 7253 4445 364 -2971 -4439 -3445 -547 2675 5249 5114 2722 -1069
3048 -1069 -4845 -6566 -6178 -3589 18 2847 3357 2029 -850 -3871 -5614 -5076 -2459 1245 4507 5910
3064 5910 4717 2202 -762 -2837 -3233 -979 2235 4920 6204 5140 2000 -1824 -4227 -4850 -3574
3079 -3574 -669 2226 3369 2837 369 -3196 -5485 -6542 -4922 -1749 1986 3930 4290 2337 -718
3094 -718 -3643 -4438 -2981 238 3655 6398 6548 4516 1032 -2154 -4159 -3450 -1158 2262 4880 5384
3110 5384 3343 -553 -4261 -6857 -6788 -4108 -434 2759 4372 3322 384 -3394 -6095 -6290 -3751 56
3126 56 4382 6430 6297 3789 -273 -3287 -4519 -3012 475 4616 7180 6839 4211 7 -4034 -6632
3142 -6632 -5837 -3304 658 4532 5267 3389 -641 -4875 -7631 -7597 -4624 -495 3903 6431 5793 2539
3158 2539 -1518 -5390 -5765 -3570 494 5265 8062 8334 5288 646 -4179 -6135 -5469 -1589 2501 6044
3174 6044 6822 4282 -181 -4995 -8072 -7963 -5220 -703 3627 5620 4883 1099 -3053 -6556 -7198 -4805
3190 -4805 -472 4710 7659 7635 5058 532 -3686 -5747 -4396 -1014 3824 6930 7699 5227 910 -3747
3206 -3747 -7090 -6932 -3988 -155 3512 5708 4671 760 -3797 -7044 -7742 -5592 -1260 3426 6000
3221 6000 6122 3478 -251 -3965 -5633 -4154 -582 3602 7080 7615 5524 1534 -2654 -4994 -5134 -2774
3237 -2774 883 4170 5195 3969 413 -3474 -6442 -6975 -5272 -1631 2060 4083 4374 1490 -1562
3252 -1562 -4298 -5474 -3891 -846 2952 5452 6151 4625 1297 -1712 -3557 -3143 -794 2059 4953
3267 4953 5221 3838 849 -2687 -4782 -5208 -3517 -869 1894 3253 2391 83 -3105 -4904 -4902 -3372
3283 -3372 -902 2037 3940 3827 2406 -197 -2335 -2556 -1819 608 3024 4688 4627 3096 690 -1822
3299 -1822 -3220 -2852 -1043 1153 2524 2882 1148 -1229 -3492 -4694 -4475 -2703 -270 1987 2536 1780
3315 1780 -299 -2469 -3290 -3118 -1270 1557 3341 4678 3983 1806 -298 -2083 -2185 -740 1446 3565
3331 3565 4415 3413 881 -1787 -3870 -4625 -3051 -1047 1254 2507 2050 180 -2379 -4028 -5026 -3439
3347 -3439 -1009 1687 3568 4096 2598 -151 -1935 -3143 -2253 94 2962 4904 5382 3924 975 -1985
3363 -1985 -3771 -3958 -1778 846 3001 3776 2548 -504 -3413 -5194 -5879 -4196 -1021 2024 3948 3570
3379 3570 1262 -1670 -4134 -4997 -3366 -153 3301 5412 5675 3884 774 -2342 -3892 -3391 -801 2414
3395 2414 4770 5201 3370 485 -2873 -5366 -5685 -3919 -511 2588 4032 3339 906 -2632 -5356 -6129
3411 -6129 -4256 -1137 2771 5250 5419 3437 471 -2847 -4450 -3467 -960 2803 5571 6126 4700 1760
3427 1760 -2366 -4390 -5091 -3031 4 3135 4493 3606 749 -2794 -5564 -6429 -4967 -1806 1835 4093
3443 4093 4275 2558 -524 -3550 -4965 -3906 -1017 2435 5336 5942 4718 1969 -1446 -3600 -3742 -2048
3459 -2048 1033 3429 4758 4037 1416 -1783 -4313 -5799 -4114 -1716 1360 2973 3310 1602 -1502
3474 -1502 -3790 -5294 -4386 -1463 1292 3974 4991 3497 1241 -1418 -2949 -3061 -1153 1945 3922
3489 3922 4871 4051 1749 -1139 -3224 -3990 -3109 -749 1669 2916 2638 888 -1847 -3941 -4675 -3975 -1927
3506 -1927 896 2452 2801 1965 190 -2004 -2931 -2331 -418 1911 3760 4074 3377 1561 -428 -2187
3522 -2187 -2318 -871 865 2327 2919 2071 417 -1788 -3445 -3459 -2995 -1276 619 1890 1373 136 -1358
3539 -1358 -2827 -3104 -1790 -133 1666 3007 3156 2206 701 -1151 -1792 -962 546 2104 3333 3292 1941
3556 1941 -117 -1622 -2548 -2342 -1000 356 1601 1546 525 -970 -2845 -3638 -2987 -1630 -33 1851
3572 1851 2130 1486 330 -1229 -2400 -1609 -243 1399 3283 3695 3471 1306 -714 -1509 -2066 -920 877
3589 877 1958 2947 2432 459 -1249 -3517 -3478 -2923 -1240 602 1775 1937 700 -1395 -3190 -3667 -2956
3606 -2956 -919 1774 3374 3670 2844 602 -1259 -2379 -1927 -448 1786 3743 4329 3393 718 -1456
3622 -1456 -3292 -3824 -2030 -382 1801 3149 2212 412 -1885 -3854 -4604 -3631 -1181 1308 3441 3386
3638 3386 2408 -307 -2219 -3152 -2743 -604 2026 4161 4719 3894 1840 -1274 -2926 -3298 -1822 803
3654 803 2827 3971 2691 731 -1991 -4036 -4597 -3854 -1496 918 2927 2917 1557 -862 -3315 -4162
3670 -4162 -3744 -1201 1208 3732 4187 3444 1344 -1144 -2542 -2848 -1474 1016 3333 4318 3888 1726
3686 1726 -949 -3532 -4207 -3254 -1311 918 2718 2474 1265 -1079 -3385 -4189 -3840 -1790 623 2721
3702 2721 3619 2757 546 -1777 -2681 -2581 -1135 1219 3323 4337 3859 2027 -231 -2013 -2939 -2098 -451
3719 -451 1944 2842 2925 1329 -1029 -2847 -3931 -3392 -1888 77 1901 2549 1681 86 -1614 -3019 -2608
3736 -2608 -1230 732 2725 3427 3037 1833 -173 -1417 -1892 -1301 519 2253 2934 2721 888 -472
3752 -472 -2175 -2773 -2323 -1383 391 1233 1133 486 -885 -2436 -2734 -2555 -1282 483 1762 2180 1693 510
3770 510 -778 -1185 -1034 -93 1215 2215 2551 2268 943 -428 -1299 -1609 -1002 198 814 1478 875 -335
3788 -335 -1229 -2216 -2735 -1776 -796 297 1052 908 78 -823 -1640 -1586 -660 103 1555 2309 2134 1273 310 -973
3808 -973 -946 -695 603 1681 2324 1922 974 -226 -1391 -2223 -1842 -788 176 1192 1256 165 -1162 -2206
3826 -2206 -2844 -2509 -1185 609 1529 1971 1774 490 -576 -1598 -1292 -469 1320 2421 2864 2563 1103
3843 1103 -691 -1694 -2073 -1289 156 1233 1966 1683 455 -1078 -2573 -3332 -2624 -1097 491 1680
3859 1680 1766 1360 -394 -1910 -2717 -2206 -676 908 2809 3066 2421 920 -398 -1772 -1959 -989 938
3876 938 2679 2970 2548 990 -884 -2495 -3103 -2707 -1045 741 1691 2040 850 -665 -2687 -3455 -2915
3893 -2915 -1220 554 2294 3041 2136 1046 -701 -2435 -2035 -1200 1143 2558 3510 3331 1455 -229
3909 -229 -2231 -2944 -2093 -753 1332 2269 2356 999 -814 -2613 -3374 -3401 -1549 271 1704 2521 2109 403
3927 403 -1578 -2440 -2379 -1020 437 2411 3153 3018 1686 -151 -1767 -1968 -1378 -82 1833 2638 2895
3944 2895 1741 -213 -2070 -3133 -2724 -1830 39 1339 1910 1199 -280 -1950 -2606 -2778 -1560 -15
3960 -15 1950 2596 2389 1239 -259 -1278 -1722 -1033 322 1643 2878 2516 1649 -39 -1014 -1918 -1804 -820
3978 -820 148 1224 1390 898 -360 -1739 -2573 -2348 -1517 -491 987 1606 1253 132 -570 -1181 -1398 -686
3996 -686 599 1703 1969 2178 1514 205 -652 -1064 -864 290 927 1504 1249 504 -271 -1331 -1623 -1697 -1004
4015 -1004 -297 608 512 67 -642 -1581 -1456 -1350 -722 217 1311 1358 1226 401 -226 -553 -650 428 910 1556
4035 1556 1774 1540 474 -472 -1055 -1261 -606 162 700 952 418 -228 -983 -1949 -1879 -1163 -303 578 1120 803
4055 803 94 -657 -1168 -1090 -200 640 1419 2103 1662 1295 -41 -807 -893 -747 345 1199 1618 1542 715 -505
4075 -505 -1383 -2016 -1516 -1046 124 819 1012 305 -805 -1647 -1948 -1505 -968 155 1481 2014 1645 634
4093 634 -452 -1149 -1360 -428 540 1747 2296 2107 1046 -442 -1480 -2157 -1472 -334 368 1454 1435 588
4111 588 -697 -1574 -2638 -2250 -1024 167 1277 1244 1132 349 -812 -1856 -1701 -663 724 2134 2654
4128 2654 2240 1499 -140 -1204 -1757 -1163 -93 1343 2169 1621 960 -483 -1805 -2541 -2303 -1151 170
4145 170 1178 1923 1196 -237 -1445 -2437 -2201 -1443 203 1623 2342 2238 1178 -118 -1230 -1643 -871
4162 -871 169 1556 1897 2250 1356 -143 -1323 -2320 -1645 -858 472 1639 1488 1086 -135 -1343 -2397
4179 -2397 -2219 -1493 -366 1071 1709 1616 692 -394 -1250 -1392 -812 -10 1363 2388 2262 1634 580 -770
4197 -770 -1381 -1191 -296 420 1378 1344 1110 -202 -1051 -2018 -2063 -1421 -430 620 1119 1082 438 -904 -1233 -1391
4217 -1391 -1203 223 950 1590 1659 1067 209 -188 -766 -584 37 500 1572 1906 1082 52 -714 -1369 -1557
4236 -1557 -762 -280 192 975 438 -167 -1072 -1551 -1410 -779 -172 760 712 726 461 -178 -621 -550 -239 268 944
4257 944 1332 1197 764 373 -578 -678 -519 73 195 859 622 78 -635 -1002 -1146 -1263 -502 -18 545 487
4277 487 219 -348 -826 -1204 -647 -1 602 1290 1113 1002 194 23 -540 -110 270 681 854 1063 731 241
4297 241 -472 -916 -832 -692 117 330 448 -47 -162 -1049 -1669 -1502 -842 100 869 1374 836 180 -301 -533
4317 -533 -818 -346 674 986 1827 1357 884 -28 -375 -1004 -571 -174 674 1167 886 488 -497 -1235 -1695 -1538
4337 -1538 -1070 120 882 902 473 -346 -924 -1381 -1271 -686 459 1510 1915 1693 901 -121 -639 -1056 -828
4356 -828 319 1151 1688 1590 960 -480 -1106 -1501 -1772 -1029 213 1128 1052 590 -287 -1364 -1952 -1833 -1056
4375 -1056 1 746 1418 1258 807 -31 -1162 -1290 -976 457 1116 1654 1880 1271 178 -1018 -1075 -1489
4393 -1489 -599 251 945 1236 573 -163 -1267 -1735 -1828 -1224 -90 747 1163 1194 253 -803 -1212 -1457 -970
4412 -970 77 991 1558 1616 1250 341 -619 -1061 -914 -372 598 1415 1432 968 -222 -1030 -1507 -1567 -813 -13
4432 -13 279 973 674 120 -827 -1394 -1506 -1095 -437 465 1369 1304 865 321 -468 -755 -788 -139 819 1632 1556
4453 1556 1163 279 -724 -848 -1083 -662 55 935 686 689 -93 -915 -1267 -1204 -904 -723 -20 504 594 425 -106
4474 -106 -788 -858 -495 -118 1057 1296 852 874 246 -332 -414 -476 -51 315 734 729 636 -153 -437 -797 -827 -584
4496 -584 -165 353 266 15 -157 -686 -987 -865 -605 -179 468 591 658 28 -108 -25 -275 220 427 679 831
4517 831 720 395 -161 -500 -539 -344 184 299 571 567 -261 -400 -878 -991 -721 -549 287 577 257 193 -340
4538 -340 -383 -764 -426 327 876 854 1159 663 82 -308 -190 -298 328 459 784 785 135 -216 -600 -821 -958
4559 -958 -627 -128 387 276 446 -234 -790 -1123 -868 -618 17 884 799 1105 561 -108 -462 -479 -266 358 1157
4580 1157 1296 1216 893 -77 -665 -919 -658 -428 395 902 940 512 -371 -1021 -1289 -1470 -933 -9 581 954
4600 954 862 -34 -400 -858 -1082 -935 127 823 1451 1245 785 133 -362 -1073 -738 70 691 836 1379 838
4620 838 -338 -785 -1252 -1338 -786 -364 368 912 479 283 -739 -1437 -1539 -674 -271 538 907 1153 860 60
4640 60 -548 -754 -561 -53 676 1600 1289 1083 36 -493 -876 -762 -599 -115 779 1136 838 113 -547 -1280
4660 -1280 -1361 -954 -113 308 813 1190 720 39 -415 -964 -564 -54 375 1125 1066 754 519 -69 -698 -719 -215
4681 -215 285 561 814 843 78 -464 -741 -1032 -1062 -336 198 357 325 167 -425 -913 -909 -457 -320 295 588 1009
4703 1009 488 169 -67 -601 -282 13 250 583 1106 464 26 -184 -558 -906 -538 -11 309 266 205 -393
4723 -393 -204 -852 -742 -613 -396 245 479 346 -105 -144 -358 -248 68 -11 730 462 671 673 293 -178 -375
4744 -375 -128 399 297 366 390 155 -102 -461 -429 -683 -85 137 245 235 257 -238 -406 -461 -466 28 255 720 425
4767 425 288 239 39 -529 135 237 445 858 422 502 121 -319 -717 -471 -336 54 561 434 148 39 -591
4788 -591 -938 -874 -493 -63 335 402 225 61 -234 -682 -576 -176 -39 706 943 337 648 -82 -565 -373 -3
4809 -3 44 490 749 762 302 -180 -598 -836 -742 -760 -133 239 596 147 114 -406 -805 -1042 -264 181 505 1101
4831 1101 1109 571 373 -503 -452 -348 183 616 1033 1147 500 35 -439 -783 -691 -311 115 513 487 474 63 -543
4853 -543 -968 -1078 -742 10 311 608 595 194 50 -967 -626 -470 -7 700 920 1151 665 176 113 -565
4873 -565 -699 -280 -22 607 776 476 -169 -287 -766 -1032 -748 -406 258 478 633 269 -412 -752 -671 -798
4893 -798 50 267 876 847 937 630 -103 -613 -324 -72 -199 832 699 790 216 -220 -604 -894 -435 -217 241
4914 241 594 380 87 -324 -531 -753 -677 -415 131 438 827 597 100 -246 -398 -591 -115 529 541 592 718
4935 718 186 -277 -414 -625 -89 170 435 166 390 24 -166 -807 -893 -645 -225 32 206 188 382 -91 -616
4956 -616 -365 -254 -145 228 839 723 361 215 -71 -344 -399 -126 271 227 267 -95 221 -408 -417 -867 -139 -56
4978 -56 67 13 80 -42 -548 -370 -412 -542 -67 -97 460 595 73 -59 -116 29 50 331 503 606 432 221
5000 221 -283 -152 -587 -124 -3 375 347 64 -99 -67 -592 -477 -272 -112 28 211 379 -43 -160 -169 -300
5021 -300 -217 45 303 375 395 505 139 -144 57 -195 394 386 358 764 342 -119 -407 -469 -349 -123 -84 405 225
5044 225 -201 -308 -410 -554 -475 -349 69 315 547 309 280 -184 -386 -397 -328 118 656 832 462 400 150 -205
5066 -205 -475 -229 -101 541 335 474 356 -337 -598 -663 -591 -318 176 97 506 622 14 -14 -365 -463 -578 -33
5088 -33 507 699 773 573 -11 -237 -486 -604 -225 410 568 880 505 204 -426 -726 -886 -547 112 212 257
5109 257 270 82 -104 -547 -720 -516 -61 137 515 483 135 38 -171 -588 -473 186 350 616 597 551 217 -67
5131 -67 -385 -264 -366 -127 308 563 407 50 -220 -850 -456 -342 -14 141 480 364 320 -95 -438 -244 -468
5152 -468 -102 108 640 1062 412 414 76 -545 -351 -367 187 621 602 518 260 -77 -403 -465 -505 -77 118 219
5174 219 209 62 -301 -384 -831 -398 -70 -109 695 338 159 43 -34 -406 281 -113 421 340 777 315 205 22
5196 22 -373 -310 -316 26 -212 25 247 -143 -313 -308 -489 -389 -82 155 54 109 123 -26 -247 -254 -101 119 507
5219 507 454 431 210 -9 -44 -20 -364 273 166 376 294 130 -163 -336 -296 -189 -77 64 176 -172 15 -132
5241 -132 -325 -350 -188 -266 219 132 377 395 301 -44 -214 -15 -18 -54 200 560 219 -206 27 -412 -353 190 321
5264 321 274 490 222 -302 -347 -600 -404 -195 -83 -29 89 157 135 -177 -304 -346 -321 -78 396 457 110 420 99
5287 99 -284 -236 -47 78 212 510 148 358 74 -397 -349 -613 -417 -124 158 386 202 -133 -378 -599 -586
5308 -586 -699 225 427 542 293 149 140 -98 -260 -135 7 439 464 321 588 18 65 -444 -250 -188 93 186
5330 186 545 65 -58 -370 -517 -369 -490 -359 -52 472 269 8 -245 -447 -14 -394 -11 3 550 738
5350 738 612 251 -154 -453 -401 -204 54 571 537 450 260 -73 -662 -373 -829 -90 37 437 226 72 -160
5371 -160 -346 -301 -341 -305 344 380 475 347 261 -52 -263 -385 320 210 511 526 446 155 -62 -313 -489 -417 -64
5394 -64 -3 364 390 128 -263 -296 -113 -355 -60 -287 268 306 434 70 -242 -193 -494 -141 419 236 411 164
5416 164 345 -61 -212 -267 14 -66 99 268 353 122 -160 -611 -329 -247 176 -60 156 363 261 136 -325
5437 -325 -213 -396 20 166 268 -34 329 185 -124 31 -144 -539 246 297 149 156 179 -101 -52 -318 -184 7
5459 7 28 -82 -109 -59 -65 -447 85 -130 -168 -199 375 49 58 -220 -222 21 -73 -58 86 96 245 94 5 -22 -295 127
5485 127 122 152 45 167 115 -42 -425 -221 -63 -365 -33 61 168 -164 -154 -122 -93 -122 -38 202 344 536 283
5508 283 -74 -57 -208 21 8 461 471 424 199 -7 -33 -395 -444 -227 28 -33 275 177 182 -186 -431 -679 -215
5531 -215 -213 328 155 227 63 -76 -374 -360 -138 472 411 392 461 390 172 -128 51 -259 -49 70 331 240 34
5554 34 -148 -193 -607 -409 -266 150 214 335 325 -88 -149 -363 -58 -469 -188 412 299 295 374 178 -129 -268 -243
5577 -243 -136 49 213 392 416 -58 -197 -184 -246 -365 -28 64 322 400 -54 -216 -28 -411 -224 -92 75 307
5599 307 304 458 164 -99 -320 34 -151 432 554 563 413 -55 26 -66 -25 -394 -265 138 81 186 172 -294 -450
5622 -450 -239 -344 -123 331 127 130 310 -336 156 -340 -403 -61 184 33 485 442 258 -205 -151 -25 -64 169
5644 169 405 127 92 120 -117 -113 -372 -16 -125 -7 167 85 200 -100 -247 100 -90 -1 -36 177 191 189 2
5667 2 -198 -252 -84 69 200 231 269 180 -215 198 -226 99 61 123 178 43 -72 -44 29 -371 -295 -442 -2 119
5691 119 178 -104 140 36 -116 -14 -302 32 213 223 342 -114 -127 -44 83 27 -8 9 -197 84 243 -81
5713 -81 -133 -170 -72 52 68 73 -23 -310 -112 119 -311 -258 -240 197 338 31 321 11 90 92 137 239 321 328 179 273
5739 273 139 -177 118 -242 -92 -20 222 -50 7 -177 -328 -12 -371 -80 -318 -144 262 197 172 -125 -302
5760 -302 70 -128 15 219 34 351 265 -25 -144 -52 -64 226 330 235 89 181 -154 -169 -7 -393 32 77
5782 77 110 223 232 -7 -59 -142 -289 -242 171 259 466 234 193 225 -45 -247 -152 -211 550 154 555 173 0 181
5806 181 -119 -539 -57 -96 -74 279 -58 175 -136 -267 -585 -415 11 30 297 244 -14 -14 -63 25 -228 -217 115
5829 115 138 601 75 70 72 97 -162 -208 298 105 17 116 189 -78 -274 -356 -444 -159 -102 157 140 138 -135 -150 -346 -46
5855 -46 -295 67 73 -24 438 188 53 -263 -166 -298 11 112 49 -146 74 -141 -229 -165 -472 59 -136 100 37
5878 37 169 -93 -161 -209 -352 -319 45 -163 40 92 -48 -44 -4 5 -273 203 112 579 463 398 -27 -150 -187 -64
5902 -64 -14 289 -26 279 121 94 3 -237 -65 -227 -231 29 256 33 -74 -115 -17 -209 55 -49 185 -25 185
5925 185 267 -127 -114 -155 -98 -72 143 348 133 -264 69 235 115 -81 -51 34 32 -155 71 -139 -72 63 -209
5948 -209 90 38 15 -64 129 -293 -205 -130 -34 107 67 169 -50 116 -109 87 -133 133 -360 -93 137 184 98
5971 98 -270 -184 -168 -108 140 -118 -186 183 -54 -205 -130 -245 -19 122 -252 187 113 -9 206 99 -215 -30
5993 -30 -167 -48 305 95 375 227 -291 -182 -292 -118 -301 43 39 70 -301 -364 -15 -494 -239 -110 -120 373
6015 373 -55 -67 31 -217 -22 -158 332 345 217 159 42 49 168 -39 11 -179 -37 432 398 1 391 25 -96
6038 -96 -357 -264 -109 -180 -344 227 89 -138 -129 -240 4 -135 4 269 88 -55 180 65 -210 -68 121 -36
6060 -36 24 -25 367 139 149 -142 -281 -247 -49 149 -37 258 55 186 -400 -386 -168 -15 349 233 219 122 -40
6083 -40 147 -99 -89 -238 177 92 262 286 218 63 -168 -86 15 73 330 -20 308 -135 -344 -345 -112 -301 -198
6106 -198 -193 476 165 133 78 -224 -170 55 -209 32 65 -20 342 -63 -73 208 126 -106 -105 142 410 409 107 98 -30
6131 -30 137 -90 -385 -95 -89 -178 -33 22 -51 -266 -2 -117 100 222 99 178 167 -85 -85 -404 -55 -78 78 15
6155 15 50 63 8 -53 -295 -78 -131 11 96 459 13 119 -110 -151 -353 172 -1 -445 42 -48 -25 200 -276
6178 -276 -42 14 30 -14 22 83 -207 -2 -188 61 94 -85 -155 85 -272 -85 -443 29 -178 -54 236 253 222
6201 222 -155 159 -144 -82 -342 -175 -98 -125 -6 8 -132 4 -109 71 489 261 216 -13 8 -255 30 18
6223 18 -52 89 64 -93 119 -59 -24 -174 -260 -249 182 12 24 -36 14 232 175 -53 -242 -320 -148 -94 -125 299
6247 299 241 220 -109 -419 25 123 -56 286 -71 113 224 -33 -61 -398 -236 -80 122 99 -137 -18 -143 74
6269 74 -132 21 -125 20 -42 278 115 64 119 -196 -115 -89 -121 140 301 -158 84 54 56 -247 -116 -157 92 54
6293 54 329 311 -135 55 41 -124 -29 -190 297 -13 289 124 -251 85 -580 -264 12 -5 160 41 -38 -59
6315 -59 -194 4 131 -103 247 249 94 56 -54 -58 55 136 -6 -105 -14 70 -219 -73 -110 -35 8 17 -102 66 135
6340 135 81 292 206 -190 99 80 -49 218 100 139 125 -23 -91 -172 -66 -156 36 296 8 -235 -164 110 -68
6363 -68 -109 -60 -133 50 67 207 -176 0 94 -216 -137 53 87 -219 199 75 112 194 -84 6 -168 -294 40 108
6387 108 -121 113 9 94 -202 -74 128 100 1 -74 80 -44 -346 -39 -234 -77 58 444 -42 -31 115 138
6409 138 -195 -26 107 -83 173 178 122 230 177 95 241 66 96 26 -236 211 -425 93 204 -58 -166 124
6431 124 257 271 -135 -316 190 -25 40 -75 123 59 190 118 66 -125 -136 246 -3 70 -157 348 -189 -93 52
6454 52 -84 -217 -181 -164 -116 94 -241 -41 -114 -178 148 169 305 156 -13 71 145 272 -12 -20 86 -377 204 383
6478 383 -148 154 29 9 -122 -150 -155 -89 -41 -197 -15 -193 159 7 -98 -37 -201 214 88 128 40 -16 -40 217
6502 217 92 -189 210 177 -20 -277 138 -84 -36 63 194 -184 113 110 -84 -104 -190 88 -52 -20 -267 -60 52
6525 52 249 298 80 80 -51 -37 -176 198 141 14 -34 -119 -79 -64 -109 225 224 -272 319 197 254 -10 -86 327 -37
6550 -37 101 -19 51 -172 349 -131 -172 -68 56 -168 -223 208 -128 -100 -127 -40 -78 -109 119 120 84 12 -184 -3
6574 -3 -53 128 -241 -277 0 -6 50 -61 -73 141 136 -55 32 -136 -139 45 87 -143 18 -184 -270 -126 224 47 -20
6599 -20 268 318 47 161 -124 93 89 42 -60 -109 496 5 -124 -206 77 -32 -21 120 41 111 28 117 49 -27 96
6624 96 156 -47 23 227 142 72 -109 122 -31 55 144 -125 143 -280 -1 -225 148 -3 -42 -47 -149 -67 -11 -108
6648 -108 117 -252 -74 -174 -124 -115 -122 -278 262 -213 127 -182 -46 -4 -119 -74 319 -99 -163 -129 -11 -134 53
6671 53 42 239 -6 -171 -61 84 -90 -223 295 177 208 -14 50 -92 -65 125 105 -146 27 18 139 54 -65
6694 -65 51 -57 115 229 -93 -92 -26 18 156 -34 58 199 -89 271 17 -66 -164 -102 96 -73 -58 59 -93
6717 -93 5 95 -26 -54 75 393 -53 -128 341 316 -109 -74 301 -25 -340 -76 66 -195 313 -48 178 -2
6739 -2 -82 176 -34 147 126 119 131 -45 -152 -104 178 14 -325 261 -23 -32 187 -189 -170 -130 131 385 57 591
6763 591 -25 -39 -256 -29 125 -79 -54 -81 -105 212 -106 -89 168 -276 95 90 -351 -326 49 -362 95 340 -232
6786 -232 134 23 92 -120 59 -120 178 -21 397 -102 268 11 -119 -58 -73 304 45 65 3 -25 -146 5
6808 5 160 133 48 107 -7 -36 -30 -267 -67 -61 161 110 142 56 -43 143 22 76 -164 22 106 13 25 86 -86 -67 -73
6835 -73 93 -188 -242 -29 -118 132 -245 -264 10 -36 -63 -85 185 96 79 61 -222 73 77 -217 170 54 -286 135
6859 135 112 -25 -38 -160 146 198 77 170 3 -155 -189 -233 -29 -3 -26 33 232 13 -10 -236 -180 -128 60 -107
6883 -107 27 -12 31 46 -242 24 94 -78 -52 -103 40 -265 -13 -47 -176 180 8 125 -186 68 219 -276
6905 -276 243 26 115 54 -307 32 74 32 75 -83 188 -435 56 -198 125 177 243 -91 -65 176 -159 -92 -16
6928 -16 -83 6 -8 -14 -155 -98 -166 29 93 60 -230 244 -19 317 -247 -135 199 -247 179 -27 146 -127 115
6951 115 38 -234 -25 -103 -5 -105 -302 126 236 -160 45 257 76 -37 227 -171 -214 266 87 -330 188
6972 188 6 -101 -229 -89 147 57 -162 -124 -98 -34 254 -282 63 54 -158 -197 137 -25 138 22 6 100 -107
6995 -107 83 12 -118 172 -68 -31 16 -19 -41 44 25 84 -63 107 -100 -291 -196 97 -30 80 60 -15 -34 148
7019 148 6 -30 -82 -60 23 169 136 -98 41 -241 258 66 -152 -14 -300 178 -92 184 163 172 -216 -21 259
7042 259 189 263 162 -96 -2 -137 38 -100 45 228 -316 -273 271 -80 -72 -197 -41 -62 169 -278 -154 -184 -206
7065 -206 83 29 272 2 271 -59 -117 -227 -235 -41 195 -82 179 177 81 36 -78 -150 17 -87 135 -96 177
7088 177 -188 -50 192 -68 -148 -277 218 107 -21 -164 292 116 295 -215 106 201 38 8 2 -21 -198 70
7110 70 -107 -99 112 -129 195 -56 -147 91 231 39 105 46 102 125 11 82 142 -330 -38 59 189 -167 -11 68
7134 68 86 36 157 146 -104 -32 -68 -17 49 -62 1 96 -196 -19 199 -68 -97 -111 263 135 11 -180 -63 -194
7158 -194 -198 -40 -191 -39 172 7 -122 32 -182 8 36 -238 91 206 105 169 73 202 -137 -131 150 50
7180 50 -55 -101 -119 -193 60 50 127 -15 -25 0 324 11 -225 -137 -150 129 -52 122 -133 -13 180 38 170
7203 170 -169 -154 190 -78 140 -32 164 73 -121 130 -73 175 69 293 -81 -16 20 -101 30 147 -338
7224 -338 25 -49 232 284 -15 17 -137 98 147 98 121 145 106 55 -9 -146 -198 94 -49 287 -97 -340 211 -366
7248 -366 0 38 -65 -258 265 31 26 -77 -214 37 6 -118 96 -131 -142 -231 77 149 -209 -222 77 -75 -13
7271 -13 200 106 33 -216 180 0 -52 170 -22 -67 -107 -167 -193 149 -50 -100 -226 -183 -11 -220 9 -84 -74 53
7295 53 -79 106 -153 -27 119 -29 -103 -29 -131 -82 -9 -17 -4 -224 149 52 -53 129 -179 47 39 250 109 -185
7319 -185 189 -50 -75 -321 -101 -105 -67 55 26 128 -155 20 -119 -147 93 31 129 -285 423 197 93 -81 124
7342 124 145 -293 -13 28 -263 12 -107 26 -195 -201 19 -385 135 -76 5 279 -115 -283 -134 110 109 -138
7364 -138 191 86 236 161 40 -46 107 5 -38 225 236 233 -224 8 57 -159 36 -91 -87 97 127 11 -7 -324
7388 -324 78 67 -8 39 75 112 -133 74 167 -42 30 -274 174 197 -22 -70 392 64 -41 -112 177 17 -104
7411 -104 32 -68 -89 -163 233 -131 200 260 96 12 13 66 197 216 -62 -123 -379 15 -41 -49 176 -211 -63 5
7435 5 -73 -80 108 -27 -248 25 -307 118 92 -51 62 -108 284 -193 -403 -47 101 128 -36 -82 -14 -205 136
7458 136 -86 135 -210 -290 -59 248 -151 18 -51 85 -57 -140 315 -48 407 -188 24 41 -18 -121 -2 130
7480 130 43 -52 -260 38 19 -156 69 90 58 -33 127 197 -190 -348 -71 79 -209 52 -40 89 252 -178 -8
7503 -8 -82 -96 34 -131 48 -175 -185 -239 22 26 5 98 -127 -188 36 88 -144 67 -12 -113 182 -164 -205 -4 205
7528 205 -66 43 294 154 -215 -96 75 -276 -34 133 -104 -7 133 119 -109 237 -207 -201 -48 434 194
7549 194 85 23 -1 -207 5 -88 -187 -185 -74 166 185 -157 107 27 -282 -69 -166 -71 94 73 7 -322 -397 -33
7573 -33 -189 121 62 9 26 -13 27 2 24 170 -17 23 -212 234 -76 -227 267 273 -66 -94 -63 -92 -197 -76 216
7598 216 5 -141 212 -4 57 38 207 113 134 -145 16 154 48 -77 -126 -91 -283 289 388 139 -71 93
7620 93 50 97 0 212 -74 -322 -37 -29 238 -187 -44 -25 67 -313 162 -193 -152 98 -482 -131 172 165 163 68 245
7645 245 37 314 80 -140 -113 -196 -159 -159 232 -266 -17 106 -51 -101 -66 -87 -58 130 -149 -167 179 249 -11 107
7669 107 35 5 222 -64 -33 -229 -42 -117 122 130 40 172 165 125 77 -140 -121 -19 18 -225 88 -159 -31 152
7693 152 -284 -63 25 -230 -246 -35 2 67 272 -131 -99 -102 -19 174 217 -83 -246 24 86 161 -148 65 57 29 -47
7718 -47 -307 155 -54 -86 118 -62 -157 257 -121 172 -286 -167 -69 -21 -137 -93 153 133 19 -220 -331 73
7740 73 194 253 135 -216 -163 -59 229 -73 1 -111 217 12 39 116 -373 -46 112 -138 129 65 -121 -247
7762 -247 -12 92 -19 -153 -153 -142 38 -52 -8 10 462 -4 195 52 -153 -207 -129 170 257 -77 14 -69 -320 -70
7786 -70 -309 -58 28 -126 -20 96 159 -231 131 -45 452 -2 86 177 31 208 -247 216 93 -316 176 -79
7808 -79 94 -51 57 147 171 79 -135 -59 21 87 -67 68 -106 -296 -243 -22 -403 -277 -73 59 120 -103 -22
7831 -22 -65 34 -222 -47 -67 99 51 60 368 -54 -69 106 97 -232 200 275 -67 141 -96 7 158 -275 -91 -84
7855 -84 -172 245 -191 64 98 -49 153 -104 18 193 10 -12 96 171 3 228 317 121 61 -115 38 -134
7877 -134 -19 110 10 -159 296 -126 73 -37 -25 -101 -253 -219 -34 54 -169 205 -37 131 -28 -22 199 43
7899 43 20 325 52 -5 16 -360 -7 -179 -69 28 -90 161 56 56 -182 -301 182 121 -206 99 3 -85 -204
7922 -204 -60 174 45 -139 89 -204 -95 312 187 -274 -48 -138 -14 182 -257 344 112 -162 -128 -161 -71
7943 -71 15 91 130 -217 339 76 48 -239 47 -182 -68 129 -177 60 -190 260 -85 -62 278 52 322 93
7965 93 -122 -37 -142 -198 -16 78 -254 -19 341 -201 43 180 -304 199 -15 -96 -117 -51 -8 -58 -16 142 151 -94
7989 -94 113 -133 65 124 84 120 -140 -145 109 387 -5 196 111 -135 -119 -17 15 246 -33 96 -149 91 212
8012 212 -171 29 -291 -201 -218 19 96 170 -231 97 -80 -137 53 -61 47 -65 -126 93 -85 152 175 67
8034 67 375 41 119 80 -188 -85 37 -73 -25 -103 -25 2 129 55 -30 -80 -95 -104 59 317 -57 -72 -116 22 371
8059 371 34 -123 178 48 269 158 -293 2 4 93 267 -117 348 -255 -59 86 -240 138 41 149 -38
8080 -38 0 20 -72 -29 215 -83 190 -43 246 84 -39 150 -96 -47 -381 71 -25 -14 82 42 49 -203 -139 140
8104 140 350 125 -329 81 -575 -32 81 514 -102 -108 -24 393 -62 134 -63 111 -118 1 33 -33 266 -104
8126 -104 -79 33 -125 152 -114 -374 -184 -201 149 -131 328 9 -55 94 180 105 303 146 -106 181 187 324
8148 324 -14 -175 145 137 142 -125 -153 115 -46 -14 81 -39 44 61 42 -100 134 10 71 271 -292 -168 -25 -4
8172 -4 -166 -75 69 234 259 -76 -52 -129 -47 -23 232 75 5 -30 -82 35 69 -180 155
8191A55
$$ Imaginary data points
##PAGE= N=2
##DATA TABLE= (X++(I..I)), XYDATA
0 0 0 0 0 -8 8 0 8 -8 16 -24 24 -32 40 -48 60 -66 88 -100 118 -143 160 -192 220 -252 293 -331 380 -432
28 -432 487 -554 619 -698 783 -873 980 -1085 1209 -1346 1489 -1654 1831 -2024 2245 -2482
44 -2482 2755 -3055 3395 -3784 4227 -4747 5362 -6099 7011 -8159 9673 -11755 14823 -19833
58 -19833 29413 -54630 265101 686060 387304 70065 -302475 -492007 -537139 -317687 33258
69 33258 393408 523898 408276 88287 -256089 -522385 -582508 -423043 -77319 284894
79 284894 509092 480333 239322 -104255 -389897 -504964 -383641 -83114 267693 508074
89 508074 552390 379240 57516 -280899 -469489 -418266 -167964 143522 387565 479487 374400
100 374400 84530 -269658 -506075 -506368 -300971 -7663 253689 400790 369559 148792 -173138
111 -173138 -428499 -480598 -318611 -37253 243340 428136 448619 280965 -12522 -285324
121 -285324 -396180 -303255 -69406 199862 400696 447032 306800 35754 -240922 -402049
131 -402049 -385638 -205061 58848 285009 365021 263162 34141 -218250 -393699 -419431
141 -419431 -275466 -15354 239101 366954 317108 130477 -99898 -281478 -342395 -244249
151 -244249 -14103 244157 399134 380397 213522 -15195 -216734 -318103 -273203 -88701
161 -88701 150404 317955 331791 195307 -23586 -237841 -364259 -346827 -186472 44262
171 44262 235244 299069 213281 22068 -187937 -323130 -320526 -178775 41900 246610 347885
182 347885 303554 134364 -81508 -244480 -279121 -171716 24528 221687 335536 314525
192 314525 160237 -63607 -254996 -327101 -254489 -79379 117750 254088 269009 148460
202 148460 -59129 -257384 -351276 -300561 -131175 81778 250208 304426 220710 35695 -164219
213 -164219 -282343 -264816 -119534 89127 272768 351523 289944 113387 -100523 -257900
223 -257900 -288807 -182251 11506 202850 303563 267144 107581 -107273 -286269 -350499
233 -350499 -272405 -87868 121235 262404 273903 151857 -48506 -236042 -325236 -273895 -100941
244 -100941 119382 292398 342844 251361 61106 -143290 -270836 -264797 -128025 79231 262959
255 262959 341623 277976 96779 -124520 -290402 -329124 -228094 -34044 166057 281940
265 281940 261131 110863 -101669 -282044 -350959 -278054 -92465 125966 283262 312395 203110
276 203110 6257 -188279 -292741 -259778 -101317 113560 291058 353257 272706 85673
286 85673 -126989 -273280 -292445 -177318 19342 208833 302852 259094 95619 -116865 -288889
297 -288889 -346345 -263038 -75956 130095 265020 271685 150786 -43540 -224199 -309519 -259223
308 -259223 -93284 116293 280496 329199 242748 61602 -133122 -256028 -253624 -128146 65037
319 65037 237653 311293 254313 89998 -111734 -265028 -305647 -216906 -41505 140851 249324
330 249324 236274 107534 -80699 -243851 -308378 -246338 -84428 107175 247459 276503 184986
341 184986 16847 -151214 -244008 -219884 -88602 92499 243841 297902 231727 75485 -104068
352 -104068 -228690 -245623 -150383 11203 165080 241489 205272 71845 -101003 -238640 -280745
363 -280745 -210388 -60481 103759 210637 214473 115201 -40051 -179184 -238763 -191443 -57886
374 -57886 105741 228394 257914 182816 38084 -109958 -195975 -183698 -80898 66569 191214
385 191214 236469 179215 44028 -109799 -215901 -230215 -149278 -12100 119832 187210 159563
396 159563 49128 -93349 -202786 -229881 -163112 -30238 112118 202049 202021 113833 -19829
407 -19829 -136538 -183073 -138531 -22334 114086 210532 222937 145822 12857 -116669 -188904
418 -188904 -172324 -77139 52487 155237 183643 123627 431 -131721 -215173 -212789 -126267
429 -126267 6186 124895 178978 145329 41290 -85176 -175664 -187506 -112715 16306 144342
440 144342 215700 199158 103800 -27332 -136308 -173305 -123507 -9829 116298 195856 192057
451 192057 104848 -28768 -152328 -212979 -184364 -79906 51547 150054 171088 106510 -15761
462 -15761 -141346 -213594 -197585 -98891 40283 158780 206400 165229 55226 -74690 -165815
473 -165815 -175275 -96284 36388 162278 225537 199105 93390 -46404 -161978 -202009 -149471
484 -149471 -29507 101302 182566 178284 89647 -46941 -173284 -233327 -199582 -86524 56009
495 56009 164650 193807 132191 7750 -122640 -199097 -186107 -88158 54106 179797 234449
506 234449 194050 76539 -64254 -166021 -186751 -118273 9264 140361 214547 194830 87954
517 87954 -58064 -179479 -226799 -182628 -67197 71309 170897 185322 105669 -28390 -155555
528 -155555 -220254 -195860 -91074 52471 174793 221154 170728 49437 -85188 -173033 -177685
539 -177685 -96904 35452 162698 226585 198185 89119 -52984 -166776 -204662 -151990 -34306
550 -34306 94465 177249 176452 91161 -42518 -166585 -225149 -192104 -83652 51124 155649
561 155649 187139 133579 19167 -106331 -183478 -175066 -83536 47640 161877 212658 181536
572 181536 79405 -50504 -150362 -173859 -111748 2885 116783 181357 168710 81661 -44077
583 -44077 -155452 -203007 -166066 -63727 57014 141153 154353 93199 -16061 -124865 -184241
594 -184241 -165284 -75243 46196 145711 182209 143327 46990 -62126 -135938 -141884 -77177 31070
606 31070 133627 181797 154564 66332 -44731 -132939 -162745 -121030 -27232 74698 135712
617 135712 129070 59399 -43730 -135016 -174082 -143819 -57908 46313 125160 143163 93514 1940
629 1940 -88253 -135311 -119139 -46447 52738 135865 166026 128952 42685 -53700 -117280 -121693
641 -121693 -67025 20260 101388 138853 113779 34576 -63649 -135814 -152014 -108563 -26184 60342
653 60342 113514 107324 43709 -44944 -116713 -139954 -105133 -25175 67816 132717 139748 88045
665 88045 4119 -73668 -111662 -93122 -24958 63728 130843 143920 97634 13129 -73014 -126809
677 -126809 -125309 -69163 16686 91047 116359 82771 6948 -78596 -138562 -145445 -93485 -3929
689 -3929 81154 124294 110033 46838 -37533 -105574 -123240 -80382 4341 92508 145584 142740
701 142740 85069 -4449 -86711 -124502 -99110 -25375 60324 119512 128130 80629 -7957 -100118
713 -100118 -152819 -140612 -71729 17980 91332 120398 91919 14304 -78718 -139251 -137831 -76859
725 -76859 15069 100998 148549 135703 66221 -29159 -103987 -123886 -82478 1309 90914 148180
737 148180 145324 81008 -16447 -104399 -146025 -125945 -52953 40190 112113 128106 78818 -10897
749 -10897 -100732 -153746 -148291 -83718 15581 105897 143876 114646 36594 -53084 -116952 -130374
761 -130374 -82060 11617 108619 161548 147257 76776 -17422 -98283 -134760 -109133 -29512 66567
773 66567 131066 134148 77092 -14624 -104603 -156136 -145678 -76542 20444 100201 128874 96010
785 96010 16901 -74224 -135495 -137749 -79798 13707 101829 149808 136946 69317 -24167 -100222
797 -100222 -122971 -84854 -5690 79897 136785 139521 82999 -11537 -99651 -141639 -122240 -55438
809 -55438 29055 96342 118432 81101 -1022 -88211 -140110 -134369 -76491 8948 87807 128073
821 128073 111646 44837 -39028 -100772 -112688 -70585 6828 86776 135227 130128 73163 -10054
833 -10054 -83039 -115541 -93960 -29723 47513 102263 108838 64298 -11093 -85782 -129000 -121375
845 -121375 -65170 13920 78607 101681 75355 14000 -56329 -103896 -106239 -59901 15258 85201
857 85201 119888 105673 51939 -18226 -74469 -91808 -61819 1158 67865 106821 100544 51934
869 51934 -17503 -79835 -109052 -91739 -37394 28141 74953 82222 47404 -14939 -75654 -107658
881 -107658 -95726 -45400 21650 76986 97138 74412 19406 -40111 -77182 -76124 -35793 26271
893 26271 82569 107003 89163 37340 -26661 -74668 -86181 -56914 -1861 53186 82573 72461
905 72461 26427 -36082 -87424 -104833 -80993 -27724 33160 73867 76703 40985 -15316 -66638
917 -66638 -88996 -71118 -19781 43167 90578 101111 71544 15835 -41539 -74782 -69285 -27318
929 -27318 31094 79874 96102 71079 14604 -48630 -91697 -95786 -61379 -3864 51564 78814
941 78814 64757 16492 -44904 -91208 -101406 -70342 -10838 51641 91525 90841 50630 -9874
953 -9874 -63477 -84059 -62449 -9090 54258 99580 106331 70579 7324 -55215 -90537 -84122 -39578
966 -39578 22155 73763 90281 64137 5293 -60936 -105779 -108112 -68870 -3633 57667 89306
978 89306 78829 30646 -33922 -84292 -97235 -65835 -3545 63350 106360 107222 65939 549
990 549 -60610 -89849 -74472 -21784 43926 92953 102731 68736 4898 -62838 -105413 -104304 -60838
1003 -60838 4822 63540 89230 70399 15696 -50655 -98742 -107212 -71630 -6443 61167 101342
1015 101342 97701 53130 -11374 -66896 -89868 -68436 -12398 54721 102483 108902 71333 7339
1027 7339 -57299 -94690 -90161 -45632 18118 71919 90677 66157 9208 -56094 -101165 -107625
1039 -107625 -70694 -7822 54298 88440 80762 36148 -24929 -75029 -91300 -65150 -8094 55538
1051 55538 98133 101942 66037 6163 -51618 -81531 -71455 -26563 32244 78255 90986 63955
1063 63955 8144 -52770 -92652 -94094 -58069 -2030 49741 75137 62845 18011 -38667 -80726
1075 -80726 -89440 -61340 -7562 48633 84397 83978 48672 -4625 -50990 -70060 -53713 -9786
1087 -9786 42831 80974 86955 57355 5351 -45872 -75235 -71073 -37013 11927 53456 67199
1099 67199 47020 2699 -47184 -79346 -81506 -51943 -3318 43202 67441 59032 23521 -21776
1111 -21776 -56294 -64366 -41661 2617 49320 77460 75114 44144 -1834 -41843 -59149 -46960
1123 -46960 -10776 31576 61226 63085 36328 -7911 -50128 -73037 -67119 -34671 8572 43352
1135 43352 53403 36089 -1526 -41397 -65730 -62662 -32020 11993 50913 68146 56995 23609
1147 23609 -17113 -46296 -50750 -27340 12500 50582 69710 61155 28179 -15728 -51508 -63929
1159 -63929 -47611 -11132 27673 51038 48826 21129 -20108 -57450 -73596 -60009 -23450 20632
1171 20632 51845 58286 38428 521 -38060 -58137 -50022 -16657 26746 62157 74190 57634
1183 57634 19142 -23914 -53416 -55541 -29884 11145 47882 64411 51988 15366 -30443 -65928
1195 -65928 -75090 -54145 -13382 29122 55217 53010 23491 -20273 -57135 -70800 -55075 -15403
1207 -15403 32071 67191 73934 49564 6841 -34691 -57304 -51570 -19040 26385 64830 77452
1219 77452 57695 14322 -33291 -65234 -69922 -45399 -2002 41084 63050 52711 15290 -31870
1231 -31870 -68268 -79052 -59410 -16601 32065 65117 67043 38676 -5678 -46556 -65529 -53854
1243 -53854 -15365 33545 70943 81336 59603 15221 -32322 -62465 -62566 -33357 11414 51733
1255 51733 69023 55762 16394 -33251 -71114 -79817 -56476 -13295 31200 58900 58638 29532
1267 29532 -16300 -57456 -73327 -56508 -15658 31080 66209 75234 54501 12295 -33035 -58930
1279 -58930 -54263 -22380 21293 58456 72685 57927 18459 -28570 -63241 -70680 -47333 -6491
1291 -6491 33561 55812 50899 20039 -23131 -59703 -73272 -57070 -18371 26339 57395 62051
1303 62051 39788 1791 -35173 -55421 -48735 -17189 25655 60338 70142 53116 17104 -22933
1315 -22933 -50768 -54993 -33252 4890 40069 55451 44654 13487 -25492 -56067 -65714 -49878
1327 -49878 -15046 23121 46964 46187 22687 -11814 -41370 -53962 -43053 -12254 25575 53769
1339 53769 60235 41869 9200 -23509 -41923 -38522 -15271 17110 44828 54918 40721 9093
1351 9093 -25762 -48969 -51811 -33807 -3574 25313 39999 33450 7574 -24230 -48097 -52668 -36570
1364 -36570 -6581 24312 44207 44388 24945 -4486 -29949 -39471 -27872 -1104 28963 49135
1376 49135 51106 33139 3380 -25764 -41214 -36547 -14028 13579 34440 38938 24411 -3001
1388 -3001 -32399 -50581 -49222 -28088 2339 27461 37314 28604 5603 -21743 -40833 -41643 -22350
1401 -22350 7936 35898 49691 44474 22446 -6789 -29872 -36588 -23064 3401 30451 46183
1413 46183 42699 21012 -10276 -37097 -48814 -40377 -15907 13205 34165 36439 19038 -9939
1425 -9939 -37555 -51180 -44558 -19991 12004 38243 47820 36021 8879 -20836 -38387 -37161 -16949
1438 -16949 13821 42690 55807 46290 19130 -14186 -38890 -45746 -31631 -2781 27384 44341
1450 44341 39862 15990 -17357 -45772 -56898 -46674 -18350 15326 40058 44314 27450 -3139
1462 -3139 -33075 -48922 -43283 -17288 18320 46986 57646 45332 16301 -17176 -40498 -43443
1474 -43443 -24065 8451 38436 53429 45618 18742 -17356 -46994 -56760 -43401 -13428 19421
1486 19421 41698 41831 21675 -11290 -42031 -56138 -47766 -19680 15997 44521 53746 40390 10374
1499 10374 -22529 -42946 -41752 -19802 13585 43761 57958 48902 20748 -14629 -41626 -49475
1511 -49475 -35789 -6173 25228 44376 41768 19192 -14120 -43941 -57109 -48425 -20588 13137
1523 13137 38571 45212 30997 1866 -28492 -45590 -42060 -19197 13697 42794 54933 45962
1535 45962 19307 -12424 -35732 -41430 -25875 2577 30714 46116 41580 18970 -12705 -39959
1547 -39959 -50976 -41389 -16319 12688 33881 37111 21262 -6578 -33105 -46195 -40673 -18626
1559 -18626 11158 36208 45834 35949 11710 -14856 -32502 -33022 -16699 9757 34000 45848 39614
1572 39614 17195 -10610 -32663 -39252 -28889 -6630 17319 31913 30410 12806 -12410 -34559
1584 -34559 -43510 -36186 -15102 10199 29223 33064 21368 -54 -21204 -32415 -28178 -9577 14745
1597 14745 34162 40551 32086 11820 -11378 -26482 -28249 -14608 6876 25203 32784 25984 7403
1610 7403 -15621 -33171 -37927 -26587 -6484 13825 24775 22732 8145 -12246 -28963 -34604 -25060
1623 -25060 -4727 17364 31915 33042 20940 1258 -16654 -25079 -19599 -2499 17938 33167
1635 33167 35141 23347 2427 -18248 -30377 -28978 -14740 5141 21296 26666 17425 -1979 -22970
1648 -22970 -35553 -35134 -21884 -453 19537 29613 24943 8302 -12057 -26218 -28170 -16316 4464
1661 4464 25527 38181 35839 19623 -2800 -21958 -28532 -21137 -3240 17662 31236 31382 16974
1674 16974 -6059 -28258 -38919 -34263 -17028 5590 23538 29023 19212 -1258 -23115 -36606
1686 -36606 -34228 -17655 6519 28611 38377 33018 14376 -8783 -26172 -29896 -17711 4837 27620
1699 27620 39690 36647 18754 -6399 -28468 -38090 -30889 -10303 12916 29195 30850 17277 -6156
1712 -6156 -29868 -42484 -38600 -19668 6222 27942 36085 27973 7534 -16170 -32211 -33381 -17970
1725 -17970 7412 30935 43146 38576 19685 -5712 -26647 -34787 -25565 -4526 19599 35106
1737 35106 34670 18473 -6736 -30220 -42370 -38102 -19096 6056 26376 33015 22951 1387 -21913
1750 -21913 -36557 -36843 -19943 5554 29057 40483 35981 17321 -7261 -25655 -30913 -20587 702
1763 702 24024 38094 36924 20605 -4089 -26761 -37483 -32732 -14537 8140 25949 29993 18666
1776 18666 -2773 -25068 -38162 -36170 -20471 2607 23809 33269 28534 10845 -10834 -26476
1788 -26476 -28594 -17114 3510 24558 37006 35345 19892 -2316 -21414 -29581 -23463 -6876 12833
1801 12833 27121 28287 16071 -4247 -24244 -34975 -32090 -17659 2389 19178 25439 18924 2318
1814 2318 -16060 -27525 -27573 -14958 4555 22529 31837 28717 14299 -4056 -17994 -22282 -14236
1827 -14236 1709 18129 28207 26081 13273 -4608 -20576 -28117 -23646 -10013 6868 17851
1839 17851 19188 10307 -5200 -20699 -28566 -25087 -11841 5567 19513 24090 18158 4726 -9575
1852 -9575 -18708 -18062 -7061 8960 22528 27992 22938 9737 -6215 -18253 -20959 -13001 1009
1865 1009 14007 20299 16805 4494 -11124 -23692 -27409 -20622 -6722 8382 17648 17543 8198 -6183
1879 -6183 -18451 -22684 -16827 -3006 13248 24374 26094 17841 3248 -11082 -18047 -15293 -3702
1892 -3702 11137 22432 25066 17353 1909 -14640 -24686 -24153 -14195 651 13800 19309 14225
1905 14225 498 -15468 -26000 -26610 -17267 -1109 15135 24443 22599 10936 -4937 -17528 -21249
1918 -21249 -13933 912 17959 28628 28470 17285 128 -15330 -23770 -20901 -7961 8701 21454
1931 21454 23728 14707 -2061 -19560 -29912 -29682 -17587 687 16673 23891 18856 4776 -12115
1944 -12115 -24466 -26361 -15921 1924 20236 30878 29029 16551 -1897 -17593 -23987 -17825 -2288
1957 -2288 15346 27328 28399 17400 -1184 -20131 -30372 -28260 -14916 3295 18136 23825 17395
1970 17395 1147 -17681 -30058 -30216 -18200 321 18328 28729 26422 13319 -4753 -19992
1982 -19992 -24301 -16707 -28 18145 30233 31109 19691 636 -17256 -26885 -24116 -10777 7010
1995 7010 20843 24920 16804 26 -18133 -29985 -30746 -19391 -1258 15822 24319 21233 8192
2008 8192 -8749 -21927 -25559 -17450 -402 17921 29209 29026 18050 1361 -14194 -21817 -19278
2021 -19278 -5650 10932 23053 25683 16997 1204 -15665 -26612 -26744 -16192 -371 13877 20392
2034 20392 15932 3331 -12350 -23694 -25458 -17392 -1919 13975 23840 23217 13134 -1422 -14106
2047 -14106 -18771 -13777 -1034 13736 23680 24914 16141 1396 -12678 -20822 -18942 -9403 3449
2060 3449 14395 17748 11846 -865 -14492 -23099 -23244 -14375 -1216 10898 17627 15116 5854 -6727
2074 -6727 -15613 -16933 -10196 2082 14539 22044 20979 11973 -275 -10954 -15054 -11236 -1032 9826
2088 9826 16837 16476 9042 -2997 -14434 -20296 -18141 -9058 2278 10714 12748 7732 -2333 -13022
2102 -13022 -18734 -16558 -7890 3957 14563 18416 14784 5389 -4775 -11754 -11999 -5038 5726 15585
2116 15585 19860 16527 6629 -5005 -14030 -16301 -11796 -1790 8204 13829 11702 2974 -8597 -17616
2130 -17616 -20599 -15642 -5879 6190 14137 15110 8112 -2489 -11735 -15724 -12068 -2153 10224 19457
2144 19457 21099 15115 4116 -7887 -14442 -13750 -5398 6041 15505 18351 12906 1755 -11108 -20069
2158 -20069 -21122 -13879 -1949 9364 15305 12794 3592 -8854 -18656 -20956 -14431 -1608 11855
2171 11855 20213 20622 12622 98 -11150 -16780 -13102 -2130 11028 21086 23020 15370 2233
2184 2233 -11132 -19562 -19841 -11208 2059 13360 17900 13471 1237 -12474 -22693 -24260 -16594 -3165
2198 -3165 11189 19219 18350 9010 -4199 -15446 -19513 -14266 -2095 12695 23173 24472 16481 2808
2212 2808 -10392 -18498 -17603 -7519 6195 17616 20995 15045 2866 -12112 -23034 -23940 -16709 -2686
2226 -2686 10538 17672 15923 6127 -7587 -18801 -22387 -16180 -2879 10925 21085 22841 15637
2239 15637 2279 -10566 -17494 -14816 -4601 8554 19310 22898 17169 4509 -9914 -19442 -20822
2252 -20822 -13118 -1044 10475 16629 13923 3864 -9314 -19652 -22701 -17126 -4974 8285 17167
2265 17167 18592 10747 -1057 -11224 -16476 -13233 -3733 9171 19346 21892 16205 4817 -7149
2278 -7149 -14924 -15499 -8438 2625 12783 16621 13050 2935 -8803 -18133 -20280 -14922 -4289 6652
2292 6652 12952 12512 5707 -4279 -13281 -16695 -12562 -2734 8461 16209 17551 12364 2948 -6455 -11736
2307 -11736 -10419 -2926 6723 14176 16261 11756 2735 -7868 -14335 -15149 -9458 -701 7167 10440 8018
2322 8018 750 -8521 -15052 -15935 -10674 -1718 7553 12346 12113 6373 -1852 -8760 -10539 -6618 1278
2337 1278 9816 15001 15071 9654 691 -7179 -10653 -8852 -2849 4781 10675 10669 5853 -2619 -10761 -15140
2353 -15140 -14109 -8031 688 7720 9686 6577 -770 -8143 -11838 -10859 -5075 3121 11244 15428 12606
2368 12606 5196 -2551 -8588 -9073 -4706 2993 10825 14354 12208 4726 -4424 -11715 -14098 -10660 -3069
2383 -3069 5010 9862 9341 3056 -5618 -13093 -15626 -12795 -4782 4776 12300 13320 9213 563 -7311
2398 -7311 -11841 -9784 -2251 6872 14910 17182 13341 4794 -5147 -12347 -13073 -7600 1574 9738 13672
2413 13672 10910 3034 -7497 -15775 -18229 -13378 -3913 5930 12091 12609 6317 -3326 -11687 -15653 -12306
2428 -12306 -2927 7777 15758 17955 13372 3786 -6172 -12690 -11946 -5027 5156 14041 17476 13312
2442 13312 4060 -7008 -15796 -17787 -12639 -2876 7309 13182 12053 4679 -5829 -15100 -18480 -14907
2456 -14907 -5258 6730 14621 16785 11373 1533 -8144 -13486 -12482 -4573 6402 15949 19081 15320
2470 15320 5684 -5093 -13492 -15253 -10080 -837 9194 14123 12329 4327 -6610 -15554 -18973 -15038
2484 -15038 -6034 4475 12322 13942 8722 -1068 -9991 -14874 -12890 -5079 5308 14744 18201 14778
2498 14778 5843 -4230 -11302 -11999 -6926 1808 10513 15237 13400 5127 -5163 -13481 -16632 -12574
2512 -12574 -4829 4269 10472 11081 5183 -3229 -11526 -15415 -12986 -5399 4333 11612 14116 11039 3615
2527 3615 -4609 -9743 -9518 -4102 4286 11611 14975 12621 5225 -3457 -10192 -11897 -8311 -1499 5827
2542 5827 9340 8458 3006 -4792 -11520 -14384 -11529 -4535 2868 8352 9416 5901 -313 -6896 -10012
2557 -10012 -8087 -2151 5289 11132 12511 9898 3660 -2753 -7542 -7563 -2955 3050 8048 10198 7140
2572 7140 1580 -5200 -10328 -11120 -7788 -2025 3706 6856 5807 932 -5227 -9620 -10411 -7040 -1295
2587 -1295 5614 9766 9583 5622 -242 -5346 -6570 -4584 820 6872 10720 10950 6423 -35 -6076
2602 -6076 -8624 -7595 -3580 2004 6696 7417 3633 -2530 -8290 -11507 -10891 -5961 590 6179 8388
2617 8388 6131 936 -4815 -8581 -8086 -3538 2913 9312 12139 10511 5526 -1600 -6552 -8364 -5008
2632 -5008 1119 7235 10186 8931 4178 -3457 -9733 -12450 -10496 -4363 2546 7129 7961 4300 -2546
2647 -2546 -9182 -12649 -10548 -4578 3774 10149 11981 9580 3539 -3924 -8814 -8484 -3879 3535 10375
2662 10375 13444 11667 4889 -3359 -9570 -12161 -8684 -1876 5467 9666 9281 3773 -4155 -11132 -14426
2677 -14426 -12091 -5341 2798 9558 11483 7665 850 -6742 -10786 -10187 -4378 4333 11487 14856 12366
2692 12366 5420 -2705 -8881 -10764 -6907 489 7871 12137 11186 4686 -3662 -11240 -14351 -12085 -5480
2707 -5480 2663 8701 10062 6355 -870 -8383 -12537 -11730 -5568 2822 10252 13742 11423 4879 -3027
2722 -3027 -8576 -9664 -5481 1858 9255 13238 12572 6311 -1821 -9211 -12116 -10132 -4232 3324 8255
2737 8255 9299 5104 -1966 -9452 -13195 -12132 -6762 1065 7943 10996 8707 2626 -4088 -8686 -9177
2752 -9177 -4815 1975 8963 12932 11737 6341 -967 -6916 -9190 -6614 -1297 4852 8992 8813 4852
2767 4852 -2127 -8211 -11776 -10232 -5654 707 5788 7493 5396 -137 -5602 -9265 -8756 -4542 1940
2782 1940 7596 10590 9378 4508 -1191 -5286 -6081 -3723 1411 6260 9233 8324 4121 -1809 -6956
2797 -6956 -8704 -7182 -2784 2111 5055 5469 2125 -2637 -6773 -9025 -7838 -3340 1751 5472 7214
2812 7214 4931 1082 -3023 -5360 -4775 -1538 3617 7636 8894 7094 2942 -2036 -5177 -5545 -2863
2827 -2863 788 4565 5940 4449 508 -4697 -7677 -8320 -6462 -1897 2531 4677 4409 1056 -3251
2842 -3251 -6099 -6680 -4506 -214 4679 7906 7700 5190 527 -3218 -5052 -3499 724 4693 7345
2857 7345 7768 4519 -231 -5286 -7586 -6717 -3750 1043 4138 5194 3129 -1172 -6291 -9179 -8576 -4493
2873 -4493 528 5318 7510 6026 2349 -2510 -5908 -6186 -3195 2263 7102 9771 8975 5053 -830
2888 -830 -5335 -7309 -5763 -903 4218 7417 7226 3500 -2117 -7630 -10183 -9586 -4981 1012 5712 7088
2904 7088 5137 -98 -5144 -8500 -8578 -4286 1811 7784 10735 9420 4752 -1179 -5952 -7382 -4773
2919 -4773 549 6175 9686 9109 4857 -1652 -7228 -10345 -8762 -4020 1982 6290 7309 4359 -1164
2934 -1164 -6929 -10817 -9822 -5413 673 6466 9369 8416 3574 -2357 -6998 -7567 -4394 1009 7531 10820
2950 10820 10224 6424 -261 -5827 -8883 -7212 -2663 3112 7253 8067 5153 -1115 -6984 -10685 -10320
2965 -10320 -6178 -174 5084 7864 6221 1763 -3628 -7994 -8269 -5126 538 6432 9632 9650 5812
2980 5812 147 -4815 -7072 -5575 -1197 4323 7781 8505 5340 -40 -5484 -9083 -9008 -5445 116 4454
2996 4454 6028 4492 173 -4580 -8362 -8613 -5800 -327 4591 7780 7354 4454 -188 -4564 -5735
3011 -5735 -3830 363 4980 7950 8027 5401 638 -3828 -6521 -5882 -2856 1531 4449 5317 3405 -652
3027 -652 -5168 -8004 -7385 -5015 -689 3456 5065 4235 1041 -2170 -5101 -5211 -2692 905 4968 6920
3043 6920 6894 4365 361 -2586 -4058 -3076 137 3089 5359 4776 2695 -1181 -4709 -6413 -5306 -2839
3059 -2839 204 2831 3577 1591 -1618 -4262 -6016 -5104 -2187 1353 4478 5402 4240 1459 -1451 -3087
3075 -3087 -2990 -793 2470 5607 6470 4939 2133 -1783 -4412 -4403 -3064 76 2625 3600 2580 23 -3527
3092 -3527 -5656 -6761 -4805 -1502 2096 3863 3480 1784 -1537 -3999 -5020 -3110 519 4013 6303
3107 6303 6617 4554 1057 -2564 -4346 -3333 -520 3057 5557 5507 3597 -258 -4390 -6518 -6324 -3874
3123 -3874 -18 3005 4266 3156 -251 -3758 -6507 -6467 -3937 92 4504 6798 6147 3496 -927 -3965
3139 -3965 -4722 -3194 706 5026 7624 7546 4899 317 -4083 -6307 -5787 -2666 1287 4587 5636 3627
3155 3627 -697 -5105 -8065 -7906 -5063 -361 4225 6364 5523 2206 -2114 -5590 -6566 -4074 310 4946
3171 4946 8214 8153 5128 452 -3663 -6045 -4977 -1620 2862 6016 6938 4331 -94 -4501 -7869 -7903
3187 -7903 -5196 -492 3494 5798 4568 1129 -3492 -6662 -7330 -5124 -418 4119 7155 7403 4592
3202 4592 229 -3910 -5414 -4432 -862 3614 7205 7898 5441 1118 -3407 -6404 -6625 -3901 -153 3659
3218 3659 5087 4497 785 -3917 -6643 -7611 -5702 -1926 2649 5665 5656 3158 -830 -4090 -5126 -4119
3234 -4119 -706 3367 6693 7130 5357 1459 -2402 -4892 -4778 -2129 1163 4411 5036 3811 543 -3134
3250 -3134 -6428 -6579 -4945 -1351 1828 3792 3643 1707 -1959 -4171 -5159 -3925 -488 2946 4908 5771
3266 5771 4254 1054 -1849 -3245 -2753 -350 2516 4767 5326 3730 798 -2299 -4474 -4680 -2897 -476
3282 -476 1819 3048 1919 -417 -2834 -5175 -4760 -3268 -777 1921 3211 3580 1760 -545 -2370 -2753
3298 -2753 -1562 854 3583 5043 4603 2744 319 -1640 -2806 -2187 -609 1931 3006 2716 1263 -1297
3314 -1297 -3849 -4500 -4115 -2250 243 2220 2496 1207 -742 -2832 -3317 -2818 -996 1808 4016 3989 3425
3331 3425 1436 -986 -1955 -2090 -548 2069 3787 4453 3391 1066 -1725 -3407 -4061 -2911 -299 1377
3347 1377 2689 2113 60 -2750 -4447 -4948 -3497 -1084 1932 3536 3618 2250 -456 -2625 -3551 -2215
3363 -2215 86 3287 5128 5604 3695 1155 -1899 -3839 -3668 -1431 1242 3863 4720 2771 13 -3369
3379 -3369 -5136 -5735 -3713 -984 2165 3779 3498 1108 -1983 -4358 -4885 -3365 -478 3158 5560 5728
3395 5728 4017 1177 -2242 -3699 -3193 -821 2401 5196 5735 4046 824 -2891 -5213 -5495 -3473 -436
3411 -436 2639 4065 3495 821 -2884 -5317 -6051 -4592 -1208 2269 4739 5278 3337 232 -2943 -4242
3427 -4242 -3497 -534 3008 5574 6394 5080 1464 -2059 -4576 -4747 -2849 481 3319 4541 3998 1397
3443 1397 -2721 -5613 -5954 -5056 -1827 1603 3839 4034 2156 -832 -3646 -4777 -3828 -1248 2152 4907
3459 4907 5969 4550 1825 -1329 -3408 -3455 -1711 1368 3821 5087 4174 1530 -1821 -4412 -5277 -4142
3475 -4142 -1111 1323 3561 3149 1013 -1703 -4145 -5032 -4431 -1726 1318 3426 4410 3310 1104 -1472
3491 -1472 -2761 -2656 -818 1768 3892 4873 4165 1802 -1019 -2804 -3486 -2520 -599 1942 2807 2211 812
3508 812 -1594 -3554 -4563 -3493 -1663 469 2269 2697 1424 -450 -2037 -2881 -2290 -356 1604 3316
3524 3316 3826 2822 1224 -1010 -1908 -2007 -476 1024 2622 2848 2076 359 -1695 -3285 -3150 -2361 -633
3541 -633 1097 1607 1057 -414 -1700 -2941 -2910 -1862 17 1770 2584 2683 1751 -82 -1339 -1460 -617 1174
3559 1174 2743 3307 3058 1809 -6 -1477 -2258 -1946 -624 670 1978 1601 132 -1494 -2997 -3762
3575 -3762 -3205 -1555 490 1837 2243 1568 -653 -2091 -2329 -2380 -966 1477 3039 3676 3087 1347 -498
3592 -498 -1756 -1862 -869 1318 2444 3052 2785 857 -1672 -3422 -3810 -2601 -983 1294 2112 1791 433
3609 433 -1513 -3404 -4068 -2860 -944 1455 3584 3577 2376 655 -1667 -2581 -2207 -533 1647 3645 4394
3626 4394 3344 1173 -1198 -3414 -3598 -2039 -260 1948 3089 2164 332 -1734 -4084 -4566 -3743 -1437
3642 -1437 1362 2850 3361 1737 -303 -2733 -3265 -2918 -684 1770 4110 5081 3688 1236 -1248 -2800
3658 -2800 -3184 -1780 625 2766 3925 3219 1363 -1477 -4037 -4741 -3705 -1655 873 2555 2856 1460
3674 1460 -1046 -3230 -4411 -3639 -1336 1385 3287 4363 3448 1514 -1118 -2688 -2907 -1558 1199 3288
3690 3288 4424 3635 1701 -891 -2828 -3798 -3193 -1181 1340 2505 2611 1201 -1183 -3285 -4497 -3803
3706 -3803 -1831 468 2740 3127 2529 824 -1459 -2523 -2763 -899 1100 3158 4154 3733 1881 88
3722 88 -2071 -2799 -1575 -104 1865 2779 2556 1365 -926 -2739 -3515 -3377 -1698 -18 1548 2344 1547
3739 1547 -218 -2041 -3048 -2864 -1251 765 2351 3345 2474 1351 -469 -1318 -1477 -631 657 2162
3755 2162 2677 2260 1133 -473 -1934 -2366 -2070 -1059 634 1259 1141 350 -1190 -2249 -2581 -2267 -1105
3772 -1105 582 1474 1709 1211 156 -803 -1202 -755 -15 1155 2414 2704 2239 1100 -415 -1319 -1144 -341
3790 -341 374 1497 1669 1074 -122 -1523 -2216 -2251 -1682 -756 737 971 561 -472 -1152 -1739 -1791 -784 511
3809 511 1877 2377 2071 1170 -236 -1118 -1029 -465 620 1723 2479 2011 1090 -380 -1636 -2252 -1537 -697
3827 -697 377 1494 1159 680 -1213 -2549 -2687 -2529 -1260 419 1440 1933 1477 38 -953 -1962 -1479
3844 -1479 -359 1339 2742 2952 2701 1438 -542 -1640 -1825 -1022 112 1338 2222 1832 559 -1290
3860 -1290 -2751 -3300 -2706 -1373 515 1594 1799 1191 -715 -2037 -2897 -2480 -808 1074 2766 3194 2576
3877 2576 1064 -578 -1822 -2169 -905 987 2485 3156 2845 1434 -989 -2637 -3328 -2478 -837 886
3893 886 1987 2033 794 -1235 -2776 -3557 -3086 -1496 440 2262 2742 2535 978 -912 -2206 -2068 -955
3910 -955 884 2946 3598 3346 1727 -451 -1990 -2990 -2057 -625 1212 2832 2020 1009 -534 -2581
3926 -2581 -3506 -3126 -1696 79 1449 2347 1362 54 -1672 -2592 -2312 -1289 812 2106 3122 3111 1657
3943 1657 -206 -1398 -1715 -1461 95 1569 2660 2885 1653 -40 -1810 -2663 -2686 -1440 213 1196 1681
3960 1681 1117 -392 -1490 -2591 -2390 -1362 15 1518 2468 2471 1225 -327 -1407 -1610 -927 539 1446
3977 1446 2476 2605 1829 202 -1088 -1708 -1524 -738 319 1413 1369 554 -201 -1638 -2291 -2177 -1272 -200
3995 -200 662 1668 947 234 -846 -1359 -1414 -599 432 1683 2100 1976 978 116 -621 -797 -339 277 905
4014 905 1566 1361 631 -501 -1265 -1790 -1402 -554 68 488 499 54 -689 -1363 -1295 -1081 -646 611 1376 1376 885
4035 885 215 -138 -893 -131 35 989 1591 1619 1099 520 -683 -1070 -1097 -781 193 845 782 487 -563 -1446
4055 -1446 -1968 -1523 -1180 -434 464 896 914 50 -1010 -1354 -1339 -559 521 1327 2063 1850 952 -285 -652
4074 -652 -871 -407 404 1414 1826 1654 595 -322 -1330 -1870 -1796 -842 94 898 855 193 -657 -1738 -2027
4093 -2027 -1779 -876 423 1771 1813 1425 745 -641 -1253 -1162 -576 708 1625 2489 2285 884 2 -1121
4111 -1121 -2001 -1539 -325 1072 1561 1452 567 -615 -2050 -2689 -2577 -1396 267 1421 1841 1119 342
4128 342 -926 -1967 -1492 -762 570 2136 2771 2159 1253 -296 -1201 -1983 -1107 36 1447 2223 2018 938
4146 938 -270 -1818 -2342 -2204 -1603 307 1399 1746 996 -1 -1309 -2364 -2196 -1217 106 1504 2491
4163 2491 2150 1249 -414 -1321 -1434 -966 233 1663 2490 2317 1441 -51 -1317 -1881 -1777 -702 559
4180 559 1224 1473 924 -127 -1355 -2213 -2313 -1485 -413 961 1665 1294 825 -395 -1545 -1525 -1215 187
4198 187 1253 1929 1989 1420 312 -590 -1127 -1224 -462 661 1488 1762 1024 298 -956 -1789 -2022 -1323 -539
4217 -539 624 1194 908 466 -870 -1392 -1768 -1138 -137 853 1507 1467 1166 346 -232 -704 -390 157 987
4236 987 1498 1485 831 -11 -489 -958 -1356 -903 -91 408 686 -70 -100 -918 -1609 -1161 -1084 53 324 747 736
4257 736 231 -387 -614 -663 -186 196 1048 1618 1000 1010 -58 -491 -418 -354 383 581 853 590 -3 -414 -960
4278 -960 -1199 -960 -230 189 535 462 -118 -664 -1147 -835 -265 -161 762 1125 974 968 200 -508 -272 102 282
4299 282 1102 1410 1174 894 -33 -744 -1520 -1030 -291 53 805 515 97 -523 -1268 -1585 -1648 -755 39 642
4319 642 995 911 399 -653 -1148 -961 -360 547 898 1640 1715 775 -49 -713 -1002 -306 42 920 1203 1291 619
4340 619 -432 -1212 -1648 -1346 -851 185 386 1123 453 -232 -1126 -1371 -1470 -1058 333 1007 1708 1839 1037
4359 1037 80 -1043 -1000 -617 346 1100 1716 1758 955 64 -948 -1356 -1379 -698 256 1106 1273 463 -253 -1234
4379 -1234 -1809 -1675 -1327 49 863 1371 1260 410 -489 -1183 -1343 -721 276 1086 1958 1923 1178 343 -580 -1121
4399 -1121 -1072 -438 569 1116 1286 790 -253 -983 -1809 -1897 -1179 -172 627 1235 842 293 -958 -1264 -1327
4418 -1327 -980 -252 879 1738 1896 1048 137 -510 -1022 -855 -56 595 1414 1547 1202 260 -782 -1156 -1382
4437 -1382 -1153 -115 642 892 704 32 -947 -1387 -1310 -1566 -205 507 1344 1038 818 42 -899 -722 -742 -159
4457 -159 724 1329 1427 1236 617 -438 -1094 -671 -497 216 481 779 601 62 -615 -1025 -1151 -1146 -392 173 514
4478 514 476 249 -271 -777 -763 -668 208 732 850 1039 444 542 6 -381 -480 329 731 720 698 49 -86 -405
4500 -405 -1066 -835 -347 -231 214 245 145 -140 -582 -694 -804 -93 50 133 676 530 208 -167 -338 -205 286
4521 286 406 1116 1126 899 494 -274 -556 -456 -344 3 461 464 295 -90 -479 -1148 -1065 -523 -243 336 380 412
4543 412 198 -464 -683 -836 -253 67 619 825 1102 558 -5 -98 -621 -214 -39 590 1026 906 722 -154
4563 -154 -754 -1033 -758 -670 114 745 540 447 -180 -973 -1073 -1246 -920 -230 703 1007 876 438 -126 -706 -917
4584 -917 -436 439 1002 1200 1369 779 -205 -493 -1040 -933 -60 556 630 880 511 -145 -1034 -1491 -1017 -1051 28
4605 28 815 984 886 101 -600 -749 -1234 -665 352 899 1342 1470 969 -4 -532 -797 -552 -338 719 864
4625 864 1212 778 129 -1047 -1268 -1330 -803 46 396 925 585 126 -687 -1351 -1359 -910 -167 605 1327 971 668
4646 668 -164 -797 -831 -487 -64 481 1214 1516 1052 187 -531 -870 -1046 -850 409 1044 795 613 124 -615
4666 -615 -1117 -1133 -1006 -398 349 804 662 427 -77 -822 -912 -720 -358 395 1104 1123 1034 381 33 -402 -703
4687 -703 6 482 514 671 470 303 -614 -748 -1116 -689 -361 102 362 360 403 -242 -718 -852 -591 -152 413
4708 413 871 567 675 241 14 -451 -164 7 446 848 928 398 248 -139 -425 -351 -277 -314 436 15 210
4729 210 168 -423 -592 -494 -448 -123 207 460 538 321 177 -148 -211 -284 110 563 708 612 508 305 -169 -165 -451
4752 -451 348 595 342 279 111 -239 -458 -627 -576 -451 -372 181 -62 9 -682 -294 -694 -375 340 78 609
4773 609 447 761 327 -399 -46 110 -239 319 617 700 639 195 -60 -560 -526 -205 55 340 424 331 -359 -868
4795 -868 -738 -657 -698 -97 45 298 642 81 -163 -552 -632 -179 52 685 785 907 299 97 -465 -613 -265
4816 -265 14 399 661 648 646 -74 -402 -1162 -915 -502 -318 201 468 419 -100 -644 -866 -946 -555 -77 572 1098
4838 1098 731 325 -98 -581 -475 -184 312 602 910 1185 477 237 -543 -682 -813 -27 205 551 537 405
4858 405 -224 -680 -1048 -1077 -858 -330 555 824 794 549 -235 -696 -652 -215 189 363 1050 1052 945 163 -319 -539
4880 -539 -465 -267 142 548 792 410 44 -402 -864 -843 -787 -206 191 437 632 232 -443 -591 -1079 -736 -199
4901 -199 224 878 1022 881 44 -248 -437 -566 -173 191 864 810 1053 206 -144 -601 -830 -621 -200 266
4921 266 270 384 70 -455 -428 -873 -738 -242 -29 524 458 472 -101 -437 -536 -538 -111 156 1096 555 623 335 -126
4944 -126 -202 -285 -253 -21 272 378 -140 64 -449 -542 -735 -507 -309 -177 127 169 293 -208 -409 -578 -355 40
4966 40 138 488 670 487 98 -241 123 -99 68 99 220 737 450 30 -101 -356 -99 -52 -327 -57 339
4987 339 -138 -244 -325 -255 -616 -234 -150 116 265 100 -43 -127 -261 -207 -254 464 426 534 573 302 129 -252 -134
5010 -134 -27 361 162 261 210 -216 -199 -671 -303 -475 -49 64 238 375 10 -360 -507 -466 -134 -12 143
5031 143 639 611 384 262 4 -417 -458 301 685 971 496 417 66 -112 -421 -624 -360 231 481 288 387
5052 387 -421 -590 -764 -690 -457 128 286 474 359 133 -114 -462 -321 -217 267 119 857 534 560 188 -466
5073 -466 -486 -299 -110 331 527 540 346 -83 -380 -929 -728 -728 -157 15 756 406 67 -517 -569 -413 -326 178
5095 178 396 619 834 540 50 20 -412 -57 -50 439 668 859 369 -138 -465 -554 -398 -390 -145 379 322 301 15
5118 15 -570 -678 -745 -349 -30 141 549 989 149 -17 -270 -730 -427 -169 546 605 956 529 113 -305 -337
5139 -337 -179 -486 124 510 493 237 79 -704 -757 -729 -610 -361 353 372 565 326 141 -578 -380 -690 -94
5160 -94 127 611 643 535 8 19 -170 -310 -344 58 644 449 536 6 42 -318 -270 -504 -68 -21 369 205 218
5183 218 -203 -499 -574 -124 -225 136 242 457 402 117 -122 -197 -155 353 84 116 307 326 510 26 -325 -264
5205 -264 -74 -97 80 71 329 -17 -616 -175 -616 -213 -172 41 60 -159 -97 51 -241 -569 163 61 288 430
5227 430 304 305 73 -152 89 59 235 263 -59 146 16 -124 -49 -125 -232 -87 -87 168 -60 -119 -275 -464 -404
5250 -404 -446 -220 151 403 56 100 -249 -17 -87 -339 -32 61 314 631 50 98 0 -141 -274 -22 45 140 165
5273 165 142 353 -382 -645 -424 -525 -362 -118 390 82 -61 -164 -336 -114 -436 -21 105 452 344 380 -117
5294 -117 29 -310 -29 172 176 343 581 400 41 -398 -388 -392 -381 27 101 321 177 -73 -566 -605 -341 -442 -272
5317 -272 108 567 348 209 -163 -234 -376 -175 -178 546 395 486 395 111 -271 -307 -360 -52 -20 401 330 365 23
5340 23 -306 -635 -674 -357 -226 275 237 439 214 -2 -557 -377 -484 -243 12 763 549 459 253 -132 -142 -248
5362 -248 -228 445 -24 476 800 141 17 -471 -406 -530 -152 66 286 464 69 -178 -629 -662 -416 -285 207
5383 207 156 238 611 12 -224 -115 -208 -352 102 635 607 591 -197 -150 -307 -406 -135 -80 147 498 441 -93 -233
5406 -233 -477 -405 -389 -485 18 124 473 423 180 -368 -339 -257 -152 -30 94 446 340 512 -139 -382 -22 -289
5428 -289 212 194 255 158 -34 -102 -191 -284 -510 -152 -426 119 141 -9 -147 -367 -321 -343 117 6 301 492 341
5451 341 9 -37 -229 191 -83 296 212 229 259 -175 -174 45 -224 -268 308 -56 121 99 70 -234 -225 -69 -38 4
5475 4 331 -138 245 -57 -139 -49 47 33 -24 49 143 173 55 234 -70 53 -136 281 181 345 -76 -309 153
5498 153 -203 -102 -424 231 6 97 47 -110 -128 -208 -206 -290 -324 269 303 143 133 -2 -166 -259 -328 -67 56 228
5522 228 337 3 252 140 -153 68 -170 143 249 176 239 -169 -289 49 -349 -238 -50 163 255 81 46
5543 46 -114 -256 -203 -87 -159 283 426 377 163 357 -70 -408 -394 -117 253 454 285 51 -20 -337 -214 -644
5565 -644 -181 -99 -25 -5 299 76 112 -210 -429 -118 38 28 190 792 402 257 -281 -329 -238 88 168 300 233
5588 233 343 134 -55 -407 -379 -397 -192 251 463 290 -27 69 167 -476 -219 -291 -14 55 337 162 -206 -94
5610 -94 -508 -160 -478 315 552 211 654 234 -21 -313 -295 -172 40 132 179 319 223 -185 86 -296 -162 -162
5632 -162 -80 0 355 320 -162 -158 -307 -279 -80 14 -3 355 362 25 16 -92 -222 -130 73 28 338 232 179 -234 -53
5657 -53 -281 -88 -178 126 -196 54 179 -16 -264 -468 -388 -131 129 52 158 289 22 -132 -59 -206 153 129
5679 129 354 271 119 239 -24 83 -70 27 287 305 93 468 215 24 -358 -77 -465 9 109 15 35 134
5701 134 -2 -133 281 -324 159 0 426 252 422 -20 19 -195 75 48 35 187 171 7 126 0 -217
5722 -217 -90 -148 -240 -184 -132 260 -132 -54 -227 -454 -172 -49 106 213 180 83 -64 180 -191 -106 -9 -20 269
5745 269 257 -192 -9 -226 168 -441 110 130 219 -77 -54 -71 -477 -144 -8 -78 7 -98 24 86 21 -185 -56
5768 -56 -75 35 186 609 251 350 -135 -33 -283 -259 -13 -11 162 128 165 -17 -72 -179 -229 -61 239 -266 228
5791 228 97 133 -138 -139 -127 -478 -73 153 157 128 140 95 -52 -50 -74 -251 42 303 234 84 62 -277 -72 -522 -306
5816 -306 -46 -17 292 50 -77 -434 -168 -286 -143 -302 -525 -35 237 198 313 -163 -429 -181 -108 -177 -70
5837 -70 86 429 416 103 11 -324 57 -4 215 449 135 271 150 -298 -354 -378 -70 -19 292 -59 266 -108
5859 -108 -381 -292 -531 -55 -148 148 397 33 2 -51 -49 -194 53 -15 15 536 539 -31 -19 177 -147 -325 -21 -213
5883 -213 358 172 26 -68 -194 -281 -241 -365 -293 96 144 44 39 230 -191 -188 -304 97 94 442 353 33 91 -69
5907 -69 101 47 244 73 146 207 -7 -308 -102 -30 -245 -41 180 -6 156 337 167 -105 0 -165 -325 160
5929 160 184 19 263 33 -217 -85 -131 144 102 131 70 -42 24 122 -220 -107 -174 216 128 -151 -69 31 80 -216
5953 -216 -69 -162 105 67 117 -45 -252 -45 79 42 -106 178 176 526 32 172 211 -265 -5 -201 -237 148 -103
5976 -103 201 23 -83 16 -29 -18 -146 -53 -2 40 -87 77 -183 -124 -27 -86 -129 357 -43 84 -100 -470 -204
5999 -204 70 -160 -2 223 -40 140 -46 83 90 -30 -250 42 149 296 93 71 -15 -357 -26 -189 -96 201
6021 201 185 -116 300 66 -137 -283 -354 -82 64 282 113 28 -17 156 -179 -33 -20 -234 216 396 77 -180
6043 -180 -134 43 -266 -101 -259 -114 146 0 63 -244 -139 -332 -122 -289 44 406 486 46 1 -151 -14
6064 -14 -2 -216 17 278 -15 206 231 395 -224 -104 -201 40 69 240 94 -58 -167 -259 -248 -281 237 44 -8
6087 -8 101 -142 -85 31 -45 2 -80 -166 237 211 -19 114 86 -107 -4 8 -114 73 56 90 90 323 -55 6 -337
6112 -337 -332 -202 22 -23 186 90 42 -176 -188 -117 -121 52 32 302 137 -43 70 13 -135 -49 88 175 241 301 -259
6137 -259 -59 -222 -264 -128 50 -142 -201 -75 -72 72 -241 -338 -164 -66 405 294 66 233 227 79 34 77 201
6160 201 -101 25 -135 60 132 -11 25 -117 76 59 533 -93 280 -34 -180 -218 21 -38 138 -171 165 -123
6182 -123 -22 -318 -23 57 -113 -116 172 46 187 16 -50 -12 134 -34 -149 215 -50 -162 285 -155 -103 40
6204 40 65 88 -138 -92 -96 46 -98 122 -74 -183 -66 -64 76 -339 -7 -19 -119 103 286 270 196 107 117 -96
6228 -96 180 -229 11 146 123 194 -19 35 -76 -228 -50 -213 -403 21 -51 306 -54 184 -41 -211 -279 -246
6250 -246 13 -2 -171 232 -19 255 6 53 -321 -275 -2 43 210 28 -230 244 -38 -357 -76 10 153 90
6272 90 284 -109 -16 -216 110 -41 -34 231 -1 77 -179 55 6 -33 70 70 154 37 147 233 32 -3 112 -146
6296 -146 3 -217 -78 64 206 385 85 -129 -258 -70 6 219 128 -219 235 177 -31 -113 -248 7 -38 209
6318 209 266 -39 59 190 113 -427 57 -13 176 335 169 224 -147 -99 -256 -235 -112 -129 -112 -22 229 126 -217
6341 -217 -185 -155 27 14 -93 373 -141 281 -23 67 287 14 284 265 -142 59 316 82 -110 211 -27 -173
6363 -173 50 -187 66 -207 143 -309 -232 -498 207 -75 74 -2 -6 200 -282 -328 -249 -331 -68 -65 109 -139 65
6386 65 203 79 -55 -185 68 73 75 16 117 49 40 -270 -134 -110 194 -49 54 74 -17 270 -39 -50 -173 -359
6410 -359 -30 -232 160 39 236 132 140 155 240 39 25 284 58 -157 -17 195 -377 -233 178 2 62 -208
6432 -208 86 -21 68 -138 -324 -172 97 116 146 -106 -175 -106 -81 275 126 252 146 -258 -68 11 -376 214
6454 214 -31 -170 -1 17 -131 -50 -109 -279 152 163 -138 134 43 212 -218 17 -49 -41 -82 141 -128 124 -75
6477 -75 161 -289 158 97 54 395 -50 -42 130 -138 206 -124 11 38 -192 -128 -144 -19 -55 122 2 -137 14
6500 14 8 -267 74 -6 144 209 -153 -153 61 60 -277 -10 192 254 87 -50 -96 10 186 -45 22 69 -49 293
6524 293 144 210 45 -110 33 -3 -107 -30 143 71 23 -227 24 -214 4 107 191 207 0 185 -429 5
6546 5 86 -80 186 -50 0 -218 -41 -327 -256 -16 -21 -74 -9 -78 122 119 -253 -119 70 59 -200 84 -114 -31 125
6571 125 -395 -166 199 168 -30 -70 135 -295 -113 122 -76 47 -115 -239 233 54 -2 99 -155 -7 -45
6592 -45 50 170 146 54 -127 -4 -237 115 -315 -243 205 -17 140 -157 -178 180 209 -255 -77 57 -156 3
6614 3 248 -134 133 -156 120 -426 -239 -63 -78 -82 26 132 -14 -63 0 -277 -8 -97 -40 -103 69 -324 -52
6637 -52 -78 46 67 -151 43 117 54 95 68 72 18 -46 161 183 -162 -43 22 -175 101 -195 183 -196 160 -2
6661 -2 -101 -87 102 -121 -4 26 -133 109 52 184 142 86 -55 143 -117 123 -20 31 -190 185 66 295 64
6684 64 21 -105 -2 28 -126 275 8 -93 -292 -101 -11 254 90 90 -111 35 -233 142 342 158 41 123
6706 123 -302 -184 -113 124 -72 -114 229 209 110 -6 214 -82 -166 -177 39 299 4 21 16 -388 -135 61 132
6729 132 109 16 -3 323 119 140 -25 -174 -189 147 -122 -61 -31 97 9 -109 107 -18 94 -66 -17 -46 -118 100
6753 100 -150 121 32 105 77 70 332 -180 203 50 120 12 -230 -338 -391 45 -2 358 215 -99 105 -213 -83
6776 -83 30 154 139 168 174 209 74 160 -34 -153 -131 71 -92 -243 196 87 -151 -6 -290 -74 372 -158 69
6799 69 107 22 -77 14 -164 -34 114 204 5 -38 -69 -225 -15 -169 117 -289 303 -85 -160 -79 56 13 -68 223
6823 223 -97 -28 22 134 201 -72 122 32 169 -57 -88 -195 -122 -5 -257 254 95 -167 -49 -195 -274 177
6845 177 133 -11 172 33 -82 -51 -110 27 332 -219 -56 112 47 24 2 25 130 41 119 419 -80 -361 -102
6868 -102 -186 -88 19 31 120 -174 181 -208 37 181 5 -183 302 -260 -8 -42 292 -46 -113 5 -38 -32 162
6891 162 -137 104 -47 60 37 -41 25 -311 22 -31 181 -166 -302 2 31 -34 -37 111 259 62 214 193 -94
6914 -94 -113 -484 -81 -28 -153 149 145 -122 -224 128 -183 98 90 -68 135 296 46 -26 0 192 -54 -77 -69 -334
6938 -334 22 -202 25 -178 66 96 -120 11 -33 -139 123 232 -19 120 139 -22 -186 -40 -3 -51 122 36
6960 36 18 -114 -210 135 -324 -80 116 -75 17 -122 72 173 -39 209 76 -154 7 50 -85 103 -5 -44
6982 -44 -72 441 143 23 96 -26 -310 36 226 -111 -158 204 24 160 -177 159 -67 -95 33 96 310 27
7004 27 -12 -270 -96 -249 -12 -50 42 48 33 -184 265 25 159 -96 170 393 124 -71 -406 126 -86 9 84
7027 84 -55 -193 -36 189 95 -138 -173 37 74 124 48 -55 -42 121 248 169 -259 260 90 164 66 -40 -78 -98
7051 -98 140 -218 -148 119 -232 -91 -169 -39 209 -48 145 -12 -270 -32 89 302 115 -173 30 -51 -214
7072 -214 71 85 134 156 -31 -293 389 112 312 66 167 -181 101 -16 44 238 67 41 -383 -45 -10 -112
7094 -112 73 125 -485 -77 -195 -85 -41 -109 103 312 -161 -193 -97 375 -210 -5 43 3 93 -177 90 436 312
7117 312 52 -15 -108 5 24 91 181 144 73 162 186 45 146 -147 158 99 -28 -118 62 138 -233 247 162 -66
7141 -66 103 185 -376 -157 19 20 279 44 259 236 21 -56 -246 -60 123 254 -246 163 40 84 -118 -47 -214
7164 -214 89 51 -27 118 -194 33 -41 206 64 -4 -37 187 73 -144 101 140 86 -42 283 -121 -24 -15 181
7187 181 179 204 -35 -149 141 12 -75 88 -106 -26 32 -116 -81 -151 33 67 -32 -110 -276 234 17 417 -87 -101
7211 -101 217 -46 141 -90 -194 -69 64 -136 8 190 59 132 79 -62 -199 0 48 108 -115 90 264
7232 264 99 23 286 125 129 -149 117 -53 -80 -128 105 54 -130 -223 -84 -47 62 153 269 4 -128 -302 -325
7255 -325 81 121 94 -137 -106 108 -35 83 90 -84 51 -128 33 -153 -19 73 53 -161 -98 -214 -194 113 74
7278 74 37 47 427 -95 80 -10 33 -100 57 111 147 -14 29 -104 -33 86 -65 -11 118 -40 43 -153 -171 -18
7302 -18 -315 -147 -62 -35 -66 -132 89 12 38 -368 187 58 62 -44 101 141 79 -1 -300 85 33 201 -106 -467
7326 -467 204 -130 63 -180 128 89 316 -73 185 -65 41 -11 -346 62 64 366 162 -96 173 418 116
7347 116 -263 -202 36 28 -239 -262 86 -131 -76 -30 7 212 -118 -92 -55 96 103 98 307 188 82 -149 -67 184 -30
7372 -30 18 133 85 120 -81 59 85 67 -45 -192 105 -231 -58 105 -170 -30 -128 -19 -78 -129 46 25 11 35
7396 35 245 -7 109 -16 76 150 -60 -30 -207 75 109 117 -279 139 -84 171 63 31 -31 -59 -210 44 -100
7419 -100 121 -156 -34 -29 216 -99 127 -84 -38 119 -103 -12 -394 -222 65 94 175 323 -120 179 237 -309
7441 -309 -108 253 -178 -85 29 416 230 -283 56 -139 100 21 18 19 -120 121 -194 -123 -17 -237 -197 154 -125
7464 -125 47 211 189 125 -109 369 72 -57 218 15 -58 -78 36 -308 -85 384 119 -63 -82 271 -178 -90
7486 -90 112 -102 72 -35 -86 190 235 226 -75 150 -383 -129 -11 204 65 4 45 -124 171 -108 -34 -411 50
7509 50 -178 91 16 -263 -345 37 -411 233 238 5 229 14 -211 -166 129 82 186 107 -76 -25 -335 57 125
7532 125 -187 119 -66 262 -26 123 72 259 -86 99 74 97 -81 -199 121 -318 -252 -141 99 -250 77
7553 77 132 104 0 -133 -157 141 -371 -29 -111 138 -57 -152 8 119 128 42 -165 18 -152 10 90 -38 80
7576 80 81 194 -236 136 6 -28 85 39 -75 124 -30 -45 42 -162 -248 56 -244 53 23 291 136 85 -111
7599 -111 18 203 34 -194 -248 -6 -258 -62 16 42 -148 -214 -105 19 111 46 81 108 7 36 -89 -245 259
7622 259 72 -6 174 66 -95 143 61 -187 135 121 110 -43 212 -181 85 -3 -65 -62 28 67 -205 -147 -188 -81
7646 -81 -91 -2 -150 263 -42 -97 85 149 27 28 74 198 -120 35 242 -195 91 19 9 -120 106 42 40 96 144
7671 144 22 39 -128 7 -156 148 -123 53 28 -60 23 123 -260 119 -18 -136 -86 185 -24 1 100 448
7693 448 149 -115 24 -61 -122 159 -226 -166 -25 21 -106 325 -10 -84 -88 -237 122 138 33 36 390 -169 129
7716 129 -16 -42 203 170 31 -321 -251 -21 20 -145 -245 139 46 -153 306 -41 22 123 96 153 -117 66 -30
7739 -30 -115 264 -59 -228 -10 -148 -271 -8 259 235 -134 29 -178 -143 60 -104 17 -154 -261 -19 -226
7760 -226 149 46 94 -51 43 -243 102 124 46 63 -232 232 89 -149 5 302 -139 95 91 4 82 80 -39 -179
7784 -179 -175 12 62 88 245 16 54 -377 -118 -342 -119 26 -51 -179 78 -108 -146 -81 40 -33 -187 101 -38
7807 -38 -129 58 80 249 -53 -198 95 -433 42 -97 -96 97 -116 91 -492 -59 95 -149 6 79 -35 102
7829 102 -109 -198 -230 -15 -221 108 -47 -76 -100 -336 23 -30 175 202 7 284 116 112 43 -313 118 257 -174
7852 -174 68 221 206 -40 -96 -274 86 25 -214 189 63 201 196 -285 -554 22 59 75 236 284 365 30 -61
7875 -61 -188 -146 227 -305 64 100 142 65 260 200 -33 27 42 145 65 93 2 -259 -161 90 47 -74 -37 -68 -38
7900 -38 155 -106 211 217 -129 134 -80 -78 127 415 387 60 85 22 -12 45 56 -290 94 55 78 -69 -52 91 -165
7925 -165 119 105 -40 119 173 -137 -54 40 33 95 18 -61 -56 -110 -77 -153 87 58 118 -277 25 -66 75 -51 -249 90
7951 90 -89 185 -10 -103 -346 16 -115 -47 -262 141 15 1 207 100 -219 76 -274 -154 -194 -64 154 38
7973 38 -141 -17 -164 109 153 -304 -419 106 247 74 107 -88 -32 -100 -234 -117 -161 -9 -116 112 6 138
7995 138 -278 -4 -2 104 8 57 51 60 -89 -65 259 -232 254 -297 -225 108 120 111 4 88 -326 -9 9 -31 132
8020 132 11 -120 280 0 54 115 -59 39 221 146 94 -71 -98 -115 -176 -73 316 -52 133 63 303 -104 -97 9
8044 9 -10 122 252 67 43 21 -90 147 -144 -138 -195 -21 -19 83 40 -73 212 163 -130 -143 -70 103 -100 -16 93
8069 93 -7 77 124 -79 166 98 113 -117 34 34 -79 -215 271 119 -206 222 182 -75 -174 184 60 45 -13 102
8093 102 -126 120 230 -141 48 -49 -139 232 -285 -122 -23 460 -46 -174 145 -315 382 -78 -235 -31 -98
8114 -98 25 149 159 -44 -96 86 -168 19 -336 -267 -243 44 277 -46 132 -363 160 24 56 -8 186 105 -151
8137 -151 -247 -66 261 110 154 -71 -86 -42 -65 -168 -110 -109 -113 129 -78 -51 321 -172 230 34 60 -67 -153 -156 -61
8162 -61 -150 -298 -170 -232 183 -15 84 266 -283 119 318 -69 -121 166 -313 118 -31 299 113 70 116 -46
8184 -46 328 71 335 181 -204 -82 -73
8191g3
##END NTUPLES=NMR FID
##END=
