##TITLE=1H_PR164_2E
 D2O, 8 sc, 
 11.4.2019
##JCAMPDX= 6.0         $$ Bruker NMR JCAMP-DX V2.0
##DATA TYPE= NMR FID
##DATA CLASS= NTUPLES
##ORIGIN= UXNMR, Bruker Analytische Messtechnik GmbH
##OWNER= root
$$ XWIN-NMR		Version 3.5
$$ Thu Apr 11 16:21:30 2019 Russian Standard Time (UT+4h)  she@DPX200
##.OBSERVE FREQUENCY= 200.1315
##.OBSERVE NUCLEUS= ^1H
##.DELAY= (6, 6)
##.ACQUISITION MODE= SIMULTANEOUS
##.ACQUISITION SCHEME= undefined
##.AVERAGES= 8
##.DIGITISER RES= 18
##SPECTROMETER/DATA SYSTEM= spect
##.PULSE SEQUENCE= zg30
##.SOLVENT NAME= D2O
##.SHIFT REFERENCE= (INTERNAL, D2O, 0, 15.7039)
##AUDIT TRAIL= $$ (NUMBER, WHEN, WHO, WHERE, WHAT)
$$ ##TITLE= Audit trail, XWIN-NMR		Version 3.5
$$ ##JCAMPDX= 5.01
$$ ##ORIGIN= Bruker BioSpin GmbH
$$ ##OWNER= she
$$ F:/spectra/data/she/nmr/H-F/1/audita.txt
$$ ##AUDIT TRAIL=  $$ (NUMBER, WHEN, WHO, WHERE, WHAT)
(   1,<2019-04-11 16:20:43.28 +0400>,<she>,<DPX200>,
      <created by zg, POWCHK disabled, PULCHK disabled
       configuration hash MD5:
       00 E9 B6 7A A2 85 ED C7 34 08 36 98 17 FE 4E 26
       data hash MD5: 16K
       64 33 99 48 FD 4D 49 81 70 D6 8F 5D E9 A6 77 E4>)
$$ ##END=
$$ 
$$ hash MD5
$$ 51 15 22 83 45 55 21 81 9E FB 7D 26 D0 3E 6E 0D
##$RELAX= 
##$RELAX= 
##$RELAX= 
##$RELAX= 
##$RELAX= 
##$RELAX= 
$$ Bruker specific parameters
$$ --------------------------
##$DU= <F:/spectra>
##$EXPNO= 1
##$NAME= <H-F>
##$PROCNO= 1
##$TYPE= <nmr>
##$USER= <she>
##$AMP= (0..31)
100 100 100 100 100 100 100 100 100 100 100 100 100 100 100 100 100 100 
100 100 100 100 100 100 100 100 100 100 100 100 100 100 
##$AQSEQ= 0
##$AQ_mod= 1
##$AUNM= <au_zg>
##$AUTOPOS= <>
##$BF1= 200.13
##$BF2= 200.13
##$BF3= 200.13
##$BF4= 200.13
##$BF5= 200.13
##$BF6= 200.13
##$BF7= 200.13
##$BF8= 200.13
##$BYTORDA= 1
##$CFDGTYP= 0
##$CFRGTYP= 5
##$CHEMSTR= <none>
##$CNST= (0..31)
1 1 145 1 1 1 1 1 1 1 1 1 1 1 1 1 1 1 1 1 1 1 1 1 1 1 1 1 1 1 1 1 
##$CPDPRG= <>
##$CPDPRG1= <>
##$CPDPRG2= <>
##$CPDPRG3= <>
##$CPDPRG4= <mlev>
##$CPDPRG5= <mlev>
##$CPDPRG6= <mlev>
##$CPDPRG7= <mlev>
##$CPDPRG8= <mlev>
##$CPDPRGB= <>
##$CPDPRGT= <>
##$D= (0..31)
0 1.2 0 0 0 0 0 0 0 0 0 0.03 0 0 0 0 0 0 0 0 0 0 0 0 0 0 0 0 0 0 0 0 
##$DATE= 1554985242
##$DBL= (0..7)
120 120 120 120 120 120 120 120 
##$DBP= (0..7)
150 150 150 150 150 150 150 150 
##$DBP07= 0
##$DBPNAM0= <>
##$DBPNAM1= <>
##$DBPNAM2= <>
##$DBPNAM3= <>
##$DBPNAM4= <>
##$DBPNAM5= <>
##$DBPNAM6= <>
##$DBPNAM7= <>
##$DBPOAL= (0..7)
0.5 0.5 0.5 0.5 0.5 0.5 0.5 0.5 
##$DBPOFFS= (0..7)
0 0 0 0 0 0 0 0 
##$DE= 6
##$DECBNUC= <off>
##$DECIM= 24
##$DECNUC= <off>
##$DECSTAT= 4
##$DIGMOD= 1
##$DIGTYP= 9
##$DL= (0..7)
0 120 120 120 120 120 120 120 
##$DP= (0..7)
150 150 150 150 150 150 150 150 
##$DP07= 0
##$DPNAME0= <>
##$DPNAME1= <>
##$DPNAME2= <>
##$DPNAME3= <>
##$DPNAME4= <>
##$DPNAME5= <>
##$DPNAME6= <>
##$DPNAME7= <>
##$DPOAL= (0..7)
0.5 0.5 0.5 0.5 0.5 0.5 0.5 0.5 
##$DPOFFS= (0..7)
0 0 0 0 0 0 0 0 
##$DQDMODE= 0
##$DR= 18
##$DS= 0
##$DSLIST= <SSSSSSSSSSSSSSS>
##$DSPFIRM= 0
$$ [...]
##$SUBNAM2= <"">
##$SUBNAM3= <"">
##$SUBNAM4= <"">
##$SUBNAM5= <"">
##$SUBNAM6= <"">
##$SUBNAM7= <"">
##$SUBNAM8= <"">
##$SUBNAM9= <"">
##$SW= 24.9337058887773
##$SWIBOX= (0..15)
0 0 2 0 0 0 0 0 0 0 0 0 0 0 0 0 
##$SW_h= 4990.01996007984
##$TD= 16384
##$TD0= 1
##$TE= 0
##$TE2= 300
##$TE3= 300
##$TEG= 300
##$TL= (0..7)
0 120 120 120 120 120 120 120 
##$TP= (0..7)
150 150 150 150 150 150 150 150 
##$TP07= 0
##$TPNAME0= <>
##$TPNAME1= <>
##$TPNAME2= <>
##$TPNAME3= <>
##$TPNAME4= <>
##$TPNAME5= <>
##$TPNAME6= <>
##$TPNAME7= <>
##$TPOAL= (0..7)
0.5 0.5 0.5 0.5 0.5 0.5 0.5 0.5 
##$TPOFFS= (0..7)
0 0 0 0 0 0 0 0 
##$TUNHIN= 0
##$TUNHOUT= 0
##$TUNXOUT= 0
##$USERA1= <user>
##$USERA2= <user>
##$USERA3= <user>
##$USERA4= <user>
##$USERA5= <user>
##$V9= 5
##$VALIST= <valist>
##$VCLIST= <CCCCCCCCCCCCCCC>
##$VD= 0
##$VDLIST= <DDDDDDDDDDDDDDD>
##$VPLIST= <PPPPPPPPPPPPPPP>
##$VTLIST= <TTTTTTTTTTTTTTT>
##$WBST= 1024
##$WBSW= 4
##$XGAIN= (0..3)
0 0 0 0 
##$XL= 0
##$YL= 0
##$YMAX_a= 4714
##$YMIN_a= -4609
##$ZGOPTNS= <>
##$ZL1= 120
##$ZL2= 120
##$ZL3= 120
##$ZL4= 120
##$ABSF1= 10
##$ABSF2= 0
##$ABSG= 5
##$ABSL= 3
##$ALPHA= 0
##$AQORDER= 0
##$ASSFAC= 0
##$ASSFACI= 0
##$ASSFACX= 0
##$ASSWID= 0
##$AUNMP= <proc_1d>
##$AZFE= 0.1
##$AZFW= 0.1
##$BCFW= 1
##$BC_mod= 2
##$BYTORDP= 1
##$COROFFS= 0
##$CY= 11.3945322036743
##$DATMOD= 1
##$DC= 2
##$DFILT= <>
##$DTYPP= 0
##$F1P= 18.9103706918063
##$F2P= -1.10871071338519
##$FCOR= 0.5
##$FTSIZE= 0
##$FT_mod= 4
##$GAMMA= 1
##$GB= 0.15
##$INTBC= 1
##$INTSCL= 1
##$ISEN= 128
##$LB= 0.24
##$LEV0= 0
##$LPBIN= 0
##$MAXI= 10000
##$MC2= 0
##$MEAN= 0
##$ME_mod= 0
##$MI= 1.114404
##$NCOEF= 0
##$NC_proc= 0
##$NLEV= 6
##$NOISF1= 3.799351
##$NOISF2= 2.8
##$NSP= 1
##$NTH_PI= 0
##$NZP= 0
##$OFFSET= 15.70392
##$PC= 1
##$PHC0= -8939.351
##$PHC1= 22.00026
##$PH_mod= 1
##$PKNL= yes
##$PPARMOD= 0
##$PSCAL= 0
##$PSIGN= 0
##$REVERSE= no
##$SF= 200.130013532006
##$SI= 16384
##$SIGF1= 3
##$SIGF2= 2
##$SINO= 400
##$SIOLD= 16384
##$SREGLST= <1H.CDCl3>
##$SSB= 0
##$STSI= 0
##$STSR= 0
##$SW_p= 3612.71676300578
##$SYMM= 0
##$S_DEV= 0
##$TDeff= 0
##$TDoff= 0
##$TI= <>
##$TILT= no
##$TM1= 0
##$TM2= 0
##$TOPLEV= 0
##$USERP1= <user>
##$USERP2= <user>
##$USERP3= <user>
##$USERP4= <user>
##$USERP5= <user>
##$WDW= 1
##$XDIM= 8192
##$YMAX_p= 0
##$YMIN_p= 0
$$ End of Bruker specific parameters
$$ ---------------------------------
##NTUPLES= NMR FID
##VAR_NAME=  TIME,          FID/REAL,        FID/IMAG
##SYMBOL=    X,             R,               I
##VAR_TYPE=  INDEPENDENT,   DEPENDENT,       DEPENDENT
##VAR_FORM=  AFFN,          ASDF,            ASDF
##VAR_DIM=   8192,          8192,            8192
##UNITS=     SECONDS,       ARBITRARY UNITS, ARBITRARY UNITS
##FACTOR=    0.0002004,     1,               1
##FIRST=     0,             0,               0
##LAST=      1.6414764,     0,               0
##MIN=       0,             -4609,           0
##MAX=       1.6414764,     4714,            0
$$ Real data points
##PAGE= N=1
##DATA TABLE= (X++(R..R)), XYDATA
0@%%%%%%%%%%%%%%%%%%%%%%%%%%%%%%%%%%%%%KmNqJ2j4J4j4J5j6J6j8K1k4K8l2
53a7L6m4N4o6Q8j33K44j013l372l11J607K647K503J987N04j492l133k974j239
72d124R50K321K619J782M14j314k695k916j528N36K128K627K053O12j155k425
88a15k374j130M52J735K499K261Q06j247k505k246r50L41J426K111J982O74j271
105B449k634k431r74N84J570J986J786P68r76k485k453r84Q04J909K274J897P44
122C834j006k378k515j261M61J880K460J973N85j185k488k640j582J28J668K556
138D90K274Q83j020k425k578j510K4J517K552K609J327o93k241k566j686k25J233
155b035K313K456J384m68k111k686j936m95J020K035K231J394k26j748k404j827
$$ y = [0, 0, 0, 0, 0, 0, 0, 0, 0, 0, 0, 0, 0, 0, 0, 0, 0, 0, 0, 0, 0, 0, 0, 0, 0, 0, 0, 0, 0, 0, 0, 0, 0, 0, 0, 0, 0, 0, 2, -2, 3, -5, 7, -7, 7, -7, 8, -8, 8, -10, 11, -13, 15, -17, 19, -25, 29, -37, 51, -82, 162, -851, -4223, -4534, -2927, -280, 2223, 4210, 4714, 3222, 89, -2885, -4124, -3174, -853, 1766, 3548, 3962, 2648, -47, -2963, -4491, -3955, -1827, 800, 2853, 3465, 2310, -115, -2489, -3619, -3167, -1432, 1067, 3328, 4134, 2887, 382, -1864, -2814, -2473, -1047, 1064, 3046, 3720, 2449, -185, -2616, -3590, -3006, -1436, 550, 2336, 3104, 2128, -357, -2810, -3794, -2990, -1081, 1193, 3090, 3834, 2828, 450, -2065, -3326, -2865, -985, 1475, 3448, 4033, 2848, 360, -2280, -3862, -3734, -2066, 490, 2764, 3647, 2627, 202, -2376, -3886, -3862, -2345, 207, 2816, 4143, 3450, 1209, -1357, -3043, -3268, -2035, 278, 2734, 4118, 3650, 1539, -1147, -3083, -3578, -2558, -523, 1708, 3102, 2876, 1128, -1276, -3103]
171c103m85R47K038K230J439r5j428k069j689n58Q42J906K099J202k03j522k096
188e45j702o18P26J756J964J119k77j586k089j602m33Q69J905K075J305j55j512
205A200k074j617m28R50J990K158J307j34j551k285j947p24P71J926K172J384
221C098p6j500k323k095q92O72J973K369J654K54j225k163k054j002N33J833K353
238A409J802M39j076k088k148j236J56J511K129J718M98r41j966k103j309Q5J352
255a768K020J718O84o65j685j855j142R8J316J946J661O57o40j586j821j148L4
272b176J163J734J462M93p34j681j834j147N5J188J757J535N60o78j631j767j064
289b765J77J341J932J667O30o56j649j911j218L4J277J924J681O33o82j765k094
$$ y = [-3103, -3588, -2641, -603, 1627, 3066, 2971, 1543, -526, -2215, -2773, -1931, -25, 2074, 3276, 3073, 1551, -545, -2247, -2865, -2139, -383, 1581, 2700, 2423, 837, -1252, -2854, -3287, -2418, -513, 1562, 2867, 2712, 1200, -874, -2491, -2919, -1969, 21, 2179, 3486, 3352, 1801, -484, -2431, -3155, -2384, -458, 1714, 3098, 3022, 1522, -801, -2896, -3788, -3116, -1143, 1226, 2880, 3134, 1909, -254, -2308, -3310, -2777, -944, 1409, 3211, 3650, 2574, 486, -1662, -2898, -2742, -1231, 898, 2616, 3114, 2173, 207, -1896, -3205, -3120, -1768, 252, 1970, 2654, 1989, 304, -1551, -2693, -2595, -1279, 667, 2328, 2985, 2345, 759, -1062, -2210, -2176, -1013, 721, 2183, 2676, 1942, 261, -1573, -2720, -2665, -1477, 280, 1815, 2375, 1697, 66, -1701, -2765, -2588, -1247, 685, 2352, 2982, 2326, 677, -1234, -2452, -2418, -1141, 783, 2464, 3097, 2415, 650, -1444]
306a444j444j72J155J950J812Q74m81j623k046j482k69J102J990K006J108k31
322B805j432j965j607m85Q62J782J901J143j64j347j980j703o63N98J576J797
338A118J153mj152j758j539o41N89J533J779J221J18r74j576j450n86N28J424
355b17J622J060Rj051j638j468o13M65J328J543R82n3j049j637j405n56O01J470
373f07J680J151L7j027j610j456n41N99J539J745J193M4j083j766j656p82M22
390b118J436J763J254J49j029j773j753r13L23J445J877J469M47p81j656j699
406a559r84K01J318J848J534N63o59j559j771j155o7J042J643J449N79n53j464
423D06j693j165j18R47J575J450O85l68j224j487j034p8R11J514J400O66l77j209
$$ y = [-1444, -2888, -3060, -1905, 45, 1857, 2731, 2250, 627, -1419, -2901, -3170, -2068, -78, 1928, 3036, 2805, 1373, -592, -2199, -2684, -1822, -40, 1861, 3004, 2840, 1493, -487, -2190, -2853, -2255, -679, 1118, 2271, 2267, 1115, -643, -2182, -2823, -2234, -701, 1078, 2299, 2417, 1443, -133, -1583, -2169, -1641, -217, 1405, 2465, 2474, 1423, -215, -1683, -2296, -1831, -503, 1040, 2022, 1969, 920, -717, -2122, -2678, -2077, -607, 1073, 2224, 2261, 1234, -376, -1832, -2373, -1774, -235, 1510, 2703, 2747, 1664, -102, -1758, -2540, -2118, -682, 1081, 2335, 2484, 1455, -318, -2071, -2984, -2661, -1216, 661, 2130, 2577, 1796, 140, -1559, -2543, -2342, -1024, 824, 2358, 2921, 2262, 703, -1068, -2223, -2290, -1248, 395, 1844, 2423, 1870, 406, -1287, -2452, -2570, -1623, -48, 1402, 2087, 1719, 495, -992, -2026, -2104, -1193, 321, 1721, 2387, 2010, 801]
441H01j467j044j20Q01J377J272N18m66j267j515j052j06Q57J441J346N89m36
458A529j236j459r82o2R65J568J473O91l96j272j566j151j71Q43J537J491P33
475B535m04j356j688j325l49P46J519J576R47j78j219j640j338m10O98J510J683
492A307J094L7j007j603j412n76M89J337J576J043P1r21j556j461p42L08J182
509h34J473J066J39p56j350j300o65K86J167J489J098K09o89j228j188o16K50
526a449J060J363R82J22p89j325j240o08K25R88J308R67J29p84j348j236n73L56
544a852J141J415J058K51p04j328j312o49L46J186J490J084K31p18j418j478q74
561b131J44J074J517J171L06o54j378j482r57K2J026J584J399N35m68j243j422
$$ y = [801, -666, -1710, -1830, -1029, 348, 1620, 2138, 1672, 405, -1110, -2162, -2268, -1411, 30, 1376, 1965, 1529, 293, -1166, -2148, -2210, -1245, 323, 1796, 2487, 2091, 819, -747, -1898, -2069, -1226, 311, 1802, 2535, 2131, 775, -913, -2238, -2587, -1841, -322, 1254, 2201, 2023, 804, -836, -2174, -2584, -1886, -376, 1307, 2401, 2438, 1431, -172, -1584, -2160, -1671, -334, 1242, 2285, 2356, 1435, -121, -1582, -2324, -2016, -834, 639, 1705, 1844, 1088, -262, -1562, -2227, -1941, -774, 715, 1813, 2022, 1333, 105, -1083, -1699, -1449, -389, 974, 1956, 2078, 1289, -36, -1276, -1884, -1659, -671, 637, 1604, 1733, 949, -399, -1635, -2208, -1852, -711, 704, 1762, 2013, 1309, -19, -1331, -1980, -1634, -448, 1042, 2126, 2357, 1639, 221, -1257, -2131, -1987, -913, 604, 1775, 2081, 1427, 49, -1433, -2390, -2368, -1342, 242, 1641, 2176, 1708, 465, -957]
578i57r80p8R02J487J389O49l67j187j485j071k36O37J284J275O61k67j084j390
596h18j072k68O36J219J246P27j15q86j249r72j90O34J192J208O41j54r17j214
614c52r84k61N76J108J104N31k72r54j265r66k43O10J173J184O52k14r34j256
632g63r36j69O57J266J312P46j54r82j363j094l31N79J203J314P70j28r96j446
650e15j255m67M69J191J366R46Q6q44j363j222n18L90J137J447J081K42p21j275
668A75j243o63J84R82J331R97K53o43j244j283p19J06Q16J193J008L26n02j107
686c3j114n98R5Q25J212J022L44m62r94j039o11Q8P82J114Q92K47n41j096j092
705i59o28P0P39J081R43K64n50j141j083n40J64Q10J221J082L47n22j091j134
$$ y = [-957, -1937, -2015, -1113, 374, 1763, 2412, 2045, 858, -627, -1698, -1934, -1297, -13, 1262, 1923, 1656, 572, -818, -1890, -2158, -1522, -303, 943, 1670, 1555, 669, -580, -1552, -1742, -1108, 84, 1292, 1933, 1779, 862, -352, -1336, -1597, -1021, 87, 1191, 1722, 1450, 496, -769, -1735, -1978, -1368, -195, 989, 1641, 1427, 493, -763, -1699, -1868, -1211, 55, 1367, 2113, 1959, 977, -386, -1480, -1811, -1232, -29, 1285, 2055, 1927, 931, -515, -1770, -2237, -1768, -577, 789, 1735, 1821, 977, -386, -1608, -2126, -1736, -599, 848, 1929, 2171, 1450, 175, -1068, -1731, -1547, -565, 766, 1763, 2016, 1373, 129, -1154, -1873, -1767, -951, 242, 1250, 1576, 1074, -33, -1147, -1745, -1650, -825, 387, 1409, 1753, 1291, 297, -742, -1353, -1265, -483, 631, 1523, 1770, 1229, 133, -959, -1587, -1517, -778, 303, 1246, 1510, 960, -181, -1264, -1804, -1640, -830, 391, 1473, 1820, 1298, 207, -927]
723i27o33J00Q32J240J070L95m75j178j320q48m2P29J221J130M90l86j110j289
741a001r09j62O75J314J290O50k40r38j176r45k78N56J211J261O91j73r06j180
759b60r86m12L52R95J156P13r7q40j129r07l81L43R58J150P51j6o71j008q38k85
779a412L99R39J034O52l7o77j019r06l41L65Q81R73N66j13p44j051q85l69L86
798a359R73J106O71q0o97j014q79l48M03J063J198P60k1p47j130j001m55K99R44
817c14J178Q13K7p21j193j119n89K06R07J213R54K43n47j088j116o28J70Q95J226
836E17J004L45m09r88j131p49JP24J092R28L29l84r35j110p75j04N97J041R11
855I04L82k93p92r32o75o5O25J012R16M08k38p80r22o39l3N67R17Q17L13l19q57
$$ y = [-927, -1560, -1460, -628, 612, 1682, 2077, 1602, 424, -896, -1744, -1786, -1057, 164, 1294, 1784, 1398, 288, -1001, -1910, -2072, -1397, -83, 1207, 1857, 1617, 679, -497, -1442, -1720, -1164, 47, 1308, 1999, 1826, 920, -260, -1246, -1658, -1306, -311, 845, 1558, 1461, 621, -508, -1415, -1796, -1453, -495, 655, 1406, 1390, 719, -289, -1127, -1412, -1013, -74, 960, 1612, 1575, 898, -121, -1027, -1368, -1003, -122, 851, 1417, 1304, 560, -491, -1376, -1745, -1359, -386, 720, 1391, 1311, 614, -400, -1279, -1627, -1224, -161, 1037, 1797, 1776, 1029, -101, -1102, -1557, -1258, -314, 864, 1677, 1704, 983, -210, -1329, -1918, -1712, -805, 408, 1362, 1605, 1058, -30, -1146, -1774, -1604, -709, 517, 1521, 1866, 1457, 469, -662, -1411, -1410, -686, 406, 1334, 1663, 1279, 344, -766, -1541, -1645, -1048, -7, 904, 1286, 993, 201, -731, -1406, -1471, -846, 166, 1082, 1490, 1252, 472, -450, -1089, -1122, -555, 362, 1179, 1492, 1173, 316]
876C16j003o59m4N60R26Q24L49l27q59r69o43qO78J038R55M12k54q11j053p25
896a297n5O19J060R61M73k48r03j160q68k25N00J016J018N76j57q23j120q84k94
915a811M65J031J110P08Ro47j042r04l66L60R05J050P18P1o35j019r47m77J89
934a232P35R81P00O7n56r17q63m58K19P36R73P09J47m45q20p87l60K43O98Q87
954F57O47J26m97q71q42l83J94O60Q37N87M9n38q91q35m17K37P65R33O76J22m62
975G54q70q58m06K38Q21J011P58J54m91r41r45n45J06P03J003P97K00m74r54j029
995i68o33J3O72J023Q92L73l12q43r81o39kO09R89R49M59k07p87r72p09j47M70
1016g51Q51Q41M20j71p43r38p37j84M09P79Q28M46r8o16q22o30j22M30Q11Q11
$$ y = [316, -687, -1346, -1390, -830, 96, 920, 1269, 942, 83, -886, -1529, -1537, -859, 179, 1134, 1546, 1292, 481, -572, -1297, -1352, -733, 327, 1288, 1761, 1513, 610, -550, -1418, -1643, -1143, -127, 891, 1467, 1310, 487, -633, -1517, -1811, -1346, -315, 795, 1503, 1512, 865, -177, -1081, -1447, -1087, -182, 868, 1586, 1657, 1022, 3, -944, -1421, -1232, -497, 484, 1184, 1251, 695, -222, -1085, -1543, -1324, -588, 385, 1094, 1241, 796, -24, -811, -1171, -928, -230, 657, 1304, 1430, 933, 62, -780, -1163, -969, -309, 528, 1115, 1164, 626, -265, -1100, -1517, -1280, -515, 418, 1094, 1216, 754, -116, -974, -1380, -1142, -321, 690, 1448, 1602, 1111, 170, -775, -1320, -1214, -511, 492, 1289, 1489, 1015, 61, -968, -1601, -1588, -916, 107, 999, 1372, 1060, 217, -764, -1403, -1405, -796, 193, 1142, 1601, 1394, 607, -365, -1074, -1221, -751, 100, 941, 1361, 1190, 447, -491, -1228, -1412, -1003, -224, 604, 1050, 952, 336, -486, -1116, -1238, -808, 3, 814]
1036H14M40j02n83q17o07j27M01P46P16L76j83o71q63o44j53L95P66P69L94j67
1056I00o65q53o28j05M73Q65Q56M88q6o47q94p10j75M32Q28Q84N11j03o74r73
1076b76q36l24L11P94R04N99K7o02r32q37l67K83P80R65P26J47m61q38q42l97
1096a176J72O89Q79O75J83m32q05q74m88O6N48P81O47J94l60p49p74m49R8N58
1116f17P94O58K26k82o47p06l87J20N51P61N87J77l46p11p38m27P9N01P44N54
1136H91J28l71p59p64m09J06N98Q01O53K33l28p27p78m21J02O28Q59P08K65l15
1156A100p75q67n67nN13Q22P37L04k81p52r06o62q3M92Q40Q00M27j29o35q30o37
1177a094j24M22Q22Q11M93q4n74q11o79k35K90O82P51M23m5n59p83o77k32K42
$$ y = [814, 1254, 1152, 569, -248, -855, -982, -581, 165, 881, 1257, 1074, 403, -460, -1104, -1257, -862, -96, 673, 1067, 900, 235, -618, -1246, -1351, -878, -13, 843, 1331, 1245, 598, -296, -1006, -1181, -749, 79, 963, 1474, 1371, 697, -276, -1112, -1436, -1125, -331, 573, 1172, 1199, 597, -335, -1172, -1539, -1256, -476, 489, 1215, 1362, 901, 63, -779, -1176, -1004, -315, 564, 1239, 1422, 990, 185, -689, -1177, -1111, -563, 218, 865, 1059, 699, -50, -824, -1273, -1175, -617, 177, 835, 1061, 779, 132, -574, -961, -841, -290, 471, 1058, 1235, 889, 178, -560, -987, -908, -407, 337, 891, 1019, 648, -111, -875, -1284, -1178, -580, 221, 874, 1107, 779, 52, -726, -1147, -1045, -417, 442, 1150, 1415, 1100, 325, -542, -1109, -1114, -601, 221, 958, 1262, 981, 229, -677, -1339, -1422, -930, -90, 710, 1137, 1008, 373, -457, -1094, -1218, -796, 26, 837, 1330, 1246, 672, -139, -818, -1053, -763, -81, 670, 1093, 1048, 489, -294, -971, -1203, -961]
1197i61O20P20M65J8m44p15n84j53K87O34P10M36K7m35o97n94j98K87O01O27L70
1218A021m5n12p46o43k11K75O48O82L95k5m88p34o07j97L20P15P84N18om70p42
1239f8o84k90K60O74P85N32K8m95q15p77l72J42N87P89O19J48m07p73p56l82J39
1260a116N61Q04O82K69k74o82p43m58P6M92P32N98K45k35o62p69m97k6M09O52
1280E8N58K51k19n78o55m52j1M29O73O10K58j96n11n93l82NM04O55N62K14k43
1301H37n84o58m21qL84N94N35K14k42o23o87m14OM38P01O21K93k03n78o80m62
1322i37%M62P30O63L01j84n88p61n85j18L66O67O91L45j56n75p60n94k04K94O77
1343b66P71M51l7m69o80n83k19K66O32P28M83M3m22o80o29k51J60M98O26M45L2
$$ y = [-961, -341, 379, 844, 862, 418, -297, -881, -1034, -747, -113, 597, 1033, 1060, 625, -72, -666, -864, -577, 24, 651, 1021, 976, 464, -282, -925, -1136, -861, -213, 469, 864, 839, 351, -383, -990, -1187, -867, -152, 632, 1150, 1144, 674, -68, -752, -1042, -782, -108, 677, 1209, 1237, 742, -73, -850, -1222, -1080, -493, 296, 915, 1063, 656, -117, -873, -1255, -1116, -555, 249, 931, 1200, 926, 244, -499, -957, -881, -389, 343, 941, 1186, 951, 289, -480, -977, -1003, -594, 58, 616, 867, 648, 70, -585, -1037, -1048, -619, 54, 664, 922, 726, 215, -378, -760, -755, -351, 304, 866, 1080, 837, 253, -405, -826, -834, -450, 144, 679, 893, 651, 28, -659, -1073, -1067, -629, 72, 693, 986, 783, 205, -475, -937, -937, -475, 255, 918, 1219, 1035, 447, -314, -899, -1017, -651, 16, 707, 1052, 896, 321, -439, -1033, -1237, -943, -266, 505, 956, 919, 450, -230, -813, -1032, -766, -134, 594, 1077, 1120, 698, 18, -611, -862, -702, -204, 422, 867, 899]
1364H99l99o50n97k70J41M97O13M19Q6l15n46n29k28K02N30O01M20N0l27n63n31
1385d97k32J61M91N82L63l1l85o34n48k57J54N02O18M47J9l55o21n47k42J96N60
1406b56O92N10J03l28o38o27l16J14N18O54N21J29l26o63p24m13M0M54O80N64
1426F88K02k47n81o53m25NM32O93O08K75j42m92o30m52o7L48N92N58K74j52m79
1447C55o37m88r6K66N18N26K54j11m47n43m18p1L27N40N21K72p0m07n21l91j7
1468f38K99N30M82K24j37m57n86m20o6K85N11M91K37j62m86n85m22o5L30O07N67
1489E39K97r1m35n97m51q0L28N74O02L56p6m57o77n16j97K04N42O03L65k1m27
1510C85o31n62k44J76N34O33M63P0k99n78n20k55J53M70O00M67J00l00n23n43
$$ y = [899, 500, -150, -747, -1017, -876, -379, 234, 653, 739, 424, -122, -651, -879, -677, -147, 454, 874, 924, 597, 34, -497, -729, -568, -77, 505, 868, 837, 452, -182, -730, -987, -833, -331, 287, 734, 753, 398, -223, -770, -1012, -816, -256, 436, 946, 1049, 721, 83, -544, -860, -746, -228, 426, 947, 1076, 750, 87, -637, -1050, -1010, -556, 124, 688, 890, 643, 62, -591, -1016, -1011, -579, 114, 722, 997, 855, 363, -267, -719, -786, -438, 154, 712, 986, 834, 355, -282, -770, -866, -600, -82, 444, 698, 587, 140, -403, -821, -892, -565, -25, 496, 768, 698, 291, -230, -621, -638, -339, 191, 673, 897, 760, 303, -283, -703, -769, -484, 27, 518, 755, 593, 107, -478, -900, -965, -635, -28, 539, 836, 745, 310, -287, -738, -818, -490, 84, 686, 1042, 966, 509, -168, -684, -881, -677, -135, 468, 833, 812, 385, -246, -808, -1052, -876, -342, 291, 754, 824, 525, -53, -573, -828, -675, -205, 395, 862, 962, 662, 139, -404]
1530d04k89M0L75N42L85J00k96m83n21k95P4L94M98L97J19k27m34m50k26J17M00
1551a84N05M17Q6k57m63m65k37Q0L49N08L70L0l05n05m94k83Q3L96N35M08J07
1572F81k39n11n05k81J20M21O03M93J48k31n10n50l50K0L83N68M95J63k28n14
1592A76o11m33m5L24N49N26K41j04m56n56m08p2K93N59N57L14n8l90n21m04j29
1613f48K15M76M83K75o1l80n25m32j46J73M19M26K71m8l05m78l68q6K17M41M55
1634C74K74l6k94m20l60q4K24M19M43K10p3l57m80m11j30K02M28M45K52r5l65
1655A66m92m07j03K25M79N31L33k6l40m97m16j50K02M67N37L62j3l22n49n14k23
1676g50J05M20N14L81N0l09n23n09k47R3M02N29M22J34j80m69m52k74O4L74M85
$$ y = [-404, -693, -653, -278, 264, 649, 749, 453, -30, -551, -846, -772, -378, 120, 517, 636, 409, -25, -475, -701, -584, -184, 321, 738, 824, 567, 104, -361, -598, -518, -169, 339, 709, 739, 434, -71, -565, -848, -765, -369, 166, 574, 681, 442, -69, -574, -855, -735, -314, 289, 782, 930, 699, 189, -361, -711, -691, -308, 260, 755, 918, 690, 176, -435, -868, -913, -589, -40, 486, 727, 623, 167, -389, -797, -869, -576, -17, 540, 854, 796, 406, -115, -519, -648, -433, 43, 526, 801, 740, 360, -165, -597, -743, -570, -151, 275, 546, 498, 193, -285, -653, -739, -522, -81, 374, 648, 612, 318, -102, -462, -546, -322, 97, 540, 750, 677, 320, -160, -571, -701, -499, -71, 374, 626, 531, 166, -326, -733, -836, -611, -132, 399, 732, 706, 366, -131, -547, -697, -495, -28, 509, 871, 858, 536, -13, -527, -750, -645, -225, 289, 670, 720, 411, -112, -621, -868, -775, -373, 156, 578, 712, 532, 63, -389, -663, -599, -225, 260]
1697B60M08J32j65m21m76l08j4K73M37L53J15j73m07m39k77J3K83M18L90J35j43
1718C94l41l99k16N2L20M21L65J27j70l84m22k52L6K67M12L30R3k15m12m60k65
1739g19QL03M66L89J55j64m01m42k87K5L31M90M54J96j37l85m79l58m2K51M60
1760A14M22K12j21l96n07m05j13K23M08M78K82n0l28m55l55j40K01M34M72L10
1780F86K3k76m22l79j65J34L58M17K62kk86m23l87j76J05L30L65K56J4k40l60
1801a66l35j14J49L41M10K73J9k34l69l14j06J43L33L68K40k7k88m11l74j43J33
1822d72L25L95K45%k92m15l62j43J54L68M73L13O1k35m23l76j89J19L49M66L25
1843F86P5k23m53m51k50K2K98M06L60J27k14l78m38k83J8K78M54L93J74j09l27
$$ y = [260, 668, 800, 635, 214, -262, -570, -584, -311, 126, 479, 594, 421, 14, -425, -702, -689, -406, 12, 402, 537, 394, 53, -346, -562, -510, -190, 231, 596, 723, 553, 169, -253, -505, -469, -202, 210, 540, 633, 418, 6, -454, -719, -711, -408, 58, 447, 602, 438, 37, -405, -692, -667, -336, 154, 608, 804, 667, 282, -197, -555, -597, -346, 114, 536, 748, 627, 231, -276, -681, -794, -571, -163, 315, 597, 547, 219, -236, -591, -731, -530, -96, 376, 686, 709, 433, 11, -368, -533, -399, -41, 376, 638, 636, 350, -73, -460, -636, -531, -201, 164, 420, 434, 194, -166, -501, -615, -466, -125, 285, 558, 577, 343, -26, -340, -446, -303, 30, 398, 638, 611, 323, -88, -462, -605, -472, -147, 248, 493, 493, 201, -214, -576, -719, -565, -197, 276, 589, 650, 415, -8, -384, -573, -454, -105, 361, 686, 761, 538, 85, -366, -616, -594, -296, 110, 470, 597, 383, 5, -433, -716, -698, -420, 34, 427, 601, 492, 165]
1864A65l94k56j6K49M09L56J66j12l23l92k85n7J76L33L20J45j27l10l57k45l9
1885e94K05L47L38J51q5k65l17k21%K29L53L40J35j20k95l59k40k3J97L18L22
1906D16J17j42l41l85k59l2K19L56L78J75r4l02l60k83k9K21M14M04K09n1l03
1927C28m16l24j06J59L48L89K33m9k94m20l66j47J13L28M07K63L4k15l57l27j60
1948e79J06L21M00K99N4j92l21l10j87N8K53L31K53L0j97l29l20j77L1K35L07
1969F6K47N9j68k97k78j25Q8K73L23K56L7j54k75k79j40P9K55L17K37Jk02l38
1991a8l22j85N9K59L35K56K4j88l26l32j70Q1K90L90L09R6j54l24l27k06L0K64
2013a59L66L38Q1j40l40l88k48m9J98L51L08J42r2l02l56k70l1J99L36L40K01
$$ y = [165, -229, -485, -501, -252, 157, 513, 679, 567, 244, -148, -433, -490, -314, 19, 339, 484, 357, 47, -310, -555, -594, -389, -42, 296, 447, 362, 97, -220, -441, -441, -212, 141, 481, 616, 496, 201, -158, -398, -421, -224, 94, 416, 533, 391, 50, -335, -594, -626, -407, -51, 327, 502, 408, 106, -254, -537, -566, -345, 69, 473, 682, 631, 328, -88, -412, -518, -359, -11, 378, 611, 562, 268, -152, -518, -665, -552, -224, 183, 446, 480, 265, -92, -419, -579, -473, -152, 248, 547, 601, 409, 88, -222, -409, -351, -98, 233, 486, 516, 319, -10, -330, -507, -476, -241, 66, 313, 372, 204, -93, -371, -496, -408, -135, 188, 444, 481, 327, 52, -227, -367, -288, -33, 284, 521, 522, 320, -18, -340, -525, -466, -207, 128, 384, 408, 220, -106, -438, -608, -527, -237, 153, 462, 558, 404, 80, -247, -453, -423, -159, 207, 545, 626, 486, 146, -242, -490, -539, -341, 10, 318, 460, 368, 66, -290, -560, -591, -392, -56, 284, 485]
2034D85m1k23l18k49o3J67L11L12J72n5k33l18k79q5J12K53K66J53o1k13l00k31
2056d38o4J48K67K78J71l6j94k53j96l9J59K76K75J52o0k13l11k35o8J28K63K77
2078B87J23n4k48l21k67p6J50L05L20J73ok05l08k80p3J51L04L56K25Lk10l25
2100B4l08j46Q1K58L24K21Rj87l42l15j72M2K53L06K53Q4j26k72k82j49M5K01
2122a98L33K65R7j06k37k83j66pJ64K63K29M6j24k48k67j71pJ78K46J90R8j03
2144A92k29k24j42M7J99K73K57O0j13k36k22j55M0J78K63K05M8j45k53l01j76
2165d34J3J81K72K32R7j22k70k84j72K3K07L20K91J20q5k21k97k14l0J85K88K84
2187C84J31q5k30l33k53p9J20K60K58J74k7k03k93k36p7J28K31L10J90J5j46k35
$$ y = [485, 444, 221, -97, -346, -409, -242, 69, 381, 553, 498, 265, -53, -332, -417, -305, -52, 214, 367, 306, 93, -207, -438, -502, -354, -87, 191, 362, 326, 132, -121, -317, -356, -197, 79, 354, 506, 446, 233, -78, -313, -381, -253, 10, 287, 410, 356, 108, -213, -480, -556, -406, -101, 219, 392, 386, 181, -127, -407, -480, -329, -25, 331, 556, 559, 349, 24, -284, -430, -349, -91, 233, 454, 463, 276, -66, -381, -553, -511, -258, 48, 301, 385, 259, -13, -295, -444, -399, -198, 135, 400, 497, 391, 154, -129, -295, -302, -138, 125, 354, 400, 276, 28, -239, -410, -417, -239, 7, 197, 295, 192, -37, -261, -403, -356, -157, 116, 373, 433, 320, 84, -138, -293, -253, -75, 188, 393, 441, 296, 43, -258, -434, -421, -240, 32, 264, 361, 239, -31, -315, -487, -464, -257, 63, 354, 474, 389, 168, -129, -343, -373, -188, 100, 384, 515, 430, 200, -133, -386, -465, -345, -85, 173, 347, 320, 117, -176, -412, -489, -361, -130, 180, 370, 385, 239, 4]
2209Dk18r1R6K14K50J53J7j62k61k34j05O2J87K13J27Kj48k37k09p4Q9K20K38
2232A33J53pj26j99j86o3J03K33K30J39j1j61k55k28r4R0J98K26J58j2j96k69
2254a44k23j13R2K29K68K01L5j41k45k29j10P8K29K88K27N1j37k57k74j67J6J89
2276a37K52K09N7j09k52k84j82jJ58K53K45J04o5j96k19j55j1J51K47K35J11m7
2298C64j83k23j68k2J06J95J59Q3o7j87k24j61k2J03K04J82Q6m8j67j98j27J2
2320c03J44K32K04R5o4j84j92j63QJ26K06J97O6q2k18k48j83j2J26K23K00J22
2342C00n6k09k43j67l2J38K66K45J55j6j65k45k06q0J09K16K56J39qj68k78k17
2364b66j25N3J91K33J62K5j43k06k24q5M9J80K46J90O3j03j87j87r4L1J75J83
$$ y = [4, -214, -305, -209, 5, 255, 408, 425, 263, 2, -232, -337, -275, -88, 125, 252, 254, 106, -131, -340, -414, -325, -105, 133, 286, 279, 153, -46, -232, -295, -192, 41, 271, 410, 399, 238, -17, -245, -339, -249, -51, 175, 333, 321, 125, -144, -367, -480, -388, -159, 109, 310, 345, 204, -41, -270, -380, -302, -73, 215, 442, 493, 356, 99, -175, -342, -326, -137, 115, 324, 381, 272, 20, -264, -446, -447, -289, -36, 209, 313, 248, 52, -167, -322, -333, -182, 65, 300, 411, 364, 181, -42, -210, -232, -126, 69, 228, 311, 244, 57, -167, -328, -350, -247, -43, 139, 225, 177, 10, -188, -315, -303, -159, 73, 277, 372, 308, 124, -68, -231, -223, -97, 109, 306, 372, 290, 72, -176, -359, -371, -245, -22, 178, 300, 244, 35, -208, -375, -407, -269, -3, 242, 397, 381, 216, -29, -235, -315, -206, 10, 266, 405, 397, 229, -49, -266, -391, -338, -147, 86, 248, 273, 130, -76, -300, -385, -336, -156, 90, 280, 343, 240, 53, -134, -228, -197, -22, 161]
2386A61J56M2j12k09j98j01J0J27J69J28K9j02j65j96q1M6J75J96J44L5q1j52
2408B1j84o3N6J61K09J34K6j26k09k14r2K6J59K04J27M3j44j89k20j17RJ89K44
2431E0J92O6p4k11j98j25J7J76K29K27O6n5k09k47j57k6J04J81J89J13o9j74k33
2454a68j74l8R6J91K07J30j3j26j79j55l6R3J93J86J05Rj14k08j35o3M8J49J56
2477A54Q7m5j26j79j48n2O5J42J79J02k5j14j53j20j0Q8J71J89R5nj37j76j35
2500a53l5P3J54J69J05l8j70k06j83l8N5J77J93J11Pj29j93j85o0Q6K00K20J57
2523C17L4j10j91k05r1L8J62J96J71K0j07k00k23j31J4J22J87J55O2o7j65j66
2545a78j16JJ32J80J91P4m1j30j64j08LJ07J48J28M8n3j40j84j04j7Q8J52R3M0
$$ y = [161, 317, 359, 247, 38, -160, -261, -251, -124, 45, 173, 202, 100, -65, -261, -342, -296, -121, 75, 219, 254, 173, 21, -163, -226, -170, -9, 200, 334, 360, 234, 25, -189, -281, -255, -96, 108, 235, 278, 134, -55, -275, -392, -383, -194, 50, 242, 308, 234, 23, -175, -300, -283, -107, 122, 349, 415, 360, 151, -96, -253, -279, -175, 6, 195, 308, 239, 65, -168, -342, -380, -284, -93, 114, 244, 231, 105, -74, -229, -265, -172, 21, 207, 312, 321, 207, -1, -136, -199, -151, -2, 154, 241, 196, 70, -109, -257, -309, -244, -102, 77, 179, 154, 40, -113, -233, -243, -155, 16, 205, 300, 295, 158, -18, -153, -188, -115, 39, 208, 313, 275, 105, -101, -284, -322, -267, -90, 103, 214, 221, 92, -101, -286, -346, -260, -60, 160, 317, 351, 241, 50, -155, -246, -208, -46, 150, 321, 341, 234, 34, -189, -320, -306, -184, 3, 158, 220, 153, -12, -178, -294, -293, -161, 19, 210, 284, 243, 113, -51, -159, -156, -49, 99, 227, 275, 222, 82, -102, -206, -223, -135, 17, 110, 150]
2569A50m0j44j44q5jJ32J66J31O9n9j20j43r1J5J20J77J32L3n8j58j87j32kJ07
2593a32J60J45N2o3j73j79j24j9J25J75J81J09nj54j80j26l0R0J89J93J06k7j20
2616A93k00j68p9N8J40J54J18Qj26j91j47p7L9J38J74J34L8o5j42j36n6L8J32
2639b3J54J27K0p1j39j55n4QQ0J35P9K3r6j37j31p3L8J16J10J12K6p6j25j07m5
2664b04O1J30J54J06K5q5j49j39p8M0J24J57R2mj08j60j64r4J9J39J55J37M1n6
2688A39j64j65p7L5J24J89J50O7m7j41j67j25nQ1J68J51M8o1j18j76j42m6P8J38
2712f6J41P7lj09j28j20k3P2J37J44R4J6r5j19j12m4O3J17J14N9k4j11j22j10
2736a52l6L7R1J12O6k4r6j16q2k3P2J30J51O5qj01j17r4LO0J25J46O5l9j25j65
$$ y = [150, 110, -34, -178, -263, -264, -132, 34, 165, 234, 175, 55, -88, -179, -164, -44, 133, 265, 298, 240, 82, -105, -237, -239, -132, 28, 173, 225, 162, -11, -190, -314, -333, -208, -33, 148, 257, 252, 98, -82, -208, -238, -148, 41, 234, 340, 313, 193, -7, -175, -254, -196, -56, 98, 216, 224, 98, -93, -240, -317, -278, -140, 34, 168, 206, 141, -1, -137, -193, -155, -23, 131, 258, 278, 207, 68, -87, -141, -133, -53, 82, 161, 184, 88, -49, -180, -253, -215, -99, 11, 123, 149, 73, -52, -159, -204, -143, -13, 141, 247, 272, 187, 38, -101, -179, -139, -15, 142, 234, 230, 122, -38, -202, -296, -277, -138, 17, 154, 195, 139, -25, -190, -267, -232, -108, 81, 231, 298, 251, 110, -57, -182, -187, -106, 62, 213, 261, 200, 82, -94, -236, -282, -204, -66, 75, 152, 149, 40, -88, -208, -231, -159, -22, 122, 216, 232, 137, 18, -94, -138, -75, 42, 156, 215, 191, 80, -42, -152, -188, -151, -60, 52, 118, 94, -2, -118, -200, -223, -151, -21, 130, 195, 187, 86, -31, -125, -122, -62, 63, 209, 274, 235, 110, -55]
2762e5j16m9M3J40J31Q3j3j21j58j18n1P1J26J64J28J1p9j38j27o3L9J32J61J09
2786B50M1q0j65j41j10MR2J32J08L9o7j19j61p3j1R0J58J24O3m4p2j24q4J7P2
2811f1J41J00M8m0j10j15q0j1N1J00Q9L2p4r8j13o5kQ2J02J15L8l0j02j08n4L3
2837a32J02J19J17M4o1j21j27q4LQ9J07J07K6m4j31j60r7j6Q8J33J28P1l5r1j37
2862a02r2l6R0J52J55P7Kj05j41j10n0L7J07J28Q9Pj18j22j44n9J8R8J24R2K6
2887A23o2j14q9m8K3J06J15J21K5m6j02j06l7K6O4Q6O3J4p0j00j15n4K1O7J00
2912A1P5%p4r4p4n2N2J22J00Q7K4o2j04r2m7L9J01J12Q8nq5j28j19o5J4Q0J42
2939D6O7L2o7j27j23n9J9R0J42J27N7l6j06j22q3KQ9J22J08O3m7r9j45j12k2M4
$$ y = [-55, -171, -220, -177, -37, 94, 177, 164, 43, -115, -233, -284, -213, -87, 77, 205, 216, 137, -1, -128, -191, -152, -20, 141, 250, 291, 211, 46, -95, -205, -201, -109, 23, 131, 170, 103, -16, -177, -250, -261, -171, -13, 111, 174, 130, 58, -66, -150, -133, -61, 80, 180, 228, 188, 78, -37, -117, -128, -77, 23, 112, 144, 70, -28, -141, -206, -208, -126, -24, 91, 129, 99, -3, -111, -165, -132, -30, 89, 206, 250, 189, 68, -59, -143, -140, -51, 56, 163, 189, 145, 14, -146, -243, -259, -171, -38, 90, 161, 126, 35, -102, -194, -230, -140, 12, 167, 244, 246, 141, 0, -110, -160, -123, -16, 112, 201, 208, 90, -32, -176, -235, -217, -119, 5, 97, 123, 61, -53, -142, -190, -167, -61, 54, 175, 200, 154, 52, -54, -91, -65, -1, 85, 148, 162, 92, -8, -123, -177, -156, -89, 11, 86, 86, 12, -82, -156, -208, -156, -34, 66, 153, 177, 115, 11, -81, -128, -89, 12, 124, 212, 207, 122, -6, -125, -190, -176, -96, 46, 113, 145, 78, -49, -172, -231, -212, -122, 20, 147, 204, 168, 62, -60, -143, -141, -52, 70, 178, 241, 194, 95, -50, -162, -184, -140]
2965a40J14J03M0j0p8j20q9l1N1R9J21P0Qo5r4o5k9M3J00R3N1jo9j11p6k6J2P6
2993b3P6L0j5o6r8p8j2N1Q3J18M6po6r0n6k0P5Q9J15O1k8q7j05r4m3N4Q7J00N6
3022A53j8r4j28j14m4O1Q9J29P8K8n3j24j05l6K9J19J20J11L4p0j01j19o7kP0
3047e4R6Q7L9l7j21j23q3lO0J01Q3N7k1q6p9m7JP2R0R6M4j5q0p9n0k6N6N8P7J7
3077A30l5p6j08n7nN0P6P9K7n1o7q0m2J8O9J04Q2M5k3q3r1n0k0P9Q8Q9N0o8j05
3106B5j12q7l3P7J03Q7O5l0q6j17p5k4N7J15J27Q8mo9r6r8l7L2J07J09O2Lo9j21
3134ar9p5K0P2R7Q4jl9r9q8n5K3P6R9P6M8k8q8o9m1QP2R3M9K1n0o6r9l6lN4O5
3166B0N3On5p6q0l5K0O9J02N8K0l2q4o3l2N0O5R1P7J4o0r6j03m8j2Q6R8N9J2m9
$$ y = [-140, -26, 77, 117, 107, 29, -91, -180, -211, -160, -61, 60, 130, 138, 73, -21, -86, -115, -72, 28, 121, 172, 171, 102, -9, -85, -111, -99, -23, 53, 83, 68, 2, -96, -174, -186, -135, -52, 66, 112, 105, 39, -51, -107, -127, -52, 37, 152, 213, 185, 98, -7, -101, -144, -90, -3, 97, 153, 135, 41, -87, -201, -245, -184, -95, 34, 112, 140, 87, -37, -142, -178, -149, -30, 90, 201, 235, 165, 64, -55, -122, -124, -54, 42, 129, 168, 131, 10, -113, -196, -199, -139, -38, 45, 102, 81, -5, -84, -131, -130, -58, 32, 128, 172, 157, 77, -2, -52, -78, -22, 36, 113, 130, 95, 19, -89, -146, -151, -101, -25, 54, 81, 30, -37, -117, -159, -141, -72, 32, 114, 159, 136, 53, -38, -88, -108, -29, 59, 148, 198, 130, 25, -87, -174, -207, -130, -27, 60, 125, 95, 9, -108, -183, -207, -150, -35, 92, 180, 176, 107, 11, -87, -124, -92, 15, 124, 186, 189, 120, -1, -100, -175, -155, -83, 14, 98, 97, 58, -41, -129, -184, -161, -85, 14, 90, 138, 110, 22, -47, -88, -80, -8, 85, 134, 155, 105, 39, -60, -96, -99, -45, 20, 73, 79, 24, -52, -132, -167, -147, -78, 24, 82, 102, 70, -14, -77, -109, -59, 6, 97, 174, 188, 128, 32, -71, -119, -131, -45, 53, 112, 124, 75]
3196G5r8j16p7J5P5J06J12N2m0r1j00n1lN7J18J17M6j4q9j13o5m7K9R6Q5N3qp5
3224D9j30o2n3K8Q9Q0P2J8m9o7p0k5L6O7R4O6Om1o6q5l7L9M0P2L4jo4r0n5l9J7
3255a27Q0O8N1j1n9o1n9j3L8Q3J00O1Kn7r5o6k9L4P6Q5O6j1p3j29r0m7J6P6J14
3284B3Q4Ln3r3r6n0K6P7J21R8M7m2q4r6o8jN6R4J07K7m1q6j18q0j9M8P3Q6L5p
3314G1o0q0o3j9M1P9R3N4nl8p6n2j7M1P0O6K9k6n2p9o0j8K9O6M0L5k9o6o5n4J
3345a44N9Q2O3M9j2o3p4n3J3N9P5Q4L2j8q0j02p6k3M4O4R2N3k4o8j06r4k5M8R4
3374e1R9O9km6q3q1l9J3J07R6Q3J7l6r7r9n5j5N8Q0O2K9m3p7q0o5j3M3Q7P9N0
3404I0on8p8m1QM3Q3O6K8k9m3o8m5j1K8N5N0J5k4p4q0l5OM0O8O7J4k8n3o1m0J2
$$ y = [75, -23, -139, -216, -201, -126, -20, 92, 144, 104, 13, -87, -138, -141, -84, 34, 151, 197, 183, 94, -19, -84, -131, -102, -6, 79, 132, 124, 49, -81, -143, -196, -168, -79, 1, 73, 91, 42, -25, -95, -120, -84, -17, 77, 143, 149, 108, 42, -43, -80, -41, -1, 71, 105, 104, 40, -50, -105, -144, -127, -47, 21, 72, 61, 2, -59, -118, -131, -93, -10, 90, 151, 153, 96, 1, -65, -94, -60, 16, 101, 167, 156, 83, -46, -136, -183, -167, -91, 23, 107, 110, 57, -36, -132, -182, -156, -79, 42, 140, 187, 145, 61, -35, -103, -104, -48, 46, 153, 180, 139, 53, -65, -145, -164, -116, -43, 43, 78, 71, 11, -69, -132, -151, -110, -31, 62, 116, 111, 73, -3, -55, -72, -31, 39, 105, 134, 108, 56, -23, -83, -101, -72, -6, 34, 69, 40, -26, -91, -145, -144, -85, -3, 60, 109, 97, 34, -40, -93, -80, -21, 54, 138, 170, 152, 72, -30, -106, -129, -85, -21, 71, 124, 100, 32, -74, -168, -193, -145, -51, 48, 117, 115, 69, -14, -95, -134, -121, -14, 82, 165, 182, 146, 49, -50, -105, -120, -62, 18, 80, 109, 66, -11, -91, -156, -169, -126, -39, 40, 90, 84, 26, -52, -93, -85, -42, 41, 107, 135, 106, 63, -5, -50, -61, -33, 22, 72, 87, 63, -11, -91, -126, -120, -80, -12, 55, 69, 41, -12, -73, -113, -101]
3436a01P2Q2Q6J2k6q6o5n8mM9Q9P0K1l9j01q1p9k0O2P6J07M4k2p8q6n8k7N9J00
3465bR5P7%o1r4q4l9K9O7J03O7j7n5j05q7n6NQ2P4N4L0k9p1o9m2J2O0R2P0Qj3
3496A01n9o3m4J9L5P5N0j2l6n8p0m6K1M3M9M1J0l5p5o4lK0N7P8N7J7k6p0q1k2
3526i1K0P6Q6O1Lo1q7j07k5J7N9P1O9J8m1j07q8n4RQ0R7R6L0k1o9r4n6mN2J05
3556D4Q7N3k2o9r2j01m0L0P7R3M0ko0r7n8m0L4N7Q8O3J2l5p4n6rLP8P5M2On1n9
3588A7p4j3QN3N2L3j7m3p9m6k5K6O9O3N2om4p7o0J1L9P8Q6M8j2o6r0m6m7L4R2
3619A6O0N4j2n4j18p6m5L6P5R2P7J7n5r1q3l0J5P4R5R2L3l6r5q7n2PL9Q6Q5J5
3649A34l3n3r3r4k7O8P4P0L6oo2p8m7nN0P6O6N1j2m5p3l5k5L4P2M1J8j5o5o1o0
$$ y = [-101, -29, 53, 139, 151, 125, 39, -26, -84, -88, -39, 50, 120, 141, 102, 1, -80, -159, -179, -117, -41, 66, 110, 88, 10, -76, -134, -161, -102, -2, 93, 170, 170, 109, 15, -69, -108, -79, -12, 91, 158, 141, 86, -19, -106, -162, -157, -75, -1, 53, 83, 54, -17, -86, -128, -116, -56, 36, 106, 114, 101, 42, -21, -65, -46, -11, 64, 114, 102, 66, 8, -62, -108, -87, -44, 5, 46, 56, 21, -54, -118, -121, -101, -44, 34, 91, 108, 82, 12, -69, -91, -71, 5, 91, 152, 155, 94, 7, -100, -125, -108, -49, 22, 91, 109, 68, -39, -127, -181, -172, -92, 5, 101, 131, 110, 41, -53, -109, -113, -61, 44, 131, 184, 162, 93, 1, -100, -140, -110, -33, 60, 100, 98, 38, -59, -117, -157, -123, -66, 22, 85, 97, 62, -12, -68, -77, -74, 4, 79, 121, 127, 76, 17, -57, -70, -62, -9, 43, 76, 59, 16, -63, -109, -134, -108, -39, 24, 76, 70, 26, -51, -111, -100, -61, 17, 103, 151, 139, 73, -17, -63, -110, -76, 16, 76, 130, 118, 64, -54, -130, -175, -139, -64, 28, 105, 122, 67, -24, -107, -137, -122, -48, 47, 139, 172, 136, 41, -46, -98, -91, -52, 34, 119, 134, 101, 48, -45, -139, -166, -98, -24, 46, 82, 76, 14, -64, -111, -116, -66, 10, 76, 127, 115, 70, -3, -38, -63, -29, 43, 84, 102, 87, 22, -39, -99]
3680i9k1L8O4N8K1k9n4o9k9jN3R7M7M5j8o5p6o4jO2R4O9L4k0j00q5q1k0M4Q7Q4
3711F5N5k4p5j03o5k0M0Q8J03P1J0m9r0r6k2K2Q8Q1P5J0o6q7q4n5KN9P3Q8L1n2
3741G3r3q0o2LO4R3N6M9j6n7o6l5jM8Q0N1K9k6p7o6n2QL6O2M3J9m4o4o7m1J2N6
3773f5Q7M8J5l9n4p4k2J4P7Q6P5J6n7q9q1n3lP6J00M9J0l7q4q6q9KQ0R1Q7M5k4
3804A01p4r2o4ML8J10Q6P4j6o1j15p5k4K3Q1P5O5ro2j00q1l7J5P4R0N6Om0p1p1
3834i4j4K2O5Q0O4kl3o6o6k1MO6O2K5Qn4p0p8j7J8P2P4J8km9n4o1k6L2R4P0N5
3866A22Po5o6o5l5L3Q6P9O1j3p3r3j02m0K9P2J08N7Ml9j00q2n2J0Q7R7R5L0l5
3895A17q2q5o5jO2Q5J01L4l3q6r6p7k4M8O9Q8O0k8o4q1q7j1L9R9O2P4j9l7q3o2
$$ y = [-99, -120, -82, -18, 40, 61, 32, -22, -91, -120, -121, -68, 29, 76, 121, 103, 38, -38, -102, -103, -41, 53, 122, 156, 136, 36, -49, -130, -150, -106, -19, 65, 120, 96, 21, -82, -147, -167, -127, -39, 64, 135, 145, 96, 6, -90, -112, -90, -2, 79, 154, 164, 98, 11, -73, -128, -126, -67, 6, 94, 125, 73, -20, -100, -162, -159, -95, -2, 54, 103, 87, 30, -36, -71, -72, -24, 56, 107, 136, 110, 33, -33, -85, -77, -41, 21, 64, 83, 39, -25, -92, -133, -121, -65, 22, 70, 85, 46, -8, -82, -104, -90, -13, 73, 148, 164, 107, 18, -63, -116, -119, -43, 57, 106, 116, 79, -5, -91, -180, -178, -98, -7, 80, 125, 101, 27, -65, -129, -125, -87, 23, 109, 183, 167, 106, -9, -84, -108, -85, -4, 71, 136, 127, 65, -35, -116, -153, -138, -64, 26, 82, 88, 48, -23, -94, -108, -86, -21, 59, 123, 121, 88, 22, -44, -65, -61, 5, 67, 92, 100, 46, -24, -102, -119, -101, -29, 45, 63, 61, 12, -42, -103, -129, -97, -3, 67, 122, 129, 64, -2, -67, -102, -69, 17, 96, 157, 144, 71, -22, -124, -164, -135, -63, 45, 102, 106, 67, -33, -115, -167, -157, -70, 27, 122, 152, 117, 35, -50, -115, -116, -54, 31, 132, 166, 133, 47, -49, -126, -150, -102, -33, 55, 115, 87, 23, -58, -145, -156, -117, -18, 44, 118, 99, 62, -21, -83]
3925h3PJ7Q0P1M9l0m7q7p4OL2O0O5J3j9p2n9n8j4O1Q0P0L0oo9r8l3LM7R6Q8M4
3957A70l4p4j07o6j3N6O9Q1N1k2q5r5q9m3N7J14Q9N8J4o6q9r1m2N8Q4R7Q6jm1
3986A26r7j02p2K6O3R2P3Ql9q2j00n1J5N0Q2P5K5k2o2p4m0mO8P6P9J1j6o8p6l5
4016g1j5N3P5N5Ml3q2p2m1J4N8O0O2J3l2p5o8j7J3O2Q6Q5Rl6q5p9n1NP6R5O8K0
4048A56n8q9j06o9%O9J01Q3L3k3r3j00p0rP3R5J09O7k0o6r9q3l5N8R8Q2M2Jp4
4077G3j06p8n7N8O2P6O8Rp1p9p5l3K7P3R9O9km3o9o4k4K8O2O0N7Oo6p6p1k4L5
4108g6N7N4N0np0p2o7j1L7P1Q0P6k6m7q9n9l2N2Q8R3N8nq6q7r1n1M3Q4R9N3K5
4139A46q0r8j06n7M3P2J04Q7M0n8q4r0p4K4O4J24Q4L8m1r0r7p1j2N6P7R1M1m0
$$ y = [-83, -76, -59, 21, 92, 141, 111, 64, -23, -97, -91, -59, 1, 66, 79, 60, -12, -71, -129, -143, -82, -2, 68, 98, 92, 23, -75, -108, -105, -58, 38, 126, 170, 136, 62, -45, -111, -124, -68, 1, 82, 133, 111, 26, -69, -158, -201, -144, -30, 59, 117, 131, 65, -24, -115, -157, -99, -15, 82, 168, 167, 126, 29, -73, -145, -119, -56, 36, 109, 117, 78, -4, -104, -155, -140, -90, -8, 67, 92, 70, 8, -66, -106, -110, -42, 34, 113, 124, 108, 40, -36, -71, -86, -33, 42, 97, 101, 68, -14, -86, -127, -113, -55, 5, 67, 80, 48, -27, -95, -112, -99, -37, 49, 134, 143, 107, 22, -57, -108, -103, -27, 68, 136, 156, 98, 9, -97, -166, -166, -97, 4, 87, 120, 97, 4, -96, -166, -175, -102, -7, 102, 169, 149, 83, -16, -99, -134, -76, 22, 104, 146, 147, 73, -33, -111, -168, -110, -48, 28, 96, 105, 34, -45, -120, -153, -126, -53, 46, 115, 113, 70, 1, -63, -87, -59, 3, 63, 120, 126, 60, -16, -87, -111, -76, -19, 35, 85, 80, 10, -62, -129, -140, -103, -32, 48, 124, 98, 51, -38, -97, -129, -77, 11, 104, 162, 157, 71, -16, -107, -158, -115, -31, 68, 121, 146, 66, -32, -138, -195, -152, -80, 24, 111, 151, 93, 9, -81, -155, -131, -67, 57, 141, 179, 138, 48, -49, -120, -132, -76, 1, 92, 133, 93]
4167I3p3j08n0k7N1P9R6N2k0o2q4m4k3N5P4Q6M2j6o7p6n5j7M1P8N9K5l0p7q1n0
4197a29qN5Q5O5M0m8n7q0n6KP2J00O1M9l4o0r4q2RO4R0P6M4l4q9j08q4k7M6R7
4227c5J00O1np6r5r2l7N7R2J14P5Nn4j07r6n2M4P9R3P5J6n9r1j07o2J5P7Q1O7
4256H3J3l1o7r3l1qP5Q8N8M6l7p3p7l6QO7P8N9lm4n9r9l2QO3P9M5Om4q9n7n0L5
4289a19Q0R2P0Mn4p4p1n7L3P8Q6P4J8o1r3r3o4LP4J08Q6Ql5r0j17o8K2M7J26J05
4319A18L9k0r8r9p5pN3J16R1O4l5o1j15q4l8L9J03Q1N5nq0q8j03k1M9P9R1N6P
4348A12o4o3p2k4L4O6Q8O2j5n8o9o8k1J8R7N5K2mo7q7n5k4L2Q7Q6M5k6n2r4o7
4378a26j8O3R5R6N2j9p4r9p9k4L3R6Q9P7j4p1j19j00l0K5R0J12O6J8n2j12r0m9
$$ y = [93, 20, -88, -138, -165, -114, -35, 61, 113, 93, 31, -53, -97, -120, -65, 9, 95, 137, 121, 54, -22, -77, -94, -53, 25, 84, 109, 79, 2, -79, -129, -137, -82, 3, 68, 108, 60, 3, -77, -133, -131, -59, 41, 102, 151, 117, 57, -37, -119, -110, -46, 44, 120, 164, 130, 41, -67, -151, -178, -132, -35, 65, 126, 121, 45, -50, -142, -179, -122, -30, 84, 159, 164, 110, 3, -93, -145, -101, -22, 71, 146, 162, 103, 12, -95, -157, -142, -65, 16, 83, 96, 65, -2, -95, -126, -134, -59, 29, 87, 133, 96, 23, -54, -90, -82, -15, 63, 122, 119, 75, 16, -83, -115, -107, -44, 35, 80, 86, 42, -47, -104, -154, -119, -39, 53, 123, 127, 73, -1, -72, -129, -96, -18, 68, 142, 160, 99, 6, -87, -151, -148, -74, 34, 120, 128, 93, 3, -114, -182, -160, -113, 13, 118, 157, 137, 39, -60, -135, -142, -89, 27, 118, 182, 147, 86, -29, -113, -151, -112, -9, 72, 127, 122, 42, -46, -149, -170, -121, -42, 49, 105, 112, 48, -15, -87, -111, -77, -11, 77, 139, 124, 66, -3, -71, -92, -74, 23, 78, 100, 96, 29, -58, -113, -137, -105, -18, 68, 113, 87, 35, -59, -126, -144, -81, 14, 110, 162, 143, 69, -30, -109, -133, -100, -4, 85, 162, 148, 77, -42, -142, -172, -147, -57, 55, 121, 139, 87, -25, -115, -164]
4406a64J4J05J21P1K5m0j04r9m4kN7J04P5L0m3p8j15o9J8M7R3P7L4j9q6q0n0j0
4434a32O9R5O1L6j2p8p7n5j1N0J00O0K8l6r3p4n7PN7P5Q1Ll0q2q4m7J2P0R3P9
4464A08M4l9r5r0n5J1P7Q7R6L5m4j08j13o5j7P7R4J00M7l1q9j06r2rN6J17R4O8
4492A58j4p6j01r6k3M2J00R8O9J0o8j10r6l7MR2Q8O5J1n4q9q8m1J4Q2Q5Q2Mm2
4521F9p9o3l4K0P9R3L8J3m4j00p9k2K6P6O2N1ko3p8r5j9M8O6Q8O0J3n9r7q2k7
4551a41M1R6R6O1J0o1j11q9m7K3P6J13Q4Mn6j21j01o7J7Q3J24Q8K6k9j11j09p1
4578a72J2P7J03J15M9m7q4j01p9k2N7J12Q5L6j7p6j11o9j9M1Q1Q6N3j3p4p4p0
4605a21lM2R4R1L1k9m3r2o0oL3Q2R0K8l6p8p9o9k0O1Q9P3M1l0q6p4q4LP2R6R7
$$ y = [-164, -150, -45, 76, 147, 172, 132, 28, -71, -115, -117, -60, 44, 119, 149, 106, 28, -87, -156, -138, -91, 2, 79, 113, 94, 8, -72, -122, -132, -63, 32, 93, 129, 117, 39, -38, -93, -104, -54, 46, 106, 134, 98, 5, -69, -126, -119, -62, 13, 94, 97, 67, -15, -99, -146, -134, -64, 29, 108, 152, 113, 18, -72, -127, -116, -39, 48, 144, 179, 135, 27, -86, -151, -168, -91, 3, 103, 150, 119, 30, -76, -168, -177, -121, -4, 90, 158, 144, 68, -33, -129, -152, -110, -10, 88, 157, 167, 99, -11, -107, -144, -140, -48, 40, 105, 116, 62, -27, -115, -156, -142, -60, 25, 107, 111, 69, -10, -73, -107, -87, -8, 85, 123, 136, 92, -8, -87, -109, -83, -7, 55, 106, 104, 41, -37, -132, -151, -103, -37, 51, 111, 124, 65, -32, -114, -141, -100, -4, 92, 153, 163, 102, -9, -98, -145, -122, -46, 67, 151, 155, 99, -22, -123, -190, -173, -90, 34, 122, 148, 119, 8, -101, -172, -160, -83, 20, 135, 184, 137, 53, -48, -127, -149, -92, 20, 105, 141, 124, 48, -63, -132, -151, -110, -29, 57, 110, 97, 23, -51, -121, -124, -82, 12, 103, 134, 105, 62, -30, -90, -96, -63, 19, 109, 137, 101, 23, -56, -125, -145, -84, 5, 78, 119, 89, 3, -71, -155, -152, -80, 16, 113]
4636A13M5k9p3j08p1j9O3J13R1M5rr9j15r0j3K8R4J20N1Oq8j15q6l8N2Q8J21Q2
4664A59Oo2r3r9n5J5R1J00R5J5o3j00r1p9J6Q2R6Q1J6n3r3q9n4J2P5Q1P5M0m7
4693G7o3q0m3qQ8Q6O1J2k3r2r2m9J4O5Q7P2Qn5q9p7m6MR7Q0P2K1m6q4j04l9K5
4724a21P5J04R3K2m3j11r9o5J4O5J11Q1M1m4r2j30q9J4O0J12J07N3l1q8j08p5
4750a44l0O4J20J00O6j2r0j15p1l2L7R3Q9O0Oo4j11r0k7L9Q1P6O5Lo5q4o8k5K5
4779a04R1Q5M7Qn0r8n6m7N4P0P9M6qp3r5q2lL2Q4Q5M8j3p0j00p1j8N0J01J02O4
4809A58j7p1j04p4m6N4Q9R6Q7kq6j09j16m4M8P5J16P4J8n6j25q8o1K2P0J41Q9
4836A38M0n4j06j01n4LO5J13R7K6l7p9j26o0j0O3R3R0K0l4o0j04n3j2O0R6O9N1
$$ y = [113, 158, 129, 56, -52, -123, -142, -79, 34, 125, 170, 161, 62, -53, -143, -156, -128, -34, 86, 137, 143, 55, -60, -146, -184, -132, -44, 77, 159, 165, 103, 10, -89, -144, -129, -38, 62, 157, 172, 109, 9, -82, -161, -145, -63, 33, 114, 130, 77, -16, -105, -159, -147, -72, 9, 84, 124, 77, 14, -66, -109, -117, -29, 57, 118, 130, 107, 15, -77, -126, -112, -47, 40, 112, 120, 65, -24, -101, -147, -143, -46, 34, 106, 127, 81, -3, -107, -146, -121, -46, 58, 151, 173, 130, 19, -80, -145, -131, -66, 45, 126, 167, 123, 31, -99, -188, -174, -114, -2, 105, 158, 127, 39, -69, -144, -174, -110, 10, 110, 176, 164, 74, -41, -112, -144, -107, -14, 75, 135, 141, 77, -34, -124, -151, -112, -31, 45, 110, 113, 48, -36, -104, -129, -104, -13, 72, 119, 127, 77, -21, -77, -124, -70, 0, 79, 125, 117, 44, -51, -133, -136, -104, -20, 65, 113, 100, 30, -70, -141, -159, -109, -8, 94, 158, 141, 70, -34, -108, -154, -100, -11, 85, 172, 170, 84, -25, -141, -185, -137, -62, 54, 128, 146, 90, -35, -123, -184, -162, -92, 49, 138, 178, 124, 18, -83, -137, -134, -69, 44, 141, 167, 130, 51, -75, -135, -145, -82, 11, 101, 121, 87, 27, -77, -130, -142, -82, 14, 83, 134]
4864A34k7q3p1o2PM8Q2J05J9n5p5r0n9lO0R8O9K9m4q3j05m7KP2J03Q4K6k7r3r0
4894g6p2J1P9R8R4L5k4r9j21o5k2O6J19Q8M8j6r6j37q2rN7J13J06N8j5p9j10r1
4922a42j1K3J07J09Q3Mp4j05r6m5K8Q7R8O2jn0q7j03n0L5P6J02N6Qm5r1p9j9J6
4951a04O9J08N8Ko1p7q8k2K5Q1P0O7ln8j13q1k6M2P4R1P4ro7q3q9m3L7Q9J11P7
4981A51K0p4j01r9o2L7Q9J20P8Mn5j08j16o6K5P5J16R5L3m3r8j39n2NP3J16J00
5008A24M1l7o6j25p0j7N8J07J04L4k4q6r6q6j7N0R4J00L5j8p1r2o8k2M9J08Q0
5035H9L5%q4q8o0KL4R8P8L8k3o3j15p8%N0R6P9L5k4r0r7o4k6P7R8J04N9l8q2j02
5066f2r1MO7J02J04M4j0r0j30p2l6M8J12J03P0j1q3j26r4l7L7J01J18O9K0n9j19
$$ y = [134, 107, 24, -47, -109, -102, -54, 28, 133, 152, 97, 22, -68, -127, -130, -70, 28, 97, 126, 82, -1, -106, -153, -151, -79, 24, 108, 134, 107, 14, -76, -148, -137, -58, 40, 134, 169, 145, 46, -75, -140, -162, -96, 23, 111, 159, 143, 47, -90, -172, -181, -124, -11, 95, 153, 138, 59, -51, -142, -153, -130, -23, 86, 169, 173, 99, -6, -102, -147, -119, -32, 66, 128, 127, 77, -10, -113, -163, -128, -52, 50, 106, 114, 69, -22, -101, -120, -104, -35, 73, 131, 133, 72, -5, -93, -115, -90, -9, 61, 128, 125, 67, -46, -127, -153, -111, -37, 54, 128, 119, 52, -31, -120, -163, -126, -37, 74, 151, 171, 97, -4, -103, -165, -128, -39, 81, 159, 163, 108, 0, -116, -182, -157, -82, 34, 129, 162, 119, 21, -118, -170, -165, -92, 24, 124, 165, 128, 62, -63, -133, -150, -92, 15, 119, 153, 129, 43, -53, -139, -156, -106, -12, 88, 123, 105, 34, -58, -126, -148, -99, 9, 89, 124, 124, 40, -48, -108, -106, -72, 26, 104, 142, 119, 56, -59, -137, -137, -87, 9, 88, 123, 99, 9, -88, -152, -178, -101, -3, 101, 160, 122, 40, -62, -153, -149, -82, 20, 124, 168, 158, 68, -62, -134, -170, -122, -10, 93, 163, 152, 69, -57, -151, -188, -151, -50, 68, 137, 157, 98, -21]
5093b1j07l6J5J03J10Q7K2n4j18r8m3LR1Q7Q0J8n7q5j02o3L2O1J08P1K0m3r6q0
5121i5l4KQ2J05O5J0m0q3r3m6K3N3J07P4Ro9q8r8m2J4Q2J05P2K4n3r5j08l1kR2
5151e8J13R9J6o0r9j13o3J8Q0J14Q8M5n8r8j14q4nO6J23R3O3k8j16j08q5NP0J04
5179HJ04N9j1q8j18q2k6N3R9R2N1J2r0j01r4k2M7Q7Q5M8qo6r7p2j1L2J04R0N2
5208A37j8o4j02o7k1N6Q1R2M3j2p0j12o7k7O0R1R4L2rq2j15o8k7O0J03J13O2k7
5236A36p2j17q4j6L0J18J14N9J1q9j24j11m5M7J00J23P3J1q6j00j13n3K3R8J24
5261E7Q0K6m4j01j14m7J5O3J21R2J1l0q4j18r6K7P2R1R3K0l5q4q5r1J0O9R5R9
5289A12K0n5n6j00n5J1O9J08P4K5l9j00p8o2J2Q3Q7P2Pn2r9q6n6RO8J20O9M1m9
$$ y = [-21, -128, -164, -149, -46, 64, 151, 173, 119, 1, -97, -140, -137, -46, 41, 121, 139, 82, -3, -105, -168, -136, -75, 33, 104, 124, 81, -15, -95, -129, -127, -45, 60, 125, 135, 95, 12, -81, -127, -104, -51, 56, 130, 139, 70, -18, -116, -158, -144, -62, 43, 115, 139, 86, -9, -117, -148, -150, -58, 55, 154, 170, 110, 11, -102, -165, -147, -67, 47, 135, 180, 122, 24, -90, -174, -179, -113, 10, 103, 166, 138, 22, -86, -171, -166, -96, 8, 112, 171, 160, 72, -46, -128, -154, -101, -2, 90, 141, 153, 63, -38, -132, -154, -107, -20, 65, 113, 105, 39, -58, -130, -141, -109, -5, 85, 137, 119, 55, -47, -114, -135, -79, 2, 94, 137, 125, 55, -57, -124, -151, -91, 0, 94, 126, 117, 35, -80, -148, -175, -115, -12, 101, 163, 136, 64, -53, -137, -153, -123, -5, 109, 168, 179, 90, -34, -145, -190, -143, -43, 80, 153, 164, 78, -22, -135, -188, -165, -67, 57, 137, 163, 119, 18, -96, -143, -128, -65, 56, 148, 159, 129, 45, -73, -169, -142, -70, 21, 114, 134, 99, 15, -70, -161, -151, -82, 13, 112, 132, 77, 21, -79, -134, -123, -54, 54, 128, 153, 114, 14, -64, -126, -114, -31, 56, 128, 135, 83, -16, -102, -158, -149, -81, 39, 108, 149, 100]
5318A00q6j13p0K3P1J20R3M5l8r8j12q3nO4J17Q9N5k0j09j31q1oN1J20R1O4or1
5346E4j04j00l1O0J16J07N9no0j09j03l6M3R4J16N6j3o1j05r3l7L3Q0J06M5Lo3
5373E2r2q2l4N1P5R0P3Jn0j19p5k1K8Q9R0O4k1n6j04r0l0L4J04R9P3k2o3j10r0
5402a36k5K2J00J12P7Np6j07j04l3L1R9J03J06Np5j11j10n5J9Q2J19Q7K2n3r4
5428A0j11r3K2Q5J22P8O3m1j08j11p0J3O5Q7J12M1k7j04r1q8QM0J10P4O3l2r9
5455A8r7p0nP3Q9Q8L4l5p9q1o3nP6R2Q3M0m2p6j16m9k2O9J07Q3K8k5r9j10p0n
5485a69P7J13Q5M0j4j10j19o1oP8J10J10L5j6r3j19j13j3P5J09J08O1lr9j25r2
5511a51l5M7R6J28P3ro6j24j03k2K8J01J10P7Ln3j15r8l7L2R0Q6P1K9o8j14q4
$$ y = [100, 14, -99, -169, -146, -75, 45, 138, 183, 145, 47, -65, -148, -153, -89, 28, 117, 172, 152, 43, -88, -169, -175, -124, -4, 87, 151, 145, 54, -50, -150, -181, -121, -5, 102, 161, 156, 96, -13, -116, -152, -109, -15, 101, 157, 144, 83, -22, -115, -152, -119, -39, 67, 112, 115, 52, -40, -122, -156, -105, -30, 60, 133, 134, 84, -35, -110, -131, -103, -14, 76, 140, 119, 63, -41, -131, -161, -127, -23, 76, 149, 127, 64, -46, -136, -161, -139, -39, 73, 150, 155, 79, -28, -132, -165, -134, -35, 68, 174, 179, 104, -7, -117, -172, -153, -71, 48, 135, 157, 104, 10, -101, -194, -172, -87, 35, 113, 176, 135, 27, -84, -154, -141, -76, 11, 123, 164, 137, 33, -58, -146, -138, -98, 12, 86, 149, 117, 18, -79, -149, -154, -81, 8, 96, 130, 95, 16, -65, -128, -133, -57, 35, 118, 158, 116, 40, -76, -125, -147, -78, 29, 112, 140, 115, 16, -94, -164, -169, -92, 21, 106, 146, 132, 22, -97, -158, -164, -86, 24, 134, 169, 153, 60, -59, -172, -185, -110, -1, 107, 168, 165, 66, -59, -151, -186, -139, -43, 85, 158, 149, 83, -41, -144, -166, -138, -37, 73, 150, 153, 100, -15, -113, -150, -118, -28, 58, 129, 158, 90, -24, -108]
5538a08m1K2Q2R8O8jm2r9q6l3J4R4R0O4Mm6j03q2k4L1P5R8O7J0o8j02j12k3K7
5567a26P9J05O9K5q3j07r8l3J5J05J10R7J3n8j17j06p2M7P1J13R9L7o0j14j15
5592a04p3KQ7J19R2M7n7q2j36o7qR1J13R1N0k8j00j00o8k4O6J07R3N5j9r6j03
5619e2p6k7N2R8R7L8rq6j20n6j8O4R1R7M7or0r7p6mO0R1Q0N7k5p9j05q0j7O8R3
5650A0R0M9k8j07q6q9qO3J07J09M5k1q2j13r1j5N2J12R9Q3oq2j10j15m5M8J14
5677a7J13O1lp6j18j09n1M8R7J17P8J2o2j02j00o8L6R4J07J02%n6j05q8n1JQ0
5704f0J12P6J3m4r9r4n9J9Q0R8Q6Kl8r7q8m4NQ3J04P1J8m0j00j04l5K1P7R9O8
5733A30K2n2r7r5o9NR6J07P0L9n1j01j08o0J4P4J33R6K6n4j11j06o8J4Q0J10R6
$$ y = [-108, -149, -127, -45, 53, 121, 120, 78, -21, -107, -140, -126, -32, 58, 122, 126, 80, -23, -105, -129, -98, -23, 75, 142, 152, 84, -18, -130, -153, -126, -47, 58, 127, 152, 69, -38, -136, -169, -154, -49, 61, 158, 171, 113, -4, -110, -182, -135, -64, 49, 148, 185, 125, 11, -104, -177, -175, -88, 31, 123, 170, 113, 31, -105, -172, -180, -89, 24, 115, 165, 137, 37, -63, -131, -155, -89, 18, 111, 166, 147, 51, -52, -128, -155, -103, -5, 92, 130, 121, 35, -85, -141, -159, -95, -4, 93, 140, 134, 44, -53, -129, -133, -73, 18, 98, 155, 130, 51, -54, -134, -151, -83, 10, 100, 149, 121, 14, -72, -161, -169, -106, 1, 110, 155, 134, 52, -61, -152, -167, -115, -3, 96, 179, 173, 91, -19, -134, -179, -131, -17, 96, 157, 154, 78, -40, -149, -200, -152, -55, 62, 140, 152, 90, -12, -112, -180, -144, -50, 57, 159, 159, 103, -2, -90, -141, -140, -60, 52, 128, 141, 97, -2, -96, -155, -136, -56, 42, 128, 130, 92, -5, -93, -137, -132, -49, 55, 126, 144, 104, 4, -100, -135, -114, -37, 62, 130, 152, 100, 3, -92, -161, -156, -60, 47, 117, 156, 105, 4, -104, -164, -150, -76, 57, 153, 179, 125, 14, -92, -160, -146, -66, 44, 140]
5760A40M1l4j17j11q0k3P3J22J03N6k9r3j19q1l7Q0J15R8N6j1p6j08r3k5M3J08
5786bR4O1k0o6j08r2k0M2R4R4O1k1o4j09p9j9M3R2J02M7kp9r0p6j9M4R2R3N2r
5816A36q3j00o8l4L3J09J00O2j9r0j16p6l6N5J03J13O4Jp0j20r7k3K3J04J30P3
5842A74Nq5j04j08n1K8R8J06R1J7p7j06j13n0J1R5J25P4L5n2j11r6o2PQ0J16Q4
5869A31K3m7q5j05n8jQ1Q4Q4N1o8q4r4n4JO5J09P3K8n0q0q7n9RO9J00Q9L6n7r6
5899Hr3o3J6P7R2R2K0m7q8j08p8J3P7J07R5L6n0q7j04p9lP2J20J04M6l6r5j24
5927h0q7PO6J19J01O0l1q5j34r1j4N3J01J22M2lp6j29r0l0N5R1J28N7kp5j00r1
5955a16m2M4R6J06N1J9q9r6r1l8L8Q7J07L9J7n9j09p8j6J8J03R0M7Po8r7q2l0
$$ y = [140, 181, 147, 30, -81, -161, -184, -111, 11, 114, 170, 141, 48, -71, -152, -189, -109, 6, 104, 160, 149, 73, -35, -128, -153, -110, -2, 92, 153, 133, 67, -41, -133, -153, -111, -17, 77, 138, 117, 53, -56, -135, -154, -111, -19, 83, 130, 128, 49, -41, -117, -136, -92, 0, 93, 145, 136, 53, -47, -115, -149, -116, -7, 93, 155, 136, 46, -70, -146, -182, -127, -24, 89, 153, 154, 84, -36, -133, -156, -133, -29, 101, 174, 179, 94, -10, -118, -169, -141, -43, 63, 154, 171, 94, -12, -125, -175, -164, -69, 56, 130, 165, 113, 2, -94, -156, -149, -69, 47, 131, 154, 107, 22, -83, -141, -142, -61, 23, 107, 158, 90, 6, -88, -142, -141, -76, 33, 106, 134, 84, 4, -83, -142, -133, -64, 36, 125, 161, 104, 8, -85, -148, -132, -55, 37, 129, 149, 102, 14, -94, -172, -159, -82, 25, 120, 156, 106, 19, -85, -164, -167, -95, 25, 129, 175, 139, 44, -80, -167, -160, -94, 25, 126, 186, 155, 70, -64, -155, -169, -116, -15, 107, 149, 146, 70, -59, -149, -179, -124, -33, 95, 152, 150, 75, -25, -116, -158, -114, -18, 88, 139, 158, 69, -27, -118, -156, -118, -31, 76, 115, 132, 73, -36, -114, -130, -112, -9, 81, 128, 135, 67, -30, -112, -142]
5983a42L2R8R3N8Rp7r5j10j2L3R8R2Q1j4o2j25q0m6L6R8J06R0po2j09r9m5J9J07
6012c5J12P7K9n4j23j08p3J7Q9J09R1L5n5j00j18m9jO7J23Q6O1o0q6r8q2J1N6
6039g9J02R8L1k0q6j08p2j5Q0Q2J01K3m0o3j03p1mO4J01P2M0k3q2r0o6JM8J09
6067C0Q1M6l1r8q8q3JO7J09P7M5m1r1r3q3jN4J05J10M9l4r0j09q2k9P0J26Q9N5
6096A61rr5j13q4k6N4J07R9O4oq8j15q5n6N1J10R8R1pp9r9r5m4L0J02J00Q9Ln4
6125A04j04r4n4K3R7Q0Q5Mn9r9p9m4K1P7J02N8Jm1r3r1l7K7Q0R9N8J8n5q6j00
6154a02k1J3Q1R7P0Rn6j12q9m1K2P7J09P5J0m4j09r8n5K5Q3J19P6K6n5j08r7p2
6182a67M1O9R7J03K8m2j03j03r0QP8J07R1L9l6q6j12p7j0P5R9R3N9k2r5j10q0
$$ y = [-142, -110, -12, 81, 139, 148, 71, -24, -134, -146, -113, -15, 77, 158, 144, 82, -43, -123, -169, -133, -35, 71, 161, 154, 92, -17, -116, -161, -142, -35, 77, 154, 183, 129, 6, -102, -175, -158, -69, 40, 131, 166, 111, 11, -107, -156, -157, -90, 33, 119, 180, 120, 34, -64, -146, -135, -79, 23, 121, 152, 132, 46, -62, -134, -149, -69, 13, 114, 137, 97, 34, -69, -140, -144, -80, 21, 93, 133, 110, 28, -62, -128, -127, -79, 30, 111, 157, 126, 28, -60, -143, -142, -75, 34, 111, 156, 115, 24, -69, -152, -153, -99, 6, 116, 165, 131, 41, -68, -150, -179, -109, 17, 106, 161, 152, 57, -56, -140, -166, -112, -5, 94, 158, 152, 64, -51, -136, -192, -141, -31, 67, 158, 151, 72, -27, -122, -166, -136, -34, 66, 155, 158, 104, 0, -94, -148, -125, -28, 52, 137, 141, 82, -17, -96, -140, -119, -42, 60, 118, 119, 78, -15, -106, -143, -116, -36, 63, 121, 139, 84, -2, -102, -123, -110, -29, 68, 138, 147, 91, -21, -110, -151, -129, -52, 57, 132, 142, 98, -11, -109, -164, -139, -56, 63, 139, 165, 110, 2, -95, -167, -126, -57, 40, 143, 171, 129, 26, -77, -167, -159, -81, 26, 117, 156, 120, 34, -78, -155, -165, -90, 9, 102, 161, 139, 44, -66, -146]
6209a46LN1J04R3M2k3o9j04o9k9N1Q5J10M8l1q4r6o4k3O6Q0R4M6k1p1r6p5k4O8
6238h4J04Q3L7oq6j03p3k4M8J11Q3N6j5q2j08q2k1N7J00J08N6k2p6j21p9k7M8
6265a18R4J17O8jr0r3r6n5L5R1J41N9Np0j21q4m9K5R3J08P1K6o9q9j00n4K1Q1
6293e4J12Q2Qn3r0r4n1K1P1J12P5Pn6r7q1n6K4N3R4Q8K5n2q4r5m8QP7J04Q1Jm0
6324I2r9j02l6K5P5J00P5J3l7q7j16m1nP9J14Q9K5n0j04j04n9mR2J10R7K7m2r4
6352C3j10o8oP4J07Q5M8j0r8j05r4j1O2J04R5N1k4q5j10q2j8N7R8Q6P0k1o2j12
6380d6p7j1M1R6P5O9j0p3j08o7l9N3Q6R1M4oo0j00p9l1M4J02P6O2kq3q5p8j6M5
6410h7Q5R7M8Kq0j03o9m2M5R4R0P4j1p6j01r3l4L6J03R4P4Ro9j08j03k9K2J11
$$ y = [-146, -143, -92, 12, 105, 147, 124, 55, -49, -118, -147, -96, -11, 99, 147, 116, 32, -64, -128, -151, -85, -5, 89, 135, 114, 43, -53, -128, -152, -84, 20, 103, 140, 134, 48, -55, -128, -152, -104, 7, 90, 146, 131, 49, -59, -141, -162, -105, -5, 103, 159, 137, 61, -60, -139, -166, -118, -24, 93, 161, 160, 70, -23, -119, -174, -139, -48, 93, 152, 157, 87, -34, -118, -167, -142, -49, 59, 130, 156, 87, -2, -102, -156, -135, -54, 58, 140, 148, 95, 5, -89, -140, -119, -48, 64, 139, 146, 90, -7, -88, -144, -120, -67, 27, 115, 140, 88, 4, -91, -139, -131, -54, 50, 131, 132, 92, -7, -109, -145, -120, -45, 55, 130, 143, 106, 19, -97, -138, -143, -64, 50, 139, 164, 114, 10, -94, -153, -157, -65, 45, 142, 169, 127, 33, -77, -145, -151, -77, 30, 115, 163, 153, 55, -50, -144, -155, -93, 11, 106, 157, 133, 48, -62, -144, -162, -105, -7, 79, 149, 128, 66, -46, -123, -134, -93, 3, 78, 147, 137, 64, -44, -111, -150, -97, -11, 80, 124, 118, 58, -42, -121, -152, -108, -6, 70, 132, 130, 47, -38, -116, -132, -87, -2, 95, 143, 145, 65, -38, -107, -149, -104, -10, 80, 154, 143, 67, -34, -127, -161, -125, -22, 72, 146, 155, 86, -22, -125, -154, -132, -21]
6438b1J00P7Ln2j18r4m8K0Q5J08Q4K0m5j31q6o1J1Q3J16O6L9n4r4r7n2J2P8P3
6466B2J09K5m5r9q8n6KP6R4O9K4l6q8q1o0kO9R0Q2L1m1p8j00m9kP3R3R1K5m1r0
6497A9r9m5oP5R2Q7L2m1r6r5o6j3P8J04Q9M2m2r4r0p3j7P2Q8J16M8l4p9j02r5
6526a45JM2J03J16N1k1q6j07p3l8N0R2J10N4j3n7j05r9k9M8Q9R8N4K0q5j06p1
6553a07k3K5Q5J03O6j5n0j07p8l1K8P9R1O3on7r4o8m4M5P2Q5N9J3n2j00p3m3L4
6582a00P7J03M2K0n8j04r6k5KR5J07Q6Mp0j15q9l5K8J06P6Q7K0p0r8q6o3J6Q6
6610e4J17Q0K4m8r4j12o3J5O3J17Q1K4k7r9j13o3J0O2J11P6M7m2q4j05n9j0P0
6637g6R0Q5M6l5o9j03n7j1O2Q5O8M5k1p9r2o9MM5Q6Q9M0k3p0r9n0pN2Q7Q3M2j6
$$ y = [-21, 79, 156, 159, 107, -11, -105, -153, -133, -48, 60, 144, 164, 119, -12, -98, -159, -148, -65, 51, 117, 156, 102, 8, -89, -141, -129, -51, 22, 131, 156, 111, 12, -76, -132, -130, -54, 40, 109, 133, 97, 9, -72, -132, -134, -65, 25, 107, 138, 97, 19, -81, -130, -132, -59, 34, 125, 150, 109, 19, -80, -125, -131, -56, 36, 123, 155, 114, 18, -77, -143, -156, -78, 26, 115, 157, 115, 21, -69, -142, -159, -87, 1, 117, 165, 131, 52, -50, -145, -144, -102, 1, 117, 168, 147, 61, -46, -119, -157, -107, -15, 95, 149, 136, 79, -26, -125, -154, -106, -17, 81, 135, 155, 70, -36, -107, -130, -105, -20, 83, 149, 134, 84, -23, -101, -132, -104, -25, 66, 129, 123, 66, -28, -96, -140, -95, -23, 62, 121, 134, 82, -18, -91, -134, -100, -23, 80, 122, 142, 84, -20, -116, -141, -139, -44, 63, 149, 153, 83, -32, -121, -156, -128, -22, 54, 141, 161, 91, -7, -93, -156, -140, -54, 63, 143, 167, 119, 25, -87, -150, -135, -72, 45, 126, 150, 123, 24, -89, -152, -142, -80, 31, 107, 154, 112, 28, -77, -136, -146, -76, 14, 99, 145, 110, 41, -62, -119, -130, -68, 17, 85, 130, 109, 30, -62, -131, -127, -82, 4, 93, 133, 110, 40, -59, -109, -116, -64, 23, 106, 148, 132]
6668A32r5r5n8k6O5J04Q2L8k2p6j08p6k1P3Q5J00N3l8p3j08o2k7N0J00R5O0j3
6695A39p7j09q0k6L8J04J07N7lp7j06r1k3K6Q1J09O1J3o3r6p1m9PR9Q9P2J0o6
6723G5p9q5m1J6P8R5O4Pm4q9q2o0K5P8R5O1J0m1j10o4m3K0P6P9P2K2n3j02n6o3
6753a39K9P5R7O5K2n7r1q7m9J5P9Q9Q5J6n7q8r3o4J4Q0J06P7L8m1j05q4p8%Q1
6782f5R8Q7M4l7r5j00o8lO1Q8R9M2l5p9r8o2j6M6R4R6N5k7o1j12p0j3L5R9Q5N4
6812A42k0p6r7n8j1L4R4Q7K5mo9r2p5j1L3R3Q6M1j5o2j00o4kM0R1P2O0j0p4r6
6842c8p7k0M5R2P3N8%q3r7o9l9M5Q7J09N9j3o3j07q0l5K8J01R8O7Mn6j02r5m3
6871a51L8P2R7Q3Qo9p9r8o3K9P6J10O1K5p0p5q0m9RQ1Q7P6J7m0r0p9m8lQ3R0O6
$$ y = [132, 37, -58, -116, -142, -77, 27, 109, 147, 125, 49, -59, -135, -156, -83, 2, 102, 155, 117, 44, -64, -126, -153, -103, -3, 92, 152, 139, 62, -47, -127, -153, -115, -11, 96, 153, 150, 73, -33, -124, -147, -121, -40, 69, 130, 143, 80, -16, -87, -136, -129, -30, 59, 131, 141, 75, -4, -89, -130, -114, -36, 59, 123, 130, 86, -3, -85, -145, -120, -42, 53, 114, 124, 83, -27, -91, -134, -114, -38, 41, 113, 135, 82, -20, -76, -139, -110, -35, 62, 127, 149, 92, 1, -86, -135, -120, -41, 48, 133, 149, 92, 4, -89, -153, -139, -59, 47, 124, 162, 121, 16, -68, -146, -146, -65, 33, 120, 164, 127, 32, -68, -136, -139, -78, 10, 109, 151, 116, 37, -61, -123, -139, -93, 1, 97, 152, 125, 64, -48, -118, -131, -96, 3, 88, 142, 122, 46, -51, -109, -120, -86, 8, 95, 120, 116, 47, -45, -120, -131, -98, -5, 81, 122, 107, 45, -55, -119, -121, -81, 10, 82, 142, 132, 58, -38, -115, -135, -90, 2, 75, 133, 133, 50, -47, -116, -155, -110, -23, 86, 145, 132, 69, -38, -118, -153, -125, -24, 74, 141, 145, 89, -13, -108, -151, -113, -41, 56, 139, 147, 78, -1, -99, -162, -133, -57, 53, 114, 139, 69, -6, -86, -135, -126, -45, 42, 118, 135, 95, 5, -74, -122, -125, -42, 48, 114]
6902A14K3m5p8r4m6NP6R1N8L0m7q8p8m8J3P4P6P5K1k8r7r3m1mQ4Q5P8K2l3p3j11
6933g9o2PN4J09Q7K8k6r4r7o8kO8R9P6O1l8p7j05o8j1O6Q6Q6N7k8q2j00p3l6O5
6963i7J01Q0N4j0p0r8q8mL0R0Q9O8j1p9r5o7j7L2P7Q5N4Ro7j05n4m4L9Q6P6N1
6993A15Jo0r4o6l0L1Q5Q5O3j5n2r2p8k1K8Q5Q0N2J1o7q4q1m3L6Q4R9N9Qo6q8r8
7024a13l9L9P4J00P2Rn7q7j03m5K8Q4J02O8J7m9j01q6n2K0P0Q5P8L1m7r0r1n2
7052a35%P3Q5R1K1l8r3q0l9oP8O1Q3L1k9p7j00n3J0M6R5P8K6l6o4r3n8OM9J04
7082C6O4K4j9q9q9n2KN6Q3Q2J7k1n7r5n9kN0R3Q0L3k2p3j06p2J9L5Q2R3M5j9q5
7113C4r8o3j1M3R7R4L3mn7j16o4l1M3R2R3N1kp5j02n7k9K5Q6Q0O3Jo2p6p9m4L7
$$ y = [114, 137, 92, 14, -80, -126, -121, -45, 46, 104, 134, 87, -1, -79, -127, -114, -40, 36, 111, 132, 104, 7, -86, -127, -131, -47, 38, 116, 138, 105, 32, -79, -141, -134, -80, 29, 116, 144, 118, 24, -73, -141, -143, -75, 24, 100, 161, 123, 46, -59, -127, -138, -72, 14, 100, 157, 129, 47, -53, -126, -162, -97, 4, 84, 138, 128, 58, -40, -128, -132, -102, -12, 77, 145, 134, 55, -40, -107, -124, -92, -15, 70, 124, 133, 66, -39, -93, -137, -98, -12, 64, 115, 116, 56, -38, -104, -134, -103, -18, 67, 130, 115, 63, -29, -107, -128, -100, -15, 65, 117, 128, 61, -23, -104, -147, -111, -27, 72, 131, 139, 73, -15, -113, -152, -113, -39, 61, 133, 142, 85, -2, -105, -150, -122, -38, 64, 132, 149, 100, -1, -87, -139, -119, -49, 36, 114, 145, 98, 8, -83, -135, -135, -62, 23, 114, 135, 97, 4, -76, -115, -121, -43, 18, 101, 132, 103, 26, -74, -127, -117, -71, 24, 102, 128, 92, 28, -65, -123, -117, -68, 36, 100, 124, 105, 16, -73, -125, -123, -67, 16, 98, 115, 94, 37, -58, -117, -119, -69, 24, 104, 137, 115, 42, -64, -136, -117, -82, 0, 93, 138, 119, 34, -64, -127, -138, -95, 2, 96, 129, 125, 68, -48, -112, -143, -100, -8, 85, 136, 134, 59, -43, -100, -129, -104, -18, 62, 125, 126, 64, -12, -91, -135, -98]
7144i8P5Q3O2lm9r0p8l3K4P3R4O3Jn2q0p5l3OP9J03L5J0m7q1q2l1J9P2Q0O3Mn7
7176E7n9r0m0L2P6Q6N6Nl9q2j02l7K2P9Q8N8Mk9q8q9m6J2N9J11O9J9m2p4r4n8
7206a36J6N2J08O9K8m4q1p6n6rN0Q7R1L3l0q5q4n2j6O1Q3Q3L0j6o9p7o9j4N1P6
7236DP5L8j7o1q2o4JL8P7P3K8lp8p9n7lL6P4P1L7j0o0q1o9pN0P5Q0M2j1p6q1p4
7269a14pL4Q1P1Q0k4q1p1r0j6N7P7Q2M6j1n6q7p2k6K3P7R1N9No4q7q3k8K8O2R3
7300D9O6Mm9r1p8k6RP1R2N3J7o1o0p9l3J2N4Q0N1L8m6o7p9m3J7N4Q8O2K9o0o5
7331Iq4m2K5N3R3M5Ok8q7o9n5K5O2Q7O2J6m3q1p0n1J5N4J10N4J5m4q4o3n9J0O5
7362e4Q0N9K7k3o7r3n1j1O6Q8O7L8j9o9r9o2PM5Q5P8J7rn8r3o2j6M2R2O5M9k2
$$ y = [-98, -23, 60, 122, 119, 70, -20, -98, -131, -107, -34, 60, 123, 124, 72, -8, -83, -116, -110, -31, 72, 107, 117, 70, -11, -93, -124, -105, -33, 47, 110, 114, 57, -2, -92, -132, -100, -24, 62, 118, 123, 84, 2, -100, -137, -115, -36, 52, 110, 114, 85, -3, -92, -138, -126, -67, 44, 113, 132, 90, 16, -78, -136, -120, -68, 40, 109, 137, 93, 12, -64, -120, -129, -79, 8, 99, 132, 102, 17, -67, -119, -135, -74, 9, 92, 122, 106, 37, -40, -109, -123, -72, 4, 79, 117, 100, 39, -43, -107, -106, -68, 9, 82, 110, 107, 29, -50, -107, -110, -74, 0, 71, 108, 98, 38, -43, -112, -119, -69, 6, 86, 128, 117, 41, -40, -114, -121, -87, -6, 65, 145, 121, 40, -31, -121, -137, -80, -3, 79, 125, 114, 58, -29, -101, -127, -104, -27, 64, 123, 128, 64, -23, -106, -134, -106, -44, 49, 115, 119, 70, -21, -99, -125, -116, -45, 47, 100, 117, 56, -4, -83, -116, -104, -50, 30, 81, 119, 73, 6, -73, -116, -99, -45, 43, 105, 134, 74, 9, -75, -117, -92, -39, 54, 99, 105, 77, -10, -79, -134, -109, -47, 40, 102, 118, 75, -6, -76, -127, -112, -58, 52, 106, 121, 77, -7, -70, -129, -119, -54, 26, 85, 112, 89, 22, -71, -122, -133, -67, 21, 88, 126, 107, 38, -61, -123, -116, -71, 14, 92, 109, 100, 42, -51, -113, -129, -87, 5, 70, 119, 97]
7393I7n7q7n5k1M4O3Q8M3j9n1q3o6j5M1N9R6L6j5m5r0o4j0L4O0P8M3k5l5q6n1
7423i3l0L3O8P7N5j6n3p1o3k3L7O1R4K8Jl9r4o1l3L1P5P8N9j0n4q7o2m5K6P8R7
7454F4M9Ol9j09o7l8L2O2R2N8Nl4p8p4m4QN4P8O6K6m1q1q1m8J9N8Q1N9K3l7o6
7485Cq0m8K0O3O8N3K4k6p8n3n6J4M6P2N6L5m3o6o7n0PN0P1O3K3l1n4q4n4J3N2
7516e7P5O3K9k5p4q0l7pN0P9O0L8k4q0o8o7RL6Q2P0L8l0n5p5p1pM2Q6O5N1j7m8
7548E1j02o2j2L7Q3O5N3Jo9p7o6j8K9Q3O4L2J9n3q3o8k2K2O5Q2M2jn4n4o3k3K6
7579g3N4P9L7mm6o3p3k4K9N4Q0N0Kn2o2q0k0K4N0Q3N8om1p7o7k9K4O2Q9K8L0o6
7611E0o4p1l5QP1Q1O9Rm9q2o7l8OP5O4O1J9k7o8q4k8lN2Q2O6K6k7q4p4n0J5M3
$$ y = [97, 40, -47, -102, -123, -79, -16, 72, 115, 96, 45, -38, -104, -119, -78, -19, 77, 113, 98, 53, -37, -101, -111, -77, -17, 61, 104, 79, 44, -42, -93, -123, -90, -22, 55, 110, 94, 41, -30, -93, -116, -79, -18, 76, 104, 105, 66, -28, -89, -122, -91, -16, 62, 121, 111, 57, -30, -92, -137, -111, -33, 64, 113, 119, 80, -29, -96, -134, -102, -40, 52, 110, 115, 81, 3, -71, -115, -107, -53, 25, 91, 117, 76, -5, -86, -134, -115, -57, 24, 83, 106, 69, 3, -77, -125, -105, -42, 26, 79, 103, 77, -1, -54, -110, -96, -50, 22, 78, 113, 70, 4, -63, -113, -106, -56, 15, 78, 101, 70, 16, -68, -122, -109, -57, 18, 81, 110, 85, 11, -69, -106, -113, -63, 16, 76, 114, 90, 10, -58, -125, -116, -80, 2, 72, 110, 80, 25, -50, -121, -128, -86, 0, 65, 116, 99, 51, -51, -113, -125, -88, -5, 60, 113, 114, 45, -32, -98, -116, -87, -4, 60, 92, 111, 58, -25, -93, -115, -93, -28, 54, 96, 95, 41, -13, -76, -99, -73, -19, 60, 97, 93, 47, -16, -89, -113, -84, -30, 50, 100, 102, 50, -12, -92, -112, -88, -38, 45, 103, 97, 56, -21, -88, -117, -93, -31, 58, 86, 116, 50, -14, -85, -120, -112, -41, 40, 109, 118, 69, -13, -80, -118, -112, -37, 27, 88, 107, 80, 12, -72, -100, -103, -51, 31, 97, 123, 96, 12, -62, -112, -97, -54]
7643e4P9N9J5j6p2o3o4NL7P8N6M8l2n6o3o5rN4O4P1K8j6o0o8n5nM6O5N2L6j3p9
7675Cm8n2j3M2O5O4L8j6o5o3n4j5L8Q7O0L3k5m9p3m1k3L8O3Q2L7j7n8q0o1j4L8
7706g9O1P6M8kp2n9p4j2L3N8P7O2j1n5p2o7l9L0P9O1M3J7m8p1n8m4L4M0P7N6J6
7737A05m7p2o0l6K4O2O7M9pk5o6p9k5K0O1P1L4K8m1o2o9k4J4M6P4L8J5l0p2o2
7767f9l7ON6P2N7Rl7o2n7l6NM8P4O2J0m0o8o1n5J5O4O1Q6j0k4o0p5m6J3L0O7P8
7799G6K4k4m9r0m4JN1O5O0L7k4o3o0n9j9N7O2O3L3k0m2p2n7qK7O6O4L7rn0o7n7
7831i1mM5N2M8L8rl9p5m7qK4O7N1M5j3n2o2n4l1L7O6O7K5Qn5p1m5j8L2N4P0L0
7863H5Ol3p8n9k1K4N2O9L9K5n8p2o6k0J4O3O2N0J1m2o6p0k9K4N5P3O1kl9o8n2
$$ y = [-54, 25, 84, 99, 83, 11, -52, -116, -111, -74, 4, 60, 108, 76, 20, -43, -108, -117, -63, 1, 72, 100, 84, 24, -44, -99, -104, -58, 7, 59, 95, 82, 3, -45, -97, -110, -68, -3, 61, 99, 83, 18, -45, -99, -114, -76, 11, 71, 104, 79, 30, -43, -84, -107, -69, -6, 76, 113, 96, 38, -42, -103, -117, -79, -18, 58, 106, 104, 32, -27, -101, -113, -80, -22, 55, 117, 106, 51, -21, -88, -127, -97, -18, 43, 86, 103, 55, -16, -74, -118, -84, -44, 33, 89, 105, 58, -14, -74, -110, -86, -24, 43, 92, 85, 60, -6, -85, -110, -90, -29, 42, 76, 104, 63, 1, -68, -92, -78, -32, 42, 80, 95, 65, -7, -69, -106, -100, -44, 28, 85, 94, 57, -5, -62, -98, -93, -45, 29, 91, 101, 61, -7, -68, -123, -108, -44, 17, 103, 93, 69, 9, -66, -112, -99, -69, -2, 76, 100, 76, 27, -63, -107, -106, -55, 10, 70, 107, 83, 20, -40, -99, -118, -61, 1, 64, 97, 77, 35, -37, -94, -102, -75, -9, 55, 92, 83, 33, -34, -91, -95, -50, 2, 50, 88, 79, 40, -35, -82, -90, -66, 1, 52, 97, 84, 32, -30, -84, -115, -78, -12, 55, 80, 88, 33, -38, -83, -101, -69, -15, 55, 85, 91, 58, -20, -79, -100, -76, -24, 45, 84, 109, 51, -21, -87, -107, -93, -30, 32, 82, 93, 51, -15, -85, -114, -90, -35, 38, 99, 97, 58, -10, -62]
7894f2l3nN1Q4M9Qk7o5o7m6K4L2P3M0L6m0n8n6l6J5L6O2N5J8k5o9m7m2K1M0N7
7925B3N0J5k0o6n8k8kL9N6N4K1k7m9o2l3KK8P5M6K3k5o1n3m8jM5N8P9J3j0p5o7
7957e8m0qM4O5M8L2mo1n6n1qK4O5O7K9nn7o3m9j5K8M8P1L6Nm0p0n7j4J6N0P8L1
7990H1Nm6o6m4l9K6O3O6K4%k7n7o4j7K8N5N5M4j3l4n8n1k5K4L4O5M8%k8q5m5j8
8022i9L1M2N6M9j3k7n7n8k6K1N1O7M5%l1n5o0l6J3N1P3L6J9l9n0p5j9pN3O9M9
8053G3J3k2n6p0l8J3M3O3M6K2j4o2o5l9JM2O5M6L1l5l5p7l9QL0N7N9K1k2n4m6
8084d1k9k1M9M2N8J8j9k5p2n1J6K8N3M5M3k6m9o0m6j2L7O4M1L4k2m6n7l7nL3O2
8115EM0K8ol7p4l7j8L9N7N3M3j2n3n3n3j5K5N3M7M3Km1q0k9j8L0K6O0N2%m2o2
$$ y = [-62, -95, -100, -49, 35, 84, 92, 65, 0, -67, -113, -89, -57, 16, 56, 92, 52, -6, -62, -98, -83, -47, 15, 70, 88, 63, -6, -53, -95, -74, -34, 23, 73, 88, 68, 2, -56, -84, -86, -47, 9, 63, 84, 57, 8, -54, -87, -85, -57, 18, 64, 87, 62, 1, -52, -100, -101, -56, 2, 81, 94, 84, 9, -58, -98, -106, -62, 3, 51, 83, 79, 18, -38, -89, -97, -73, -8, 59, 88, 83, 26, -37, -86, -101, -73, -25, 46, 82, 87, 47, -23, -80, -94, -78, -28, 50, 81, 86, 40, -26, -70, -109, -83, -20, 46, 70, 70, 43, -14, -78, -95, -67, -12, 43, 87, 74, 40, -18, -69, -94, -70, -36, 29, 77, 77, 49, -36, -81, -99, -68, -26, 30, 79, 66, 39, -18, -76, -102, -81, -30, 37, 82, 82, 51, -4, -64, -100, -87, -36, 37, 73, 92, 53, 3, -72, -91, -98, -45, 24, 73, 86, 64, 8, -62, -100, -87, -44, 19, 65, 87, 73, 11, -54, -93, -92, -50, 15, 61, 92, 57, 22, -55, -94, -86, -56, 1, 60, 81, 59, 5, -41, -70, -91, -42, 0, 58, 76, 57, 32, -40, -91, -75, -47, 6, 51, 94, 68, 19, -41, -87, -99, -62, 2, 43, 77, 55, 9, -48, -85, -90, -57, 5, 45, 73, 67, 30, -44, -81, -99, -60, -3, 50, 93, 81, 28, -25, -78, -93, -68, -15, 32, 75, 77, 36, -44, -73, -91, -61, -35, 25, 77, 77, 35, -27]
8147b7m6k9K5M6O2M2Mk8n9o0j3KM5O8L5Rk9n9o0k7J3N1O0M5qk0m1n4l0J1M1O9
8179C8L6ok2n1m5l3%M5N6K6K4k9
$$ y = [-27, -73, -102, -77, -31, 31, 73, 77, 49, -10, -70, -83, -81, -36, 32, 67, 76, 47, -12, -72, -99, -86, -35, 25, 70, 62, 42, 1, -53, -83, -72, -31, 38, 74, 68, 46, -5, -50, -83, -83, -38, 18, 44, 68, 39]
8191C9
$$ Imaginary data points
##PAGE= N=2
##DATA TABLE= (X++(I..I)), XYDATA
0@%%%%%%%%%%%%%%%%%%%%%%%%%%kQj4J6j6J6j6J6j6J7k1K6l0L2l3L8m3M6n2N8
46C0o3P1q1R0j02J17j33J53j78K11k61L40m78P99k973j489M328K153J363o81j487
67A729k915k440r83J605K922L027J423j99j797k516k526j142P68K516K736J619
83C827j74j684k675k448j045Q75K122K352J656L78j313k530k361o95J134K143
99d38K144J519M00j173k411k392q74J061K186K011J114%j223k348k460j107R44
116c047K309K260J262Mj279k291k284r46R28K365K608J716J77j417k433k341j065
133c474O97K117K571J860L11j411k683k698j317N22J916K445J978P31j046k523
149dk702j450M28J887K503K175J023o78k172k598j653Q9J666K353K025R23o30
$$ y = [0, 0, 0, 0, 0, 0, 0, 0, 0, 0, 0, 0, 0, 0, 0, 0, 0, 0, 0, 0, 0, 0, 0, 0, 0, 0, 0, -2, 6, -8, 8, -8, 8, -8, 8, -8, 9, -12, 14, -16, 16, -17, 21, -22, 24, -28, 30, -33, 38, -43, 47, -55, 62, -71, 82, -96, 115, -146, 194, -284, 515, -2458, -3947, 381, 2534, 3897, 3216, 1729, -1186, -3626, -4609, -3004, -82, 2945, 4368, 4169, 2372, -144, -2670, -3812, -3044, -528, 2208, 3827, 3653, 1969, -706, -3154, -4199, -3324, -1202, 1150, 2806, 3184, 1871, -659, -3020, -3715, -2581, -438, 1706, 3225, 3625, 2452, 41, -2351, -3225, -2164, 22, 2033, 3147, 3147, 1924, -424, -2884, -3991, -3047, -738, 1522, 2784, 2788, 1509, -782, -3066, -4012, -3084, -719, 1889, 3605, 3782, 2365, -68, -2409, -3474, -2777, -660, 1911, 3771, 4082, 2671, -12, -2710, -4027, -3505, -1589, 856, 2834, 3565, 2519, -4, -2706, -4156, -3728, -1841, 662, 2837, 3860, 3182, 1010, -1588, -3241, -3152, -1486, 867, 2892, 3815, 3185]
166C185j997k536j796k22J295K116J935R58n39j813k234j538j70J218K072K014
182A948J056m21j644k038j375q8J185J946J847R07n17j760k182j480j53J165J877
199B73J726Q11n48j820k212j476r9J298K093J982R70m40j715k150j535k00J288
216a754K226K122J093m45j767k335j810n39J026K093K161J199l15j718k369j967
232c099o45Q89K020K288J500M2j408k176j892p54P22J914K251J571K04j227k060
249A40j989r86M35J621K012J435K03j115j967j902j005L49J497J929J458L27r31
266A511j701j672q34M29J502J897J417K76r12j673j669q55L53J400J760J258J64
283B651j045j827j765q98L83J453J848J358K41r85j802j727q66M52J598K034J553
$$ y = [3185, 1188, -1348, -3144, -3366, -2071, 45, 1980, 2938, 2399, 586, -1648, -3186, -3356, -2138, -66, 1948, 3004, 2583, 939, -1099, -2474, -2562, -1377, 569, 2416, 3323, 2806, 1046, -1136, -2616, -2769, -1604, 273, 1999, 2810, 2262, 442, -1770, -3246, -3345, -2047, 46, 2028, 2998, 2558, 843, -1307, -2842, -3042, -1754, 472, 2594, 3687, 3242, 1475, -860, -2670, -3209, -2183, -90, 2071, 3270, 2955, 1237, -1132, -3099, -3744, -2855, -835, 1453, 2953, 2995, 1587, -589, -2481, -3235, -2513, -599, 1652, 3223, 3427, 2200, 140, -1849, -2835, -2400, -779, 1233, 2668, 2871, 1756, -211, -2113, -3118, -2769, -1272, 657, 2115, 2442, 1511, -190, -1862, -2696, -2267, -765, 1132, 2549, 2825, 1913, 240, -1429, -2284, -1931, -531, 1229, 2487, 2651, 1606, -221, -1986, -2884, -2501, -1048, 800, 2158, 2399, 1414, -388, -2115, -2981, -2529, -931, 1103, 2656]
300B656L95r25j824j886j055K59J487K003J609M64r23j896k083j298L3J302K014
317C32J744O69o70j742j992j329o1J222K023J886R09m14j522j917j398k40R95
334a505J808J733Q99l67j427j916j474m08P85J592J638Q77k69j286j697j306l41
351b664Q14J591J635R33j75j163j583j204k70P94J544J525P93k98j264j678j293
368a963l39P60J485J508P68l39j317j705j307l02Q52J654J697R41j90j246j714
385g57j349l62Q40J677J780J050j39j298j862j571o07O10J560J780J131l4j196
402A253j847j655p41N05J502J852J358K45r34j661j604q04L67J398J799J376L59
419B768p98j579j635r49J48J139J589J262L19p35j475j562r06J04J063J539J258
$$ y = [2656, 3051, 2126, 302, -1584, -2639, -2380, -893, 1110, 2719, 3183, 2260, 364, -1719, -3017, -2984, -1682, 332, 2076, 2745, 2075, 333, -1659, -2988, -3049, -1827, 196, 2082, 2991, 2577, 1055, -862, -2260, -2500, -1505, 303, 2036, 2935, 2568, 1141, -775, -2249, -2657, -1872, -280, 1358, 2235, 1966, 680, -1017, -2323, -2664, -1850, -259, 1376, 2309, 2134, 971, -612, -1816, -2086, -1292, 252, 1777, 2570, 2272, 1008, -670, -1963, -2302, -1542, -57, 1451, 2219, 1880, 563, -1142, -2449, -2751, -1899, -245, 1452, 2393, 2203, 957, -757, -2106, -2468, -1628, 49, 1829, 2879, 2740, 1442, -420, -1991, -2598, -1988, -428, 1352, 2483, 2449, 1253, -594, -2249, -2990, -2485, -983, 869, 2227, 2472, 1538, -123, -1727, -2531, -2164, -766, 1033, 2409, 2768, 1970, 391, -1244, -2193, -2045, -906, 683, 1945, 2264, 1529, 54, -1508, -2414, -2310, -1247, 292, 1550]
436A550M22n93j322j371p70J81J101J528J225L83o23j319j404q22J34J052J421
453G73J134K86p36j447j481q62J45J068J525J256L87o58j416j486q47J92J162
470a005J636J410N48n89j441j610j035K2J054J583J425N85n35j459j743j234j78
487b566R14J572J511P60l25j268j633j236k63Q36J577J595R04j56j087j516j256
504a637m13O20J366J488Q85j32j087j507j248m90M36J206J382Q81n0r82j359j108
522a749l79N20J191J379Q92K7q70j326j068l27N54J181J252P94o8r59j407j206
540a569m10N20J171J286P76j21r52j417j195m31N61J332J504R29j0r02j389j230
558a547n04M75J314J529J072O0r45j512j392p02K74J135J511J158J95q26j480
$$ y = [1550, 1972, 1379, 57, -1314, -2084, -1903, -802, 726, 1951, 2334, 1711, 392, -1012, -1834, -1700, -648, 773, 1907, 2193, 1457, 10, -1471, -2333, -2188, -1120, 405, 1661, 2048, 1390, -26, -1512, -2359, -2167, -1005, 631, 2041, 2589, 2000, 559, -1051, -2086, -2064, -1010, 573, 1998, 2583, 2048, 589, -1154, -2388, -2566, -1652, -80, 1431, 2191, 1866, 598, -1035, -2271, -2534, -1698, -121, 1474, 2378, 2222, 1135, -381, -1637, -2050, -1430, -64, 1424, 2309, 2177, 1090, -417, -1665, -2155, -1719, -513, 869, 1750, 1700, 718, -641, -1749, -2128, -1608, -417, 962, 1854, 1881, 1011, -315, -1383, -1710, -1156, 25, 1277, 2071, 2003, 1044, -363, -1569, -1979, -1459, -288, 998, 1774, 1653, 701, -716, -1911, -2342, -1781, -449, 1055, 1984, 1974, 1072, -317, -1547, -2051, -1576, -262, 1267, 2339, 2399, 1454, -58, -1450, -2152, -1878, -743, 768, 1926, 2121, 1295, -185]
575a85j440p74K00J081J534J265M52n76j302j399q04J25R61J452J215M92m62j220
593F15j400r32n2Q02J268J091M34m33j118j307q96p9P87J255J128M61l43r93j171
612h83p51K6P80J255J101M48m10j043j223p84k2P43J175J062L41m59j137j316
630a097q54k4Q20J270J138M99l85j094j325q68kQ53J387J285O10l19j106j384
648e96j061j96P31J317J287O27k55j091j462j180l49N96J231J332Q14l0r17j371
666e73j136l81N17J201J364R37Q0p80j266j161m84L64J048J203Q11Q9p07j255
684a29j169n26K81R10J112Q26J25o33j106j034m15L51R12J154Q46J48o17j053
702a7r99m14L49R28J092P39P5o99j194j131m65L58R22J086P60J24p05j207j117
$$ y = [-185, -1625, -2399, -2199, -1118, 416, 1681, 2133, 1557, 255, -1144, -1948, -1823, -862, 590, 1805, 2297, 1835, 615, -785, -1717, -1769, -967, 301, 1392, 1826, 1393, 275, -1032, -1928, -2007, -1220, 35, 1163, 1624, 1281, 288, -883, -1634, -1608, -828, 427, 1528, 1976, 1566, 523, -700, -1484, -1506, -763, 412, 1474, 1815, 1356, 219, -1097, -1951, -1975, -1155, 115, 1253, 1752, 1367, 273, -1052, -1920, -1922, -1069, 318, 1603, 2213, 1894, 788, -596, -1657, -1853, -1122, 195, 1482, 2109, 1854, 763, -699, -1879, -2228, -1632, -401, 931, 1745, 1715, 798, -573, -1709, -2090, -1573, -372, 992, 1929, 2009, 1229, -37, -1198, -1682, -1318, -270, 933, 1744, 1833, 1126, -129, -1298, -1824, -1543, -633, 479, 1305, 1430, 797, -309, -1343, -1758, -1407, -495, 659, 1505, 1653, 1036, -17, -1016, -1430, -1081, -153, 939, 1678, 1753, 1054, -140, -1271, -1736, -1378, -456, 630, 1390, 1514, 809, -398, -1515]
721a515m79L81J016J258R33K08o01j170j175n92K66J016J281R92K77o03j249j310
739a066p53P9Q41J226J081M10n12j216j268p73J6P39J254J194N73l17j029j200
757g21p71m4O47J123J100N78j87r84j235q49j59N15R43R90N52k21q94j133q15
776a565j12N21R90J002N31j78p73r64p24j00N63J022R91M88k45q33j045p66j39
795a336N06R53R69M84l06r46j136p75j55N38J028J105O03j76r06j137q20j58N89
814a076J097J170P02r6q64j203j005l12M45J012J126P40l6q01j244j113m61L14
832a605R62J209Q47J07o29j086j026n13K45R32J206R03K09n21j007j021n54J09
850a233P62J033Q18J94n16r88r96n72O9O56R68Q10K16m15q88q99m66J52P32R89
$$ y = [-1515, -1994, -1613, -597, 661, 1594, 1802, 1201, 31, -1144, -1736, -1470, -454, 827, 1819, 2096, 1493, 244, -1066, -1819, -1740, -899, 327, 1408, 1818, 1306, 90, -1178, -1951, -1935, -1196, 58, 1252, 1825, 1508, 479, -721, -1492, -1536, -889, 234, 1334, 1912, 1725, 741, -494, -1343, -1502, -987, -44, 946, 1498, 1277, 383, -750, -1565, -1677, -1156, -166, 836, 1367, 1189, 416, -548, -1272, -1372, -809, 213, 1204, 1692, 1447, 614, -431, -1197, -1336, -830, 123, 1092, 1576, 1270, 324, -812, -1587, -1742, -1204, -176, 929, 1532, 1356, 450, -687, -1507, -1665, -1076, 21, 1191, 1893, 1797, 933, -270, -1275, -1587, -1142, -130, 996, 1736, 1700, 899, -345, -1458, -1919, -1605, -643, 566, 1413, 1520, 891, -195, -1221, -1734, -1489, -557, 649, 1552, 1761, 1240, 233, -788, -1342, -1233, -471, 562, 1380, 1574, 1058, 70, -926, -1498, -1429, -773, 195, 1005, 1221, 806, -82, -981, -1447, -1295, -563, 426]
870D26P83K54m07q65q85m89J55P24R47P29J52n04r43r98n55J16P29R84P76J91
890A320m88r55r87n55J29P97J119R19L16l84r31j056o60M5P58J095R53L76l58
909A453r86j161q05j26N97J034J005M85k89q61j094q17j88N43J022J078N99q7
927A402p27j007q01k30M55R02R80N97n1o91j004q53l11L17P86Q77N65q6o28r32
947d40p74k57L59Q11Q78N40rn34q45p03k12L93Q16Q77N16q5o08q87p71k80L52
968h63P79Q57M90j28o65r69p88k69L43Q64R65O30ro23r46p98l17L54R01J034P03
989A545Q7o10j013r35m37K18P79R89P25J40n48j009j008n47J15P43R98Q16K74
1008A322l64q75r35n47Q0O85R84Q29L35k90p87r15o05l2N53Q46P48K59k96p48
$$ y = [426, 1209, 1463, 1056, 191, -694, -1183, -1028, -304, 643, 1372, 1524, 1020, 77, -921, -1476, -1360, -631, 353, 1129, 1320, 832, -123, -1110, -1665, -1536, -739, 380, 1299, 1615, 1231, 300, -756, -1416, -1371, -613, 482, 1435, 1811, 1453, 467, -694, -1499, -1625, -1028, 6, 1011, 1496, 1207, 346, -748, -1565, -1753, -1210, -188, 890, 1489, 1402, 675, -332, -1133, -1363, -908, -6, 974, 1571, 1520, 829, -175, -1028, -1339, -1022, -236, 641, 1206, 1120, 492, -440, -1214, -1471, -1112, -301, 577, 1117, 1108, 574, -271, -974, -1186, -793, 23, 900, 1416, 1331, 723, -164, -935, -1215, -863, -84, 773, 1263, 1135, 470, -499, -1287, -1556, -1213, -349, 616, 1246, 1237, 614, -332, -1130, -1447, -1093, -192, 842, 1545, 1632, 1022, 9, -926, -1363, -1145, -366, 623, 1348, 1488, 940, -69, -1077, -1624, -1509, -766, 232, 1048, 1322, 958, 83, -852, -1399, -1319, -634, 350, 1179, 1514, 1224, 437, -478, -1083, -1115, -562, 284, 1032, 1291, 995, 247]
1028B47q99n85n9M92Q08P19K88k46o82p70m94K3N47Q44P21K94k53o67p77n14K5
1049i38N37Q08O76K20l31p74q75n56j1N14Q44P48K72k86p61q85n72j6N84R35Q76
1070A009L88k06p22r06o73q8M99R22Q62M48j93p32j004p94k40M00Q30Q78N11p2
1090A117o44r35p66k65L46Q14R15O22M8m93q47p45l08K72P30Q32N65M5m80q12
1110A1p77l71J77O26P36N10M5m56p36p14k99K08O38P82N38Q3m18o76o47k53K61
1131g32O56P41N10K8m52p75p05l23J96O45P41M99Jn12p95p63l26K15O98Q42O12
1152A001J19m36p84p66l75K19P14Q74O90J64m03q04q59n03N0O06Q51O87K18l60
1172I03p91q83n68jN16Q42P64L32k07o65q00n39l9M70Q17P54L86j55o13p74n91
$$ y = [247, -652, -1237, -1296, -804, 4, 723, 1011, 765, 83, -687, -1181, -1158, -611, 233, 954, 1248, 995, 328, -449, -963, -938, -401, 407, 1083, 1303, 972, 198, -677, -1233, -1244, -730, 114, 862, 1134, 848, 87, -798, -1370, -1386, -802, 133, 1009, 1397, 1191, 469, -437, -1110, -1198, -699, 223, 1085, 1533, 1340, 608, -396, -1190, -1430, -1030, -200, 678, 1189, 1117, 473, -462, -1228, -1493, -1147, -333, 582, 1204, 1252, 759, -88, -833, -1141, -869, -139, 693, 1258, 1303, 823, 11, -766, -1137, -960, -334, 402, 912, 957, 501, -235, -949, -1248, -1040, -402, 380, 918, 1001, 583, -93, -740, -993, -732, -76, 665, 1175, 1203, 751, -24, -729, -1052, -856, -211, 530, 1029, 1030, 518, -277, -1040, -1366, -1151, -453, 389, 1001, 1120, 684, -100, -866, -1241, -1022, -308, 566, 1256, 1420, 1017, 213, -646, -1149, -1099, -493, 358, 1045, 1263, 903, 112, -771, -1339, -1340, -824, 18, 782, 1114, 907, 242, -558, -1097, -1136, -666, 151, 905, 1291, 1136, 523, -251, -842]
1193h42j16L85O83O43L25j68n84p57o01j01L58O62O13L39j27n20o56m91o7M11
1213f11P05O58L40j65n17o74n08r2L83P03O27K70k27n92p72n56j27L80P07P03
1233F35L55j67o00p78n54j09M19P71P78M73p4n43q11o41j94L24P30P62M73k0n30
1254F99q58p61l13K38O35P57N33O0m28p64p09l50J98O47P83N85J33l31o36o66
1274e48l87J31N64P02N25J28l61o36o70l80M3M59O38N06J10l31o18o07l06J07
1294i31M95O55N33J45k94n83n67k79J46N26O40M82R8l26o41o72l60J16N10O40
1314C33M82J08l60o67o85l98J00N49P52O13J81l15o18o73m03M9N25P78O51K30
1334A232k45o30p76n04o7M02O86O63K92k11o21p60n42j04L64O68O88L86p8m97
$$ y = [-842, -958, -573, 110, 753, 1078, 910, 326, -431, -1032, -1133, -775, -113, 500, 839, 712, 192, -464, -955, -1022, -611, 94, 752, 1092, 927, 410, -264, -772, -864, -481, 222, 849, 1119, 892, 300, -472, -1028, -1155, -775, -68, 635, 990, 823, 223, -555, -1109, -1218, -799, -28, 750, 1223, 1149, 606, -205, -846, -1040, -716, 14, 776, 1249, 1229, 699, -159, -920, -1233, -995, -360, 397, 930, 990, 562, -202, -911, -1261, -1063, -416, 367, 952, 1085, 754, 118, -548, -935, -804, -240, 462, 987, 1115, 754, 118, -552, -932, -889, -430, 208, 714, 824, 493, -125, -732, -1038, -931, -436, 219, 752, 897, 603, 20, -547, -826, -680, -154, 486, 968, 1066, 740, 99, -573, -933, -817, -307, 333, 815, 923, 563, -104, -789, -1187, -1087, -538, 214, 827, 1008, 693, 75, -598, -1001, -952, -427, 351, 1002, 1232, 987, 357, -419, -923, -990, -588, 98, 761, 1053, 842, 221, -539, -1081, -1185, -821, -153, 535, 921, 843, 346]
1354C46o79n24j06L35O34O55L87m5m48o41n44j88K55N33N72L16q7m36o15n09j83
1375i72K18N41N88L16m2m08n46m32j29K98N70N94L58p3m33n97m55j45K65N37N76
1396F29L02q5m97o74n31j77K71N53O36L81o3m40o41n45j83K77O26P06M55L7m03
1417F34o41o15k84K04N71O74M69M1l90o81o58l58Q6M79O72N20J27l10n98n91l45
1438i94M9M74O71N47K01k04n27n73l54J7M00N70M86J78k33n23n78l83k2L45N10
1459E7M60J55k10m84n25l15L4L89N59M77J68j94m37n10k99N8L83N74M60J36k20
1480G16n48n86l52J5L74N37M90J42k43n41n92l90LL99O44N62K40j56m95n96m27
1501h04l1L87O23N90K93j22n07o62m97j40K64N35O01L14r2m51o43n08j76K43N48
$$ y = [346, -333, -857, -963, -628, 6, 661, 1048, 1003, 555, -86, -630, -818, -563, -30, 542, 858, 771, 335, -280, -789, -972, -754, -213, 375, 691, 649, 241, -305, -737, -866, -568, 2, 596, 954, 881, 448, -149, -604, -749, -484, 53, 629, 931, 846, 349, -325, -856, -1033, -762, -209, 427, 808, 745, 305, -336, -881, -1064, -787, -161, 545, 1000, 1037, 634, -7, -622, -906, -702, -131, 543, 1012, 1053, 663, -18, -676, -1034, -948, -469, 203, 723, 850, 540, -58, -649, -994, -945, -471, 200, 747, 948, 744, 217, -356, -710, -693, -293, 277, 763, 941, 708, 185, -393, -776, -798, -453, 57, 517, 672, 462, -22, -547, -862, -828, -439, 120, 597, 765, 571, 134, -376, -675, -617, -234, 340, 800, 936, 716, 168, -418, -770, -755, -381, 156, 646, 788, 545, 4, -588, -978, -975, -576, 68, 630, 870, 714, 219, -377, -804, -835, -448, 175, 765, 1058, 936, 429, -233, -730, -870, -606, -71, 530, 844, 752, 301, -342, -850, -1026, -783, -235]
1522b35N93L56K2l35n47m85j66K17M97N57L70L8l41n19m72k20J33M20M81L10q
1543F66l38n04m59j95J56M12M92L42K9l15m63m08j35K16M54N04L42pl26n05m35
1564d77j65J64M38M97L19k8l72n60n10k20J75M60N51L74M6l19n60m92k23J77M74
1585b51O16M62J14k88n46n36k92N5M27N70M62J19k66n55n77l75jL63N39M75K05
1606G20j78m71n33l44J0L30N23N11K41j05m13m86l40n7K86M68M33J76j44m00m77
1627b50l70q0K50M22M04J83j50l77m34l05j0K89M76M37K03j38l79m19k99oK92
1648b61M78M24J74j75m27n05l71l5K71M61M45K01j66m29n20l74n5L03N03N27K89
1669G58o4l86n08m14r0K58M97N14L13m5l70n36m83k00J61M37M94L23ol20n06m76
$$ y = [-235, 358, 714, 736, 401, -146, -631, -797, -580, -83, 474, 844, 882, 541, 22, -450, -670, -537, -117, 364, 674, 666, 328, -176, -635, -830, -674, -262, 230, 572, 601, 286, -177, -585, -720, -504, -50, 454, 796, 789, 463, -42, -477, -642, -478, -40, 457, 776, 748, 376, -184, -694, -914, -739, -279, 272, 646, 692, 373, -187, -679, -902, -725, -251, 365, 827, 941, 653, 107, -429, -721, -666, -239, 331, 793, 912, 646, 91, -486, -861, -862, -499, 40, 515, 720, 542, 71, -462, -806, -796, -466, 57, 568, 809, 704, 291, -195, -535, -592, -306, 162, 595, 771, 627, 227, -250, -620, -700, -450, -28, 376, 559, 409, 32, -402, -707, -717, -428, 48, 485, 688, 550, 171, -248, -547, -553, -261, 217, 641, 815, 640, 213, -292, -663, -698, -427, 34, 479, 680, 514, 85, -435, -809, -864, -561, -58, 469, 758, 694, 308, -200, -614, -704, -446, 51, 565, 878, 833, 463, -73, -556, -756, -595, -158, 336, 659, 653, 333, -173, -649]
1691f49k06J33M16N06L87P4k61m31m05j96J17L75M72L46P1k27m33m26k12O6L01
1712a82L93L01N7k62m10m08j86R9L17M13L25M8k04l85l55j56J47L57M33L15O5
1733G22k43m22m12j88Q6L46M40K91L7k73m66m66k38Q5L59M76L84J02k25m51m38
1754d94k48P7L65N16M41J50j72m19m87l29lL05M60M09J74j51m23n06l54p0K33
1775e26M53M18K31r7l46m33l15n8K43M12M39K49o0k77m01l24q9J84L60L67J93
1796F23o8l07m19l32r1J62L39L63J69p2k91l65k78m3K21L71L84K13m9k91l74k93
1818d28n1K26L79L51J93r3l35m31l49r0J95L68L96K02n7l21m44l39j20K19M02
1839a27M66K79J1k56m43l84j36J64L95M36K98L1k57m47m36k11P7L07M24K94O4
$$ y = [-649, -855, -722, -306, 200, 587, 661, 400, -31, -436, -632, -515, -140, 332, 678, 749, 522, 89, -337, -549, -483, -182, 211, 512, 569, 307, -103, -511, -697, -598, -281, 132, 457, 505, 301, -84, -439, -595, -448, -91, 342, 657, 722, 479, 57, -355, -543, -457, -111, 329, 620, 657, 384, -82, -548, -786, -701, -342, 134, 518, 620, 395, -56, -494, -742, -665, -300, 216, 657, 807, 635, 216, -271, -600, -603, -298, 162, 571, 745, 594, 171, -335, -689, -759, -526, -73, 345, 576, 479, 133, -300, -615, -673, -430, -18, 421, 670, 610, 333, -68, -392, -481, -297, 63, 430, 623, 555, 248, -171, -503, -594, -432, -93, 270, 439, 367, 76, -289, -567, -610, -389, -18, 366, 579, 530, 239, -135, -428, -479, -253, 126, 477, 670, 577, 242, -189, -538, -628, -433, -65, 331, 533, 476, 155, -289, -628, -748, -529, -127, 339, 618, 629, 373, -70, -454, -590, -426, -31, 405, 703, 734, 477, 30, -406, -617, -540, -233, 191, 485, 549]
1860E49k09m07m10k08M7L09M14L33J29j47l22l62k13N9K66L85L14R8j61l28l60
1881b24k22J3K30L16K62Q2j70l31l53k03N8K37L58K90Q0j21l07l19j64P8K83L68
1903B41K93R0j67l31l78j99L8K39L59K92Q7j78l96m02k33OK59L97L60J50j30l37
1925F0l88k52J5K72L87L92J91q2l32l99l01p0J78L63L63K10j07l08m11l30r7J43
1947e03L28L67K41j4k48l42k84q4J41L25L51K45J2j97l26k90j01J17K62K84K21
1968E05l3k35l34k89j10J03K43L08J91k5k10l15k38n7J30K96L39K11Mk15l12k64
1990c07q4J36K85L25J96k3k77l54k96j46J00K88L43K42j9k12l72l20j29J08L11
2011b05L92K97O8j67l47l19j83P2K81L64K79Q0j66l44l62k38mK08L48K72J16j30
$$ y = [549, 340, -67, -477, -685, -638, -329, 85, 418, 547, 400, 78, -284, -497, -438, -172, 213, 527, 625, 464, 136, -224, -446, -433, -203, 113, 375, 457, 287, -44, -397, -600, -542, -305, 53, 343, 423, 302, -5, -324, -488, -410, -127, 241, 534, 624, 457, 126, -252, -451, -413, -174, 185, 477, 564, 386, -10, -412, -645, -639, -380, 17, 377, 527, 397, 60, -328, -580, -565, -293, 94, 486, 677, 595, 263, -136, -437, -507, -329, 34, 397, 607, 500, 192, -219, -549, -646, -503, -175, 192, 433, 419, 171, -171, -455, -539, -398, -73, 278, 523, 535, 338, 12, -278, -379, -262, 0, 284, 505, 472, 237, -97, -386, -496, -393, -150, 158, 349, 324, 114, -201, -439, -496, -366, -70, 269, 480, 484, 269, -43, -307, -391, -255, 30, 355, 551, 528, 251, -103, -399, -545, -445, -157, 186, 428, 409, 197, -175, -495, -624, -516, -205, 187, 484, 552, 385, 38, -281, -464, -392, -111, 253, 532, 612, 446, 102, -260, -498, -502, -294, 54, 326, 442, 312]
2033C12k97l44k15nK07L46L20J20o3k45k93k03jK01K90K70J10q9k46k89k22l0
2055c66J39K43K27J09j04k56k78j99LJ92K80K51J25r4k14k68j65K6K02L12K72
2076D37J08j15k53l24k22j9J84K76K92J01j18k74l40k50m8J78L30L04J71l7k33
2097A48l30k43n5J82L08L44K19l5k33l25k84j19J08K75L06J89pk25l28k99j30
2118e34P3K41L01K10N7j58k64k58j06Q2K48K91K32N4j51k55k28j30M3K01K44J73
2140C66Mj51k60k66j15N6J96K50J74J3j24k64k23o6Q2K44K65K22L3j49k59k27
2162a99j14N7K27K81K02Qj78l02k79j64N7K08K88K18L7j21l03k74j57L6K24L17
2184F9K98J18j27k36k72j89j2J79L08K77R2j04k34l18k29o6J65K15K78J30o9k22
$$ y = [312, 15, -329, -544, -549, -342, 4, 324, 444, 381, 136, -157, -360, -361, -160, 130, 400, 510, 421, 175, -114, -336, -366, -227, 16, 243, 352, 248, -8, -286, -485, -482, -290, -10, 241, 366, 272, 58, -210, -375, -349, -147, 165, 437, 545, 430, 177, -147, -369, -388, -204, 72, 364, 465, 347, 73, -267, -517, -565, -387, -57, 247, 418, 381, 148, -182, -425, -480, -298, 10, 354, 573, 538, 305, -20, -304, -423, -315, -40, 266, 455, 448, 223, -105, -404, -534, -461, -220, 81, 291, 348, 190, -74, -332, -438, -356, -108, 183, 415, 469, 318, 63, -165, -295, -252, -51, 193, 366, 370, 219, -41, -307, -422, -366, -170, 80, 254, 267, 143, -121, -344, -410, -328, -84, 181, 403, 436, 287, 28, -199, -313, -256, -29, 252, 454, 462, 284, -18, -297, -461, -404, -196, 92, 310, 347, 226, -77, -351, -508, -472, -248, 69, 367, 485, 358, 122, -150, -339, -351, -172, 136, 413, 505, 401, 167, -151, -380, -446, -281, -66, 212, 342, 273, 51]
2206E1k70k00l9J25K76K66J42j4j64k29j67n4J13K32K26J23m8j86k30k05p5J11
2228b16J80K16Q7o2j99k19j68l2J32K16K46J24n1j60k21j55l1J47K41K57J18o1
2250C89j97k71k19m6J09K29K42J15l7k12k78k40o6J14K36K84J84lj64k37k35q7
2272c90R5K54K93J92K3j36k49k69j37L3J99K43J76M3j55k32k64j46K2J64K53J92
2294B04P1q9j80k12j21K8J75K43J70R0q7j69k30j28K1J26K18J28L4j11j97k06
2316b22j30J7J36K08J65M4r8j77j99r3O2J81K28J77Q2j06j89k24j26L6J69K15
2338A56J84M9j10k28k69j70JJ58K26K17Q0q1k06k40j72j2J66K67K42J29l8j65
2360A84k50j75n2J18K13K28J39l8j95k48k10p4P8J80K09J30j6j37k05j96m3P2
$$ y = [51, -219, -419, -458, -333, -57, 209, 351, 337, 173, -56, -223, -277, -164, 68, 294, 417, 369, 183, -47, -252, -327, -216, -36, 180, 267, 205, 6, -213, -381, -413, -281, -65, 181, 305, 254, 94, -127, -282, -313, -166, 75, 332, 450, 389, 192, -79, -298, -344, -235, -6, 236, 351, 314, 102, -176, -416, -482, -368, -132, 152, 336, 333, 169, -68, -303, -390, -295, -41, 252, 444, 467, 331, 82, -187, -324, -291, -92, 151, 327, 370, 215, -17, -281, -427, -405, -241, 12, 204, 275, 186, 6, -206, -327, -299, -124, 119, 289, 379, 292, 123, -107, -235, -214, -88, 130, 258, 292, 181, -16, -222, -352, -335, -199, 9, 174, 218, 120, -57, -256, -349, -287, -106, 122, 299, 381, 275, 86, -138, -264, -228, -59, 156, 340, 389, 279, 51, -218, -388, -387, -229, -3, 214, 294, 213, 7, -233, -405, -417, -251, 16, 258, 387, 349, 184, -66, -241, -293, -175, 38, 266, 405, 367, 172, -76, -286, -360, -282, -102, 107, 237, 221, 84, -121, -317, -360, -288]
2382b88J86K22J63Qj04j74j71m3O4J70J78J12Mj31k15j72p4N8J55J63J01j7j32
2405F3k00j51n4P9J82K08J19Lj22j86j53n0R6J89K29J20j4j53k25j86j09P8J63
2428g4K06J32Pj44k42j99j08O0J92K27J87O2j00k01k02j09M3J67K30K09N6q0j98
2451A21k14j46k1J18J96J70N8n9j77k37j37j2J01K02J67R9m4j27j70j21kJ10J82
2474E7J81R0n3j36j67j24k9Q9J39J33O6o6j56j79j32j1J02J55J53P2m3j47j63
2497a69j04K0J37J85J71O9l1j47j98j36j3J12J88J54P7n2j64k23j73n0R6J90J94
2520A33R8j8j40j94j61m9P4K04K20J64Lj20j94j74q2M9J70J92J29jj16j84j97
2543a94j08RJ21J91J35L9q0j62j73o9K6J45J66J59N5o2j32j45p7K3J29J52R5K4
$$ y = [-288, -102, 120, 283, 291, 187, 13, -158, -201, -137, 33, 211, 323, 327, 196, -19, -191, -265, -207, -52, 111, 212, 195, 63, -137, -288, -342, -263, -81, 127, 246, 249, 127, -59, -212, -262, -166, 23, 252, 372, 358, 205, -20, -206, -315, -237, -74, 132, 264, 271, 127, -115, -314, -422, -362, -170, 57, 244, 306, 206, 5, -197, -306, -263, -96, 134, 343, 399, 319, 121, -93, -239, -260, -142, 54, 224, 282, 223, 46, -191, -328, -340, -239, -37, 130, 229, 185, 58, -112, -233, -235, -125, 57, 238, 328, 275, 139, -28, -152, -181, -92, 47, 180, 246, 180, 24, -155, -287, -298, -196, -41, 112, 184, 141, -6, -169, -273, -253, -116, 69, 240, 309, 278, 131, -67, -203, -216, -104, 84, 238, 315, 263, 99, -124, -297, -347, -251, -61, 133, 231, 213, 73, -121, -282, -331, -257, -53, 167, 331, 334, 214, 20, -154, -236, -187, -17, 175, 304, 303, 187, 3, -194, -302, -293, -172, 19, 154, 193, 113, -49, -222, -291, -265, -120, 46, 205, 260, 198, 66, -79, -156, -133, -4, 148, 243, 267]
2567B67r0j34j70q6PJ17J30J11Qr0j47j41n7L2J39J76J39L4p8j49j35q1N6J08
2591c4J99J22N8j20j75j82j07J2J03J69J46M6q2j79j78j26J5J11J97J75Q4m1j25
2614H8j84j24k2J11J91J80Q6l2j33j85j34q0O7J43J62Q3k0j38j61j29n9N7J40
2637i3J43J27Jr0j15j29j8N7J37J45Q5kq6j32j23o8O3J07J20N7l0j05j42j21m5
2662b57M3J39J48Q2k3r1j39r5k3P3J69J43J08j6r6j71j29n4N8J42J51J01oj36
2686A21j90j40r2L5J40J74J24J8o5j54j64p1K4J43K01J40O2o3j41j73r1qJ07J45
2710H2J27M8o8j42j83r8k5R6J14J34O0m2j05j28q0k0R3J47J34N5l3p0j17q7k4
2735a32Q0J22J03M1n4r0j57r4mN4J31R5K9n1j03j22q7OJ09J49J27N8l4j10j30
$$ y = [267, 177, 43, -127, -213, -206, -89, 41, 152, 160, 70, -77, -218, -275, -243, -104, 72, 211, 245, 167, 18, -117, -198, -142, -34, 165, 287, 345, 225, 50, -132, -239, -227, -124, 45, 191, 237, 155, -24, -202, -328, -313, -202, -5, 170, 254, 213, 88, -96, -220, -242, -131, 60, 240, 326, 294, 161, -24, -158, -238, -171, -28, 134, 217, 197, 59, -102, -231, -290, -233, -93, 50, 177, 178, 88, -27, -156, -174, -117, 20, 165, 250, 248, 162, 30, -93, -161, -98, 9, 129, 186, 156, 51, -91, -212, -257, -214, -75, 73, 155, 132, 41, -98, -193, -216, -143, 26, 169, 277, 261, 165, -6, -135, -189, -131, 11, 162, 263, 257, 121, -69, -209, -301, -266, -126, 48, 172, 190, 125, -29, -193, -264, -240, -97, 104, 244, 306, 243, 102, -71, -162, -170, -63, 82, 209, 257, 189, 47, -136, -234, -259, -163, -49, 85, 145, 103, -2, -130, -210, -230, -137, 10, 144, 199, 166, 96, -21, -108, -132, -52, 70, 173, 214, 160, 70, -87, -181, -185, -131, 0, 95, 124, 73, -30, -152, -239, -233, -124, 25, 152, 210, 176, 66, -64]
2760f4p8oR6J55J18N6m7j33j63j21k7P2J35J27O9l3j20j68j27k2O7J49J66J04
2784B05J1q0j44j26n4N8J28J51R6J1q4j40j46p2RR9J06J14J2p4j15j25q7J4J07
2809a26J42R1M8l9j03r0n3K0J03J13P5M1n5j25j06m4lP7J05N9J0p3j17j12o1J6
2835b07J01J31R0J0n0j06j12m0M0J11J49J19No7j30j06r0PR4J17J08L1o9j47j47
2860a58r0j8R6J43J26O3l4j05j35q8mP3J69J31R6l6r4j30j08l8M6J19J10O8j9
2885A83j06j24j18n6M2Q9J23O9Mn7j09r6k3N8R4J18P1J2o8q7r0k4L3R0Q6M1j0
2912A45r5j02q5l5L5Q8R2N8k9q2r4r1rO6J19J14Q5Nq3j17r3k4N3J03J32P0nr8
2940A23j45j18o8L0R9J24P5K0q0j10j21q1M1R5J50J21M2m5r2j16q6MR3J13J08
$$ y = [-64, -142, -148, -52, 103, 221, 277, 230, 97, -66, -187, -214, -142, -7, 120, 189, 156, 36, -132, -259, -281, -214, -65, 101, 205, 216, 136, -8, -134, -188, -130, -2, 149, 245, 256, 172, 32, -114, -186, -177, -78, 28, 142, 154, 80, -35, -160, -247, -233, -126, 16, 107, 155, 116, 13, -77, -130, -110, -7, 106, 181, 222, 167, 42, -64, -108, -111, -34, 71, 130, 140, 67, -50, -162, -223, -207, -106, 25, 115, 125, 75, -31, -143, -183, -143, -32, 117, 236, 241, 174, 44, -62, -152, -145, -51, 66, 174, 205, 136, -11, -158, -248, -266, -170, -27, 99, 162, 128, 23, -112, -200, -204, -131, 38, 169, 265, 229, 135, 5, -103, -141, -95, 24, 134, 202, 183, 77, -47, -165, -221, -179, -90, 33, 102, 106, 49, -60, -156, -179, -121, -27, 91, 162, 174, 106, 19, -71, -95, -62, 28, 114, 155, 145, 50, -52, -137, -172, -137, -49, 43, 101, 72, -10, -104, -195, -204, -138, -19, 95, 180, 185, 102, -15, -108, -132, -79, 24, 156, 226, 221, 123, -22, -140, -208, -178, -79, 45, 120, 140, 60, -50, -171, -252, -211, -116, 34, 155, 197, 152, 60, -56, -142, -138, -45, 68, 176]
2965A76M6m6r0j39q9l8O0R1R7M2l1p3j19q7rP0J16P8P9j6p0r1n4qO7R7P9M9l5
2994A52p4j05p6JL9Q2Q6%k9p8j22o9J0O2J14R3N0k8j02q4n9rQ9J21J18M5m1r9
3022H7j18q6k7O2J08Q7M8k2j06j33j12m0N5J23J09R2J3o9j28q0n1L7J25J28R8
3047B00J9n9j09j05o7J3O9R6R6Oo8j06r0o5OO1R2O6L9k1q5q1m2K9P2Q5O7M2l1
3076A29p4q3m2J7N5P5N7mn0r6r5n5K8O3Q1N7Ml1r5q4l5L6Q8J08Q8J7k2j02q7n8
3106a10KR8J00P3M0o4j06j19r3j4P6J04Q9N1k5r4j12q6j4P9R6J34Q0np6j00r9
3133i5k6M8R3R3O1J3p4j19r3m2RO0Q4P1j1m8q7p6l3J2Q0R5P2J9l7p1n1l3K9O5
3163HR2M7lo4q8n9m0K5P5O6M1k5o3q2p1l5M1R0Q7O9Mm7q9p6k9N2Q8J13O1Np4r8
$$ y = [176, 222, 176, 86, -53, -142, -180, -120, -29, 68, 110, 79, 6, -113, -200, -209, -139, -23, 55, 134, 118, 48, -43, -97, -105, -38, 59, 138, 187, 152, 78, -27, -103, -102, -63, 19, 105, 105, 76, -2, -124, -193, -183, -121, -7, 86, 136, 108, 6, -78, -137, -146, -57, 64, 182, 227, 186, 87, -31, -117, -144, -82, 26, 113, 161, 139, 33, -100, -212, -252, -197, -74, 35, 127, 140, 71, -57, -137, -188, -151, -26, 102, 200, 219, 160, 51, -54, -121, -108, -39, 57, 153, 159, 91, -15, -105, -170, -164, -103, -11, 55, 94, 73, -12, -93, -135, -106, -34, 51, 118, 160, 129, 55, -28, -70, -53, 2, 77, 134, 130, 80, -16, -111, -166, -138, -75, 6, 63, 67, 36, -59, -143, -178, -142, -54, 54, 142, 159, 137, 35, -52, -110, -108, -10, 90, 163, 203, 139, 33, -86, -179, -193, -117, -13, 76, 127, 102, 8, -104, -190, -204, -125, -29, 105, 185, 180, 104, 4, -95, -121, -73, 20, 113, 174, 187, 113, -6, -99, -141, -132, -72, 12, 83, 72, 24, -63, -139, -172, -160, -80, 15, 87, 106, 69, -2, -53, -86, -57, 8, 100, 147, 144, 80, -8, -67, -107, -82, -7, 59, 100, 75, 12, -70, -141, -176, -135, -45, 42, 111, 115, 68, -21, -97, -126, -74, 14, 127, 188, 193, 119, 21]
3195B1j00o3J4Q5R4Q5oo1r9j13p0RQ8R8J03O1n1q7r1o4J5O4J07J01N0k5r1j03
3223b9p1k6M7Q0Q3L0j1q3r2q2j6L7P3Q1N2Kn3o4n9lM4P8Q4L6qo1o4m6k3L7N4N9
3255H6L8m0p0q2m5l4L8Q5N7M7k3o9q3n5J0N4R8R4N5j5p5r4n8k3L5Q7R3O2j8q4
3285G1j26q5l7J6Q4R6Q9ko1q0j19k3K4R5J10R4L5m6p9r2o1JO8R6P1K4n1p0q8p9
3315a25mM7N8O9K9l0n8p0n6jN8P7P1N5l3n5n7m6J0M7N5O0K7l1o2q6o1QM1N3P2
3346F2J2l7p1o9n8J3P1Q6P7L0j9p1q0n2J2O6R4Q4L5l6q9q8q7JL3R5O8M4k3p6r5
3377f8j02k1M1P9J33M5K2m5j16m6m8L9O3J14P2J9n5r5r4m5KM9P3O1Mk5p2j09j8
3406a43rO4O6P1J1qn8n6j6JO0Q5L1L4l8o0p2l2K5L9N2M1Rn7p0q0l5K2O6O0O1J3
$$ y = [21, -79, -142, -128, -43, 51, 136, 130, 69, -30, -143, -213, -204, -116, -18, 85, 146, 95, 8, -83, -147, -132, -68, 39, 140, 190, 165, 74, -29, -100, -126, -79, 1, 84, 114, 103, 20, -72, -154, -170, -133, -60, 21, 73, 75, 22, -42, -101, -104, -60, 18, 102, 138, 130, 69, 5, -41, -64, -27, 27, 86, 124, 84, 14, -68, -113, -147, -109, -24, 33, 80, 57, -12, -95, -150, -140, -86, 12, 106, 161, 146, 71, -23, -81, -104, -69, 18, 111, 173, 155, 71, -55, -140, -177, -161, -77, 19, 108, 106, 45, -35, -154, -177, -153, -58, 52, 146, 181, 135, 56, -36, -97, -96, -28, 68, 139, 163, 112, 42, -46, -125, -129, -82, -24, 45, 74, 44, -14, -84, -140, -141, -83, -6, 65, 120, 87, 32, -25, -71, -61, -14, 41, 101, 128, 97, 35, -51, -112, -104, -63, -10, 62, 74, 37, -34, -103, -161, -148, -77, 9, 86, 116, 97, 26, -54, -106, -94, -28, 66, 150, 185, 149, 60, -28, -115, -114, -81, 14, 82, 126, 103, 27, -68, -170, -191, -150, -71, 62, 107, 129, 84, -32, -78, -126, -87, -24, 90, 162, 181, 126, 31, -63, -108, -106, -57, 16, 77, 81, 56, -16, -125, -143, -152, -88, -22, 49, 60, 52, -6, -62, -78, -77, -17, 68, 99, 133, 95, 35, -37, -69, -44, -5, 47, 88, 97, 40, -30, -110, -145, -123, -57, 3, 64, 77]
3438G7k4q9o9k1K9Q3Q4Q3qk0q9q8n9J2O3R0P1J9n0q1j19n8j1O3R6Q1M2l3p6q2
3468h4o8ON0Q6J10N3Op4q0o7l4K8Q9O8M7Ko1r1p9l2rO4O8O3J0m8n7o1l1M8M1P5
3500C8M9Qk5n3o4j1K5N4M5N2j4o8o8o3j4J9O0N3L3qn2p7n6j2K8R0Q8O1j1n2p5
3531b0n8k2L5Q0R5N3no0j01p7n9J9O8J04N6Pn1r9q6o5L2O6J04Q7L2j1p7r6n6j1
3561a16P9P8Q5M7k1q2q7p4j3J7N8P9L8j9n9q8n0j4K6P7P2L1Qm1o1l4kM1N6N6M4
3592A31j5n8o7n3j8M1M9N7K1k4p7o0n7kM6O3P9L3%q4o3m9nO5P9R4L6j8p1q7o4
3623g8l4M7P8P3N5k7o4j09r3m2N7N9R8P1J7o5o5r3m3K4Q2J11Q8K7m2q6q7n1j3
3652a05P7P7O1K5l3q1r8n1j2M7Q6N2L4k8n8o3l9RN4O5P1K6j6m7o5m9J4M3N3O0
$$ y = [77, 53, -36, -105, -126, -97, -14, 70, 153, 145, 125, 36, -52, -111, -99, -36, 54, 125, 144, 94, 13, -106, -164, -175, -112, -16, 65, 107, 74, -2, -84, -152, -146, -96, -10, 100, 153, 159, 85, 5, -62, -96, -68, 21, 89, 136, 138, 77, -14, -93, -125, -134, -70, -2, 61, 71, 23, -34, -95, -126, -78, -37, 38, 87, 95, 70, 17, -47, -58, -33, 21, 66, 118, 104, 36, -32, -95, -109, -90, -30, 23, 56, 48, -4, -81, -137, -149, -121, -31, 57, 118, 107, 55, -20, -78, -100, -65, 15, 110, 163, 158, 98, -3, -80, -139, -120, -52, 52, 108, 115, 64, -35, -121, -186, -154, -88, 16, 103, 135, 124, 47, -49, -105, -116, -37, 41, 126, 173, 152, 70, -17, -91, -104, -87, -29, 50, 88, 69, 10, -78, -128, -142, -116, -39, 33, 64, 72, 31, -30, -64, -66, -25, 31, 87, 131, 116, 58, -9, -62, -80, -39, 10, 67, 88, 64, -13, -73, -130, -132, -86, -23, 56, 89, 89, 5, -58, -107, -112, -47, 32, 126, 162, 144, 73, -14, -78, -112, -65, 13, 86, 141, 114, 50, -59, -152, -194, -137, -78, 20, 91, 108, 43, -22, -115, -158, -134, -52, 59, 147, 174, 132, 46, -41, -92, -105, -28, 49, 110, 135, 102, 21, -77, -128, -140, -93, -7, 45, 79, 51, -7, -70, -109, -100, -46, 19, 90, 116, 100, 53, -12, -61, -47, -4, 49, 109]
3682A09J2m3q3q0k0rN4O5N4J3l7r0n1n2K1Q1Q6O2M0j6q6q5n5J7O5R7O1L9m1p4
3712E4j05q8j5L4R1J11L7k2q4q8q9j1N1R4J09O8j0o1p5r0j5L8P1J04M4J7o1j05
3740Do3n5J0N7O6O4qk6q0p8l0K1O5O9N4J6k3n1n8l5J3P2O0N5Nl9q0n7l6J8O7M1
3772C8M8mm8q6n9l1L7O3Q6N4Lm4p8o9k6M0P5R9O2J1n9r2q5n2J4P7Q6O2K6o1j06
3803a9r9m5JO5Q2R0L8l0p6r2n5k2P3J06Q4N7j9o9r7p9k1M4P5Q7L1j2n8q4p6l1
3833a51J6Q1Q3L8Rn2o5o1JK3P5P8L2Kl4o8n7oK5N6P2K0k5o3p8m8k5L2O8O5L8k2
3865E9o2p4n0j1N9Q3Q1N5ro6r9n8l0M1R5Q3O7j1q3j23p6n6M6P7R4Q8No5j04q7
3895a31m8K3R2R9R5K6l5q0j03m3JN7J05P7L1m4r2p3p5RL9O9O0L3k8o8p9l9j9N4
$$ y = [109, 121, 78, -5, -85, -105, -114, -60, 5, 59, 72, 35, -55, -106, -158, -137, -56, 30, 92, 132, 116, 30, -55, -110, -93, -28, 69, 130, 169, 128, 54, -51, -139, -154, -120, -29, 82, 119, 97, 13, -75, -164, -175, -124, -30, 79, 147, 137, 76, 1, -89, -104, -66, 5, 109, 153, 170, 109, 4, -59, -114, -104, -47, 19, 83, 75, 49, -31, -109, -139, -118, -53, 16, 70, 86, 63, 12, -46, -81, -68, 4, 64, 119, 124, 85, 5, -52, -88, -70, -3, 38, 86, 82, 34, -52, -111, -142, -105, -42, 44, 98, 101, 57, -21, -90, -116, -76, -1, 98, 160, 171, 112, 20, -65, -117, -103, -26, 60, 122, 148, 87, -19, -118, -163, -162, -97, -15, 75, 113, 83, 7, -85, -140, -162, -89, 17, 101, 158, 139, 70, -27, -106, -127, -83, -8, 79, 110, 98, 40, -44, -120, -151, -135, -54, 29, 67, 76, 24, -41, -102, -101, -78, -3, 75, 107, 109, 75, 7, -50, -56, -31, 25, 97, 117, 92, 29, -49, -97, -122, -90, -22, 43, 81, 59, -3, -77, -127, -138, -79, 4, 85, 140, 131, 65, -34, -92, -122, -81, 14, 97, 164, 153, 70, -53, -129, -185, -139, -62, 32, 120, 125, 60, -44, -131, -179, -156, -64, 35, 130, 156, 121, 41, -62, -105, -104, -47, 58, 135, 166, 122, 30, -43, -118, -109, -70, -1, 59, 92, 64, -4, -83, -122, -141, -87]
3925h7Q0O8L7k1m6o6l9nN3O9N6L4l4p7p1m5lM6P8N8j0k6q5n5n5QO0R4P9K9m7o2
3957A5q2n2J5P4R6P4L4k2j02r1o5oM9R5Q4K5j2j01r4r4pM7Q8J01P0j9o0r8p0m0
3987a48M6Q3J01P6Lm8j09q5m6K3P7Q3M5Pm5q6q3m9J9O6O6P5Ok5q0n2l3K5O1Q7
4017F0L9J8m8n7n9k9J3O4O2O1j6n9p7q0l5L4Q1O5O5j7m9r4n3j8K3Q2J00P2Mm4
4047A08j02q9m2L3P4R6O7J7o0j05j02o9J5P2R9P7K8l5q4j12m4oN8J12R8M5ko6
4075H1j07p3j1N2Q5P3O0l0o2r4p9j8K0Q0P9M5qo8p3o7j1N2O4O8N4nn8o7n1qM8
4106b9O9N3L1k1m9r5n7j1M3Q2N3K8k5p8q6n9NM8R2P9N3l2n3r3q8jO0J12R9M4r
4137A65q5j14q2m7N0Q7J07O6op8j13q5n5L8Q4J10Q1K7o2q9r2l4KR5J01P4K2l4
$$ y = [-87, -7, 61, 98, 77, 31, -35, -74, -79, -26, 43, 99, 133, 99, 22, -49, -94, -97, -51, 27, 85, 75, 49, -36, -91, -146, -138, -78, 16, 95, 124, 77, 15, -67, -119, -104, -30, 66, 140, 174, 152, 50, -41, -106, -112, -63, 32, 116, 141, 129, 28, -66, -160, -167, -120, -32, 69, 139, 120, 60, -38, -108, -148, -102, -19, 82, 158, 161, 113, 4, -81, -127, -104, -27, 56, 101, 108, 63, -23, -106, -155, -136, -70, -4, 71, 77, 52, -28, -80, -113, -88, -27, 60, 99, 117, 69, 12, -47, -76, -63, 1, 63, 124, 108, 49, -28, -108, -143, -109, -28, 37, 102, 85, 36, -58, -111, -129, -106, -24, 76, 148, 152, 108, 6, -83, -125, -92, -18, 78, 145, 162, 102, -3, -105, -174, -159, -87, 12, 89, 117, 82, -2, -114, -158, -164, -106, 6, 104, 149, 147, 81, -26, -99, -110, -58, 27, 100, 160, 130, 68, -26, -105, -123, -103, -23, 56, 101, 93, 25, -48, -115, -126, -74, -10, 58, 112, 107, 49, -18, -69, -77, -29, 40, 93, 124, 103, 54, -41, -98, -109, -66, 16, 69, 97, 72, -6, -92, -151, -146, -98, -6, 73, 126, 94, 41, -52, -140, -141, -81, 31, 130, 174, 165, 80, -34, -116, -163, -113, -26, 81, 147, 141, 63, -50, -135, -190, -152, -68, 42, 123, 150, 88, -1, -93, -127, -125, -30, 71, 145, 167, 133]
4165A33r5q8n7kN2P5Q2J9m8p2q9m8J0L1Q3Q3L7m4q0n2m2RN5Q3P1J6l6o6o4m6%
4196i0M6Q9N7J2n1p4q4n2J6O4R5P0J6m7p6q5m5J2O5J24P6K4l9q8j07n8PO5Q6J01
4226A29L6m9p6j26p4j8O0R6J05M6j4p8j09q5rN1R5J02O4No5j09p7l1M1P9R1O1
4254A41Op3q1r6m5K7P8P2O2J1n8p3o9k5K2P2Q9N0Ol4q4n6l3L5P0Q2L7j8n8q1o7
4285i1k9K7P4P9N4j3o6j01o9k2K8R9R0O1J0o5q9r5k5L9R0R7P7Jn7j14r6n9L5O6
4315f4J05Q5J0n5r6j01n8%P8J23R6L9l9q9j05m9k2P7R8R4N2k5r2q7q2j9M3Q6P3
4344G6L2j3o9q6o4k4L8Q7Q2M2j6n0q6l8pN0O5Q5J9k1p6o7n3oN2P3P5J7k9q1j03
4375i6m6mN4R4R0L1k3p6j06o2NO5J13Q1M4rq5r9r5j6M6J00J15M6j5q9j07j04k4
$$ y = [133, 38, -50, -107, -109, -57, 18, 100, 119, 71, -1, -90, -138, -128, -97, -14, 69, 106, 62, -18, -70, -112, -103, -48, 35, 106, 122, 86, 20, -44, -90, -90, -44, 45, 102, 114, 63, -11, -95, -147, -131, -67, 28, 98, 114, 67, -9, -94, -139, -127, -62, 62, 138, 162, 123, 35, -72, -130, -123, -58, 28, 129, 165, 116, 40, -86, -160, -178, -118, -22, 83, 129, 115, 37, -72, -157, -166, -115, -20, 82, 146, 151, 86, -23, -100, -131, -90, -11, 80, 141, 147, 74, -7, -103, -148, -121, -43, 29, 91, 102, 44, -29, -98, -123, -101, -29, 60, 110, 116, 82, -2, -58, -91, -56, 14, 96, 133, 115, 57, -24, -91, -120, -93, -19, 60, 114, 101, 35, -66, -135, -157, -129, -30, 60, 121, 131, 66, -23, -118, -143, -104, -14, 83, 160, 161, 104, -10, -106, -165, -130, -64, 41, 126, 136, 81, -15, -116, -174, -174, -96, 27, 123, 162, 123, 34, -71, -120, -142, -65, 33, 127, 179, 154, 62, -25, -107, -126, -83, 3, 76, 108, 95, 26, -60, -124, -148, -110, -23, 59, 101, 85, 35, -51, -89, -96, -46, 19, 104, 123, 102, 26, -41, -94, -100, -48, 25, 100, 117, 88, 7, -96, -142, -146, -92, 2, 92, 123, 100, 24, -82, -144, -139, -74, 39, 120, 164, 155, 70, -29, -124, -140, -94, 6, 121, 167, 152, 63, -44, -148, -172]
4404a72M0R5J07O2Lo9j06q6m3L4Q7J13N8M3o2r4q4n6PQ9Q5Q1Rn6p8j06m4JP1Q3
4434A2N7K3l7p5q1l2L7M8R3N6J9m8o0p9l4L2O2Q1M8J8n3r5p4m9L1O7R2N2Pn6q6
4465b4j00m4M1Q9R9P6J9o8q9r5m9J3R4J08Q3K3m7j07j12p3mO3J11R7L8m2q9j01
4493i0p8j4O1J14J00O2j6p8j05p3k2O6Q3R2O6j0p7r8p0l3K1R4O4M7jo5p6q3k5
4522a44M3O8Q6N5Oo3r1n3j3M4Q5P7M4j0q2p9o8k7M5Q9O0N3k1q2j00p5qN4R3Q5
4552G1O1j3q1j04n5k5M9Q8J07P9pq0q7j15m1M7R7Q7Q6J1q4j13j09m8J9R4J14P5
4580A23L7m9j03j06n6KR0J15P7M2l9r6r8n9qP6P7Q7L3k2r9j05n7%M5Q6P7K5k4
$$ y = [-172, -132, -37, 70, 132, 135, 66, -40, -126, -169, -135, -48, 65, 123, 166, 104, 10, -74, -130, -123, -34, 51, 132, 141, 85, 7, -99, -143, -142, -71, 12, 69, 92, 55, -20, -101, -133, -96, -48, 45, 101, 120, 72, 12, -67, -101, -69, -7, 74, 122, 140, 87, -8, -82, -131, -100, -33, 59, 111, 118, 62, -24, -124, -168, -127, -38, 61, 137, 156, 88, -1, -96, -145, -132, -38, 70, 153, 176, 129, 22, -90, -163, -167, -104, 7, 104, 142, 100, 11, -90, -168, -182, -121, -7, 93, 155, 139, 61, -44, -117, -139, -73, 10, 102, 168, 158, 81, -17, -87, -120, -99, -5, 59, 106, 105, 40, -36, -119, -144, -101, -33, 53, 108, 114, 51, -40, -93, -106, -62, 23, 100, 144, 134, 52, -27, -95, -122, -77, 12, 72, 125, 104, 22, -78, -153, -161, -107, -14, 71, 132, 119, 38, -66, -121, -146, -97, -9, 98, 177, 170, 90, 3, -112, -153, -106, -9, 78, 164, 175, 91, -22, -131, -179, -160, -66, 48, 123, 160, 111, 8, -98, -154, -152, -62, 53, 130, 172, 133, 37, -61, -120, -128, -52, 25, 112, 145, 123, 24, -81, -138, -138, -93, -7, 70, 95, 71]
$$ [...]
8191d4
##END NTUPLES=NMR FID
##END=
