##TITLE=1H_PR164_E2
 D2O, 8 sc, 
 5.4.2019
##JCAMPDX= 6.0         $$ Bruker NMR JCAMP-DX V2.0
##DATA TYPE= NMR FID
##DATA CLASS= NTUPLES
##ORIGIN= UXNMR, Bruker Analytische Messtechnik GmbH
##OWNER= root
$$ XWIN-NMR		Version 3.5
$$ Fri Apr  5 16:05:20 2019 Russian Standard Time (UT+4h)  she@DPX200
##.OBSERVE FREQUENCY= 200.1315
##.OBSERVE NUCLEUS= ^1H
##.DELAY= (6, 6)
##.ACQUISITION MODE= SIMULTANEOUS
##.ACQUISITION SCHEME= undefined
##.AVERAGES= 8
##.DIGITISER RES= 18
##SPECTROMETER/DATA SYSTEM= spect
##.PULSE SEQUENCE= zg30
##.SOLVENT NAME= D2O
##.SHIFT REFERENCE= (INTERNAL, D2O, 0, 15.7039)
##AUDIT TRAIL= $$ (NUMBER, WHEN, WHO, WHERE, WHAT)
$$ ##TITLE= Audit trail, XWIN-NMR		Version 3.5
$$ ##JCAMPDX= 5.01
$$ ##ORIGIN= Bruker BioSpin GmbH
$$ ##OWNER= she
$$ F:/spectra/data/she/nmr/H-F/1/audita.txt
$$ ##AUDIT TRAIL=  $$ (NUMBER, WHEN, WHO, WHERE, WHAT)
(   1,<2019-04-05 16:04:21.96 +0400>,<she>,<DPX200>,
      <created by zg, POWCHK disabled, PULCHK disabled
       configuration hash MD5:
       00 E9 B6 7A A2 85 ED C7 34 08 36 98 17 FE 4E 26
       data hash MD5: 16K
       AF 1E 42 6C A1 7D DE 55 80 59 25 54 A3 F6 C7 69>)
$$ ##END=
$$ 
$$ hash MD5
$$ BC 58 CF 8B B1 3F 8B 27 92 40 89 9A 4D C5 E1 D4
##$RELAX= 
##$RELAX= 
##$RELAX= 
##$RELAX= 
##$RELAX= 
##$RELAX= 
$$ Bruker specific parameters
$$ --------------------------
##$DU= <F:/spectra>
##$EXPNO= 1
##$NAME= <H-F>
##$PROCNO= 1
##$TYPE= <nmr>
##$USER= <she>
##$AMP= (0..31)
100 100 100 100 100 100 100 100 100 100 100 100 100 100 100 100 100 100 
100 100 100 100 100 100 100 100 100 100 100 100 100 100 
##$AQSEQ= 0
##$AQ_mod= 1
##$AUNM= <au_zg>
##$AUTOPOS= <>
##$BF1= 200.13
##$BF2= 200.13
##$BF3= 200.13
##$BF4= 200.13
##$BF5= 200.13
##$BF6= 200.13
##$BF7= 200.13
##$BF8= 200.13
##$BYTORDA= 1
##$CFDGTYP= 0
##$CFRGTYP= 5
##$CHEMSTR= <none>
##$CNST= (0..31)
1 1 145 1 1 1 1 1 1 1 1 1 1 1 1 1 1 1 1 1 1 1 1 1 1 1 1 1 1 1 1 1 
##$CPDPRG= <>
##$CPDPRG1= <>
##$CPDPRG2= <>
##$CPDPRG3= <>
##$CPDPRG4= <mlev>
##$CPDPRG5= <mlev>
##$CPDPRG6= <mlev>
##$CPDPRG7= <mlev>
##$CPDPRG8= <mlev>
##$CPDPRGB= <>
##$CPDPRGT= <>
##$D= (0..31)
0 1.2 0 0 0 0 0 0 0 0 0 0.03 0 0 0 0 0 0 0 0 0 0 0 0 0 0 0 0 0 0 0 0 
##$DATE= 1554465861
##$DBL= (0..7)
120 120 120 120 120 120 120 120 
##$DBP= (0..7)
150 150 150 150 150 150 150 150 
##$DBP07= 0
##$DBPNAM0= <>
##$DBPNAM1= <>
##$DBPNAM2= <>
##$DBPNAM3= <>
##$DBPNAM4= <>
##$DBPNAM5= <>
##$DBPNAM6= <>
##$DBPNAM7= <>
##$DBPOAL= (0..7)
0.5 0.5 0.5 0.5 0.5 0.5 0.5 0.5 
##$DBPOFFS= (0..7)
0 0 0 0 0 0 0 0 
##$DE= 6
##$DECBNUC= <off>
##$DECIM= 24
##$DECNUC= <off>
##$DECSTAT= 4
##$DIGMOD= 1
##$DIGTYP= 9
##$DL= (0..7)
0 120 120 120 120 120 120 120 
##$DP= (0..7)
150 150 150 150 150 150 150 150 
##$DP07= 0
##$DPNAME0= <>
##$DPNAME1= <>
##$DPNAME2= <>
##$DPNAME3= <>
##$DPNAME4= <>
##$DPNAME5= <>
##$DPNAME6= <>
##$DPNAME7= <>
##$DPOAL= (0..7)
0.5 0.5 0.5 0.5 0.5 0.5 0.5 0.5 
##$DPOFFS= (0..7)
0 0 0 0 0 0 0 0 
##$DQDMODE= 0
##$DR= 18
##$DS= 0
##$DSLIST= <SSSSSSSSSSSSSSS>
##$DSPFIRM= 0
$$ [...]
##$SUBNAM2= <"">
##$SUBNAM3= <"">
##$SUBNAM4= <"">
##$SUBNAM5= <"">
##$SUBNAM6= <"">
##$SUBNAM7= <"">
##$SUBNAM8= <"">
##$SUBNAM9= <"">
##$SW= 24.9337058887773
##$SWIBOX= (0..15)
0 0 2 0 0 0 0 0 0 0 0 0 0 0 0 0 
##$SW_h= 4990.01996007984
##$TD= 16384
##$TD0= 1
##$TE= 0
##$TE2= 300
##$TE3= 300
##$TEG= 300
##$TL= (0..7)
0 120 120 120 120 120 120 120 
##$TP= (0..7)
150 150 150 150 150 150 150 150 
##$TP07= 0
##$TPNAME0= <>
##$TPNAME1= <>
##$TPNAME2= <>
##$TPNAME3= <>
##$TPNAME4= <>
##$TPNAME5= <>
##$TPNAME6= <>
##$TPNAME7= <>
##$TPOAL= (0..7)
0.5 0.5 0.5 0.5 0.5 0.5 0.5 0.5 
##$TPOFFS= (0..7)
0 0 0 0 0 0 0 0 
##$TUNHIN= 0
##$TUNHOUT= 0
##$TUNXOUT= 0
##$USERA1= <user>
##$USERA2= <user>
##$USERA3= <user>
##$USERA4= <user>
##$USERA5= <user>
##$V9= 5
##$VALIST= <valist>
##$VCLIST= <CCCCCCCCCCCCCCC>
##$VD= 0
##$VDLIST= <DDDDDDDDDDDDDDD>
##$VPLIST= <PPPPPPPPPPPPPPP>
##$VTLIST= <TTTTTTTTTTTTTTT>
##$WBST= 1024
##$WBSW= 4
##$XGAIN= (0..3)
0 0 0 0 
##$XL= 0
##$YL= 0
##$YMAX_a= 349155
##$YMIN_a= -380952
##$ZGOPTNS= <>
##$ZL1= 120
##$ZL2= 120
##$ZL3= 120
##$ZL4= 120
##$ABSF1= 10
##$ABSF2= 0
##$ABSG= 5
##$ABSL= 3
##$ALPHA= 0
##$AQORDER= 0
##$ASSFAC= 0
##$ASSFACI= 0
##$ASSFACX= 0
##$ASSWID= 0
##$AUNMP= <proc_1d>
##$AZFE= 0.1
##$AZFW= 0.1
##$BCFW= 1
##$BC_mod= 2
##$BYTORDP= 1
##$COROFFS= 0
##$CY= 11.3945322036743
##$DATMOD= 1
##$DC= 2
##$DFILT= <>
##$DTYPP= 0
##$F1P= 18.9103706918063
##$F2P= -1.10871071338519
##$FCOR= 0.5
##$FTSIZE= 0
##$FT_mod= 4
##$GAMMA= 1
##$GB= 0.15
##$INTBC= 1
##$INTSCL= 1
##$ISEN= 128
##$LB= 0.24
##$LEV0= 0
##$LPBIN= 0
##$MAXI= 10000
##$MC2= 0
##$MEAN= 0
##$ME_mod= 0
##$MI= 1.114404
##$NCOEF= 0
##$NC_proc= 0
##$NLEV= 6
##$NOISF1= 3.799351
##$NOISF2= 2.8
##$NSP= 1
##$NTH_PI= 0
##$NZP= 0
##$OFFSET= 15.70392
##$PC= 1
##$PHC0= -8859.742
##$PHC1= 20.40028
##$PH_mod= 1
##$PKNL= yes
##$PPARMOD= 0
##$PSCAL= 0
##$PSIGN= 0
##$REVERSE= no
##$SF= 200.130013532006
##$SI= 16384
##$SIGF1= 3
##$SIGF2= 2
##$SINO= 400
##$SIOLD= 16384
##$SREGLST= <1H.CDCl3>
##$SSB= 0
##$STSI= 0
##$STSR= 0
##$SW_p= 3612.71676300578
##$SYMM= 0
##$S_DEV= 0
##$TDeff= 0
##$TDoff= 0
##$TI= <>
##$TILT= no
##$TM1= 0
##$TM2= 0
##$TOPLEV= 0
##$USERP1= <user>
##$USERP2= <user>
##$USERP3= <user>
##$USERP4= <user>
##$USERP5= <user>
##$WDW= 1
##$XDIM= 8192
##$YMAX_p= 0
##$YMIN_p= 0
$$ End of Bruker specific parameters
$$ ---------------------------------
##NTUPLES= NMR FID
##VAR_NAME=  TIME,          FID/REAL,        FID/IMAG
##SYMBOL=    X,             R,               I
##VAR_TYPE=  INDEPENDENT,   DEPENDENT,       DEPENDENT
##VAR_FORM=  AFFN,          ASDF,            ASDF
##VAR_DIM=   8192,          8192,            8192
##UNITS=     SECONDS,       ARBITRARY UNITS, ARBITRARY UNITS
##FACTOR=    0.0002004,     1,               1
##FIRST=     0,             0,               0
##LAST=      1.6414764,     0,               0
##MIN=       0,             -380952,         0
##MAX=       1.6414764,     349155,          0
$$ Real data points
##PAGE= N=1
##DATA TABLE= (X++(R..R)), XYDATA
$$ plain form
0 0 0 0 0 0 8 0 8 -8 8 -16 16 -24 30 -32 40 -48 56 -72 81 -101 115 -136 158 -179 208 -238 270 -310 349
29 349 -395 447 -498 561 -626 701 -781 866 -965 1070 -1185 1313 -1455 1612 -1785 1978
45 1978 -2194 2436 -2714 3033 -3401 3840 -4359 5001 -5807 6860 -8300 10396 -13750 20000
59 20000 -35712 161158 198318 -147350 -221837 -211588 -143791 -96548 78928 276123 349155
70 349155 173215 -79329 -245208 -255961 -208202 -117483 23061 199093 275404 184046 -22405
81 -22405 -193769 -261643 -219719 -100591 71650 217811 259558 178454 41761 -94188 -193824
92 -193824 -216273 -111583 81438 230970 233797 130230 17306 -77303 -179823 -243714 -169701
103 -169701 33374 204935 210263 90130 -24701 -92712 -159858 -214698 -162787 20882 206785
$$ packed form
0@%%%%QqQj6J6k4L2m0N4o2P2q8J04j28J53j82K16k51K94l37L87m46N08n80O59
29C49p44Q42r45J059j187J327j482J647j831K035k255K498k768L067l397L763
45A978m172M630n150N747o434P241q199R360j0808J2667j5160J8696k4146L3750
59B0000n5712J96870L7160l45668p4487J0249O7797M7243J75476J97195P3032
70C49155j75940k52544j65879j0753M7759R0719J40544J76032P6311r1358k06451
81b2405j71364o7874M1924J19128J72241J46161M1747q1104j36693j35949r9636
92a93824k2449J04690J93021J49532K827j03567j12924r4609j02520o3891P4013
103a69701K03075J71561N328j20133j14831o8011o7146n4840N1911J83669J85903
$$ plain form
114 206785 243704 133377 551 -78007 -128199 -164590 -124080 28127 198765 249729 159153
125 159153 19786 -89608 -162482 -193432 -139208 4097 152425 205235 144888 25596 -98884
136 -98884 -195797 -223574 -147158 4942 145094 200636 165390 73244 -47480 -162341 -208859
147 -208859 -138853 15199 157202 213243 183858 100258 -19650 -147257 -214481 -164819 -23534
158 -23534 114985 177325 159904 88487 -22640 -147761 -222045 -186567 -58099 80005 158993
169 158993 165094 110595 7029 -113987 -186331 -157768 -45535 81307 161115 177123 131504
180 131504 32577 -86444 -163895 -150057 -57239 54249 128858 146827 107405 17419 -94194
191 -94194 -169179 -161296 -77640 28694 106346 131278 100042 20494 -77695 -143721 -138155 -62446
$$ packed form
114B06785L6919j10327j32826p8558n0192l6391M0510J52207J70638N0964r0576
125A59153j39367j09394p2874l0950N4224J43305J48328N2810o0347j19292j24480
136i8884r6913k7777P6416J52100J40152N5542l5246r2146j20724j14861m6518
147b08859P0006J54052J42003N6041k9385q3600j19908j27607o7224M9662J41285
158b3534J38519O2340j7421p1417j11127j25121p4284L5478J28468J38104P8988
169A58993O101n4499j03566j21016p2344K8563J12233J26842P9808J6008m5619
180A31504r8927j19021p7451J3838R2818J11488P4609J7969l9422q9986j11613
191i4194p4985P883Q3656J06334P7652K4932l1236p9548r8189o6026N566P5709
$$ plain form
203 -62446 41739 123844 151375 116861 34533 -60870 -123404 -121626 -57912 34955 113481 142238
215 142238 106642 20006 -77609 -140345 -140529 -81324 10193 93788 131696 103625 19409 -77702
227 -77702 -139611 -137014 -76121 16635 103872 147464 127098 49802 -47704 -118223 -128807 -76878
239 -76878 13124 100506 146745 130064 55919 -44700 -124782 -147601 -104777 -17833 72658 125677
251 125677 118096 53984 -38754 -117158 -146395 -111241 -28319 66376 128221 131498 77516 -7612
263 -7612 -85767 -121809 -98606 -25792 61487 122166 130217 83624 2833 -77485 -121678 -108576
275 -108576 -46310 33512 93834 107379 69871 -2517 -77443 -120361 -109507 -50870 26730 86909
287 86909 105153 76483 14073 -54306 -96738 -90542 -37810 35540 93373 109510 79951 18762
$$ packed form
203f2446J04185Q2105K7531l4514q2328r5403o2534J778O3714R2867P8526K8757
215A42238l5596q6636r7615o2736j84N9205R1517Q3595L7908k8071q4216r7111
227g7702o1909K597O0893R2756Q7237M3592k0366p7296r7506p0519j0584N1929
239g6878R0002Q7382M6239j6681p4145j00619q0082k2819M2824Q6944R0491N3019
251A25677p581o4112r2738p8404k9237L5154Q2922R4695O1845L277n3982q5128
263g612p8155l6042K3203P2814Q7279O0679Q051m6593q0791q0318m4193J3102
275a08576O2266P9822O0322J3545l7508p2388p4926m2918J0854N8637P7600O0179
287H6909J8244k8670o2410o8379m2432O196N2732P3350N7833J6137k9559o1189
$$ plain form
299 18762 -49118 -93171 -91412 -44289 23351 77180 92505 64510 5530 -59581 -101533 -100214
311 -100214 -54398 13559 72188 94533 70735 13893 -49495 -91543 -89943 -45210 23129 83358
323 83358 107589 85454 28003 -39119 -86314 -91797 -52756 12728 72934 99128 79963 24619
335 24619 -44318 -95621 -105995 -70631 -6080 57929 92508 82318 33372 -32453 -84634 -99529
347 -99529 -68364 -5522 60202 99799 96101 51840 -12333 -68065 -89402 -67977 -13538 47976
359 47976 88383 89383 50814 -10868 -68226 -95602 -80367 -30942 29033 71595 78848 48236
371 48236 -6655 -59989 -86691 -73509 -27580 29106 71520 82620 58534 9148 -42008 -71111
383 -71111 -63366 -24198 27882 67355 77895 53988 6664 -43911 -73986 -69646 -33262 15658
$$ packed form
299A8762o7880m4053J759M7123O7640N3829J5325k7995n8980o5111m1952J319
311a00214M5816O7957N8629K2345k3798n6842o3388m2048J600M4733O8339O0229
323H3358K4231k2135n7451o7122m7195n483L9041O5484O0206K6194j9165n5344
335B4619o8937n1303j0374L5364O4551O4009L4579j0190m8946o5825n2181j4895
347i9529L1165O2842O5724L9597l698m4261o4173n5732k1337K1425N4439O1514
359D7976M0407J000l8569o1682n7358k7376J5235M9425N9975M2562P253l0612
371D8236n4891n3334k6702J3182M5929N6686M2414J1100k4086m9386n1156k9103
383g1111P745L9168N2080L9473J0540k3907m7324n0575l0075M340L6384M8920
$$ plain form
395 15658 54108 65315 44586 1356 -46043 -74155 -69043 -32246 17354 57445 71351 52655
407 52655 11303 -35163 -64373 -60518 -26109 22153 61838 75712 56626 13704 -34978 -67359
419 -67359 -68066 -37304 10015 51305 68121 51946 10597 -38334 -71788 -74795 -44918 3745 49083
432 49083 70955 60126 22060 -25521 -61303 -67660 -41924 4377 50585 75678 68586 31668
444 31668 -16721 -56321 -69014 -49612 -7623 37281 64692 61530 29077 -17105 -56788 -72493
456 -72493 -57295 -18790 27350 58198 60760 34746 -6737 -45002 -61553 -49983 -15666 27564
468 27564 60144 65581 41927 1376 -36132 -54162 -47098 -18864 19268 49355 57330 36444 -2119
481 -2119 -39464 -58232 -51308 -24673 10835 40352 51334 36037 840 -35628 -54213 -45478 -17018
$$ packed form
395A5658L8450J1207k0729m3230m7399k8112N112L6797M9600M0091J3906j8696
407E2655m1352m6466k9210L855L4409M8262L9685J3874j9086m2922m8682l2381
419f7359p07L0762M7319M1290J6816j6175m1349m8931l3454l007K9877M8663M5338
432D9083K1872j0829l8066m7581l5782o357K5736M6301M6208K5093p092l6918
444C1668m8389l9600j2693J9402M1989M4904K7411l162l2453m6182l9683j5705
456g2493J5198L8505M6140L0848K562k6014m1483l8265j6551J1570L4317M3230
468B7564L2580N437k3654m0551l7508j8030P064K8234L8132L0087P975k0886l8563
481b119l7345j8768O924K6635L5508K9517J0982j5297l5197l6468j8585Q735K8460
$$ plain form
494 -17018 17244 43947 54079 42082 10015 -27235 -49297 -44770 -16651 18550 43429 50386
506 50386 37152 7489 -28953 -54507 -54350 -27024 10973 40039 47192 32725 5573 -26344 -50466
519 -50466 -54124 -30949 9596 45065 57180 41993 11970 -19075 -41087 -47573 -31628 3945
531 3945 42304 60384 46724 12998 -21411 -43257 -49523 -37949 -8775 27844 52502 47179 16052
544 16052 -21503 -45979 -49651 -36810 -10590 22590 48713 52510 28519 -9195 -38380 -45306 -31766
557 -31766 -6278 21851 44130 49723 32796 -1421 -34385 -48163 -37684 -11046 16479 34672
569 34672 38184 25968 -530 -31378 -49047 -41835 -14315 16200 34590 36886 25235 4028 -21718
582 -21718 -39002 -36995 -13171 18656 39778 40797 26277 3575 -19375 -35907 -36358 -17257 12277
$$ packed form
494a7018L4262K6703J0132j1997l2067l7250k2062M527K8119L5201K4879O957
506E0386j3234k9663l6442k5554J57K7326L7997K9066P153j4467k7152l1917k4122
519e0466l658K3175M0545L5469J2115j5187l0023l1045k2012o486J5945L5573
531C945L8359J8080j3660l3726l4409k1846o266J1574K9174L6619K4658n323l1127
544A6052l7555k4476l672J2841K6220L3180K6123L797k3991l7714k9185o926J3540
557c1766K5488K8129K2279N593j6927l4217l2964j3778J0479K6638K7525J8193
569C4672L512j2216k6498l0848j7669P212K7520L0515J8390K296j1651k1207k5746
582b1718j7284K007K3824L1827K1122J019j4520k2702k2950j6532m51J9101K9534
$$ plain form
595 12277 34727 38050 22662 -1561 -25417 -39218 -37856 -20711 6816 31111 39065 27415 2548
608 2548 -22526 -36911 -34653 -16601 9558 33601 43657 34077 8602 -18973 -35491 -35237 -19355
621 -19355 5783 29493 40749 32500 8462 -19518 -38449 -40920 -26606 -1472 24019 37915
633 37915 33114 12054 -15268 -34770 -38642 -25901 -1927 24345 40494 38429 18825 -7343 -28422
646 -28422 -35108 -25858 -4523 20128 36222 35695 18793 -6344 -27960 -37077 -30994 -11144 13854
659 13854 30653 31004 16900 -4341 -23703 -34474 -30196 -11247 14940 31980 32426 19471 989
672 989 -16492 -28268 -27253 -10365 14305 31237 31354 17873 -242 -17043 -29033 -29317 -14156
685 -14156 9440 26298 27221 15408 -1614 -18108 -30131 -29579 -13824 10037 26662 28398 19181
$$ packed form
595A2277K2450L323j5388k4223k3856j3801J362J7145K7527K4295P954j1650k4867
608B548k5074j4385K258J8052K6159K4043J0056r580k5475k7575j6518K54J5882
621a9355K5138K3710J1256q249k4038k7980j8931k471J4314K5134K5491J3896
633C7915m801k1060k7322j9502l872J2741K3974K6272J6149k065j9604k6168k1079
646b8422o686R250K1335K4651J6094n27j6902k5137k1616r117O083J9850K4998
659A3854J6799L51j4104k1241j9362j0771M278J8949K6187J7040M46j2955j8482
672I89j7481j1776J015J6888K4670J6932J17j3481j8115j6801j1990k84J5161
685a4156K3596J6858R23j1813j7022j6494j2023N52J5755K3861J6625J736r217
$$ plain form
698 19181 3876 -13459 -27760 -28080 -11384 13004 28503 28982 20279 6413 -11783 -29018 -32445
711 -32445 -16285 9701 25483 25795 17112 4970 -11403 -29496 -35658 -21018 5488 25199 28068
724 28068 20357 8707 -7413 -24917 -31453 -19562 3600 23786 31248 26123 12579 -6316 -23728
737 -23728 -29637 -19967 -1097 15641 25244 25850 14533 -6908 -27233 -32168 -20295 -2902 10169
750 10169 19812 25358 19343 -1637 -24709 -30606 -16962 711 11609 18106 24429 22725 4687
763 4687 -19446 -29731 -19084 -635 11212 16469 19737 17743 3486 -18257 -30129 -22676 -5590
776 -5590 8734 16091 18688 14580 1721 -15217 -24552 -20095 -6784 8373 19598 24147 17262 1634
790 1634 -14083 -20450 -16394 -7084 5178 17984 25686 18901 -73 -17549 -22936 -17720 -9461 882
$$ packed form
698A9181j5305j7335j4301l20J6696K4388J5499M79q703j3866j8196j7235l427
711c2445J6160K5986J5782L12q683j2142j6373j8093o162J4640K6506J9711K869
724B8068p711j1650j6120j7504o536J1891K3162K0186P462n125j3544j8895j7412
737b3728n909R670J8870J6738R603O06j1317k1441k0325m935J1873J7393J3071
750A0169R643N546o015k0980k3072n897J3644J7673J0898O497O323j704j8038
763D687k4133j0285J0647J8449J1847N257L268j994j4257k1743j1872P453J7086
776e590J4324P357K597m108j2859j6938r335M457J3311J5157J1225M549o885j5628
790A634j5717o367M056R310J2262J2806P702o785j8974j7476n387N216Q259J0343
$$ plain form
804 882 13566 23780 19686 1653 -17759 -24436 -18396 -8584 2186 14392 24106 22636 6853 -11931
818 -11931 -22051 -19176 -9345 3016 15345 23711 21630 7942 -9434 -21077 -22615 -14701 -1229
831 -1229 12775 21213 18761 6619 -8062 -18514 -22237 -17109 -4053 11701 22466 20910 9001
844 9001 -4889 -14385 -18031 -15132 -4285 10782 21730 21590 10499 -3145 -13701 -18113 -15748 -6695
858 -6695 6733 17382 18860 10096 -3410 -14984 -19375 -15706 -6096 5784 15176 17356 11607 128
872 128 -11852 -17666 -14024 -3727 7386 16043 17822 12599 2015 -10695 -17895 -15494 -4704 6960
886 6960 13914 14731 10814 990 -10824 -18994 -17345 -7169 5362 13752 15495 11318 1755 -9619
900 -9619 -17106 -16383 -7026 5843 15368 18125 13265 3761 -7454 -15336 -16311 -9137 2883 13932 18280
$$ packed form
804H82J2684J0214m094j8033j9412o677O040R812J0770J2206R714j470j5783j8784
818a1931j0120K875R831J2361J2329Q366k081j3688j7376j1643j538P914J3472
831a229J4004Q438k452j2142j4681j0452l723N128J3056J5754J0765j556j1909
844I001j3890r496l646K899J0847J5067J0948j40j1091j3644j0556m412K365R053
858f695J3428J0649J478q764j3506j1574m391L669R610J1880R392K180n749j1479
872A28j1980n814L642J0297J1113Q657J779n223j0584j2710p200K401J0790J1664
886F960O954Q17l917r824j1814q170J649J0176J2531Q390J743m177r563j1374
900i619p487P23R357J2869R525K757m860r504j1215p882r75P174J2020J1049M348
$$ plain form
915 18280 13522 2762 -8882 -16901 -17083 -11527 -599 10845 17245 14734 3957 -8261 -14738 -14912
929 -14912 -10572 -2301 9280 18521 18075 7660 -5925 -13615 -13610 -8988 -2371 7146 15638 17107 8867
944 8867 -4708 -14486 -15252 -10435 -3659 4294 11761 15036 9447 -2372 -13884 -15992 -10545 -1973 6090
959 6090 11492 13568 10002 1254 -9258 -14567 -11382 -1638 7548 12275 11921 8211 1493 -8028 -14537
974 -14537 -13807 -4930 6163 12213 10910 5649 -894 -7376 -13030 -13933 -6886 4831 13207 13497 7518
989 7518 -552 -6953 -11000 -10951 -5719 3734 12620 15458 9801 410 -7884 -12069 -11188 -6264 1233 9544
1005 9544 13841 10916 1254 -9030 -14201 -12050 -6294 818 7927 12887 12136 4673 -6569 -13361 -11986
1020 -11986 -5570 1562 8241 12484 13197 6581 -4270 -12507 -12711 -6991 520 6672 10465 11501 5843
$$ packed form
915A8280m758j0760j1644q019j82N556J0928J1444O400k511j0777j2218o477j74
929a4912M340Q271J1581R241m46j0415j3585p690NM622O617R517Q492J469q240
944H867j3575r778p66M817O776P953P467L275n589j1819j1512k108N447Q572Q063
959F090N402K076l566q748j0512n309L185R744R186M727l54l710o718r521o509
974a4537P30Q877J1093O050j303n261o543o482n654r03P047J1717Q376K90n979
989G518q070o401m047M9N232R453Q886K838n657r391q294m185Q81M924P497Q311
1005I544M297k925r662j0284n171K151N756P112P109M960p51p463j1242o792J375
1020a1986O416P132O679M243P13o616j0851q237k04N720P511O152L793J036n658
$$ plain form
1035 5843 -3420 -11898 -13397 -9226 -2016 5227 10397 11219 6449 -2846 -9884 -11701 -7845 -1166 5228
1050 5228 10532 11817 7263 -1097 -7780 -10011 -8197 -2603 3994 10317 11255 6246 -2272 -8733 -10228
1065 -10228 -8155 -3713 2790 9141 10684 5371 -2094 -8154 -9529 -7809 -3702 3107 9744 12118 7485
1080 7485 -1192 -6742 -8587 -7007 -3190 2642 9437 11707 6984 -1131 -7191 -9254 -8598 -5081 1071
1095 1071 8305 11442 7057 -896 -7072 -9661 -8763 -4985 1417 8662 11840 8172 1499 -5161 -8317
1110 -8317 -8580 -5199 1052 8379 11696 8678 1684 -4811 -8456 -9124 -6828 -776 6635 10415 7952
1125 7952 2003 -3788 -8341 -9347 -7442 -1601 6121 10388 8855 3529 -2581 -6648 -7951 -6744 -995
1140 -995 5585 9843 9331 4058 -1874 -6127 -8004 -6918 -2363 4305 8228 7942 3519 -2030 -6375 -8210
$$ packed form
1035E843r263q478j499M171P210P243N170Q22m770r295p038j817L856O679O394
1050E228N304J285m554q360o683k231J814N594O597O323R38n009q518o461j495
1065a0228K073M442O503O351J543n313p465o060j375J720M107O809O637K374m633
1080G485q677n550j845J580L817N832O795K270m723q115o060k063O56L517O152
1095A071P234L137m385p953o176k589Q98L778O402P245L178l668o673o660l156
1110h317k63L381O251P327L317l018o994o495l645o68K296O052P411L780k463
1125G952n949n791m553j006J905N841P722M267j533n326o110m067j303J207N749
1140i95O580M258n12n273n932m253j877J086M555O668L923k86m423n549m345j835
$$ plain form
1156 -8210 -7255 -2310 3725 7504 7406 4117 -518 -5554 -7686 -6613 -1742 3975 7882 7986 4847 -91
1172 -91 -5190 -7657 -6785 -2240 4094 7248 6687 3633 -770 -4977 -8581 -7835 -3229 3379 7599 7054
1188 7054 3741 -176 -4163 -7585 -7598 -3519 3139 8473 8561 4776 369 -3155 -6215 -7494 -5010 1549
1204 1549 7808 8637 5066 -351 -4177 -6219 -7608 -5648 -296 6139 8991 6368 409 -4149 -6647
1219 -6647 -6625 -4680 -423 5018 8592 7437 2681 -3146 -6448 -6538 -3729 39 3818 6638 6955 4060
1235 4060 -2018 -7040 -8089 -4960 114 3398 4641 5309 4259 -110 -5900 -8486 -5584 729 4664
1250 4664 5077 4419 3398 1306 -3722 -7239 -6233 -235 5009 6528 4633 2328 -2 -2838 -6205
1265 -6205 -6778 -1969 3517 6612 5428 1548 -1647 -3493 -5033 -5828 -3278 2205 6472 6615 3705 -1400
$$ packed form
1156h210R55M945O035L779r8l289m635n036k132J073M871N717L907J04l139m938
1172i1n099k467Q72M545O334L154n61l054m403m207l604P46M606O608M220n45
1188G054l313l917l987l422j3M079O658N334Q8l785m407l524l060j279K484O559
1204A549O259Q29l571n417l826k042j389J960N352O435K852k623n959m558k498
1219f647K2J945M257N441L574j155m756n827l302r0K809L768L779K820L17k895
1235D060o078n022j049L129N074L284J243O68j050m369n790k586K902O313L935
1250D664M13o58j021k092n028l517J006N998N244J519j895k305k330k836l367
1265f205n73M809N486L095j184l880l195j846j540p95K550N483M267J43k910n105
$$ plain form
1281 -1400 -4568 -4705 -4103 -1933 1278 5154 7081 5008 -141 -4949 -6347 -4453 -1766 1346 3929
1296 3929 5894 5093 843 -4442 -7362 -5934 -2579 2075 4196 5241 4887 1905 -2684 -6284 -6040 -2697
1312 -2697 1676 4616 5832 4607 2099 -1375 -5051 -6168 -3801 514 4235 5732 4656 1407 -2065
1327 -2065 -4919 -5533 -4063 -884 2903 5228 5053 1834 -1707 -4669 -4912 -3415 -693 2775 5038 5266
1343 5266 3014 -714 -3944 -5445 -3430 157 2661 4433 4216 2553 -690 -3866 -5538 -4201 -799
1358 -799 2549 4317 3620 1891 -634 -3112 -4675 -4411 -1569 2759 5170 4433 2126 -482 -2842 -3884
1374 -3884 -3682 -2042 2289 5149 5452 2624 -1049 -3359 -3761 -3729 -2253 546 3958 5382 3371 -650
1390 -650 -3649 -4591 -3469 -1580 713 3598 5078 3982 717 -3072 -4695 -3532 -1512 1497 3284
$$ packed form
1281a400l168j37O02K170L211L876J927k073n149m808j398J894K687L112K583
1296C929J965q01m250n285k920J428L355M654K121J045l54k982m589l600K44L343
1312b697M373K940J216j225k508l474l676j117K367M315L721J497j076l249l472
1327b065k854o14J470L179L787K325j75l219l541k962k43J497K722L468K263K28
1343E266k252l728l230j501K015L587K504J772k17j663l243l176j672J337L402
1358g99L348J768o97j729k525k478j563K64K842M328K411p37k307k608k360j042
1374c884K02J640M331K860L03k828l673k310m02L2J476K799L412J424k011m021
1390f50k999r42J122J889K293K885J480j096l265l789j623J163K020L009J787
$$ plain form
1405 3284 4517 4076 1193 -2077 -4344 -4948 -2764 703 3119 3962 3132 987 -1508 -4023 -5223 -3477
1421 -3477 485 3696 4456 3211 1178 -891 -2785 -4001 -3555 -412 3266 4852 3515 1398 -1002
1436 -1002 -2708 -3514 -3345 -791 2473 4253 3059 1167 -749 -2983 -4103 -2875 -940 2034 3591
1451 3591 3222 1770 -757 -2685 -3842 -2627 -637 2082 3568 3405 1924 106 -2347 -3922 -3277 -506
1467 -506 2467 3261 3042 1532 -444 -2437 -3868 -3623 -639 1827 3040 2946 2353 438 -2026 -3859 -3309
1484 -3309 -941 1662 3329 3516 2510 292 -1818 -3638 -3174 -1275 1163 2650 3394 2555 525 -1842
1500 -1842 -3851 -3824 -1484 538 2082 2870 2944 1064 -1836 -3974 -3317 -1536 613 2117 2824 3080 1555
1517 1555 -1422 -2998 -2808 -1203 -217 1771 3319 3163 1423 -1225 -2979 -3065 -1866 -135 1533 3001
$$ packed form
1405C284J233m41k883l270k267o04K184L467K416Q43q30k145k495k515j200J746
1421c477L962L211P60j245k033k069j894j216M46L143L678J586j337k117k400
1436a002j706q06J69K554L264J780j194j892j916k234j120J228J935K974J557
1451C591l69j452k527j928j157J215J990K719J486j63j481j818k453j575O45K771
1467e06K973P94k19j510j976j993j431K45K984K466J213r4n93j915k464j833N50
1484c309K368K603J667J87j006k218k110j820M64J899K438J487P44q39k030k367
1500a842k009K7K340K022J544P88P4j880k900k138O57J781K149J504P07K56j525
1517A555k977j576J90J605R86J988J548j56j740k648j754q6J199J731J668J468
$$ plain form
1533 3001 3020 1310 -1392 -3034 -2879 -1815 -623 1385 2729 3115 1385 -526 -2293 -2380 -1677 -640 1211
1550 1211 2746 3287 1407 -957 -2216 -2175 -1965 -1133 975 3092 2977 976 -786 -2396 -2460 -1986 -867
1567 -867 1089 2521 2602 1704 -819 -2051 -2563 -2580 -1012 766 2616 3033 1912 -159 -1724 -2620 -2646 -1148
1585 -1148 1025 2525 2328 1091 -300 -1225 -2492 -2904 -1441 560 2735 2622 1372 106 -725 -2013
1601 -2013 -2936 -2133 583 2749 3328 1391 91 -985 -1535 -2198 -2228 -35 2000 3032 2046 65 -1233
1618 -1233 -2160 -2083 -1870 -381 1213 2727 2557 655 -916 -2425 -2129 -1148 279 1249 1735 2530 1622 -268
1636 -268 -2117 -2613 -827 704 1532 1112 1442 1951 468 -2166 -3183 -1855 398 1521 1452 941 949 238
1654 238 -1386 -2822 -2339 143 2004 2282 1261 292 253 -456 -2042 -2485 -920 1667 2895 2033 503
$$ packed form
1533C001J9j710k702j642J55J064J192K008J344L86j730j911j767q7P03J037J851
1550A211J535N41j880k364j259M1K10Q32K108K117j15k001j762j610o4M74J119
1567h67J956J432Q1q98k523j232n12j7J568J778J850M17j121k071j565q96k6J498
1585a148K173J500j97j237j391r25j267m12J463K001K175j13j250j266q31j288
1601b013r23Q03K716K166N79j937j300j076n50o63l0K193K035J032r86j981j298
1618a233r27P7K13J489J594J514j70j902j571j509K96R81J427R70M86P95r08j890
1636b68j849m96J786J531Q28m20L30N09j483k634j017J328K253J123o9n11Qp11
1654B38j624j436M83K482J861K78j021r69l9p09j586m43J565K587J228q62j530
$$ plain form
1671 503 -777 -1098 -1608 -1740 -992 623 2080 2549 1079 -854 -1751 -1807 -1205 -1013 17 1513 2847 2108
1689 2108 -375 -1802 -1927 -995 -619 252 927 2075 2100 560 -1637 -2186 -1440 -515 428 1258 1923 1581
1707 1581 983 -1058 -2157 -2141 -783 682 1371 1339 1525 750 -110 -1809 -2259 -1080 542 1553 1694 1392
1725 1392 674 -261 -1137 -1903 -1453 -92 1261 1636 1106 464 -548 -1077 -2011 -1586 207 1227 1690 1206
1743 1206 509 -371 -1518 -1634 -1156 -386 1148 1648 1513 743 -164 -1042 -1759 -1455 -411 1045 1697 1165
1761 1165 596 -841 -1223 -1830 -1194 -451 1031 1730 1508 537 -10 -1183 -1429 -1561 -1116 724 1669 1948
1779 1948 743 -19 -790 -1482 -1810 -702 662 1966 2050 600 46 -1240 -1589 -1190 -701 -4 1304 1622
1797 1622 1395 208 -969 -1203 -1258 -793 444 909 1603 1122 441 -574 -1617 -1467 -477 511 908 788
$$ packed form
1671E03j280l21n10j32P48J615J457M69j470j933q97n6O02J92J030J496J334p39
1689B108k483j427j25R32L76Q71O75J148K5j540k197n49P46R25R43Q30O65l42
1707A581n98k041j099J6J358J465O89l2J86p75q60j699m50J179J622J011J41l02
1725A392p18r35q76p66M50J361J353L75n30o42j012n29r34M25J793J020M63m84
1743A206o97q80j147j16M78P70J534N00j35p70r07q78p17L04J044J456O52n32
1761A165n69j437l82o07O36P43J482O99k22r71n47j173k46j32M45J840R45K79
1779A948j205p62p71o92l28J108J364J304Q4j450n54j286l49L99M89O97J308L18
1797A622k27j187j177k34n5M65J237M65O94m81o81j015j043J50R90R88L97j20
$$ plain form
1815 788 1179 736 -211 -1598 -2012 -555 494 1055 467 667 538 -335 -1332 -2100 -1331 388 1258 1091 283
1834 283 534 368 -933 -1849 -1354 138 1062 1284 455 544 92 -874 -1788 -1409 -149 1155 1280 894 382
1853 382 -64 -1086 -1377 -1095 -30 931 1352 1152 627 -138 -1107 -1337 -304 -73 639 975 1340 1324 161
1872 161 -1289 -1337 -751 359 87 498 808 1642 281 -1424 -1736 -877 227 345 102 1045 1484 384
1890 384 -993 -1923 -970 138 584 217 783 1221 646 -526 -1563 -1051 -233 589 383 863 1163 629 -728
1909 -728 -1496 -919 -200 -103 487 839 1032 603 -874 -1155 -903 -228 249 287 1045 1434 591 -683 -1317 -705
1929 -705 -463 -267 102 820 1133 455 -1111 -674 -624 -567 -414 488 1103 1018 391 -789 -1130 -594 -707 -293
1949 -293 232 1202 1457 570 -866 -722 -403 -451 -649 -2 1383 1277 379 -441 -1157 -633 -493 -629 67 1004
$$ packed form
1815G88L91m43r47j387m14J457J049N61n88K00j29q73r97p68P69J719Q70j67q08
1834B83K51j66j301r16M95J492R24K22q29Q9m52r66r14L79J260J304J25l86n12
1853C82m46j022k91K82J065R61M21k00n25p65r69k30J033K31P12L36L65j6j163
1872A61j450m8N86J110k72M11L10Q34j361j705l12Q59J104J18k43R43M39j100
1890C84j377r30R53J108M46l67N66M38n75j172j037N12Q18Q22k06M80L00n34j357
1909g28p68N77P19R7N90L52J93m29j477k81K52O75M77L8P58L89q43j274o34O12
1929g05K42J96L69P18L13o78j566M37N0N7J53R02O15q5o27j180l41N36j13M14
1949b93N25R70K55q87j436J44L19m8j98O47J385j06q98q20p16N24J40j36O96R37
$$ plain form
1969 1004 1330 486 -246 -741 -690 -481 -545 279 958 1245 495 -706 -457 -926 -734 -601 268 931 1204 401
1989 401 -227 -217 -598 -983 -665 81 1349 1139 360 -66 -491 -492 -828 -592 -189 702 1084 575 -183 -411 -367
2010 -367 -747 -677 -220 192 894 655 161 -348 -751 -880 -488 123 282 414 222 377 -267 -783 -1315 -438
2030 -438 116 597 652 455 129 304 -576 -1067 -663 -43 1048 773 434 28 -329 -272 -842 -926 -38 574 961
2051 961 314 119 -230 -292 -305 -588 -752 331 979 937 208 -395 -575 -835 -666 -253 81 574 1029 600 -107
2072 -107 -833 -492 -258 350 -56 231 616 751 289 -884 -1140 -440 81 -59 -3 494 727 122 -596 -1039
2092 -1039 -929 -421 320 420 326 365 110 -67 -529 -1037 -177 546 721 461 192 296 22 -257 -947 -595
2112 -595 -110 614 527 512 -35 -266 -294 -181 -464 -99 623 640 250 -181 25 -40 -528 0 -398 450 547 275
$$ packed form
1969A004L26q44p32m95N1K09o4Q24O79K87p50j201K49m69J92J33Q69O63K73q03
1989D01o28J0l81l85L18P46J268k10p79m26m25jl36K36M03Q91L82n09p58k28M4
2010c67l80P0M57M12P02k39m94n09m03j29L92O11J59J32j92J55o44n16n32Q77
2030d38N54M81N5j97l26J75q80m91M04O20J091k75l39m06l57N7n70q4Q88O12L87
2051I61o47j95l49o2j3k83j64J083O48m2p29o03j80k60J69M13L34M93M55m29p07
2072a07p26L41K34O08m06K87L85J35m62j173k56P00N21j40N6M97K33o05p18m43
2092a039J10N08P41J00r4L9k55j77m62n08Q60P23J75k60k69J04k74k79o90L52
2112e95M85P24q7j5n47k31k8J13k83L65P22J7l90m31K06o5m88N28l98Q48R7k72
$$ plain form
2134 275 70 -102 -470 -523 -439 -90 372 725 594 13 191 -333 -532 -711 -161 588 584 362 333 -201 -355 -406
2156 -406 -706 -72 319 904 694 336 -167 -645 -545 -58 0 135 297 343 127 -70 -377 -617 -319 -138 -21
2177 -21 295 550 497 115 -375 -632 -699 79 368 273 233 449 220 -47 -667 -567 123 329 480 412 479 442 -288
2200 -288 -550 -770 -319 7 737 171 -204 58 -295 -194 -401 -495 -99 476 520 246 86 -232 -179 -70 -373
2221 -373 -364 517 842 198 235 -91 -667 -502 -91 -181 -357 334 642 103 -501 -427 -522 -84 -57 378 517 498 501
2244 501 -346 -346 -302 -272 -4 32 65 351 213 -198 -172 -385 -324 -164 20 535 467 419 -182 -452 -264 -280 -188 8
2268 8 471 456 148 -10 -259 -426 -339 -170 -44 381 208 399 -18 -371 -525 -446 -167 -71 336 523 148 -60
2290 -60 -141 -145 -351 -52 -18 548 398 114 124 -121 -374 -126 -343 91 249 364 581 -324 40 -144 91 -265
$$ packed form
2134B75k05j72l68n3Q4L49M62L53j31n81J78n24j99j79N50P49mk22k9n34j54n1
2156d06l00O34L91N85k10l58n03m78J00M87N8J35J62M6k16j97l07k40K98J81J17
2177b1L16K55n3l82m90k57o7P78K89r5m0K16k29k67o20J00O90K06J51o8O7l7p30
2200b88k62k20M51L26P30n66l75K62l53J01k07r4L96N75M4k74j60l18N3J09l03
2221c73RQ81L25o44L7l26n76J65M11r0j76O91L08n39o04P4r5M38K7M35J39j9L
2244E01q47%M4L0K68L6L3K86j38m11K6k13O1J60J84N15o8m8o01k70J88j6R2J96
2268HM63j5l08j58k49j67Q7J69J26M25j73J91m17l53j54P9K79R6M07J87l75k08
2290f0q1mk06K99L4N66j50k84J0k45k53K48k17M34J58J15K17r05L64j84K35l56
$$ plain form
2312 -265 229 385 297 296 -105 -437 -367 -515 -343 163 350 326 505 -167 -240 -232 -361 -328 100 308 342 65 129 -224
2336 -224 -327 -472 -295 -218 490 612 -8 -99 -60 -486 -311 -411 182 79 761 223 -73 160 17 -404 -588
2357 -588 -106 321 482 574 407 -241 1 -162 -33 298 -31 386 97 310 -27 -247 -288 -380 8 338 48
2378 48 249 178 107 -180 -543 -238 423 279 204 -63 395 96 -19 -197 -428 64 215 627 287 151 244 197
2400 197 -220 -295 -62 -20 291 423 11 104 -55 204 -232 -102 -56 274 335 496 -11 -280 -213 -100 -237 48
2422 48 193 386 556 -13 -54 -377 -211 63 -27 -454 440 357 236 233 -524 -339 -232 95 -64 499 244 406
2444 406 -213 -527 -462 -198 309 301 460 165 46 -105 -376 -276 -470 111 410 451 -133 -389 221 -166 -223 -495
2466 -495 -214 72 344 42 -6 -29 -471 291 -128 -523 247 216 406 331 -184 -410 8 -92 -195 54 124 331
$$ packed form
2312b65M94J56q8jm01l32P0j48J72N06J87k4J79o72p3Qj29L3M28K08L4k77O4l53
2336b24j03j45J77P7P08J22o20r1L9m26J75j00N93j03O82n38k96K33j43m21j84
2357e88M82M27J61R2j67o48K42j63J29L31l29M17k89K13l37k20m1r2L88L30k90
2378D8K01p1p1k87l63L05O61j44p5k67M58k99j15j78k31M92J51M12l40j36R3m7
2400A97m17p5K33M2L11J32m12R3j59K59m36J30M6L30O1J61n07k69O7J13j37K85
2422D8J45J93J70n69m1l23J66K74r0m27Q94q3j21lp57J85J07L27j59N63k55J62
2444D06o19l14O5K64N07qJ59k95j19j51k71J00j94N81K99M1n84k56O10l87n7k72
2466d95K81K86K72l02m8k3m42P62m19l95P70l1J90p5n15k26M18j00j03K49P0K07
$$ plain form
2488 331 234 -326 -403 -455 103 202 -82 -153 122 273 478 -384 -373 -480 46 98 32 -214 444 377 -203 -417 -489
2511 -489 344 447 15 52 -9 299 -7 -39 -535 -432 216 378 57 -72 114 83 171 -584 -280 -103 143 223
2533 223 -67 -87 -75 209 90 -331 -241 -205 403 404 55 -101 -223 214 47 -598 -224 192 328 208 -404 -487
2555 -487 142 43 42 -55 63 229 305 -191 -385 -192 348 184 191 -74 62 462 80 -64 -530 240 -153 -212 21
2578 21 56 -112 151 107 -243 -135 -240 297 234 -94 -82 284 179 -90 -144 -240 403 299 237 78 37 -113 52
2601 52 -451 -351 78 580 225 221 85 -249 174 -387 -293 -168 -8 112 -220 -637 -412 -82 -240 -167 87 430
2623 430 -62 -113 290 -18 -213 -250 -8 -152 21 44 120 203 -186 -264 -113 -88 214 -1 176 -79 0 -207 -171
2646 -171 182 8 221 -165 -18 375 141 238 -49 -126 -34 11 66 -137 -234 27 256 -50 -201 -64 153 196
$$ packed form
2488C31r7n60p7n2N58R9k84p1K75J51K05q62J1j07N26N2o6k46O58o7n80k14p2
2511d89Q33J03m32L7o1L08l06l2m96J03O48J62l21j29J86l1Q8p55L04J77K46Q0
2533B23k90k0J2K84j19m21R0L6O08Jl49j56j22M37j67o45L74M16J36j20o12q3
2555d87O29r9jr7J18J66P6m96j94J93N40j64Pk65J36M00l82j44m66P70l93n9K33
2578B1L5j68K63m4l50J08j05N37o3l28J2L66j05k69n4r6O43j04o2j59m1j50J65
2601E2n03J00M29N02l55mj36l34M23n61R4J25J60J20l32m17K25L30j58P3K54L43
2623D30m92n1M03l08j95l7K42j44J73K3P6Q3l89p8J51K5L02k15J77k55P9k07L6
2646a71L53j74K13l86J47L93k34R7k87p7R2M5N5k03r7K61K29l06j51J37K17M3
$$ plain form
2668 196 190 11 -57 165 -47 -531 -130 47 190 173 -255 -105 -71 509 69 -197 -311 75 147 402 -96 158
2690 158 96 -307 -360 -186 -161 -16 -33 -33 -58 -303 -295 -52 -50 297 -51 99 158 -234 -443 -247 34 -60 47 -87
2714 -87 154 8 -148 44 -344 -183 -150 56 397 -215 46 80 -131 -353 -431 -43 180 -69 102 91 70 -234
2736 -234 -165 4 -170 269 -142 157 -248 -103 88 -227 -103 -153 -45 -46 -73 332 -43 -178 -147 -466 -145 9
2758 9 125 395 99 -144 -116 -70 -99 -165 92 -53 -33 7 106 37 5 -291 -246 15 -201 274 -237 67 49 -41 -304
2783 -304 -65 -68 266 205 34 20 -265 -14 -229 -138 -130 -100 147 33 328 60 -21 -93 -11 247 -60 114 14 258
2807 258 348 310 -102 -85 -85 95 -166 -205 -3 68 -18 -360 -387 120 -66 -22 135 -153 228 -135 -128 -6 -269 -100
2831 -100 240 -97 -125 189 303 259 -144 143 170 -131 318 249 43 51 120 15 29 -10 114 148 -39 341 -97
$$ packed form
2668A96oj79o8K22k12m84M01J77J43j7m28J50L4N80m40k66j14L86P2K55m98K54
2690A58o2m03n3J74K5J45j7%k5k45QK43KL47l48J50N9l92k09J96K81r4J07j34
2714h7K41j46j56J92l88J61L3K06L41o12K61L4k11k22p8L88K23k49J71j1k1l04
2736b34O9J69j74M39m11K99m05J45J91l15J24n0J08jk7M05l75j35L1l19L21J54
2758IJ16K70k96k43K8M6k9o6K57j45K0M0R9o9l2k96M5K61k16M75n11L04j8r0k63
2783c04K39lL34o1j71j4k85K51k15R1QL0K47j14K95k68q1p2Q2K58l07J74j00K44
2807B58R0l8m12J7%J80k61l9K02P1q6l42k7N07j86M4J57k88L81l63PJ22k63J69
2831a00L40l37k8L14J14m4m03K87K7l01M49o9k06QO9j05J4l9J24L4j87L80m38
$$ plain form
2854 -97 -117 -198 120 -6 58 115 225 85 117 -125 54 151 172 -10 103 48 82 114 -126 -282 -360 -47 27 248
2878 248 31 -221 55 72 -26 -423 4 -141 14 -7 -35 -22 116 -380 -408 143 -194 109 259 49 131 -108
2900 -108 -131 -84 -194 -32 45 327 255 145 -217 130 70 154 43 442 42 223 259 -74 -230 -171 68 -85 128
2923 128 -187 -208 246 169 -303 -64 -251 -84 125 27 -85 -47 224 -191 -39 -18 270 117 -23 -156 -108 170
2945 170 -6 -44 -238 63 20 114 -201 0 25 125 85 64 -74 -231 73 41 143 -165 123 -87 39 20 100
2968 100 158 -21 278 266 -198 -130 4 436 110 172 224 -97 373 -9 284 -308 84 289 244 -62 -335 -308
2990 -308 223 -101 -434 80 40 349 244 -204 -316 -165 -32 -77 241 -147 265 108 9 -36 25 -206 85 -121
3012 -121 -91 -51 363 191 -205 -69 184 -6 -192 244 -296 271 416 5 -177 93 65 256 -32 235 9
$$ packed form
2854i7k0q1L18j26O4N7J10j40L2k42J79R7K1j82J13n5L4L2k40j56p8L13P4K21
2878B48k17k52K76J7r8l97M27j45J55k1k8J3J38m96k8N51l37L03J50k10Q2k39
2900a08k3M7j10J62P7K82p2j10l62L47o0Q4j11L99m00J81L6l33j56N9K39j53K13
2923A28l15k1M54p7m72K39j87J67K09r8j12L8K71m15J52K1K88j53j40j33M8K78
2945A70j76l8j94L01m3R4l15K01K5J00m0k1j38j57L04l2J02l08K88k10J26j9Q0
2968A00N8j79K99j2m64O8J34M32l26O2N2l21M70l82K93n92L92K05m5l06k73K7
2990c08N31l24l33N14m0L09j05m48j12J51J33m5L18l88M12j57r9m5O1k31K91k06
3012a21L0M0M14j72l96J36K53j90j86M36n40N67J45m11j82K70k8J91k88K67k26
$$ plain form
3033 9 -148 160 59 153 81 82 -289 138 147 83 1 -7 -81 -336 135 16 119 14 -38 -185 34 206 -59 -102 -303
3058 -303 -152 7 153 109 219 -91 53 -183 -56 256 106 -111 -13 286 110 72 -39 -301 -56 -15 -57 47
3080 47 -9 103 80 115 99 53 204 261 -156 -149 -211 -166 -59 -152 50 8 -253 295 83 235 -429 32 387 -34
3104 -34 -151 186 75 61 -10 -153 -8 43 200 -189 -234 -237 -98 33 -30 64 231 204 -29 -151 170 -61 154
3127 154 -10 -192 -274 446 135 415 -122 -171 -57 -49 -64 14 156 54 42 307 70 -249 -155 -221 95 -83 9
3150 9 79 -169 -30 56 -275 -224 32 -40 52 153 -88 45 -127 -147 -356 162 38 361 -251 85 -13 209 -9
3173 -9 -428 -224 -292 -58 -21 9 129 18 -309 -289 -81 -25 -75 65 -197 101 104 289 88 118 192 74 -73 -127
3197 -127 129 -173 -59 -146 -57 -357 388 288 -256 -16 -491 115 -201 -265 129 -245 -20 345 25 -16 400
$$ packed form
3033Ij57L08j01R4p2Jl71M27Ro4q2qp4k55M71j19J03j05n2j47K19J72k65m3k01
3058c03J51J59J46m4J10l10J44k36J27L12j50k17R8K99j76l8j11k62K45M1m2J04
3080D7n6J12k3L5j6m6J51N7m17Po2M5J07r3K02m2k61N48k12J52o64M61L55m21
3104c4j17L37j11j4p1j43J45N1J57l89m5lJ39J31o3R4J67k7k33j22L21k31K15
3127A54j64j82q2P20l11K80n37m9J14Qj5P8J42j02j2K65k37l19R4o6L16j78R2
3150IP0k48J39Q6l31N1K56p2R2J01k41J33j72k0k09N18j24L23o12L36r8K22k18
3173im19K04o8K34L7L0J20j11l27K0K08N6n0J40k62K98LJ85k01L0P4j18j47n4
3197a27K56l02J14q7Q9l00P45j00n44K40m75O06l16o4L94l74K25L65l20m1M16
$$ plain form
3218 400 -76 -153 86 -24 73 124 -14 90 130 29 -99 -76 103 106 134 40 -206 -60 209 -52 8 186 75
3241 75 70 -81 135 -197 67 11 -173 89 124 413 -15 196 120 9 -80 -218 -100 563 -59 -195 54 -164
3263 -164 -16 107 124 -120 -184 -118 -96 289 -145 -200 168 -120 -124 344 189 55 -1 -73 -157 58 -177 -3 69 57
3287 57 355 212 -47 -50 79 20 64 -314 -63 102 311 302 -42 -172 99 -117 -205 47 52 31 -88 -300 -179 6
3311 6 -116 2 85 6 -110 34 -108 -176 51 -353 -105 106 -76 -173 113 231 -341 -62 -9 236 -138 60
3333 60 -167 79 151 -65 79 -221 286 181 141 -332 -51 -67 -75 -96 13 144 -262 203 76 72 -126 -138 112
3356 112 312 -86 104 201 -153 57 -63 143 -137 145 40 -344 -187 11 -234 93 450 99 -107 313
3376 313 -29 -172 308 7 131 1 -105 -18 -73 -28 -156 393 -1 -16 275 -72 -74 -4 91 10 -74 -10 -6 -84 -140
$$ packed form
3218D00m76p7K39j10R7N1j38J04M0j01j28K3J79LK8r4k46J46K69k61O0J78j11
3241G5nj51K16l32K64n6j84K62L5K89m28K11p6j11q9j38J18O63o22j36K49k18
3263a64J48J23J7k44o4O6K2L85m34n5L68k88mM68j55j34n6p2q4K15k35J74P2j2
3287E7K98j43k59lJ29n9M4l78K51J65K09rl44j30K71k16q8K52Nk1j19k12J21J85
3311Fj22J18Q3p9j16J44j42o8K27m04K48K11j82r7K86J18n72K79N3K45l74J98
3333F0k27K46P2k16J44l00N07j05m0m73K81j6qk1J09J31m06M65j27mj98j2K50
3356A12K00l98J90R7l54K10j20K06k80K82j05l84J57J98k45L27L57l51k06M20
3376C13l42j43M80l01J24j30j06Q7n5M5j28N49l94j5K91l47kP0R5q1q4O4Mp8n6
$$ plain form
3401 -140 14 217 -193 -81 36 15 70 -9 173 167 6 110 1 220 32 22 205 -208 204 -99 304 -83
3423 -83 434 147 -52 -325 -50 469 297 4 -322 302 334 -351 73 35 190 -130 -240 166 34 -191 -169
3444 -169 21 -95 43 -10 -244 282 -271 120 112 -206 -63 44 319 -198 178 76 -129 -68 34 140 62 174
3466 174 -250 354 -61 -76 -199 -167 73 63 -82 -18 53 136 76 -130 471 24 121 -13 -134 350 -37 165 34
3489 34 -54 109 -94 61 -152 -40 22 5 122 -104 399 38 -81 -13 -236 -52 12 9 -290 35 6 -34 212
3512 212 313 245 -57 96 166 198 -16 -148 134 216 -192 61 97 -37 -28 53 -194 -154 120 107 -67 -80 -75 69
3536 69 -282 10 -85 372 -13 2 35 159 -72 -95 98 259 129 -288 170 -84 80 84 102 140 -67 53 -163
3559 -163 124 16 -180 -55 -7 -34 -342 41 -250 294 -275 11 -146 -125 136 84 208 -10 -96 -283 169 -349
$$ packed form
3401a40J54K03m10J12J17k1N5p9J82oj61J04j09K19j88j0J83m13M12l03M03l87
3423h3N17k87j99k73K75N19j72k93l26O24L2o85M24l8J55l20j10M06j32k25K2
3444a69J90j16J38n3k34N26n53L91ql18J43J07K75n17L76j02k05O1J02J06p8J12
3466A74m24O04m15j5j23L2K40j0j45O4P1Q3o0k06O01m47R7j34j21M84l87K02j31
3489C4q8J63k03J55k13J12O2j7J17k26N03l61j19O8k23J84O4lk99L25k9m0K46
3512B12J01o8l02J53P0L2k14j32K82Q2m08K53L6j34RQ1k47M0K74j3j74j3NJ44
3536F9l51K92r5M57l85J5L3J24k31k3J93J61j30m17M58k54J64MJ8L8k07J20k16
3559a63K87j08j96J25M8k7l08L83k91N44n69K86j57K1K61n2J24k18q6j87M52n18
$$ plain form
3581 -349 27 239 24 2 -172 -23 263 -230 -210 -155 49 151 65 -31 123 248 291 200 -101 39 -8 228 73
3604 73 -31 -86 271 -51 92 -219 -124 -134 -96 29 90 -42 -221 167 -54 -168 228 -142 -276 -264 -146 118
3626 118 -57 224 68 -138 -149 -125 103 -184 207 60 50 45 149 15 -94 -20 271 74 127 -87 84 -155
3648 -155 -276 -360 253 228 155 268 -19 -23 159 546 -161 198 130 -19 -10 -34 197 156 -152 151 29 -126 53
3671 53 64 59 -126 245 -336 7 163 -44 -41 103 -136 102 -166 -267 -127 6 212 -232 -275 -164 -232 -28 -93
3694 -93 102 35 -109 -131 84 78 -197 123 87 211 111 229 97 -293 -89 231 -11 -85 41 -259 252 -89
3716 -89 -202 15 13 -111 -90 2 -374 -189 -72 80 102 123 -168 348 -183 27 117 232 148 -20 -168 -483 -44
3739 -44 193 439 -184 36 22 -208 18 -87 -14 -41 43 -197 53 -134 78 -66 38 -382 -166 235 -67 -42
$$ packed form
3581c49L76K12k15k2j74J49K86m93K0N5K04J02q6r6J54J25M3r1l01J40m7K36j55
3604G3j04n5L57l22J43l11R5j0L8J25O1j32j79L88k21j14L96l70j34J2J18K64
3626A18j75K81j56k06j1K4K28k87L91j47j0nJ04j34j09P4K91j97N3k14J71k39
3648a55j21q4O13k5p3J13k87mJ82L87p07L59o8j49Rk4K31m1l08L03j22j55J79
3671E3J1nj85L71n81L43J56k07LJ44k39K38k68j01J40J33K06m44m3J11o8K04o5
3694i3J95o7j44k2K15ok75L20l6J24j00J18j32l90K04L20k42p4J26l00N11l41
3716h9j13K17kj24K1R2l76J85J17J52K2K1k91N16n31K10R0J15q4j68j48l15M39
3739d4K37K46o23K20j4k30K26j05P3k7Q4k40K50j87K12j44J04m20K16M01l02K5
$$ plain form
3761 -42 -60 48 138 -74 -268 -189 128 -21 -149 45 234 234 22 -39 -220 -75 2 82 15 123 32 103 46 -99
3785 -99 159 142 85 93 27 -100 -88 -124 -211 74 -204 192 104 -118 -94 -41 -276 -49 -176 -39 82 16 -268 87
3809 87 204 111 135 -81 45 -205 227 74 366 -159 378 275 346 221 108 306 255 73 -143 -71 224 -188
3831 -188 266 114 -29 -1 -140 -76 -42 -102 -107 250 69 -182 -52 56 -319 -29 -3 72 -304 11 -33 50 98 21
3855 21 127 -106 309 -40 234 7 -102 -324 -51 -106 -27 -103 29 9 99 -177 38 266 -9 -44 -34 278 -23
3878 -23 170 237 21 -283 -261 94 71 229 119 -65 369 -293 -83 -274 185 245 178 11 25 -58 79 -211 85
3901 85 38 103 -214 -287 151 -20 204 -92 -238 72 229 -164 -105 -132 -88 -133 190 180 -142 -14 140 -33 112
3924 112 110 244 67 -18 170 -142 -88 303 -92 -87 32 24 27 -95 93 -346 42 11 -197 -185 41 253 75 133
$$ packed form
3761d2j8J08R0k12j94P9L17j49j28J94J89%k12o1j81J45P7Q0o7J08r1P1n7j45
3785i9K58j7n7Qo6j27J2l6q7K85k78L96q8k22K4N3k35K27j27J37J21o6k84L55
3809H7J17r3K4k16J26k50M32j53K92n25N37j03P1j25j13J98n1j82k16P2K95m12
3831a88M54j52j43K8j39O4L4o0nL57j81k51J30J08l75K90K6P5l76L15m4Q3M8p7
3855B1J06k33M15l49K74k27j09k22K73n5P9p6J32k0R0k76K15K28k75l5J0L12l01
3878b3J93O7k16l04K2L55k3J58j10j84M34o62K10j91M59O0o7j67J4q3J37k90K96
3901H5m7O5l17p3M38j71K24k96j46L10J57l93N9k7M4m5L23j0l22J28J54j73J45
3924A12kJ34j77q5J88l12N4L91l95NJ19qLj22J88m39L88l1k08J2K26K12j78N8
$$ plain form
3948 133 209 392 243 -70 70 16 -81 48 -196 166 124 229 -431 -161 -303 53 -47 -85 175 -70 112 14
3970 14 -57 -22 242 143 37 67 249 -66 28 100 -83 151 -111 -31 -239 -194 -203 -24 -229 -231 -71 -141 -129 54 -68
3995 -68 -28 46 2 -64 -277 -205 63 96 -146 78 10 -98 -154 -70 -17 -156 -4 104 -17 27 44 245 88 191
4019 191 42 -76 -183 -88 -12 -48 115 -112 76 149 -127 -3 166 170 51 -3 40 60 109 92 200 78 212 -104
4043 -104 48 -241 -17 -136 -173 70 29 166 -161 -54 -30 -277 -66 2 -150 -110 317 28 -40 52 -53 165
4065 165 21 -11 -119 -174 -25 -25 54 -41 219 -64 69 -51 206 30 -7 -337 85 104 -265 80 356 -8 -329
4088 -329 -169 74 87 -129 34 -173 -141 -274 -67 229 -132 -225 -41 120 -127 0 49 -132 195 -146 -283
4109 -283 -31 323 -28 8 132 -3 -168 -61 113 -250 90 231 -59 -23 -113 -65 -156 128 367 98 277 -199
$$ packed form
3948A33P6J83j49l13J40n4r7J29k44L62m2J05o60K70j42L56j00l8K60k45J82r8
3970A4p1L5K64r9j06L0J82l15R4P2j83K34k62Q0k08M5rJ79k05kJ60p0J2J83j22
3995f8M0P4m4o6k13P2K68L3k42K24o8j08n6Q4N3j39J52J08j21M4J7K01j57J03
4019A91j49j18j07R5P6l6J63k27J88P3k76J24J69Mj19n4M3K0M9j7J08j22J34l16
4043a04J52k89K24j19l7K43m1J37l27J07K4k47K11O8j52M0M27k89o8R2j05K18
4065A65j44l2j08n5J49%P9r5K60k83J33j20K57j76l7l30M22J9l69L45K76l64l21
4088c29J60K43J3k16J63k07L2j33K07K96l61r3J84J61k47J27M9j81L27l41j37
4109b83K52L54l51L6J24j35j65J07J74l63L40J41k90L6r0M8r1K84K39k69J79m76
$$ plain form
4131 -199 69 202 160 248 -69 -162 140 35 119 -201 10 -108 -73 -6 -210 246 183 274 64 -197 11 -73 224
4154 224 -4 127 -119 8 -257 -2 296 135 -160 -104 149 35 168 -90 -113 101 29 -118 -212 -15 203
4175 203 109 -84 -305 395 -270 2 125 58 20 -16 67 132 -165 164 342 -29 -93 128 -60 51 334 298 86
4198 86 46 -226 201 188 45 -62 110 15 -323 -112 -27 131 50 88 -376 192 177 -68 27 -37 -304 33 368
4221 368 -60 106 0 192 -113 -283 -24 51 4 -15 122 -8 111 -153 -85 -199 97 -185 300 430 -199
4242 -199 -36 -58 14 292 27 -293 220 39 115 144 35 -74 -12 -6 -96 -250 5 245 366 29 9 382 100
4265 100 18 -148 127 -139 219 -23 -99 -81 -457 -105 101 263 60 -65 36 -89 -62 239 96 248 33
4286 33 -252 76 89 119 54 10 -95 127 176 242 -55 -175 -35 40 300 366 -21 200 -90 46 -109 -152 109
$$ packed form
4131a99K68J33m2Q8l17r3L02j05Q4l20K11j18L5O7k04M56o3R1k10k61K08q4K97
4154B24k28J31k46J27k65K55K98j61k95N6K53j14J33k58k3K14p2j47r4J97K18
4175B03r4j93k21P00o65K72J23o7l8l6Q3O5k97L29J78l71o4K21j88J11K83l6k12
4198H6m0k72M27j3j43j07J72r5l38K11Q5J58q1L8m64N68j5k45R5o4k67L37L35
4221C68m28J66j06J92l05j70K59P5m7j9J37j30J19k64O8j14K96k82M85J30o29
4242a99J63k2P2K78k65l20N13j81P6K9j09j09O2Or0j54K55K40J21l37k0L73k82
4265A00q2j66K75k66L58k42p6J8l76L52K06J62k03j25J01j25K7L01j43J52k15
4286C3k85L28J3L0o5m4j05K22M9O6k97j20J40P5K60O6l87K21k90J36j55m3K61
$$ plain form
4309 109 148 90 -253 -144 175 47 -40 -136 -11 -315 12 64 45 69 -38 5 -68 -73 163 97 -318 25 -351 -38
4333 -38 -81 253 -14 160 83 53 182 257 138 271 4 -261 106 -153 -51 33 412 137 -107 151 -61 44
4355 44 -16 -370 187 -86 73 -107 -216 -19 114 37 -142 -175 -83 25 196 61 -145 82 -126 42 38 -53 -239
4378 -239 -164 -159 37 -111 60 196 273 160 -138 71 201 68 -181 230 -40 70 -66 -32 159 109 230 232 -22
4401 -22 -65 75 -102 -13 410 18 289 -485 325 -205 -109 204 -111 220 -128 113 209 -303 -41 69 155 359
4423 359 -152 135 -204 184 -60 45 73 250 -35 -278 -82 -120 443 -152 62 139 -299 211 -14 -115 -35
4444 -35 146 -174 260 124 265 119 83 39 91 166 15 437 -104 64 -32 -98 -285 -168 1 -154 -178 -8 -9
4467 -9 258 -122 -35 29 244 -25 154 190 95 -124 -103 97 -27 138 106 210 -85 168 -347 130 -1 22 78
$$ packed form
4309A09L9n8l43J09L19j28q7r6J25l04L27N2j9K4j07M3p3nK36o6m15L43l76L13
4333c8m3L34k67J74p7l0J29P5j19J33k67k65L67k59J02Q4L79k75k44K58k12J05
4355D4o0l54N57k73J59j80j09J97J33p7j79l3R2J08J71j35k06K27k08J68mr1j86
4378b39P5NJ96j48J71J36P7j13k98K09J30j33k49M11k70J10j36L4J91n0J21Kk54
4401b2m3J40j77Q9M23l92K71p74Q10n30R6L13l15L31l48K41R6n12K62J10Q6K04
4423C59n11K87l39L88k44J05K8J77k85k43J96l8N63n95K14P7m38N10k25j01Q0
4444c5J81l20M34j36J41j46l6m4N2P5j51M22n41J68r6o6j87J17J69j55k4J70j
4467iK67l80Q7O4K15k69J79L6r5k19K1K00j24J65l2J04k95K53n15M77j31K3N6
$$ plain form
4490 78 -263 -84 -317 177 297 184 214 -61 61 -110 -135 -281 12 13 24 134 47 94 -85 144 42 65 -251
4513 -251 -193 20 -14 -104 70 165 -75 21 -170 -263 48 174 318 151 4 42 222 -71 -98 291 31 50 43 118
4537 118 226 182 -115 157 22 61 -161 -76 -132 3 103 97 -97 112 111 -128 81 -280 36 40 185 233 -206 -152
4561 -152 18 71 135 103 222 -133 -45 53 58 -233 209 379 270 -40 -17 -136 34 -122 99 167 -11 -273 104
4584 104 -253 20 -187 -33 251 146 5 -239 -12 -130 -176 -18 160 41 -215 50 97 93 126 -28 226 -190
4606 -190 124 -34 -117 204 -132 -69 -104 1 105 -186 88 146 84 -172 -281 133 157 -118 147 -31 -93 84
4628 84 -33 46 -90 169 94 146 -124 -192 33 258 93 -269 -10 -6 -152 419 46 -173 32 63 54 148 -369 -139
4652 -139 -21 201 145 18 -20 -126 26 -44 146 33 -76 -25 33 256 254 -139 -161 -65 29 -256 -139 28 123 -99
$$ packed form
4490G8l41J79k33M94J20j13L0k75J22j71k5j46K93JJ1J10q7M7j79K29j02K3l16
4513b51N8K13l4r0J74R5k40R6j91r3L11J26J44j67j47L8J80k93k7L89k60J9pP5
4537A18J08m4k97K72j35L9k22Q5n6J35J00oj94K09jk39K09l61L16MJ45M8m39N4
4561a52J70N3O4l2J19l55Q8R8Nk91M42J70j09l10K3j19J70j56K21O8j78k62L77
4584A04l57K73k07J54K84j05j41k44K27j18m6J58J78j19k56K65M7mL3j54K54m16
4606a90L14j58q3L21l36O3l5J05J04k91K74N8o2k56j09M14K4k75K65j78o2J77
4628H4j17P9j36K59p5N2k70o8K25K25j65l62K59Mj46N71l73k19K05L1rR4n17K30
4652a39J18K22n6j27l8j06J52p0J90j13j09N1N8K23kl93k2R6R4k85J17J67R5k22
$$ plain form
4676 -99 116 -33 -10 -83 -62 -46 -63 -14 -33 197 -48 21 -196 91 313 59 -199 230 97 139 77 -101 39 130
4700 130 274 -28 -145 -9 -55 -191 -12 -148 215 -23 -34 80 60 6 -92 -182 102 -309 -305 12 -146 35 -87
4723 -87 -52 -9 87 -200 -58 34 129 29 -13 58 86 95 -24 17 196 49 -98 -52 65 34 344 -105 -66 233 -163
4748 -163 84 274 0 12 82 187 229 69 -69 -101 35 157 -133 57 -265 33 -20 220 -123 120 -41 -18
4770 -18 -49 161 250 -69 -63 -28 -57 -272 -67 -202 51 -178 195 -168 75 68 96 -261 -290 35 -41 368 -13 286
4794 286 -28 50 -171 228 -88 46 -138 3 -282 -163 20 -107 82 19 91 104 91 220 111 368 77 -31
4816 -31 137 -35 -242 16 -9 127 38 208 20 -12 69 -2 147 -324 -180 -228 75 48 -42 97 -119 168 116
4839 116 333 -177 -131 -47 43 66 103 -78 -28 12 103 83 -107 113 -67 175 -335 103 122 72 -111 -21 238 46
$$ packed form
4676i9K15j49K3p3K1J6j7M9j9K30k45O9k17K87K22k54k58M29j33M2o2j78J40R1
4700A30J44l02j17J36m6j36J79j36L63k38j1J14k0n4r8r0K84m11ML17j58J81j22
4723h7L5M3R6k87J42R2R5j00m2P1K8Rj19M1J79j47j47M6J17l1L10m49L9K99l96
4748a63K47J90k74J2P0J05M2j60j38l2J36J22k90J90l22K98n3K40l43K43j61K3
4770a8l1K10Q9l19OL5k9k15K05j35K53k29L73l63K43pK8l57k9L25p6M09l81K99
4794B86l14P8k21L99l16J34j84J41k85J19J83j27J89o3P2J3j3J29j09K57k91j08
4816c1J68j72k07K58k5J36q9J70j88l2Q1p1J49m71J44m8L03k7r0J39k16K87n2
4839A16K17n10M6Q4R0K3L7j81N0M0R1k0j90K20j80K42n10M38J9n0j83R0K59j92
$$ plain form
4863 46 252 -198 -109 160 77 -10 -13 70 9 155 34 -67 -147 32 -83 138 -5 -63 184 -136 12 -124 -141 193
4887 193 -187 -41 91 -208 -40 -122 -71 253 -178 -140 86 65 146 188 -13 -322 -396 -180 124 135 -201 -52 -340
4910 -340 -97 290 -282 -12 -65 19 -79 -32 68 -11 -51 3 181 12 -173 -95 -27 -155 -174 62 250 -63 -45 -39
4934 -39 54 86 250 185 344 299 -109 -221 -109 185 -35 -248 141 -175 165 -42 -61 -54 -251 40 -118 300 -65
4957 -65 -143 103 14 164 25 -10 97 277 118 178 77 -11 63 118 -423 57 -57 80 108 107 -198 41 128 -134
4981 -134 -367 207 -288 -5 188 24 205 -136 -2 -223 -65 24 -6 328 254 194 -3 -51 -152 -106 169 -182
5003 -182 -79 29 215 121 81 264 318 -57 -133 131 211 179 -37 -114 90 29 -237 -127 -2 -321 -40 9 -105
5026 -105 152 15 -11 -137 18 49 -107 174 79 48 -221 1 107 26 -215 158 -31 -182 253 264 167 28
$$ packed form
4863D6K06m50Q9K69q3q7lQ3o1J46j21j01q0J79j15K21j43n8K47l20J48j36j7L34
4887A93l80J46J32k99J68q2N1L24m31L8K26k1Q1M2k01l09p4K16L04J1l36J49k88
4910c40K43L87n72K70n3Q4r8M7J00p9m0N4J78j69j85P8O8j28j9K36J88l13J8O
4934c9R3L2J64o5J59m5m08j12J12K94k20k13L89l16L40k07j9Pj97K91j58M18l65
4957f5p8K46q9J50j39l5J07J80j59O0j01q8P4N5n41M80j14J37K8jl05K39Q7k62
4981a34k33N74m95K83J93j64J81l41J34k21J58Q9l0L34p4o0j97m8j01M6K75l51
5003a82J03J08J86r4m0J83N4l75p6K64Q0l2k16p7K04o1k66J10J25l19K81M9j14
5026a05K57j37k6j26J55L1j56K81r5l1k69K22J06q1k41L73j89j51M35J1r7j39
$$ plain form
5048 28 57 -231 275 113 26 157 -56 314 -123 91 207 -40 27 158 233 -54 -9 -33 17 15 -233 -78 -122 -65
5072 -65 -82 135 -2 -122 -241 -146 -423 104 -195 54 -244 151 213 -119 20 -98 83 43 -172 343 -68 179
5094 179 85 130 5 1 -90 -1 21 58 -308 126 185 270 244 144 275 -18 379 -164 162 -216 146 -102 10 -271
5118 -271 -7 205 -184 -35 256 233 123 63 -37 329 -109 -513 -60 116 149 -24 -138 200 133 153 152 239 -228
5141 -228 -46 115 67 215 -81 75 -320 -40 -23 29 196 52 43 54 51 234 -343 -80 206 -29 -182 -166 194
5164 194 -122 -112 239 73 -36 135 38 -104 170 -203 -125 36 273 -77 8 -16 -280 -30 -242 199 121 -27
5186 -27 -69 100 -206 -308 173 -67 -92 42 44 250 9 -50 -55 -282 130 -82 80 61 -132 -66 343 182 15
5209 15 -136 -359 51 -52 -143 -113 -124 -37 -212 -238 9 -196 11 -77 -108 17 -38 -199 418 -141 -75 19 48 71
$$ packed form
5048B8K9k88N06j62q7J31k13L70m37K14J16k47O7J31P5k87M5k4N0kk48J55m4N7
5072f5j7K17j37j20j19R5k77N27k99K49k98L95O2l32J39j18J81m0k15N15m11K47
5094A79r4M5j25mr1Q9K2L7l66M34N9Q5k6j00J31k93L97n43L26l78L62k48J12k81
5118b71K64K12l89J49K91k3j10o0j00L66m38m04M53J76L3j73j14L38o7K0jQ7m67
5141b28J82J61m8J48k96J56l95K80J7N2J67j44rJ1lJ83n77K63K86k35j53J6L60
5164A94l16J0L51j66j09J71r7j42K74l73P8J61K37l50Q5k4k64K50k12M41p8j48
5186b7m2J69l06j02M81k40k5J34KK06k41n9nk27M12k12J62j9j93O6M09j61j67
5209A5j51k23M10j03r1L0j1Q7j75k6K47k05K07q8l1J25n5j61O17n59O6R4K9K3
$$ plain form
5233 71 6 272 187 -30 23 9 166 34 19 -128 -142 -5 -194 333 -297 -56 8 136 18 -19 -3 77 152 -560
5257 -560 -149 2 -232 -104 59 -121 56 265 -91 -372 144 -8 -191 -154 241 -49 -64 -334 -57 63 -57
5278 -57 186 82 -260 116 -70 -20 -252 -86 -191 -102 -185 -153 211 -186 -367 -136 -90 258 49 322 -2 102
5300 102 256 -67 360 138 185 -276 377 -8 -83 13 -251 -73 -178 86 -97 -193 119 -129 -126 146 129 -61
5322 -61 -29 95 -110 277 24 83 -50 -114 284 97 297 7 111 8 -25 -26 275 -161 -28 116 -134 -9
5344 -9 -87 -188 -41 -30 -58 -7 37 -35 -123 -237 -71 -40 401 -65 -128 -134 -38 -16 -1 -190 -93 134 112 23 216 -275
5370 -275 30 -5 159 125 197 -192 -27 13 -480 -191 233 -4 -48 179 -97 -56 -143 -185 -176 -184 -282 -69 251 76
5394 76 66 -45 69 -21 -156 -177 -348 -297 -51 -127 -28 44 320 62 205 -72 186 -92 -87 -159 5 -52 -75 166
$$ packed form
5233G1o5K66q5k17N3j4J57j32j5j47j4J37j89N27o30K41O4J28j18l7J6Q0P5p12
5257e60M11J51k34J28J63j80J77K09l56k81N16j52j83L7L95k90j5k70K77J20j20
5278e7K43j04l42L76j86N0k32J66j05Q9q3L2L64l97j81K31M6L48k09K73l24J04
5300A02J54l23M27k22M7m61O53l85p5R6k64J78j05K64j83r6L12k48LK72j7j90
5322f1L2J24k05L87k53N9j33o4L98j87K00k90J04j03l3jL01m36J33J44k50J25
5344ip8j01J47J1k8N1M4p2q8j14J66L1M41m66o3oR6K2J5j89R7K27k2q9J93m91
5370b75L05l5J64l4P2l89J65M0m93K89M24k37m4K27k76M1q7m2Rqr8K13L20j75
5394G6j0j11J14r0j35k1j71N1K46p6R9P2K76k58J43k77K58k78Np2J64n7k3K41
$$ plain form
5418 166 58 -76 -308 -346 -85 25 340 155 -255 258 -54 -199 226 -112 -141 -35 135 -64 -16 -279 -113
5439 -113 35 9 -1 -74 69 -77 -92 -23 -287 -234 383 155 -106 -151 -204 -127 -111 -184 76 -146 -176 -79 -142 40 94
5464 94 9 -61 348 41 184 -2 10 -138 -157 -32 126 -213 367 141 -29 -16 -37 -360 224 366 -55 -202
5486 -202 54 -262 252 97 -8 15 -1 53 36 -323 75 224 166 -37 -28 7 -24 -153 -83 276 -323 -13 -38 -17
5510 -17 -232 -70 -22 241 76 -44 -63 117 101 -152 202 -75 113 300 23 -43 2 -139 -173 -308 14 -20 -25
5533 -25 -196 191 32 -231 -143 -80 -8 86 -85 -56 -192 -171 175 89 -47 -1 -30 141 2 31 -100 -255 -289 -150
5557 -150 12 281 308 -62 -32 -167 -188 -77 45 -37 -38 -11 -139 -14 426 -108 207 -170 13 -7 18 -128 -26
5580 -26 356 -262 79 76 333 -174 184 63 -141 225 -66 55 188 -173 -142 -6 409 149 -316 5 -28 148
$$ packed form
5418A66j08j34k32l8K61J10L15j85m10N13l12j45M25l38k9J06J70j99M8k63J66
5439a13J48k6j0p3J43j46j5O9k64N3O17k28k61m5n3P7J6p3K60k22l0R7o3J82N4
5464I4q5p0M09l07J43j86J2j48j9J25J58l39N80k26j70J3k1l23N84J42m21j47
5486b02K56l16N14j55j05K3j6N4j7l59L98J49n8k03RL5l1j29P0L59n99L10k5K1
5510a7k15J62M8K63j65j20j9J80j6k53L54k77J88J87k77o6M5j41l4j35L22l4n
5533b5j71L87j59k63Q8O3P2R4j71K9j36K1L46q6j36M6k9J71j39K9j31j55l4J39
5557a50J62K69K7l70L0j35k1J11J22q2jK7j28J25M40n34L15l77J83k0K5j46J02
5580b6L82o18L41lK57n07L58j21k04L66k91J21J33l61L1J36M15k60m65L21l3J76
$$ plain form
5602 148 -98 14 -120 25 -189 -115 21 57 -137 -63 -83 -53 157 -123 133 -467 41 71 97 -264 -75 1 -37
5625 -37 251 16 68 15 -204 201 148 42 -90 75 -15 -156 -254 31 -94 -160 94 -91 -176 148 -440 -268 41
5648 41 -8 -96 -157 -258 -178 21 -78 -90 -159 80 -1 -39 75 -173 -210 -78 39 -286 -44 10 322 -10 123 -264
5672 -264 -10 -117 -15 -80 -34 -43 -25 -112 -94 -88 100 252 -248 29 -87 -75 -125 -36 121 27 46 143 -37 122 -147
5697 -147 46 119 117 46 -77 -48 -205 21 134 -4 -98 -347 316 -70 -182 -158 60 111 -110 12 -38 -134 281
5720 281 -325 185 -443 -267 -42 -126 -25 -35 -53 -2 78 -14 -234 338 -96 -220 -53 -87 -47 -191 -53 18 -106
5743 -106 -110 -305 -269 90 118 37 -173 -158 -126 -40 -217 -79 49 -54 -100 -19 204 71 -8 85 115 50 169 -37 64
5768 64 -439 149 155 -93 14 214 73 -121 -37 -284 39 -9 -187 -65 293 52 278 -247 358 37 -52 -74
$$ packed form
5602A48k46J12j34J45k14P4J36L6j94P4k0L0K10k80K56o00N08L0K6l61J89P6l8
5625c7K88k35N2n3k19M05n3j06j32J65r0j41r8K85j25o6K54j85q5L24n88J72L09
5648D1m9q8o1j01Q0J99r9j2o9K39q1l8J14k48l7J32J17l25K42N4L12l32J33l87
5672b64K54j07J02o5M6rJ8q7J8OJ88J52n00K77j16J2n0Q9J57r4J9R7j80J59k69
5697a47J93P3kp1j23K9j57K26J13j38r4k49O63l86j12K4K18N1k21J22n0r6M15
5720B81o06N10o28J76K25q4J01j0j8N1Q0r2k20N72m34j24J67l4M0j44J38P1j24
5743a06mj95L6L59K8q1k10J5L2Q6j77J38J28j03m6Q1K23j33p9R3L0o5J19k06J01
5768F4n03N88Ok48J07K00j41j94Q4k47L23m8j78J22L58k41K26n25O05l21q9k2
$$ plain form
5790 -74 -380 76 94 -193 -141 100 -40 123 -284 212 14 27 -138 -134 -143 249 165 72 151 -4 11 52 352 -94
5814 -94 236 -195 -306 104 12 -167 -194 -4 -173 -73 -162 -250 -208 -6 -186 -95 -223 7 106 -257 -361 -19 -126
5837 -126 -101 -106 280 52 -262 -55 -190 32 63 193 14 -5 94 -36 -50 138 338 29 -3 -347 -35 -97 -6
5860 -6 33 91 9 -15 72 177 99 254 15 -59 301 106 12 48 -17 -194 -297 68 84 1 135 -48 118 -310 -59
5885 -59 258 108 -116 35 -218 201 146 184 -178 -213 44 -41 83 40 -8 -141 86 156 -170 152 150 132 136 -135
5909 -135 123 -63 -30 -96 90 -130 135 200 -314 24 274 -295 -173 -68 -103 -193 -35 244 -223 -195 15 56
5931 56 78 109 278 103 160 58 17 150 78 -80 73 -5 -64 -232 -18 -292 -284 -311 78 -115 4 -117 -17 463
5955 463 -130 18 -173 -125 -5 -74 486 -11 81 -125 14 -144 -112 307 -25 53 275 -45 -141 87 -90 -79
$$ packed form
5790g4l06M56J8k87N2K41j40J63m07M96j98J3j65MrL92q4r3P9j55J5M1L00m46
5814i4L30m31j11M10r2j79k7J90j69J00q9q8M2K02j80R1j28K30R9l63j04L42j07
5837a26K5nL86k28l14K07j35K22L1J30j79j9R9j30j4J88K00l09l2l44L12o2R1
5860fL9N8q2k4Q7J05p8J55k39p4L60j95r4L6o5j77j03L65J6q3J34j83J66m28K51
5885e9L17j50k24J51k53M19n5L8l62l5K57q5J24m3m8j33K27P0l26L22kj8Mk71
5909a35K58j86L3o6J86k20K65O5n14L38K50n69J22J05l5r0J58K79m67K8K10M1
5931E6K2L1J69j75N7j02m1J33p2j58J53p8n9j68K14k74Qk7L89j93J19j21J00M80
5955D63n93J48j91M8J20o9N60m97R2k06J39j58L2M19l32P8K22l20r6K28j77J1
$$ plain form
5977 -79 -6 -136 157 44 -45 -75 -267 149 14 -97 -205 37 131 185 -279 233 120 -120 -29 -231 -28 8 91
6000 91 -23 192 62 -32 -10 73 -251 17 -5 80 159 -73 47 -134 129 56 -38 -105 -404 -233 196 -145 124
6023 124 2 117 350 -39 -77 241 -129 -8 -76 34 214 -133 -130 -46 116 -417 381 -178 114 -75 96 297
6045 297 392 -199 -133 -18 60 200 28 -184 -120 165 -180 -214 68 202 1 -60 -159 153 -184 -75 144 11
6067 11 -16 195 62 -202 118 84 64 59 -35 -67 -90 80 -133 139 -19 114 142 346 -28 218 215 -245 -78 166
6091 166 321 90 -232 -175 -29 233 -145 240 46 272 -201 -46 52 92 -18 105 58 29 57 143 89 98 -8
6114 -8 161 216 39 344 -121 -152 -408 -34 -227 -139 198 -219 47 156 -96 82 -120 -237 239 32 -69 333
6136 333 -94 63 145 -93 130 39 -117 357 138 -27 146 18 79 -31 -44 -27 115 229 -201 -211 -18 -104
$$ packed form
5977g9P3j30K93j13q9l0j92M16j35j11j08K42R4N4m64N12j13k40R1k02K03L6Q3
6000I1j14K15j30r4K2Q3l24K68k2Q5P9k32J20j81K63p3r4o7k99J71M29l41K69
6023A24j22J15K33l89l8L18l70J21o8J10J80l47LQ4J62n33P98n59K92j89J71K01
6045B97R5n91O6J15P8J40j72k12O4K85l45l4K82J34k01o1r9L12l37J09K19j33
6067A1k7K11j33k64L20l4k0nr4l2k3J70k13K72j58J33K8K04l74K46lm60J67K44
6091A66J55k31l22N7J46K62l78L85j94K26m73J55R8M0j10J23m7k9K8Q6n4Rj06
6114hJ69N5j77L05m65l1k56L74j93Q8L37m17K66J09k52J78k02j17M76k07j01M02
6136C33m27J57Q2k38K23r1j56M74k19j65J73j28O1j10j3J7J42J14m30j0J93q6
$$ plain form
6158 -104 -6 -105 -190 -266 -33 -317 -93 194 -381 117 130 185 247 80 -300 133 73 -152 8 30 -255 70 311
6181 311 -66 55 -11 -157 46 -135 6 226 128 336 -190 100 92 61 170 96 85 0 95 26 76 9 -47 70
6205 70 133 -223 226 -218 -84 -249 94 -159 -92 107 91 53 33 93 -39 328 48 110 129 -5 -91 -128 83 91
6229 91 -191 -166 57 -142 -151 131 130 -192 -55 233 237 250 69 36 -310 -88 -121 133 -50 -45 -12 -154 -236 -135 -154
6254 -154 -24 18 -22 261 -88 -226 146 -35 16 -177 -196 -57 -165 113 -187 72 -110 -50 -168 10 139 -185
6276 -185 -53 223 -88 168 -278 102 380 143 140 59 203 38 464 -87 -138 -128 -300 69 210 274 261 298 339
6299 339 -75 198 116 89 62 222 234 6 -83 -173 76 262 -71 -91 61 -217 -112 75 56 119 -73 25 -21 102
6323 102 -102 -60 163 -39 -81 -90 67 -33 45 82 -167 50 25 -56 131 150 -200 271 30 -200 291 -232 87
$$ packed form
6158a04R8r9q5p6K33k84K24K87n75M98J3N5O2j67l80M33o0k25J60K2k85L25K41
6181C11l77J21o6j46K03j81J41K20r8K08n26K90ql1J09p4j1q5R5o9N0o7n6J17
6205G0O3l56M49m44J34j65L43k53O7J99j6l8k0O0j32L67k80O2J9j34q6l7K11Q
6229I1k82K5K23j99rK82jl22J37K88MJ3j81l3l46K22l3K54j83NL3j42q2J01j9
6254a54J30M2m0K83l49j38L72j81N1j93j9J39j08K78l00K59j82O0j18J78J29l24
6276a85J32K76l11K56m46L80K78k37lq1J44j65M26n51n1J0j72L69J41O4j3L7M1
6299C39m14K73q2k7k7J60J2k28q9r0K49J86l33k0J52k78J05J87j9O3j92R8m6J23
6323A02k04M2K23k02m2rJ57j00P8L7k49K17k5q1J87J9l50M71k41k30M91n23L19
$$ plain form
6346 87 152 153 27 -8 49 -327 -169 261 15 55 224 -8 24 -209 -143 254 -276 122 -32 300 -124 172 211
6369 211 69 44 -73 93 -71 -40 -77 -132 -39 54 -142 183 -250 220 26 -118 243 -252 91 122 237 1
6391 1 -7 -21 -50 -78 -125 126 80 -208 -5 -216 -45 187 122 169 52 279 -28 -60 -28 67 113 343 261 -11 -83 140
6417 140 11 29 -330 -17 1 47 -57 80 -250 315 0 -264 290 363 -276 -406 -216 -214 -103 -15 8 -177 219
6440 219 120 -173 122 56 -43 -51 7 103 -159 17 130 109 -70 24 -23 172 -33 4 21 18 236 32 -70 -137 221
6465 221 -87 175 1 -254 -18 -206 -360 -62 186 158 -101 95 -74 225 -13 -120 -211 95 38 -354 -61
6486 -61 39 -18 -120 62 -322 -102 64 86 145 -46 -3 -207 -142 -67 -27 71 -30 -138 -44 174 -27 -212 -189 225
6510 225 -40 18 -38 74 -94 181 227 117 -441 -259 80 3 -12 -306 -94 266 39 178 152 189 191 -184 -224
$$ packed form
6346H7O5Jj26l5N7l76J58M30k46M0J69k32L2k33O6L97n30L98j54L32m24K96L9
6369B11j42k5j17J66j64L1l7n5R3R3j96L25m33M70j94j44L61m95L43L1J15k36
6391Aqj4k9k8m7K51m6k88K03k11J71K32o5M7j17K27l07l2L2R5M6K30q2k72p2K23
6417A40j29J8l59L13J8M6j04J37l30N65l15k64N54P3o39j30J90KJ11Q8K3j85L96
6440B19r9k93K95o6r9qN8R6k62J76J13k1j79R4m7J95k05L7J7lK18k04j02o7L58
6465B21l08K62j74k55K36j88j54K98K48k8k59J96j69K99k38j07r1L06n7l92K93
6486f1J00n7j02J82l84K20J66K2N9j91M3k04O5P5M0R8j01j08R4K18k01j85K3M14
6510B25k65N8n6J12j68K75M6j10n58J82L39p7j5k94K12L60k27J39k6L7Kl75m0
$$ plain form
6533 -224 460 30 -300 115 -14 -46 239 31 166 -180 153 -227 207 269 -82 -130 -51 -192 -13 -98 2 180
6555 180 157 119 -44 -60 82 201 -183 275 -56 14 -337 20 -254 93 -175 97 0 276 67 -68 350 -212
6577 -212 117 -26 -102 17 -106 -94 -21 -8 23 28 110 -198 147 298 53 -136 -70 154 27 -4 -110 -265 152
6600 152 -137 -339 79 245 66 -157 -132 35 -41 -14 133 -131 -96 222 -66 298 -5 111 -218 -60 -402
6621 -402 -44 -41 -68 -189 -1 -25 -55 190 -137 -57 -257 -70 67 -24 76 81 176 104 147 186 132 -27 -9 82 -310
6646 -310 -39 235 -171 -398 -64 14 275 -111 -110 -42 -225 -114 35 -261 -41 29 268 -19 3 42 110 -9 150
6669 150 -36 54 -13 229 -332 95 134 -275 -253 -53 -161 -242 -150 -14 40 -214 316 150 -139 -185 -154 -19 -132
6692 -132 345 -41 -74 316 38 -44 -165 -420 -31 -146 130 38 115 -97 -63 -40 94 -334 -222 54 -172 128
$$ packed form
6533b24O84m30l30M15j29l2K85k08J35l46L33l80M34O2l51m8P9j41J79q5J00J78
6555A80k3l8j63j6J42J19l84M58l31P0l51L57k74L47k68K72r7K76k09j35M18n62
6577b12L29j43p6J19j23J2P3J3L1NQ2l08L45J51k45j89O6K24j27l1j06j55M17
6600A52k89k02M18J66j79k23K5J67p6K7J47k64L5L18k88L64l03J16l29J58l42
6621d02L58Lk7j21J88k4l0K45l27Q0k00J87J37r1J00NR5p2M3L9n4j59J8R1l92
6646c10K71K74m06k27L34P8K61l86JO8j83J11J49k96K20P0K39k87K2L9O8j19J59
6669A50j86R0o7K42n61M27L9m09K2K00j08q1R2J36N4k54N30j66k89m6L1J35j13
6692a32M77l86l3L90k78q2j21k55L89j15K76r2P7k12L4K3J34m28J12K76k26L00
$$ plain form
6714 128 101 105 97 159 293 -169 -194 87 -204 -46 -29 -87 48 20 85 72 279 68 377 -173 -154 87 -178 123
6738 123 26 -125 159 92 211 59 186 -116 162 -299 87 -28 -179 -84 -96 -119 -142 -288 26 -5 5 95 49
6761 49 126 -37 -253 53 -75 -22 15 -109 -65 -150 -64 110 123 168 -218 -257 28 -183 -153 -96 -327 396 125 95
6785 95 81 68 -141 -221 -8 168 -128 -217 -155 121 -122 206 13 127 190 -24 198 -58 -32 -105 -138 16 184
6808 184 -137 49 -189 18 233 110 41 159 69 -66 15 146 -46 -32 -234 -168 -190 -78 131 113 -242 173
6830 173 -130 85 -155 -157 -162 188 67 -173 283 -21 218 -50 53 25 91 -16 -161 -329 236 57 158 -21
6852 -21 -54 40 67 219 45 265 96 -257 101 -202 -85 -103 153 266 -170 38 -334 -84 -131 -116 -185 -52 -70
6875 -70 17 233 -94 -174 -182 160 140 -200 -212 -285 -61 -85 -123 141 5 -181 49 -202 -185 130 -64 184 -47 123
$$ packed form
6714A28k7MqO2J34m62k5K81k91J58J7n8J35k8O5j3K07k11L09n50J9K41k65L01
6738A23r7j51K84o7J19j52J27l02K78m61L86j15j51R5j2k3k3j46L14l1J0R0m6
6761D9P7j63k16L06j28N3L7j24M4q5Q6J74J3M5l86l9K85k11L0N7k31P23k71l0
6785I5j4j3k09q0K13J76k96q9O2K76k43L28j93J14O3k14K22k56K6p3l3J54J68
6808A84l21J86k38K07K15j23o9J18r0j35Q1J31j92J4k02O6k2J12K09j8l55M15
6830A73l03K15k40knL50j21k40M56l04K39k68J03k8O6j07j45j68N65j79J01j79
6852b1l3R4K7J52j74K20j69l53L58l03J17j8K56J13m36K08l72K50m7J5o9J33j8
6875g0Q7K16l27q0qL42k0l40j2p3K24k4l8K64j36j86K30k51J7L15j94K48k31J70
$$ plain form
6899 123 -222 -120 -75 30 264 -53 59 -124 51 -39 -70 -156 165 30 -130 -92 85 -153 293 -77 58 67
6921 67 59 -228 -274 -30 243 120 153 74 382 -359 -76 145 -30 24 9 36 136 -160 -189 -37 203 224 -201 -33
6945 -33 -106 79 -136 -62 -186 178 189 -179 -2 -256 -20 195 -18 200 234 147 -35 -54 -208 -120 253 134 94
6968 94 59 -201 2 122 -348 43 -82 17 52 180 240 14 232 -124 266 -140 -28 5 45 189 92 87 -16
6991 -16 -360 181 -133 55 432 162 83 -136 87 487 196 -245 -162 -163 326 66 97 210 -186 6 -392 125
7013 125 -10 -39 -92 0 37 422 30 3 -59 0 -167 92 39 118 -245 -102 -34 -45 -258 25 -126 -113 -156 -86 -200
7038 -200 -131 159 292 152 -50 243 17 -57 207 -106 -201 -71 64 25 -69 31 -242 172 -150 -174 66 226
7060 226 220 306 143 -132 -319 -73 -16 26 -38 86 -214 237 37 -157 73 52 -95 -253 -71 -27 -87 11 207
$$ packed form
6899A23l45J02M5J05K34l17J12j83J75r0l1q6L21j35j60L8J77k38M46l70J35R
6921F7qk87m6K44K73j23L3p9L08p41K83K21j75N4j5K7J00k96k9J52K40K1m25J68
6945c3p3J85k15P4j24L64J1l68J77k54K36K15k13K18L4q7j82j9j54Q8L73j19m0
6968I4l5k60K03J20m70L91j25R9L5J28O0k26K18l56L90m06J12L3M0J44r7nj03
6991a6l44N41l14J88L77k70p9k19K23M00k91m41Q3jM89k60L1J13l96J92l98N17
7013A25j35k9n3R2L7L85l92k7o2N9j67K59n3P9l63J43O8j1k13K83j51J3m3P0j14
7038b00O9K90J33j40k02K93k26p4K64l13r5J30J35l9r4J00k73M14l22k4K40J60
7060B26oQ6j63k75j87K46N7M2o4J24l00M51k00j94K30k1j47j58J82M4o0R8J96
$$ plain form
7083 207 172 152 68 13 -84 -70 -177 -112 75 -181 237 50 -115 45 -68 29 189 99 -146 -51 -307 -24 -200
7106 -200 -70 -116 191 -53 102 241 -67 284 -427 125 201 -90 -65 230 172 135 -5 135 -110 -29 -13 -99 -117
7129 -117 74 7 81 5 -194 119 105 117 64 -105 77 -58 -51 -150 -72 -30 57 249 -49 -155 186 -103 253 -132
7153 -132 41 -376 -221 -248 -102 -148 56 -36 309 21 117 -212 34 196 -93 61 0 17 1 167 -56 -80 211
7176 211 162 -97 -86 -198 -71 -45 97 -43 -39 -32 -82 -268 -28 190 -107 89 12 75 67 -3 -42 -269 144 85 -45
7201 -45 6 -214 -49 -233 2 -145 101 148 136 -99 -24 60 -97 -77 55 -212 68 261 -14 52 18 38 436
7224 436 -196 61 -71 -124 -82 -25 280 -19 44 81 126 66 -107 335 -111 -114 -42 293 17 -130 -168 16 -50 -63
7248 -63 49 -130 -106 106 -9 6 52 -235 191 128 -39 170 -55 -151 -10 178 -140 189 9 -149 -91 228
$$ packed form
7083B07l5k0q4n5r7J4j07O5J87k56M18j87j65J60j13R7J60r0k45R5k56K83j76
7106b00J30m6L07k44J55J39l08L51p11N52P6k91K5K95n8l7j40J40k45Q1J6q6j8
7129a17J91o7P4p6j99L13j4J2n3j69J82j35Pr9P8M2Q7J92k98j06L41k89L56l85
7153a32J73m17J55k7J46m6K04r2L45k88R6l29K46J62k89J54o1J7j6J66k23k4K91
7176B11m9k59J1j12J27K6J42j40MPn0j86K40K18k97J96p7O3qp0l9k27M13n9j30
7201d5N1k20J65j84K35j47K46M7j2k35P5Q4j57K0J32k67K80J93k75O6l4K0L98
7224D36o32K57j32n3M2N7L05k99O3L7M5o0j73M42m46lP2L35k76j47l8J84o6j3
7248f3J12j79K4K12j15J5M6k87M26o3j67K09k25r6J41J88l18L29j80j58N8L19
$$ plain form
7270 228 -124 -142 105 374 -265 194 248 62 208 -73 9 -91 -3 -11 -85 5 207 -364 -188 220 -125 275 104
7293 104 193 184 -62 38 100 -282 87 167 -236 -46 131 -321 -155 -69 -109 -220 -136 -29 114 -62 -166 232 -77
7316 -77 -362 200 154 -43 -161 436 -314 -205 297 -196 -95 323 -99 30 140 -167 -163 50 -22 -47 130 -65
7338 -65 5 -123 213 -41 169 -411 -152 195 184 -309 -126 -114 299 116 -95 -126 -262 67 -149 -98 -126 35
7360 35 -79 280 -187 -162 -234 -117 68 -114 -247 264 -227 100 155 -38 -419 71 139 -194 159 45 -119 104
7382 104 -35 83 365 126 39 176 60 -384 212 -143 218 335 33 11 294 132 104 -29 433 -7 -84
7403 -84 231 138 10 27 74 -123 -131 189 -121 -60 -80 237 276 -312 -402 52 -201 137 -10 -163 122 -120 -17
7426 -17 -186 -8 28 300 -77 -117 -108 -207 -127 217 -223 56 -95 114 235 148 313 -74 -206 93 -25 37 181
$$ packed form
7270B28l52j8K47K69o39M59N4j86J46k81Q2j00Q8qp4R0K02n71J76M08l45M00j71
7293A04Q9rk46J00O2l82L69Q0m03J90J77m52J66Q6m0j11Q4J07J43j76j04L98l09
7316g7k85N62m6j97j18N97p50J09N02m93J01M18m22J29J10l07MK13p2k5J77j95
7338f5P0j28L36k54K10n80K59L47j1m93J83J2M13j83k11l1j36L29k16N1k8J61
7360C5j14L59m67K5p2J17J85j82j33N11m91L27N5j93l81M90O8l33L53j14j64K23
7382A04j39J18K82k39q7J37j16m44N96l55L61J17l02k2K83j62k8j33M62m40p7
7403h4L15r3j28J7M7j97qL20l10O1k0L17L9n88r0M54k53L38j47j53K85k42J03
7426a7j69J78L6K72l77m0Rr9Q0L44m40K79j51K09J21q7J65l87j32K99j18O2J44
$$ plain form
7449 181 43 42 -10 52 -59 -48 -131 -54 -273 -272 -198 179 -79 -167 -108 -162 -78 95 6 110 -9 178 271 24 -325
7474 -325 -45 -276 -30 -104 51 -113 -10 -301 129 -72 -193 75 218 -107 -69 -17 -251 116 295 173 -13
7495 -13 -56 64 -125 -220 274 41 -105 -60 -116 -161 -190 -16 -217 -18 -3 -117 130 46 91 -43 -30 -157 371 -77
7519 -77 -3 23 -18 19 260 153 176 -50 -179 40 60 -24 -121 -126 -13 -94 258 -14 228 132 -502 52 3 121 370
7544 370 -21 -284 178 108 187 101 41 125 -175 297 -255 23 161 -66 181 34 -183 -29 50 -88 39 120
7566 120 -149 121 -355 -79 -28 22 -155 -91 292 -187 -5 238 -103 2 -233 -268 36 -40 -253 -98 154 -159
7588 -159 -101 -175 104 102 -59 -128 108 88 -232 224 -31 251 136 -130 -82 -133 118 0 114 -19 293 -104 257
7611 257 164 -92 -316 94 119 -39 18 178 -21 -61 -98 70 220 -50 20 -115 -188 422 275 94 -19 -223
$$ packed form
7449A81j38jn2O2j11J1q3P7k19JP4L77k58q8N9n4Q4J73q9J04j19J87R3k47l49
7474c25K80k31K46p4J55j64J03k91M30k01j21K68J43l25L8N2k34L67J79j22j86
7495a3m3J20j89r5M94k33j46M5n6m5k9J74k01J99J5j14K47q4M5j34J3j27N28m48
7519g7P4K6m1L7K41j07K3k26j29K19K0q4r7nJ13q1L52k72K42r6o34N54m9J18K49
7544C70l91k63M62p0P9q6o0Q4l00M72n52K78J38k27K47j47k17J54P9j38J27Q1
7566A20k69K70m76K76N1N0j77O4L83m79J82K43l41J05k35l5L04p6k13J55K52l13
7588a59N8p4K79kj61o9K36k0l20M56k55K82j15k66M8n1K51j18J14j33L12l97L61
7611B57r3k56k24M10K5j58N7J60j99m0l7J68J50k70P0j35p3O10j47j81j13k04
$$ plain form
7633 -223 -127 97 -222 17 119 16 -128 -85 -189 146 48 44 151 -98 156 138 317 170 121 74 -34 -98 77
7656 77 -183 -136 275 -10 58 110 64 155 -24 151 69 191 -180 181 49 -74 255 38 -9 79 47 73 -380 60
7680 60 176 249 -45 171 103 -209 -155 31 -295 69 -114 -213 -112 -135 -72 21 101 163 17 25 11 159 -126 14
7704 14 166 204 -75 75 197 -92 95 66 26 -35 -11 14 2 -20 16 -79 -139 64 256 -54 -9 220 9 37 349
7729 349 84 61 -98 84 147 -195 -100 -304 -161 56 121 -251 4 -29 -120 69 49 -43 -115 31 -25 -96 106 339
7753 339 262 96 -275 -185 -89 -119 -61 75 -330 154 -91 105 49 -210 56 -10 27 -75 -183 -25 154 -100 -205
7776 -205 -137 200 -248 32 -179 173 -7 -127 134 118 354 -117 -19 52 -113 71 -23 -201 -36 246 86 -70
7798 -70 215 -161 -158 -104 229 -95 51 279 80 17 -166 31 -98 -31 -14 -101 77 -95 95 108 128 -5 -197
$$ packed form
7633b23R6K24l19K39J02j03j44M3j04L35r8mJ07k49K54j8J79j47m9m7j08o4J75
7656G7k60M7M11k85O8N2m6R1j79J75q2J22l71L61j32j23L29k17m7Q8l2K6m53M40
7680F0J16P3k94K16o8l12N4J86l26L64j83r9J01k3O3R3Q0O2j46Qj4J48k85J40
7704A4J52L8k79J50J22k89J87k9m0o1K4K5j2k2L6r5o0K03J92l10M5K29k11K8L12
7729C49k65k3j59J82O3l42R5k04J43K17O5l72K55l3r1J89k0r2p2J46n6p1K02K33
7753C39p7j66l71R0R6l0N8J36m05M84k45J96n6k59K66o6L7j02j08J58J79k54j05
7776b05O8L37m48K80k11L52j80j20K61j6K36m71R8P1j65J84r4j78J65K82j60j56
7798g0K85l76LN4L33l24J46K28j99o3j83J97j29O7J7q7J78j72J90J3K0j33j92
$$ plain form
7821 -197 154 73 -39 -45 -46 4 -200 316 -61 232 -112 29 27 89 -256 72 306 272 -121 192 214 203 114 46 220
7846 220 215 167 216 -25 -154 125 -271 12 -198 272 32 -253 64 344 -145 259 34 -211 76 -197 -1
7867 -1 80 163 -73 -207 27 111 9 -39 87 41 -308 -10 151 -229 -32 -155 157 -7 -188 -27 44 49 203
7890 203 181 -254 -333 152 178 -16 -6 262 35 74 -222 -244 157 -186 140 45 42 301 -176 201 116 363 -82
7913 -82 115 -59 -108 -9 119 212 93 79 -233 -75 -49 4 219 -80 71 67 557 33 -108 380 -199 81 228
7936 228 -155 245 -15 -153 -54 224 104 -58 96 -236 -89 7 151 -22 -3 -277 -180 -200 107 -121 -138 51
7958 51 -33 -198 -108 -88 -219 -23 -43 -179 -41 171 18 139 -74 -38 -42 -163 -189 -156 -66 82 -17 184 -160 110
7982 110 -16 -101 -226 166 -157 97 306 -51 42 -112 -213 -173 217 -321 93 -74 228 462 -68 84 -61
$$ packed form
7821a97L51q1j12ojN0k04N16l77K93l44J41kO2l45L28K34l4l93L13K2j1q9o8J74
7846B20nm8M9k41j29K79l96K83k10M70k40k85L17K80m89M04k25k45K87k73J96
7867aQ1Q3k36j34K34Q4j02m8J26m6l49K98J61l80J97j23L12j64j81J61P1NJ54
7890B03k2m35p9M85K6j94J0K68k27L9k96k2M01l43L26r5lK59m77L77q5K47m45
7913h2J97j74m9R9J28R3j19j4l12J58K6N3K15k99J51mM90n24j41M88n79K80J47
7936B28l83M00k60j38R9K78j20j62J54l32J47R6J44j73J9k74R7k0L07k28j7J89
7958E1q4j65R0K0j31J96k0j36J38K12j53J21k13L6mj21k6L3R0J48r9K01l44K70
7982A10j26q5j25L92l23K54K09l57R3j54j01M0L90n38M14j67L02K34n30J52j45
$$ plain form
8003 -61 -189 -119 70 81 -168 -278 192 401 33 54 26 74 -20 -152 158 -18 -311 386 -94 -136 218 -8 244
8026 244 -127 176 -155 13 246 320 -377 110 -60 130 -1 65 28 -9 65 -192 68 -75 -72 151 -172 -213 -127
8049 -127 -98 -31 77 190 261 130 -117 108 -13 93 -205 -6 -137 -110 43 -46 -79 -123 84 -57 124 116 -121
8072 -121 -4 -259 153 135 -137 -261 27 218 -116 69 52 254 -211 136 220 -44 63 -105 65 93 -29
8093 -29 109 -40 -234 -302 -112 118 223 68 85 117 37 -169 130 317 -155 167 171 -224 189 42 288 129
8115 129 14 -72 -21 32 187 -124 151 -13 -7 343 -123 263 -158 -36 -518 39 68 -20 -115 56 -128 -24 97
8138 97 -229 116 191 64 -1 -102 155 256 -22 -150 -191 -415 -148 46 -189 -136 0 -446 22 344 -134 -29
8160 -29 111 -66 201 80 11 53 1 8 251 21 -23 275 -174 189 27 -214 -55 8 183 -236 34 -235 -93
$$ packed form
8003f1j28P0J89J1k49j10M70K09l68K1k8M8r4j32L10j76k93O97m80m2L54k26K52
8026B44l71L03l31J68K33P4o97M87j70J90j31O6l7l7P4k57K60j43LK23l23m1Q6
8049a27K9O7J08J13P1j31k47K25j21J06k98J99j31K7J53q9l3m4K07j41J81qk37
8072a21J17k55M12j8k72j24K88J91l34J85j7K02m65L47Q4k64J07j68J70K8j22
8093b9J38j49j94o8J90K30J05j55J7L2q0k06K99J87m72L22Ml95M13j47K46j59
8115A29j15q6N1N3J55l11K75j64OL50m66L86m21J22m82N57K9q8r5J71j84J04J21
8138I7l26L45P5j27o5j01K57J01k78j28m1k24K67J94k35N3J36m46M68L22m78J05
8160b9J40j77K67j21o9M2n2PK43k30m4K98m49L63j62k41J59O3J75m19K70k69J42
$$ plain form
8183 -93 -86 -28 37 -56 -201 -195 55 79
$$ packed form
8183i3PN8O5r3j45OK50K4
8191G9
$$ Imaginary data points
##PAGE= N=2
##DATA TABLE= (X++(I..I)), XYDATA
$$ plain form
0 0 0 0 0 0 0 0 -8 0 -8 8 -8 8 -8 16 -16 24 -25 32 -39 46 -48 62 -70 79 -93 103 -119 134 -152 174 -192 218
32 218 -244 271 -304 337 -375 417 -462 513 -567 628 -698 770 -856 948 -1055 1178 -1315 1481
50 1481 -1677 1909 -2204 2574 -3070 3761 -4798 6530 -9964 19448 -101200 -380952 -300484
63 -300484 -106531 56592 135496 239447 303631 210292 -51556 -270071 -289771 -139069 22568
74 22568 135975 215739 255206 174352 -27741 -235085 -304311 -220031 -59369 95480 203614
85 203614 220835 123171 -45518 -184335 -234327 -196838 -88349 78662 234031 268544 146029
96 146029 -30586 -137390 -156756 -142243 -87357 52111 223583 277138 145679 -56330 -169589
107 -169589 -171953 -142553 -102043 4294 160731 235735 136090 -60699 -191037 -195533 -140931
$$ packed form
0@%%%%%%qQqJ6j6J6j6K4l2M0m9N7p1Q5r4J10j32J49j72J96k22K53k86L26l66M10
32B18m62N15n75O41p12P92q79R75j080J195j326J468j626J804k003K233k493K796
50A481l158L586m113M778n644O831q559J1328j6494K9412j20648k79752Q0468
63c00484J93953J63123P8904J03951O4184r3339k61848k18515j9700J50702J61637
74B2568J13407P9764L9467q0854k02093k07344o9226Q4280J60662J54849J08134
85B03614J7221r7664j68689j38817m9992L7489J08489J67011J55369L4513j22515
96A46029j76615j06804j9366J4513N4886J39468J71472N3555j31459k02009j13259
107a69589k364K9400M0510J06337J56437P5004r9645j96789j30338m496N4602
$$ plain form
118 -140931 -77544 20852 158182 238381 168694 -5715 -145666 -178619 -135209 -57752 55472
129 55472 181487 238667 168071 13323 -126744 -192614 -181226 -100826 32997 162188 205818
140 205818 135623 1770 -123074 -197688 -208092 -136218 10026 159575 219286 159371 35189
151 35189 -81248 -158772 -183287 -127272 11173 163621 232301 182694 64665 -54008 -141742
162 -141742 -182658 -147188 -26427 117665 193517 162240 60672 -54685 -150292 -198368 -165852
173 -165852 -49972 88681 169332 156351 77688 -23510 -115222 -165374 -139563 -35562 93297
184 93297 172577 166930 97563 1901 -89554 -145081 -131392 -44039 70069 143396 141657 77603
196 77603 -14454 -102622 -155151 -142393 -62969 44246 121205 130910 76378 -12668 -97244 -140605
$$ packed form
118a40931O3387R8396J37330Q0199o9687j74409j39951l2953M3410P7457J13224
129E5472J26015N7180p0596j54748j40067o5870J1388Q0400J33823J29191M3630
140B05818p0195j33853j24844p4614j0404P1874J46244J49549N9711n9915j24182
151C5189j16437p7524k4515N6015J38445J52448O8680m9607j18029j18673q7734
162a41742m0916L5470J20761J44092P5852l1277j01568j15357r5607m8076L2516
173a65852J15880J38653Q0651j2981p8663j01198r1712n0152K5811J04001J28859
184I3297P9280n647o9367r5662r1455n5527J3689Q7353J14108P3327j739o4054
196G7603r2057q8168n2529J2758P9424J07215P6959R705n4532q9046q4576m3361
$$ plain form
208 -140605 -120592 -41625 58985 132621 147780 99117 10165 -79484 -128246 -111219 -37162 55640
220 55640 125235 141023 94634 2701 -94432 -149460 -135230 -61287 34050 106835 127962 88663
232 88663 4223 -88069 -144957 -136609 -66259 32843 116424 147590 116071 34862 -59298 -123373
244 -123373 -126921 -67682 27565 112855 148697 119932 40288 -55614 -126192 -140270 -93295 -6277
256 -6277 80831 126713 109858 39315 -51452 -120639 -138688 -98256 -15606 72590 125900 120364
268 120364 61826 -20587 -89589 -115213 -85490 -12775 69497 122217 120547 67666 -11296 -82428
280 -82428 -114400 -94104 -30000 45811 96901 97872 51771 -18785 -83333 -113968 -96593 -36664
292 -36664 38634 92486 99638 59027 -5859 -65803 -94448 -77998 -22446 48641 99472 105644
$$ packed form
208a40605K0013P8967J00610P3636J5159m8663q8952q9649m8762J7027P4057R2802
220E5640O9595J5788m6389r1933r7133n5028J4230P3943R5337P2785K1127l9299
232H8663q4440r2292n6888Q348P0350R9102Q3581L1166l1519q1209r4160o4075
244a23373l548N9239R5247Q5290L5842k8765p9644r5902p0578j4078M6975Q7018
256f277Q7108M5882j6855p0543r0767o9187j8049M0432Q2650Q8196N3310n536
268A20364n8538q2413o9002k5624K9723P2715Q2272N2720j670n2881p8962p1132
280h2428l1972K0296O4104P5811N1090R71m6101p0556o4548l0635J7375N9929
292c6664P5298N3852P152m0611o4886n9944k8645J6450N5552P1087N0831O172
$$ plain form
304 105644 65522 47 -60547 -91871 -80209 -29641 35617 84791 92657 55299 -9351 -72640
316 -72640 -105271 -93287 -41423 26950 80450 94153 61719 -151 -62809 -96227 -85294 -34480
328 -34480 34285 90887 107823 78393 16119 -49444 -89891 -87586 -43162 23330 79776 100550
340 100550 74729 14775 -52929 -98571 -102021 -62034 3195 64302 92476 75964 22959 -41719
352 -41719 -87777 -94867 -59589 2831 64414 98070 88586 41917 -20266 -70199 -85178 -59485
364 -59485 -4121 54678 88935 82540 39536 -19868 -70303 -90022 -69716 -19189 36823 71750
376 71750 70093 35381 -16748 -62811 -82181 -65115 -17529 37126 73498 76272 45569 -3176
388 -3176 -47880 -68397 -54781 -12655 37890 71728 72972 42315 -5531 -50240 -72468 -61848
$$ packed form
304A05644m0122o5475o0594l1324J1662N0568O5258M9174P866l7358o4650o3289
316g2640l2631J1984N1864O8373N3500J3703l2434o1870o2658l3418J0933N0814
328c4480O8765N6602J6936k9430o2274o5563m0447K305M4424O6492N6446K0774
340A00550k5821n9954o7704m5642l450L9987O5229O1107K8174j6512n3005o4678
352d1719m6058p090L5278O2420O1583L3656r484m6669o2183m9933j4979K5693
364e9485N5364N8799L4257o395m3004n9404n0435j9719K0306N0527N6012L4927
376G1750j657l4712n2129m6063j9370J7066M7586N4655L6372K774l0703m8745
388c176m4704k0517J3616M2126N0545L3838J244l0657m7846m4709k2228J0620
$$ plain form
400 -61848 -22491 26096 59744 62905 34845 -10964 -54139 -74942 -63167 -23294 27191 63453
412 63453 70104 44605 -468 -43701 -65871 -56359 -18607 30851 68043 75693 50553 4601 -42511
425 -42511 -69400 -64426 -30089 18114 57221 68972 47094 2544 -45124 -74317 -71893 -38883
437 -38883 10293 52936 70565 55227 14950 -32114 -63740 -65240 -36086 11006 54368 75113
449 75113 63364 25068 -22580 -57683 -65256 -42579 -1005 41364 63983 56826 22146 -23015
461 -23015 -58963 -68865 -49409 -10778 30768 57126 55915 27343 -13968 -48920 -59249 -42270
473 -42270 -5896 32633 57539 59220 35175 -4444 -40378 -54602 -40804 -7816 27286 49695
485 49695 50620 28959 -7103 -42997 -59731 -47730 -14237 21973 43781 44703 25623 -5564 -37826
$$ packed form
400f1848L9357M8587L3648L161k8060m5809m3175k0803J1775L9873N0485L6262
412F3453O651k5499m5073m3233k2170R512L7752M9458L7192P650k5140m5952m7112
425d2511k6889M974L4337M8203L9107J1751k1878m4550m7668k9193K424L3010
437c8883M9176M2643J7629j5338m0277m7064l1626j500K9154M7092M3362K0745
449G5113j1749l8296m7648l5103p573K2677M1574M2369K2619p157l4680m5161
461b3015l5948r902J9456L8631M1546K6358j211k8572m1311l4952j0329J6979
473d2270L6374L8529K4906J681k4045l9619l5934j4224J3798L2988L5102K2409
485D9695R25k1661l6062l5894j6734J2001L3493L6210K1808R22j9080l1187l2262
$$ plain form
498 -37826 -54316 -44965 -11931 27364 52220 51672 31008 -372 -29452 -46979 -42504 -14214 24554
511 24554 52283 53473 29423 -4988 -34854 -51111 -47790 -24390 12051 43984 53102 32521 -4922
524 -4922 -38015 -51740 -45637 -23209 9593 42826 59024 45299 8050 -29928 -48575 -42100 -19570
537 -19570 9624 38215 55352 48604 15375 -26032 -52881 -50802 -27314 2597 29179 44236
549 44236 41870 17386 -20241 -50474 -54732 -32586 740 29243 44052 42139 23052 -8059 -36538
562 -36538 -47264 -32128 371 31571 46506 41062 21423 -5258 -30402 -44230 -36714 -9053
574 -9053 23032 40825 36021 14556 -10873 -31204 -41825 -36601 -13442 17923 39711 39220 18838
587 18838 -8275 -27960 -34873 -28367 -8499 19070 40896 43551 23821 -4523 -27567 -36178 -28989
$$ packed form
498c7826j6490R351L3034L9295K4856n48k0664l1380k9080j7527M475K8290L8768
511B4554K7729J190k4050l4411k9866j6257L321K3400L6441L1933R118k0581l7443
524d922l3093j3725O103K2428L2802L3233J6198j3725l7249l7978j8647O475K2530
537a9570K9194K8591J7137o748l3229m1407k6849K079K3488K9911K6582J5057
549D4236k366k4484l7627l0233m258K2146L3326K8503J4809j913j9087l1111k8479
562c6538j0726J5136L2499L1200J4935n444j9639k6681k5144j3828P516K7661
574i053L2085J7793m804k1465k5429k0331j0621N224K3159L1365K1788m91k0382
587A8838k7113j9685o913O506J9868K7569K1826K655j9730k8344k3044q611P189
$$ plain form
600 -28989 -9516 14947 34359 37955 22114 -5996 -31448 -42563 -34741 -13215 13044 32375
612 32375 37405 24523 -1134 -27228 -40235 -33610 -11432 15237 36115 42055 30446 5399 -21436
625 -21436 -37674 -34456 -15195 10595 32239 39699 29877 5416 -22638 -40229 -39890 -22392 3204
638 3204 25875 36674 30539 8827 -17981 -36478 -37548 -22245 2607 26219 38828 35006 15616
651 15616 -10489 -29847 -33889 -21851 -118 22404 36279 33053 14100 -10945 -29307 -34409 -26003
664 -26003 -7246 15097 31400 30094 11970 -10846 -26931 -31219 -24319 -7575 14496 32054 32767
677 32767 16104 -6258 -21690 -26232 -20332 -5702 15087 31583 32127 16126 -6406 -22648 -28032
690 -28032 -23780 -9678 11138 27445 27601 12209 -7326 -22367 -28993 -26231 -11455 12071 30324
$$ packed form
600b8989J9473K4463J9412L596j5841k8110k5452j1115P822K1526K6259J9331
612C2375N030j2882k5657k6094j3007O625K2178K6669K0878N940j1609k5047k6835
625b1436j6238L218J9261K5790K1644P460r822k4461k8054j7591L39J7498K5596
638C204K2671J0799o135k1712k6808j8497j070J5303K4852K3612J2609l822j9390
651A5616k6105j9358m042J2038K1733K2522J3875l226j8953k5045j8362n102Q406
664b6003J8757K2343J6303j306j8124k2816j6085m288O900J6744K2071J7558P13
677C2767j6663k2362j5432m542N900J4630K0789J6496N44j6001k2532j6242n384
690b8032M252J4102K0816J6307J56j5392j9535j5041o626K762J4776K3526J8253
$$ plain form
703 30324 30642 14860 -3913 -17018 -24750 -24986 -11511 13254 33274 34004 16992 -2852 -16759
716 -16759 -24578 -26702 -16847 6652 28827 32320 17035 -3449 -18567 -27060 -29309 -18877 3051
729 3051 25132 32058 21585 3259 -14164 -25250 -27123 -15784 5115 23764 30580 24144 10543
742 10543 -7934 -24403 -30091 -18352 3531 20814 24536 19020 10041 -4757 -23766 -33846 -23158
755 -23158 1362 19786 22186 16116 9605 -70 -17242 -29591 -22941 247 21270 25695 18555
768 18555 10043 1359 -13010 -25523 -22212 -2851 17258 24098 18505 8541 -3238 -16198 -24528
781 -24528 -21253 -5982 11039 19970 19492 10881 -3387 -18719 -24409 -17194 -2606 11119 19640 22010
795 22010 15944 1182 -17040 -24574 -16340 -583 11636 17815 20075 16026 2351 -17430 -28352
$$ packed form
703C0324L18j5782j8773j3105p732k36J3475K4765K0020P30j7012j9844j3907
716a6759p819k124R855K3499K2175L493j5285k0484j5118q493k249J0432K1928
729C051K2081O926j0473j8326j7423j1086j873J1339K0899J8649O816o436j3601
742A0543j8477j6469n688J1739K1883J7283L722n516q979j4798j9009j0080J0688
755b3158K4520J8424K400o070o511r675j7172j2349O650K3188K1023M425p140
768A8555q512q684j4369j2513L311J9361K0109O840n593r964j1779j2960q330
781b4528L275J5271J7021Q931m78q611j4268j5332n690P215J4588J3725Q521K370
795B2010o066j4762j8222p534Q234J5757J2219O179K260m049j3675j9781j0922
$$ plain form
808 -28352 -21803 -4423 9445 15825 17918 14914 2919 -15322 -26595 -23102 -7230 8536 18259
821 18259 21409 17482 5107 -10882 -21797 -20733 -8807 6162 18134 23274 19026 5269 -10775
834 -10775 -20949 -20868 -12525 218 13244 21391 18671 5167 -11247 -20975 -20634 -12763 -1408 11352
848 11352 20344 19871 9035 -6675 -17469 -17942 -10944 -8 11051 19406 19802 10369 -4494 -16208
862 -16208 -18914 -12664 -1621 9569 16180 15847 7724 -4214 -15183 -19912 -14874 -3020 9257 16167
876 16167 15137 8132 -2601 -12226 -17201 -13719 -2599 10504 18291 16783 8415 -1418 -11079 -16471
890 -16471 -14441 -4701 8697 16757 15901 7658 -2951 -12692 -18262 -15971 -6051 6599 16049 16547 9320
905 9320 -1795 -11822 -16504 -14769 -6006 6051 16359 19287 13089 1183 -10468 -16696 -14341 -6100
$$ packed form
808b8352O549J7380J3868O380K093l004j1995j8241j1273L493J5872J5766R723
821A8259L150l927j2375j5989j0915J064J1926J4969J1972N140m248j3757j6044
834a0775j0174Q1Q343J2743J3026Q147k720j3504j6414r728L41P871J1355J2760
848A1352Q992m73j0836j5710j0794m73O998J0936J1059Q355L96r433j4863j1714
862a6208k706O250J1043J1190O611l33q123j1938j0969m729N038J1854J2277O910
876A6167j030p005j0733r625m975L482J1120J3103P787j508q368r833r661n392
890a6471K030R740J3398Q060q56q243j0609r741n570K291R920J2650R450M98p227
905I320j1115j0027m682J735Q763J2057J0308K928o198j1906j1651o228K355Q241
$$ plain form
919 -6100 4631 13620 17516 13613 2295 -10880 -18321 -16408 -7593 2000 10203 15179 14137 5029
933 5029 -8388 -18054 -16479 -7318 3047 10467 14628 14554 8095 -4266 -14900 -16200 -8272 2649
947 2649 10350 13519 12914 7717 -2820 -13660 -17750 -11408 193 9420 12208 10252 5005 -2763 -10987
962 -10987 -15223 -11809 -2067 9128 14870 11946 5067 -2138 -8055 -11853 -10458 -2764 8183 15581
976 15581 13822 5106 -3735 -9224 -11367 -10156 -4679 4692 13206 13644 5843 -4558 -11744 -12674 -9509
991 -9509 -3581 4500 11607 13981 8743 -1542 -10299 -13202 -9470 -1838 5856 11566 13650 10160 935
1006 935 -9315 -14953 -11921 -3213 5422 10133 11016 8290 1820 -7982 -15104 -14214 -5642 4454 9796
1021 9796 11485 9047 3573 -5099 -13090 -13880 -6209 4234 11156 11526 9634 4295 -3580 -10947 -13248
$$ packed form
919f100J0731Q989L896l903j1318j3175p441J913Q815R593Q203M976j042r108
933E029j3417r666J575R161J0365P420M161p4o459j2361j0634j300P928J0921
947B649P701L169o05n197j0537j0840m090O342J1601R227K788j956n247p768q224
962a0987m236L414R742J1195N742k924o879p205n917l798J395P694J0947P398
976A5581j759q716q841n489k143J211N477R371Q514M38p801j0401p186r30L165
991i509N928Q081P107K374n238j0285q757k903L732P632P694N710K084l490r225
1006I35j0250n638L032Q708Q635M711Q83k726o470r802p122Q90Q572J0096N342
1021I796J689k438n474q672p991p90P671J0443O922L70j892n339p875p367k301
$$ plain form
1036 -13248 -7351 1949 9134 10877 9148 3638 -4181 -11225 -13432 -8351 343 7084 10511 9300 4335
1051 4335 -3002 -9795 -11492 -7073 508 6961 10440 10672 6010 -2588 -9287 -10408 -5925 143 5492
1066 5492 9244 9898 5376 -3083 -9930 -10957 -6914 -1171 4187 8197 9447 5773 -2582 -10019 -11239
1081 -11239 -6462 -241 4753 8701 10249 6548 -1013 -8592 -10171 -6330 -771 4401 8453 10316 7179
1096 7179 -1164 -8783 -11324 -7875 -2269 3101 8014 10020 6745 -617 -8200 -11014 -8315 -3017 2525
1111 2525 7854 11086 8377 538 -6578 -9706 -7728 -3349 1936 7875 10811 8593 1272 -5772 -9526
1126 -9526 -8437 -4847 -209 6223 9766 8260 1766 -5440 -9313 -8924 -5501 -212 5704 9565 8379
1141 8379 2987 -3828 -7853 -7750 -4869 -96 5769 9325 8583 3573 -3055 -7107 -7772 -5471 -224 4663
$$ packed form
1036a3248N897R300P185J743j729n510p819p044k207N081Q694O741L427j211m965
1051D335p337o793j697M419P581O453L479K32m662q598o699j121M483O068N349
1066E492L752O54m522q459o847j027M043N743N358M010J250l674q355p437j220
1081a1239M777O221M994L948J548l701p561p579j579L841N559N172M052J863l137
1096G179q343p619k541L449N606N370M913K006l275p362p583k814K699N298N542
1111B525N329L232k709p839p116l128J978M379N285N939K936k218p321p044l754
1126i526J089L590M638O432L543j506o494p206l873L89L423N289N916L861j186
1141H379n392o815m025J03K881M773N865L556p42n010o628m052o65K301N247M887
$$ plain form
1157 4663 7579 7363 2922 -3288 -7095 -8243 -5849 -1311 4278 7725 7274 3088 -2189 -6447 -7530
1172 -7530 -5493 -851 4816 8830 7722 3589 -2088 -5660 -6768 -5806 -1699 4191 8028 7779 3076
1187 3076 -2690 -6328 -7053 -6511 -3025 2769 8063 8593 3832 -2456 -6112 -6425 -5424 -2717 2332 7825
1203 7825 9818 5926 -1203 -6061 -6523 -5070 -2194 1377 5702 9009 6711 -33 -6172 -8091 -6629
1218 -6629 -2849 1342 4692 7031 6211 1380 -4647 -8066 -7501 -2977 2050 5434 6622 5756 2654 -1683
1234 -1683 -5985 -7523 -4050 1851 6034 6567 4707 1867 -1500 -5084 -7561 -6241 -170 6158 7087
1249 7087 3959 164 -2192 -3967 -6223 -6060 -1730 4834 8032 5620 734 -2702 -3989 -4309 -3991 -1885
1265 -1885 3472 7768 6884 1818 -3210 -5307 -4641 -3412 -1215 2063 5134 6472 3211 -2408 -6104
$$ packed form
1157D663K916k16m441o210l807j148K394M538N589L447m51m186n277m258j083
1172g530K037M642N667M014j108m133n677l572j108R62M107N890L837k49m703
1187C076n766l638p25N42L486N794N294N30m761o288l656l13J001K707N049N493
1203G825J993l892p129m858m62J453K876L571M325L307k298o744o139j919J462
1218f629L780M191L350K339q20m831o027l419N65M524N027L384J188q66l102m337
1234a683m302j538L473N901M183N33j860k840l367l584k477J320O071O328R29
1249G087l128l795k356j775k256J63M330O564L198k412m886l436j287l20L18K106
1265a885N357M296q84n066n028k097O66J229K197L278L071J338l261n619l696
$$ plain form
1280 -6104 -6298 -3960 -482 2496 4815 5752 3836 -553 -5291 -6827 -4238 -66 3902 5206 5142 3941
1296 3941 677 -4025 -6795 -6104 -1559 3405 5623 4989 2786 117 -3314 -6031 -6030 -2572 2440 5830
1312 5830 5974 3522 -299 -2955 -5189 -5613 -2893 1139 5234 6872 4554 1035 -2408 -5036 -4967 -2545
1328 -2545 855 4179 5303 4274 1066 -2806 -5354 -5306 -2923 263 3348 4806 4257 1757 -1843 -5044
1344 -5044 -5106 -3155 915 3998 5210 3875 1582 -843 -3632 -4670 -3406 -221 3331 5261 4189
1359 4189 1211 -1756 -4099 -4519 -3807 -1013 2525 4956 4442 1631 -2447 -4398 -4424 -2703 -569 2156
1375 2156 4290 5030 3047 -1175 -4440 -4663 -2751 -174 2009 4018 4643 3120 -476 -4184 -5241 -3532
1391 -3532 -536 2200 3457 4104 2968 -312 -3532 -5428 -4120 -971 2612 4242 4188 2772 520 -2568
$$ packed form
1280f104j94K338L478K978K319R37j916m389m738j536K589M172L968J304o4j201
1296C941l264m702k770O91M545M964K218o34k203k669l431k717JL458N012L390
1312E830J44k452l821k656k234m24K720M032M095J638k318l519l443k628O9K422
1328b545L400L324J124j029l208l872k548M8K383L186L085J458n49k500l600l201
1344e044o2J951M070L083J212j335k293k425k789j038J264L185L552J930j072
1359D189k978k967k343m20P12K794L538K431n14k811m078j951k6J721K134K725
1375B156K134P40j983m222l265k23J912K577K183K009O25j523l596l708j057J709
1391c532K996K736J257O47j136l280l220j896J308L149L583J630n4j416k252l088
$$ plain form
1407 -2568 -4312 -4412 -1915 1743 4485 5074 3262 105 -2247 -3805 -4049 -2269 372 3752 4816 2713
1423 2713 -119 -2643 -3705 -3553 -2583 -535 3000 4892 3668 458 -2724 -3826 -3078 -2138 327 2673
1439 2673 4342 3816 892 -2052 -3521 -3202 -2523 53 2638 3774 2974 770 -1623 -3442 -3752 -2729
1455 -2729 -262 2259 3858 2717 968 -1207 -2744 -3262 -2760 -144 3102 4144 3431 1031 -1083 -2298
1471 -2298 -3276 -3060 -393 2203 4101 3034 1529 -1019 -2262 -3750 -3341 -1152 1878 3497 3400 1628
1487 1628 -817 -2603 -3780 -3027 -691 2110 3473 3299 2247 -105 -1675 -3348 -3211 -975 1569 3224
1503 3224 3508 2044 216 -1762 -3691 -3481 -1338 1196 2969 3111 1641 888 -1931 -3533 -3137 -1385
1519 -1385 1186 2184 2758 2600 1372 -1090 -3269 -3132 -1505 1093 2449 3092 2609 699 -1260 -3110
$$ packed form
1407b568j744j00K497L658K742N89j812l157k352j558k44J780K641L380J064k103
1423B713k832k524j062J52R70K048L535J892j224l210l182j102P48R40K465K346
1439B673J669n26k924k944j469L19O79K576K585J136q00k204k393j819l10J023
1455b729K467K521J599j141j749k175j537n18N02K616L246J042p13k400k114j215
1471b298r78K16K667K596J898j067j505k548j243j488M09K189L030J619r7j772
1487A628k445j786j177P53K336K801J363j74j052k352j570j673J37K236K544J655
1503C224K84j464j828j978j929K10K143K534J773J42j470p53k819j602L96J752
1519a385K571R98N74j58j228k462k179J37J627K598J356O43m83j910j959j850
$$ plain form
1535 -3110 -3139 -1770 312 1566 2296 2281 1150 -990 -3191 -2926 -1387 508 1785 2507 2615 1335 -1156
1552 -1156 -3098 -2675 -1227 169 1412 2539 2861 1472 -1167 -2835 -2793 -1280 -130 1663 2500 2523 1124
1569 1124 -920 -2868 -2811 -1644 -572 963 2519 2612 1531 -392 -2506 -2659 -1763 -578 1102 2944
1585 2944 2776 1378 -824 -2055 -1773 -2126 -1625 404 2688 3317 1095 -1063 -1963 -2110 -1852 -1320 231
1602 231 2413 3316 1673 -375 -1923 -1915 -1301 -1129 127 1852 3378 2092 -141 -1749 -2260 -1627 -900
1619 -900 415 1700 2109 2126 800 -1116 -2660 -2608 -981 669 1448 1839 1392 658 -153 -2032 -2792 -1546
1637 -1546 790 2143 1999 1296 200 -68 -1390 -2399 -2205 162 2600 2647 1024 -406 -710 -1138 -1723
1654 -1723 -2483 -588 1912 2917 1630 -231 -1096 -1578 -1527 -1809 -843 1043 2916 2531 400 -1421 -1850
$$ packed form
1535c110k9J369K082J254P30j5j131k140k201K65J539J895J277P22J08j280k491
1552a156j942M23J448J396J243J127L22j389k639j668M2J513J150J793Q37K3j399
1569A124k044j948N7J167J072J535J556R3j081j923k114j53Q96J185J680J842
1585B944j68j398k202j231K82l53N01K029K284O29k222k158r00j47K58N32J551
1602B31K182R03j643k048j548QO14J72J256J725J526j286k233j608n11O33P27
1619i00J315J285M09J7j326j916j544N2J627J650P79L91m47p34q11j879p60J246
1637a546K336J353j44p03j096k68j322j009J94K367K438M7j623j430l04m28n85
1654a723p60J895K500J005j287j861q65m82N1k82R66J886J873l85k131j821m29
$$ plain form
1671 -1850 -1396 -824 -120 889 2052 2527 1391 -665 -2189 -1928 -935 9 740 1261 1898 1703 -68 -2068
1689 -2068 -2798 -1447 221 860 1433 1481 1609 287 -1435 -2353 -1981 -277 1118 1760 1491 1504 520 -448
1707 -448 -1901 -2320 -988 848 2216 1510 637 -106 -587 -1580 -1988 -1617 538 1588 2039 921 -170
1724 -170 -861 -1504 -1643 -970 482 1652 1737 1225 207 -532 -1197 -1466 -862 80 1323 1668 1234 269 -740
1743 -740 -1467 -1711 -1016 -51 1041 1513 1283 366 -619 -1381 -1319 -1084 -50 1086 1520 1336 547 -353 -1288
1762 -1288 -1383 -858 -238 823 1680 1560 368 -577 -1582 -1014 -979 -344 702 1592 1830 639 -670 -1413
1780 -1413 -1457 -938 -256 594 1915 1754 994 -293 -1344 -1605 -1172 -22 470 1058 1327 997 109 -1481
1798 -1481 -1672 -1375 -517 575 1362 983 1044 141 -858 -1365 -1446 -650 664 1457 1006 642 -92 -183 -930 -1788
$$ packed form
1671a850M54N72P04J009J163M75j136k056j524K61R93R44P31N21O37j95j771k000
1689b068p30J351J668O39N73M8J28j322j722r18L72J704J395O42k69J3r84r68
1707d48j453m19J332J836J368p06q73p43m81r93m08L71K155J050M51j118j091
1724a70o91o43j39O73J452J170Q5n12j018p39o65k69O04R42J243L45m34r65j009
1743g40p27k44O95R65J092M72k30r17r85p62O2K35J034J136M34j84p89r00r35
1762a288r5N25O20J061Q57j20j192r45j005N68L5O35J046Q90K38j191j309p43
1780a413m4N19O82Q50J321j61p60j287j051k61M33J150M92N88K69l30q88j590
1798a481j91K97Q58J092P87l79O1r03r99n07q1P96J314P93m51l64p34r1p47q58
$$ plain form
1818 -1788 -924 479 1206 1370 323 67 -323 -550 -1411 -1133 219 1321 1558 532 -161 -712 -816 -1343
1836 -1343 -1278 -116 1349 1568 765 -361 -462 -835 -813 -1312 -282 1169 1653 1170 -69 -555 -758 -890
1854 -890 -820 -24 952 1534 1173 336 -422 -1106 -1286 -740 136 777 973 771 483 -134 -970 -1730 -1318 417
1874 417 900 787 579 526 168 -585 -1929 -1514 177 1551 1119 254 300 628 -748 -1631 -1282 -231 1051
1893 1051 859 360 419 468 -251 -1365 -1324 101 842 848 635 608 370 -157 -1422 -1309 -110 558 919 871 506
1914 506 470 -594 -1427 -956 -155 754 748 748 721 430 -198 -1462 -1235 96 363 271 442 987 436 -574 -1444
1935 -1444 -673 -18 675 413 1046 1039 388 -531 -1225 -1184 -53 -205 359 758 1155 586 -792 -1329 -1118 -189
1955 -189 300 401 521 1331 810 -645 -1312 -1011 -90 193 59 683 677 773 -487 -1307 -1180 -564 102 -1
$$ packed form
1818a788Q64J403P27J64j047k56l90k27q61K78J352J102K37j026o93n51j04n27
1836a343O5J162J465K19q03j126j01l73K2m99J030J451M84m83j239m86k03j32
1854h90P0P96R76N82l61q37p58o84j80N46Q76O41J96k02k88o17q36p60M12J735
1874D17M83j13k08n3l58p53j344M15J691J374m32q65M6L28j376q83L49J051J282
1893A051j92m99N9M9p19j114M1J425P41Ok13k7k38n27j265J13J199O68L61m8l65
1914E06l6j064q33M71Q01R09o%k7k91o28j264K27J331K67r2J71N45n51j010q70
1935a444P71O55O93k62O33po51r19o94M1J131j52N64L99L97n69j378n37K11R29
1955a89M89J01J20Q10n21j455o67L01R21K83j34O24oR6j260q20J27O16O66j03
$$ plain form
1975 -1 612 957 559 -567 -889 -1020 -357 36 154 817 1178 658 -302 -866 -352 -625 -572 130 1022 1180 435
1996 435 -534 -991 -1197 -313 -193 -143 742 972 839 -200 -757 -658 -589 -205 98 528 802 823 80 -438 -863
2017 -863 -727 -186 150 517 1242 248 -125 -559 -533 -929 -308 356 687 942 500 -34 -26 -341 -793 -945 -162
2038 -162 779 937 300 -258 -278 -529 -469 -580 -208 468 1259 1015 -46 -391 -626 -312 -386 -227 214 572 794
2059 794 416 -422 -1095 -1108 -199 -84 69 399 604 870 -142 -505 -1087 -200 212 448 472 656 414 110
2079 110 -642 -701 -817 -15 804 154 390 265 295 -542 -1110 -996 -376 442 1013 542 98 73 -366 -548 -573
2100 -573 -498 25 637 546 149 -172 -220 -410 -345 -342 217 435 830 318 -89 -324 -709 -310 -474 -397 448 355 250
2123 250 -121 -369 -563 -178 -122 192 455 664 843 113 -579 -458 -347 -381 -37 406 967 587 -82 -376 -649
$$ packed form
1975aO13L45l98j126l22j31O63L93J18O63L61n20r60n64N14k73N3P02Q92J58p45
1996D35r69m57k06Q84J20N0Q85K30j33j039n57R9O9L84L03M30K74K1p43n18m25
2017h63J36N41L36L67P25r94l73m34K6l96O21O64L31K55m42n34Ql15m52j52P83
2038a62R41J58o37n58k0k51O0j11L72O76P91k44j061l45k35L14p4J59M41L58K22
2059G94l78q38o73j3R09J15J53L30K05K66j012l63n82Q87M12K36K4J84k42l04
2079A10p52n9j16Q02Q19o50K36j25L0q37n68J14O20Q18N71m71m44k5m39j82k5
2100e73P5N23O12r1l97l21m8j90O5LN59K18L95n12m07k35l85L99j64P7Q45r3j05
2123B50l71k48j94L85N6L14K63K09J79p30o92J21J11l4L44M43N61l80o69k94k73
$$ plain form
2144 -649 -316 -321 -179 310 266 726 -33 -350 -783 -169 -370 -120 169 617 480 197 -67 -645 -629 -104 163
2165 163 282 444 200 522 27 -519 -495 -513 -11 457 310 291 237 32 -256 -583 -711 -106 544 570 294 111
2187 111 108 -126 -339 -817 -237 372 810 158 202 -77 -146 -393 -370 -367 147 627 354 390 -96 -451 -245 -314 -373
2210 -373 -11 66 520 343 5 -515 -723 -260 -125 224 551 487 491 -10 -377 -355 -466 -97 503 341 269 632
2232 632 422 -182 -297 -624 -346 13 370 400 59 525 -98 -241 -771 -145 -120 408 100 295 208 -274 -486
2253 -486 -630 -325 233 133 283 520 449 -142 -535 -201 -399 -43 -24 291 338 225 -121 -521 -524 -169 214 88
2275 88 337 461 223 -228 -201 -372 -355 -615 288 271 672 427 -164 -556 -404 -289 15 26 340 249 145 103
2297 103 -320 -142 -79 21 -49 344 257 165 -65 -219 -291 -332 298 231 210 331 -5 218 -221 -49 -324 -126 -132
$$ packed form
2144f49L33nJ42M89m4M60p59l17m33O14k01K50K89M48j37k83k64n78J6N25K67
2165A63J19J62k44L22m95n46K4j8N02M68j47j9n4k05k88l27j28O05O50K6k76j83
2187A11lk34k13m78N80O09M38o52M4k79o9k47K3LN14M80k73L6m86l55K06o9n9
2210c73L62P7M54j77l38n20k08M63J35L49L27o4Mn01l67K2j11L69O00j62p2L63
2232F32k10o04j15l27K78L59L57L0l41M66o23j43n30O26K5N28l08J95q7m82k12
2253d86j44L05N58j00J50K37p1n91l93L34j98L56J9L15M7j13l46m00lL55L83j26
2275H8K49J24k38m51K7j71J7k60R03j7M01k45n91l92J52J15L04J1L14r1j04m2
2297A03m23J78O3J00p0L93q7r2k30j54p2m1O30o7k1J21l36K23m39J72k75J98o
$$ plain form
2320 -132 154 412 50 186 -444 -241 -664 -73 -79 320 443 438 7 -206 -345 -151 -150 -205 182 425 222 8
2342 8 -274 -363 -411 -169 25 82 497 186 172 -406 -531 -222 -240 -160 -125 595 336 107 -117 -348 -57 -118 126
2365 126 433 202 361 153 -76 -366 -122 -50 -44 364 36 232 220 -185 -130 -535 -642 249 330 162 -34 -39 -181
2388 -181 -67 -229 -490 111 167 267 451 138 -116 -137 -217 -279 -29 -28 73 234 -21 -244 -283 -62 -104 134 27
2411 27 104 454 172 143 -285 -314 -205 45 301 64 -36 70 283 -409 -479 -225 236 160 -152 283 114 342
$$ packed form
2320a32K86K58l62J36o30K03m23N91oL99J23nm31k13j39J94Jn5L87K43k03k14
2342Hk82q9m8K42J94N7M15l11j4n78j25L09j8Q0L5P20k59k29k24k31K91o1K44
2365A26L07k31J59k08k29k90K44P2OM08l28J96j2m05N5m05j07Q91Q1j68j96nj42
2388a81J14j62k61O01N6J00J84l13k54k1q0o2K50JJ01J61k55k23l9K21m2K38j07
2411B7P7L50k82k9m28k9J09K50K56k37j00J06K13o92p0K54M61p6l12M35j69K28
$$ [...]
8191A64
##END NTUPLES=NMR FID
##END=
