##TITLE=1H_PR163_2
 D2O, 8 sc, 
 18.1.2019
##JCAMPDX= 6.0         $$ Bruker NMR JCAMP-DX V2.0
##DATA TYPE= NMR FID
##DATA CLASS= NTUPLES
##ORIGIN= UXNMR, Bruker Analytische Messtechnik GmbH
##OWNER= root
$$ XWIN-NMR		Version 3.5
$$ Fri Jan 18 15:53:22 2019 Russian Standard Time (UT+4h)  she@DPX200
##.OBSERVE FREQUENCY= 200.1313
##.OBSERVE NUCLEUS= ^1H
##.DELAY= (6, 6)
##.ACQUISITION MODE= SIMULTANEOUS
##.ACQUISITION SCHEME= undefined
##.AVERAGES= 8
##.DIGITISER RES= 18
##SPECTROMETER/DATA SYSTEM= spect
##.PULSE SEQUENCE= zg30
##.SOLVENT NAME= D2O
##.SHIFT REFERENCE= (INTERNAL, D2O, 0, 15.7039)
##AUDIT TRAIL= $$ (NUMBER, WHEN, WHO, WHERE, WHAT)
$$ ##TITLE= Audit trail, XWIN-NMR		Version 3.5
$$ ##JCAMPDX= 5.01
$$ ##ORIGIN= Bruker BioSpin GmbH
$$ ##OWNER= she
$$ F:/spectra/data/she/nmr/H-F/1/audita.txt
$$ ##AUDIT TRAIL=  $$ (NUMBER, WHEN, WHO, WHERE, WHAT)
(   1,<2019-01-18 15:51:10.50 +0400>,<she>,<DPX200>,
      <created by zg, POWCHK disabled, PULCHK disabled
       configuration hash MD5:
       00 E9 B6 7A A2 85 ED C7 34 08 36 98 17 FE 4E 26
       data hash MD5: 16K
       0C 4F EC A9 98 0B 60 6F BF 85 21 C7 96 36 AA 6F>)
$$ ##END=
$$ 
$$ hash MD5
$$ 24 6B B1 A0 1B 8E 70 39 D7 A1 E0 1A E4 7E 40 CC
##$RELAX= 
##$RELAX= 
##$RELAX= 
##$RELAX= 
##$RELAX= 
##$RELAX= 
$$ Bruker specific parameters
$$ --------------------------
##$DU= <F:/spectra>
##$EXPNO= 1
##$NAME= <H-F>
##$PROCNO= 1
##$TYPE= <nmr>
##$USER= <she>
##$AMP= (0..31)
100 100 100 100 100 100 100 100 100 100 100 100 100 100 100 100 100 100 
100 100 100 100 100 100 100 100 100 100 100 100 100 100 
##$AQSEQ= 0
##$AQ_mod= 1
##$AUNM= <au_zg>
##$AUTOPOS= <>
##$BF1= 200.13
##$BF2= 200.13
##$BF3= 200.13
##$BF4= 200.13
##$BF5= 200.13
##$BF6= 200.13
##$BF7= 200.13
##$BF8= 200.13
##$BYTORDA= 1
##$CFDGTYP= 0
##$CFRGTYP= 5
##$CHEMSTR= <none>
##$CNST= (0..31)
1 1 145 1 1 1 1 1 1 1 1 1 1 1 1 1 1 1 1 1 1 1 1 1 1 1 1 1 1 1 1 1 
##$CPDPRG= <>
##$CPDPRG1= <>
##$CPDPRG2= <>
##$CPDPRG3= <>
##$CPDPRG4= <mlev>
##$CPDPRG5= <mlev>
##$CPDPRG6= <mlev>
##$CPDPRG7= <mlev>
##$CPDPRG8= <mlev>
##$CPDPRGB= <>
##$CPDPRGT= <>
##$D= (0..31)
0 1.2 0 0 0 0 0 0 0 0 0 0.03 0 0 0 0 0 0 0 0 0 0 0 0 0 0 0 0 0 0 0 0 
##$DATE= 1547812269
##$DBL= (0..7)
120 120 120 120 120 120 120 120 
##$DBP= (0..7)
150 150 150 150 150 150 150 150 
##$DBP07= 0
##$DBPNAM0= <>
##$DBPNAM1= <>
##$DBPNAM2= <>
##$DBPNAM3= <>
##$DBPNAM4= <>
##$DBPNAM5= <>
##$DBPNAM6= <>
##$DBPNAM7= <>
##$DBPOAL= (0..7)
0.5 0.5 0.5 0.5 0.5 0.5 0.5 0.5 
##$DBPOFFS= (0..7)
0 0 0 0 0 0 0 0 
##$DE= 6
##$DECBNUC= <off>
##$DECIM= 32
##$DECNUC= <off>
##$DECSTAT= 4
##$DIGMOD= 1
##$DIGTYP= 9
##$DL= (0..7)
0 120 120 120 120 120 120 120 
##$DP= (0..7)
150 150 150 150 150 150 150 150 
##$DP07= 0
##$DPNAME0= <>
##$DPNAME1= <>
##$DPNAME2= <>
##$DPNAME3= <>
##$DPNAME4= <>
##$DPNAME5= <>
##$DPNAME6= <>
##$DPNAME7= <>
##$DPOAL= (0..7)
0.5 0.5 0.5 0.5 0.5 0.5 0.5 0.5 
##$DPOFFS= (0..7)
0 0 0 0 0 0 0 0 
##$DQDMODE= 0
##$DR= 18
##$DS= 0
##$DSLIST= <SSSSSSSSSSSSSSS>
##$DSPFIRM= 0
$$ [...]
##$SUBNAM2= <"">
##$SUBNAM3= <"">
##$SUBNAM4= <"">
##$SUBNAM5= <"">
##$SUBNAM6= <"">
##$SUBNAM7= <"">
##$SUBNAM8= <"">
##$SUBNAM9= <"">
##$SW= 20.0189088683792
##$SWIBOX= (0..15)
0 0 2 0 0 0 0 0 0 0 0 0 0 0 0 0 
##$SW_h= 4006.41025641026
##$TD= 16384
##$TD0= 1
##$TE= 0
##$TE2= 300
##$TE3= 300
##$TEG= 300
##$TL= (0..7)
0 120 120 120 120 120 120 120 
##$TP= (0..7)
150 150 150 150 150 150 150 150 
##$TP07= 0
##$TPNAME0= <>
##$TPNAME1= <>
##$TPNAME2= <>
##$TPNAME3= <>
##$TPNAME4= <>
##$TPNAME5= <>
##$TPNAME6= <>
##$TPNAME7= <>
##$TPOAL= (0..7)
0.5 0.5 0.5 0.5 0.5 0.5 0.5 0.5 
##$TPOFFS= (0..7)
0 0 0 0 0 0 0 0 
##$TUNHIN= 0
##$TUNHOUT= 0
##$TUNXOUT= 0
##$USERA1= <user>
##$USERA2= <user>
##$USERA3= <user>
##$USERA4= <user>
##$USERA5= <user>
##$V9= 5
##$VALIST= <valist>
##$VCLIST= <CCCCCCCCCCCCCCC>
##$VD= 0
##$VDLIST= <DDDDDDDDDDDDDDD>
##$VPLIST= <PPPPPPPPPPPPPPP>
##$VTLIST= <TTTTTTTTTTTTTTT>
##$WBST= 1024
##$WBSW= 4
##$XGAIN= (0..3)
0 0 0 0 
##$XL= 0
##$YL= 0
##$YMAX_a= 365803
##$YMIN_a= -370035
##$ZGOPTNS= <>
##$ZL1= 120
##$ZL2= 120
##$ZL3= 120
##$ZL4= 120
##$ABSF1= 10
##$ABSF2= 0
##$ABSG= 5
##$ABSL= 3
##$ALPHA= 0
##$AQORDER= 0
##$ASSFAC= 0
##$ASSFACI= 0
##$ASSFACX= 0
##$ASSWID= 0
##$AUNMP= <proc_1d>
##$AZFE= 0.1
##$AZFW= 0.1
##$BCFW= 1
##$BC_mod= 2
##$BYTORDP= 1
##$COROFFS= 0
##$CY= 11.3945322036743
##$DATMOD= 1
##$DC= 2
##$DFILT= <>
##$DTYPP= 0
##$F1P= 18.9103706918063
##$F2P= -1.10871071338519
##$FCOR= 0.5
##$FTSIZE= 0
##$FT_mod= 4
##$GAMMA= 1
##$GB= 0.15
##$INTBC= 1
##$INTSCL= 1
##$ISEN= 128
##$LB= 0.24
##$LEV0= 0
##$LPBIN= 0
##$MAXI= 10000
##$MC2= 0
##$MEAN= 0
##$ME_mod= 0
##$MI= 1.114404
##$NCOEF= 0
##$NC_proc= 0
##$NLEV= 6
##$NOISF1= 3.799351
##$NOISF2= 2.8
##$NSP= 1
##$NTH_PI= 0
##$NZP= 0
##$OFFSET= 15.70392
##$PC= 1
##$PHC0= -9217.788
##$PHC1= 12.40004
##$PH_mod= 1
##$PKNL= yes
##$PPARMOD= 0
##$PSCAL= 0
##$PSIGN= 0
##$REVERSE= no
##$SF= 200.130013532006
##$SI= 16384
##$SIGF1= 3
##$SIGF2= 2
##$SINO= 400
##$SIOLD= 16384
##$SREGLST= <1H.CDCl3>
##$SSB= 0
##$STSI= 0
##$STSR= 0
##$SW_p= 3612.71676300578
##$SYMM= 0
##$S_DEV= 0
##$TDeff= 0
##$TDoff= 0
##$TI= <>
##$TILT= no
##$TM1= 0
##$TM2= 0
##$TOPLEV= 0
##$USERP1= <user>
##$USERP2= <user>
##$USERP3= <user>
##$USERP4= <user>
##$USERP5= <user>
##$WDW= 1
##$XDIM= 8192
##$YMAX_p= 0
##$YMIN_p= 0
$$ End of Bruker specific parameters
$$ ---------------------------------
##NTUPLES= NMR FID
##VAR_NAME=  TIME,          FID/REAL,        FID/IMAG
##SYMBOL=    X,             R,               I
##VAR_TYPE=  INDEPENDENT,   DEPENDENT,       DEPENDENT
##VAR_FORM=  AFFN,          ASDF,            ASDF
##VAR_DIM=   8192,          8192,            8192
##UNITS=     SECONDS,       ARBITRARY UNITS, ARBITRARY UNITS
##FACTOR=    0.0002496,     1,               1
##FIRST=     0,             0,               0
##LAST=      2.0444736,     0,               0
##MIN=       0,             -370035,         0
##MAX=       2.0444736,     365803,          0
$$ Real data points
##PAGE= N=1
##DATA TABLE= (X++(R..R)), XYDATA
0 0 0 0 0 0 0 0 0 0 0 0 0 -8 8 -8 8 -8 16 -16 24 -24 32 -40 48 -56 64 -72 88 -97 115 -131 152 -171 193
33 193 -222 249 -281 315 -351 396 -439 491 -546 604 -670 739 -819 903 -994 1097 -1209 1335
51 1335 -1467 1618 -1786 1971 -2186 2425 -2703 3024 -3401 3857 -4415 5121 -6040 7301 -9139
66 -9139 12090 -17620 31602 -146399 -206785 71907 164994 226747 241305 265326 158964 -38220
78 -38220 -249932 -326918 -294620 -190986 -72772 84436 233996 323043 293420 183293 29920
89 29920 -125154 -261928 -315636 -258355 -116232 32428 159003 258794 311216 255091 89314
100 89314 -103675 -223223 -257734 -246624 -198886 -75406 113809 277372 318923 241176 118655
111 118655 995 -121657 -243880 -304421 -246389 -94987 67715 186243 255226 269902 205769
122 205769 63444 -100860 -219006 -263366 -241409 -158729 -20359 138252 252673 277478 218789
133 218789 110238 -23406 -161528 -263838 -282266 -205605 -73887 60809 171167 242265
143 242265 246565 163522 17615 -129023 -224899 -256166 -226329 -135694 4059 150371 247121
154 247121 262763 204173 95989 -36106 -162122 -241752 -242068 -163172 -38801 90156 194365
165 194365 249734 233581 141951 5180 -126800 -215175 -242529 -204266 -105197 29718 156637
176 156637 233173 238780 177248 67539 -61801 -175333 -236603 -224449 -144115 -23806 100115
187 100115 194580 233936 204293 111756 -14464 -134419 -213702 -231258 -181654 -78069 48201
198 48201 158521 221384 219818 153936 41828 -82598 -181255 -225673 -204820 -125485 -10597
209 -10597 106198 190424 216312 175782 81865 -36460 -144138 -210812 -217205 -160313 -56184
220 -56184 63477 163271 215526 205516 135515 26592 -87044 -171437 -203717 -175566 -94018
231 -94018 17904 125995 196771 209641 161983 67996 -45135 -144412 -200835 -198237 -137473 -36753
243 -36753 73552 161163 201356 181672 107443 1610 -102928 -176086 -198308 -163138 -78974
254 -78974 29369 127718 186211 189850 138916 47254 -59322 -149155 -194608 -181981 -116017 -17641
266 -17641 83881 160130 190059 164252 88914 -13553 -110897 -173898 -185697 -143884 -60111 41266
278 41266 129658 178815 175146 119668 28411 -71430 -150018 -184510 -165193 -97681 -1694 94123
290 94123 161099 180785 148444 73227 -22978 -111205 -165040 -169009 -122019 -37926 57842 136526
302 136526 175508 164158 105454 15969 -77792 -147749 -173972 -149467 -81370 10498 98085 155062
314 155062 165686 127643 51728 -39866 -119689 -164026 -160371 -110061 -27429 63121 134400 165275
326 165275 147347 86390 273 -85310 -145497 -163323 -133698 -64425 24092 104512 152676 155543
338 155543 113173 37752 -48867 -120831 -156442 -146154 -93336 -12850 71589 134550 157235 133601
350 133601 70903 -12206 -91088 -142598 -152543 -118085 -48692 35287 108398 148691 145162 99520
362 99520 25077 -56534 -120549 -148095 -131874 -76919 1030 79083 133862 149319 121340 57858
374 57858 -22508 -95657 -139650 -142556 -104412 -36191 42520 108206 141141 131913 83749 10562
386 10562 -65986 -122846 -143403 -121994 -65283 10187 82157 129546 139228 108400 45311 -31474
398 -31474 -98483 -134886 -131290 -90129 -23373 50455 110053 136989 123077 72676 1122 -69887
410 -69887 -119604 -134197 -110158 -53842 18974 86366 127592 130496 95367 33069 -38100 -98050
422 -98050 -129521 -123259 -80326 -12522 58916 111069 128806 109963 61367 -5107 -72250 -119304
434 -119304 -129378 -98791 -39059 29313 87116 120563 121428 87067 24507 -47172 -103140 -125204
446 -125204 -110496 -66469 -5063 59236 108131 124962 102586 48400 -19209 -78965 -114403 -117462
458 -117462 -88415 -33823 32572 91115 121853 114036 71773 10406 -50943 -96774 -116637 -104516
470 -104516 -60232 5400 70166 110581 115197 87841 38910 -20558 -77467 -114004 -114894 -78499
482 -78499 -18797 43100 89750 111512 103573 65578 5752 -57218 -101743 -113759 -92259 -45510
494 -45510 13342 68730 104791 110143 82901 30627 -31090 -83234 -109381 -102503 -66688 -13172
506 -13172 44256 90348 110758 97105 53083 -6061 -61289 -97195 -105883 -85304 -39273 20122
518 20122 73856 103526 101553 71188 21441 -35233 -83140 -106146 -96217 -57764 -3906 50196
530 50196 90266 104821 88026 44515 -11833 -63549 -95784 -100353 -76267 -29310 27044 75054
542 75054 99946 95150 63362 13426 -41064 -83814 -100958 -87844 -49780 2032 53789 90428
554 90428 99652 78392 34514 -17986 -64791 -93583 -95716 -68761 -20469 33524 75963 95288
566 95288 87718 55585 6480 -45663 -84032 -96216 -79881 -41424 8670 57137 89057 93668
578 93668 70115 27095 -22829 -66857 -92298 -89655 -59144 -11717 37089 74378 91351 82937
590 82937 48885 -1690 -51212 -82866 -89064 -71432 -35109 12985 60097 88905 88533 61346 18838
603 18838 -27308 -66974 -88737 -83629 -51851 -4997 41196 74780 87780 75674 40001 -8358
615 -8358 -52983 -80368 -84897 -66401 -28284 20396 63407 84896 79849 53720 14789 -30123 -69815
628 -69815 -88404 -76739 -41070 2516 42111 71610 84287 71790 33766 -15883 -57147 -78014
640 -78014 -77575 -58423 -22417 23718 64423 83486 75326 46399 6747 -35085 -68819 -82381 -69820
653 -69820 -36383 6098 46131 73934 80475 61779 23910 -19326 -54836 -75078 -75845 -54390 -13964
666 -13964 31919 65780 77014 66737 40900 3886 -37899 -70921 -80462 -62674 -27142 12526
678 12526 47276 70651 75242 56363 18909 -23969 -58029 -74247 -69529 -45167 -7286 33119
690 33119 63560 74674 64042 35064 -4440 -43096 -68574 -72883 -55759 -23637 14881 50244
702 50244 71642 70910 47996 11379 -26765 -56619 -71002 -65253 -39761 -1703 36810 63625 70972
715 70972 57804 28255 -9115 -44055 -66433 -69030 -51079 -18109 20107 52251 68503 64405
727 64405 41823 7604 -29185 -57939 -69293 -59377 -32036 3716 37741 61468 67682 53480
739 53480 22681 -14598 -46670 -64336 -63465 -44769 -12992 23179 52790 66325 59753 35654 1658
752 1658 -32570 -57374 -65209 -53734 -26632 7914 40479 61363 63578 46422 15983 -18033 -46619
765 -46619 -62342 -60201 -39526 -6347 28255 53181 61997 53580 30549 -1871 -35041 -58124 -62532
778 -62532 -47518 -19430 12777 41190 58734 59501 41893 11181 -22372 -48564 -59971 -54258 -32873
791 -32873 -2029 29774 52867 60076 49206 24033 -7654 -36912 -55518 -57935 -43197 -15436
803 -15436 16720 43697 57509 54080 35127 6439 -24034 -48000 -58055 -50478 -27484 3139
815 3139 32185 51528 56019 44369 19556 -10974 -38546 -54486 -54009 -37466 -10397 19178 43251
828 43251 55080 50682 30849 1763 -27408 -47768 -53927 -44832 -23241 5450 33467 51773 53620
841 53620 38816 13435 -14410 -37925 -51605 -50789 -33894 -6102 22982 43981 51787 45222 26060
854 26060 -1235 -28890 -47831 -51671 -40081 -17610 9325 34091 49592 49947 34705 9512 -17542
867 -17542 -39125 -49937 -46331 -28332 -1831 24510 43103 49322 41677 21558 -5571 -31107 -46525
880 -46525 -47666 -35434 -13752 12107 35459 48410 45943 29370 5206 -19359 -38802 -47978 -42780
893 -42780 -23670 2507 26669 42082 45954 37375 17548 -8525 -32254 -45449 -44335 -30791 -9385
906 -9385 14757 35574 46267 42287 25192 1439 -21682 -38704 -45187 -38301 -19358 5441 27938
919 27938 41540 43289 32936 12776 -11545 -32576 -43466 -41148 -26983 -5574 17523 35934
931 35934 43815 38195 20922 -1751 -23228 -38169 -42535 -34346 -15282 8369 28822 40305 40155
944 40155 28854 9050 -13790 -32780 -41603 -37727 -22939 -2127 19137 35401 41375 34649 17244
957 17244 -4776 -24646 -37202 -39502 -30331 -11671 10468 29252 38880 37207 24966 5332 -16001
970 -16001 -32668 -39241 -34041 -19258 745 20604 34974 39015 30756 13116 -7536 -25181 -35853
983 -35853 -36792 -26732 -7984 13279 29666 36731 33542 21274 2537 -17603 -32720 -37340 -30360
996 -30360 -15003 3740 21389 33718 36403 27535 9846 -10059 -26015 -34394 -33463 -22775 -5013
1009 -5013 14546 29428 35260 30788 17483 -838 -18819 -31271 -34361 -27563 -12701 6012 23199
1022 23199 33255 32852 22773 6867 -10287 -25144 -33663 -32078 -19526 -640 16802 27863 31343
1035 31343 27516 15969 -1839 -20397 -32032 -32364 -22917 -8319 7372 21502 30890 31463 21496
1048 21496 4094 -13765 -26201 -30637 -26931 -16040 -461 15925 28129 31793 25294 10715 -6323
1061 -6323 -20273 -27949 -28577 -21864 -8134 9328 24417 30983 27048 15494 1334 -12398 -23836
1074 -23836 -29899 -26709 -13689 3971 18874 26623 27017 21097 9527 -5902 -20643 -28889 -27598
1087 -27598 -17635 -3130 11206 22193 27360 24934 15025 48 -15093 -25352 -27581 -21507 -9615
1100 -9615 4421 17053 25442 26738 19748 6039 -9353 -21034 -25803 -23644 -15341 -2572 11600
1113 11600 22784 26860 22267 11127 -2702 -15132 -23345 -25184 -19707 -8071 6039 18243 24775
1126 24775 23885 16033 3649 -9532 -19895 -24615 -22242 -13152 78 13137 21876 23954 19337 9346
1140 9346 -3402 -15374 -22962 -23510 -16888 -5352 7380 17702 22970 21664 13967 2010 -10485
1153 -10485 -19754 -23114 -19689 -10450 1884 13273 20718 22149 17394 7346 -5045 -15954 -21758
1166 -21758 -20951 -14245 -3641 8004 17514 21944 19704 11384 -98 -11199 -18830 -21212 -17523 -8459
1180 -8459 3210 13804 20004 20267 14865 5119 -6262 -15712 -20337 -18907 -12206 -1971 8942 17376
1194 17376 20465 17278 9008 -1510 -11378 -18065 -19642 -15431 -6373 4665 13944 18820 18326 12784
1208 12784 3379 -7215 -15626 -19057 -16978 -10041 -383 9662 16801 18801 15137 7168 -2679 -11712
1222 -11712 -17388 -18117 -13213 -4373 5579 13596 17606 16668 10962 1872 -7999 -15229 -17680 -14997 -8151
1237 -8151 947 9935 15957 17301 13346 5607 -3633 -11903 -16632 -16381 -11125 -2839 6128 13141 16531
1252 16531 15215 9193 328 -8595 -14558 -16174 -13294 -6681 1924 10196 15349 15753 11494 4045 -4564
1267 -4564 -11763 -15492 -14671 -9584 -1823 6632 13140 15629 13383 7165 -900 -8519 -13622 -14943 -12079
1282 -12079 -5216 3222 10575 14392 13926 9736 2934 -4944 -11612 -14699 -13189 -7785 -351 7101 12556
1297 12556 14275 11689 5737 -1769 -8708 -13173 -13825 -10296 -3617 4132 10233 13296 12626 8452 1712
1312 1712 -5770 -11568 -13561 -11353 -6177 499 7264 12068 13248 10342 4309 -2757 -8910 -12466 -12361
1327 -12361 -8597 -2438 4473 10015 12627 11533 7012 290 -6395 -10922 -12101 -9924 -5301 1121 7639
1342 7639 11855 12109 8571 2804 -3338 -8440 -11535 -11407 -7642 -1319 5329 9940 11436 9770 5723
1357 5723 -180 -6323 -10597 -11562 -8895 -3677 2255 7500 10601 10758 7748 2331 -3852 -8861 -11029
1372 -11029 -9751 -5785 -478 5039 9187 10821 9145 4691 -1432 -6790 -9813 -10046 -7566 -3094 2492
1387 2492 7610 10378 9837 6177 1035 -4124 -8108 -9950 -8952 -5187 331 5718 9039 9573 7528 3512
1403 3512 -1533 -6437 -9568 -9564 -6527 -1737 3278 7210 9204 8636 5467 526 -4572 -8275 -9253 -7500
1419 -7500 -3864 924 5540 8557 8952 6630 2421 -2284 -6435 -8657 -8325 -5527 -1126 3589 7224
1434 7224 8715 7514 4239 -269 -4585 -7640 -8429 -6691 -3042 1597 5643 7976 7915 5637 1805 -2638
1450 -2638 -6343 -8202 -7412 -4411 -330 3748 6699 7912 6663 3454 -913 -4901 -7266 -7382 -5612
1465 -5612 -2333 1788 5535 7654 7178 4579 845 -2997 -5941 -7303 -6517 -3746 179 4086 6564
1480 6564 7068 5584 2658 -1228 -4735 -6840 -6859 -4715 -1467 2272 5288 6873 6345 3830 206 -3273
1496 -3273 -5713 -6668 -5696 -2974 793 4183 6153 6295 4759 2022 -1587 -4764 -6439 -6029 -3773 -768
1512 -768 2437 5096 6358 5554 3000 -340 -3348 -5395 -6013 -4941 -2162 1387 4162 5599 5411 4036
1528 4036 1496 -1871 -4832 -5973 -5021 -2899 -316 2448 4785 5882 4883 2246 -942 -3432 -4902
1543 -4902 -5325 -4221 -1588 1636 4108 5170 4804 3352 786 -2303 -4583 -5277 -4283 -2434 0 2698
1559 2698 4784 5317 4016 1356 -1195 -3159 -4518 -4853 -3599 -955 2015 3980 4576 4144 2704 331
1575 331 -2323 -4297 -4729 -3725 -1832 525 2788 4372 4580 3235 1031 -1296 -3135 -4309 -4315 -2802
1591 -2802 -279 2069 3581 4065 3733 2252 -156 -2597 -4028 -4016 -3030 -1350 702 2767 4064 4048 2557
1608 2557 499 -1463 -3048 -3922 -3688 -2137 13 2092 3374 3688 3049 1592 -482 -2534 -3640 -3613
1624 -3613 -2549 -853 1107 2778 3648 3324 2012 188 -1575 -2963 -3591 -3015 -1442 447 2081 3072
1640 3072 3253 2585 1039 -903 -2562 -3266 -2968 -1988 -470 1221 2654 3257 2807 1444 -257 -1743 -2707
1657 -2707 -3042 -2479 -1089 647 2108 2915 2884 1977 566 -1057 -2272 -2879 -2575 -1601 -74 1479 2524
1674 2524 2799 2198 1018 -436 -1649 -2545 -2693 -1909 -600 893 2024 2532 2354 1467 228 -1169 -2091
1691 -2091 -2521 -2114 -1135 222 1482 2201 2311 1762 684 -578 -1681 -2334 -2198 -1437 -231 961 1830
1708 1830 2234 1996 1108 -95 -1243 -1973 -2167 -1591 -672 374 1338 1990 1993 1385 302 -820 -1635 -1964 -1684
1727 -1684 -982 -32 963 1742 1925 1514 632 -381 -1243 -1698 -1724 -1254 -369 645 1443 1775 1543 908 8
1746 8 -836 -1476 -1651 -1372 -597 297 1105 1537 1516 1107 409 -478 -1162 -1464 -1421 -824 -46 795 1229 1419 1181
1767 1181 554 -147 -849 -1314 -1319 -1038 -331 447 1009 1217 1120 798 147 -586 -1133 -1253 -987 -545 142 723 1107
1788 1107 1202 854 248 -409 -863 -1042 -967 -624 -90 552 959 1008 870 445 -54 -647 -983 -893 -603 -245 268
1809 268 728 958 851 450 25 -422 -671 -829 -734 -369 205 585 782 737 532 220 -267 -655 -806 -647 -373
1830 -373 49 341 635 783 574 193 -179 -467 -658 -631 -466 -95 303 572 610 512 280 12 -365 -610 -547
1851 -547 -375 -69 121 391 589 554 306 -67 -310 -433 -498 -396 -209 124 419 483 423 242 121 -166 -447
1872 -447 -572 -370 -91 116 300 460 461 348 -6 -265 -412 -400 -363 -217 69 309 398 459 241 46 -104 -338
1894 -338 -386 -374 -142 72 247 351 456 342 107 -156 -371 -384 -332 -183 46 249 457 444 313 16 -157 -318
1916 -318 -438 -475 -221 60 308 451 379 323 165 -101 -403 -467 -451 -214 12 247 418 466 407 140 -129 -428
1938 -428 -532 -488 -280 4 238 443 502 474 272 -51 -383 -537 -563 -329 -127 157 494 590 616 374 -47 -391
1960 -391 -534 -553 -470 -235 97 375 650 665 439 75 -272 -502 -625 -570 -375 0 393 647 693 550 226 -91
1982 -91 -467 -668 -668 -471 -94 263 558 702 617 398 -1 -394 -654 -770 -588 -293 170 547 723 722 537 204
2004 204 -247 -671 -814 -665 -374 -12 382 731 839 673 329 -84 -600 -850 -830 -603 -162 261 673 878
2024 878 819 470 54 -411 -815 -875 -709 -339 86 578 857 953 625 159 -330 -699 -875 -872 -562 -72 445 779
2046 779 934 775 434 -76 -524 -901 -921 -693 -299 258 717 943 928 556 62 -436 -801 -973 -849 -435 46
2067 46 599 885 946 767 274 -207 -673 -984 -928 -636 -127 372 843 1024 876 537 -8 -543 -872 -1013 -784
2088 -784 -358 196 688 1020 970 724 227 -304 -793 -1007 -930 -560 -41 496 889 1062 857 461 -99 -656 -1022
2109 -1022 -1039 -710 -277 302 786 1044 998 685 61 -422 -939 -1051 -889 -501 44 624 966 1040 840 308 -256
2130 -256 -753 -1045 -984 -736 -192 414 892 1109 976 557 -16 -533 -959 -1072 -882 -354 206 702 1059 1094 778
2151 778 210 -311 -825 -1104 -988 -615 -67 517 978 1071 926 476 -152 -737 -1020 -1074 -799 -305 282 809 1109
2172 1109 1056 736 135 -441 -948 -1068 -949 -529 123 647 1026 1072 880 359 -210 -727 -1057 -1051 -731 -218 343
2193 343 880 1052 958 559 40 -551 -927 -1089 -901 -434 172 710 1011 1046 726 255 -305 -808 -1078 -1022 -616
2214 -616 -86 483 982 1094 879 432 -107 -597 -954 -1058 -807 -335 263 770 1086 1039 648 152 -436 -884
2234 -884 -1040 -897 -524 34 581 994 1045 818 349 -230 -711 -975 -1019 -716 -207 332 828 1024 903 583 -13
2255 -13 -468 -938 -1054 -858 -446 105 696 986 1022 764 293 -316 -730 -1018 -1006 -599 -78 476 939 1076 892
2276 892 507 -90 -608 -898 -1028 -753 -308 236 731 998 950 655 120 -420 -805 -1003 -878 -521 27 541
2296 541 899 980 808 373 -195 -651 -949 -920 -630 -191 328 830 956 932 540 27 -488 -878 -1015 -823 -433
2317 -433 87 663 959 948 754 268 -287 -750 -931 -902 -530 -121 429 853 972 863 454 -15 -554 -836 -924
2338 -924 -722 -321 243 657 931 919 614 151 -396 -830 -929 -858 -509 -14 471 835 942 744 366 -193 -632
2359 -632 -943 -938 -667 -196 264 740 907 871 561 73 -406 -783 -945 -846 -392 116 598 865 953 672 230 -227
2381 -227 -657 -892 -850 -623 -88 398 755 927 780 459 -45 -494 -817 -958 -737 -374 198 628 887 920 631
2402 631 181 -301 -713 -932 -861 -514 -43 508 816 931 739 320 -142 -607 -858 -874 -708 -203 287 692 950
2423 950 869 531 134 -411 -785 -886 -770 -445 65 511 834 882 682 267 -195 -689 -916 -909 -529 -170 353
2444 353 748 897 812 433 29 -450 -809 -901 -727 -315 135 603 857 848 611 239 -300 -721 -899 -841 -515 -8
2466 -8 461 754 887 742 352 -78 -575 -842 -850 -719 -234 227 643 859 835 567 91 -369 -772 -869 -793 -432
2488 -432 17 496 798 864 730 263 -157 -619 -879 -852 -617 -171 356 671 865 796 447 -41 -484 -745 -876
2509 -876 -682 -355 185 576 818 892 620 184 -291 -668 -875 -802 -504 -69 421 797 872 797 398 -95 -517
2530 -517 -826 -859 -648 -246 251 630 871 854 493 88 -369 -680 -890 -778 -450 55 524 815 863 681 304
2551 304 -193 -609 -865 -848 -555 -161 284 678 825 770 495 18 -442 -756 -886 -720 -403 113 527 836 878
2572 878 668 233 -300 -613 -867 -815 -543 -20 339 756 895 713 404 -53 -543 -796 -820 -704 -303 184 624
2593 624 861 834 567 154 -345 -668 -881 -752 -437 28 445 783 863 724 290 -128 -577 -816 -782 -585 -184
2614 -184 286 667 833 774 451 58 -474 -760 -816 -721 -374 152 555 805 872 626 211 -312 -659 -878 -862 -526
2636 -526 -81 349 685 802 736 395 -62 -501 -820 -873 -629 -261 164 617 867 803 520 102 -261 -752 -845
2657 -845 -746 -422 24 459 739 777 687 284 -192 -525 -776 -787 -567 -220 276 664 841 787 492 57 -406 -746
2679 -746 -799 -687 -301 122 562 793 817 600 215 -264 -673 -884 -813 -515 -156 386 686 871 676 424 -35
2700 -35 -480 -774 -832 -638 -204 242 597 802 806 535 146 -373 -685 -816 -747 -463 -26 461 759 850 642 331
2722 331 -134 -600 -834 -817 -548 -168 318 695 857 768 451 46 -417 -744 -848 -703 -320 159 566 824 808
2743 808 609 187 -284 -631 -848 -769 -517 -69 414 699 861 774 440 -60 -497 -793 -836 -612 -229 199 629
2764 629 819 757 493 129 -370 -723 -862 -764 -373 39 488 731 839 638 306 -167 -582 -795 -808 -582 -195
2785 -195 329 644 836 772 433 1 -469 -715 -842 -685 -333 131 524 793 806 617 228 -277 -677 -798 -745
2806 -745 -463 -53 420 737 851 725 363 -132 -468 -768 -766 -566 -235 238 592 864 798 525 107 -316 -731
2827 -731 -852 -765 -408 -25 438 792 811 654 265 -177 -606 -794 -827 -556 -120 298 666 849 748 418 7
2848 7 -441 -756 -822 -674 -346 97 566 791 790 596 198 -274 -691 -812 -772 -497 -54 425 752 846 685 358
2870 358 -102 -484 -729 -812 -653 -206 199 600 827 814 493 99 -383 -741 -840 -727 -390 19 459 814 831
2891 831 597 300 -140 -520 -857 -810 -517 -135 303 699 792 714 420 27 -419 -723 -892 -674 -331 86 500
2912 500 827 817 592 190 -217 -657 -820 -770 -503 -53 365 687 825 717 375 -90 -512 -802 -852 -628 -275
2933 -275 249 556 815 804 530 76 -339 -678 -847 -677 -423 54 439 747 848 649 323 -140 -588 -775
2953 -775 -776 -545 -163 320 707 804 760 479 -16 -377 -721 -795 -657 -374 136 526 744 804 644 227 -287 -632
2975 -632 -827 -826 -468 -144 390 709 820 722 357 -49 -468 -773 -799 -631 -218 156 634 780 785 535 160 -251
2997 -251 -676 -800 -750 -398 -45 419 700 818 668 311 -94 -501 -760 -815 -604 -211 232 614 796 754 483
3018 483 82 -328 -670 -823 -699 -347 77 521 683 785 593 224 -168 -566 -839 -744 -529 -129 277 648
3038 648 811 668 388 -2 -416 -704 -757 -633 -253 102 501 739 757 580 175 -294 -580 -728 -695 -471 -92
3059 -92 382 705 795 667 294 -92 -469 -763 -771 -578 -230 219 565 824 741 472 92 -314 -580 -794 -732 -404
3081 -404 69 440 689 784 610 273 -137 -480 -780 -762 -529 -101 218 577 742 699 423 29 -375 -633 -768
3102 -768 -623 -337 69 467 714 772 564 182 -235 -602 -752 -737 -423 -61 300 605 778 685 345 -29 -382
3123 -382 -731 -778 -534 -214 179 541 744 701 479 137 -252 -587 -764 -635 -401 -16 374 682 747 611 307
3144 307 -94 -469 -730 -700 -562 -199 187 560 733 676 453 64 -318 -584 -751 -663 -309 35 422 687 709
3165 709 553 265 -168 -491 -694 -762 -503 -191 233 573 738 690 407 10 -354 -618 -762 -608 -306 146 494
3186 494 663 709 475 177 -183 -518 -695 -689 -460 -95 307 641 722 627 373 -2 -398 -650 -769 -553 -268 135
3208 135 478 731 710 428 73 -264 -576 -764 -632 -394 -8 374 635 732 598 274 -99 -449 -682 -706 -552
3229 -552 -216 184 555 730 689 462 87 -316 -580 -675 -593 -349 37 408 651 752 580 282 -171 -496 -718
3250 -718 -662 -480 -137 264 551 652 640 342 18 -342 -676 -682 -582 -270 108 471 657 678 503 194 -150 -520
3272 -520 -706 -629 -443 -30 334 603 712 593 378 -24 -420 -651 -673 -564 -232 179 517 682 721 475 123
3293 123 -223 -554 -660 -601 -379 11 363 590 696 563 240 -110 -422 -623 -660 -532 -209 181 487 699 630
3314 630 363 22 -267 -606 -670 -609 -356 47 425 636 681 503 236 -189 -481 -680 -698 -491 -58 274 541
3335 541 695 608 356 19 -347 -620 -692 -549 -279 109 444 625 671 502 208 -225 -540 -673 -576 -417 -83
3356 -83 261 558 707 580 308 -45 -393 -658 -658 -523 -226 169 463 672 631 446 175 -227 -549 -665 -549
3377 -549 -339 24 358 596 674 556 270 -94 -461 -665 -663 -450 -171 146 522 680 674 432 55 -275 -577 -660
3399 -660 -579 -306 45 341 665 611 505 209 -178 -483 -658 -655 -460 -66 247 511 691 591 385 -12 -310
3420 -310 -597 -642 -527 -288 118 447 628 652 470 169 -160 -557 -671 -598 -400 -72 310 542 649 551 318
3441 318 -85 -373 -629 -683 -479 -181 160 466 674 628 420 119 -285 -501 -612 -588 -369 25 339 582 660
3462 660 531 273 -68 -435 -610 -619 -482 -140 222 513 668 573 372 53 -257 -483 -631 -524 -275 58 412
3483 412 607 659 466 214 -170 -502 -625 -618 -406 -106 273 555 683 547 292 -34 -303 -542 -629 -516 -228
3504 -228 128 472 635 638 432 179 -203 -500 -612 -612 -333 -52 291 531 613 514 273 -129 -378 -560 -609 -434
3526 -434 -182 130 456 561 567 356 101 -270 -533 -621 -610 -270 25 326 474 659 505 218 -148 -443 -593
3547 -593 -548 -410 -154 198 508 632 556 369 57 -258 -540 -618 -497 -229 53 394 546 586 426 167 -183
3568 -183 -487 -575 -521 -340 -64 301 522 642 494 293 -42 -312 -498 -614 -469 -175 151 428 594 645 434
3589 434 116 -197 -458 -617 -605 -342 -5 330 511 606 471 252 -49 -418 -558 -550 -444 -154 197 439 570
3610 570 582 397 59 -211 -491 -549 -493 -309 8 356 576 589 451 181 -115 -415 -508 -581 -374 -110 205 432
3632 432 566 507 296 -27 -327 -524 -566 -460 -238 99 430 542 530 366 107 -187 -370 -583 -502 -299 -57
3653 -57 277 484 557 481 226 -64 -303 -562 -578 -439 -139 194 362 580 568 345 57 -214 -505 -544 -485 -298
3675 -298 -6 274 485 541 473 220 -71 -347 -547 -509 -401 -161 164 450 520 500 281 31 -258 -465 -542 -474
3697 -474 -244 66 347 554 520 413 181 -177 -348 -475 -486 -293 -35 207 454 590 481 212 -26 -305 -462
3718 -462 -544 -408 -171 111 364 522 494 336 122 -230 -465 -556 -468 -296 31 225 452 521 394 251 -82 -364
3740 -364 -497 -516 -361 -152 74 384 471 456 284 113 -249 -458 -570 -490 -273 8 283 466 503 424 148 -97
3762 -97 -357 -504 -509 -350 -127 212 422 513 421 269 6 -266 -449 -543 -442 -152 75 297 492 435 337 96 -141
3785 -141 -370 -543 -448 -256 -56 186 440 538 410 242 -28 -290 -420 -442 -319 -143 133 355 479 417 280
3806 280 96 -201 -396 -468 -418 -226 -24 241 432 483 342 180 -119 -270 -433 -455 -331 -148 157 328 443
3827 443 425 253 19 -229 -398 -451 -383 -176 15 240 445 420 326 128 -71 -339 -488 -418 -313 -66 177 404
3849 404 454 460 281 2 -262 -383 -460 -366 -203 99 300 452 428 280 95 -146 -384 -471 -404 -216 27 217 384
3872 384 469 367 152 -47 -262 -394 -471 -348 -130 82 285 417 361 291 8 -185 -371 -441 -366 -156 4 217
3894 217 391 392 345 144 -60 -266 -387 -384 -315 -154 174 321 415 463 222 -6 -237 -339 -406 -393 -194 40 272
3917 272 423 386 263 90 -106 -292 -419 -404 -270 -19 145 378 381 405 179 -19 -199 -352 -415 -337 -110 118
3939 118 268 356 359 277 97 -119 -299 -396 -354 -239 -29 211 313 413 364 129 23 -268 -375 -407 -289 -114 114
3962 114 275 384 403 222 51 -168 -301 -364 -345 -174 -6 218 326 381 266 124 -60 -262 -349 -340 -262 -84 160
3985 160 325 364 271 224 56 -159 -326 -366 -304 -122 44 257 303 286 268 79 -113 -266 -362 -394 -201 -49 136
4008 136 297 330 271 144 -22 -212 -326 -348 -268 -136 76 215 312 365 247 62 -139 -268 -332 -316 -189 -9 208
4031 208 358 324 281 166 -53 -262 -382 -341 -260 -56 115 268 353 329 224 7 -201 -314 -360 -282 -154 20 202
4054 202 306 337 294 90 -105 -207 -338 -304 -255 -54 69 305 346 336 176 35 -166 -293 -346 -298 -162 43 203
4077 203 305 281 250 82 -125 -210 -277 -302 -207 -45 125 296 323 270 147 -36 -213 -309 -330 -240 -146 86 207 327
4101 327 307 260 73 -102 -253 -301 -321 -195 35 137 294 307 230 128 -39 -216 -346 -312 -205 -128 81 209 308
4124 308 288 192 -24 -125 -289 -295 -267 -172 93 164 312 301 276 107 -55 -229 -298 -329 -187 -13 142 260 348 290
4148 290 167 -34 -168 -285 -312 -223 -142 37 224 261 359 216 72 -65 -221 -279 -302 -159 -41 119 213 342 254
4171 254 124 -12 -240 -274 -306 -230 -49 81 249 335 305 180 28 -100 -211 -301 -265 -221 13 129 285 321 227
4194 227 174 -60 -203 -291 -291 -211 -85 45 219 304 233 152 2 -134 -228 -328 -267 -156 9 149 284 274 185 62
4218 62 -81 -227 -298 -296 -170 -4 146 293 296 226 206 45 -196 -282 -223 -237 -120 48 191 280 263 228 70 -44 -261
4243 -261 -269 -270 -166 -31 152 284 306 291 128 -55 -148 -232 -250 -270 -87 55 182 288 284 176 64 -126 -214 -284 -246
4268 -246 -131 -40 166 270 307 215 71 -73 -195 -241 -277 -231 -43 113 226 286 252 139 25 -132 -218 -261 -278 -164
4292 -164 -16 169 287 273 226 107 -45 -222 -277 -249 -239 -35 125 168 293 281 135 5 -196 -276 -235 -249 -72
4315 -72 54 184 269 286 193 67 -66 -209 -271 -262 -169 -31 125 241 270 247 103 -31 -141 -244 -286 -185 -76 80
4339 80 244 238 242 179 4 -142 -241 -287 -264 -110 45 95 251 275 143 112 -25 -185 -259 -266 -178 7 80 210 288 244
4365 244 190 28 -147 -212 -228 -231 -69 41 184 230 269 203 69 -112 -160 -227 -230 -173 -8 110 245 300 283 123 35
4390 35 -166 -228 -278 -222 -108 86 161 267 242 141 51 -104 -149 -224 -242 -170 -22 125 230 250 222 118 -60 -137 -225
4415 -225 -244 -144 -45 103 216 218 285 129 1 -84 -195 -244 -185 -160 20 205 265 231 163 130 -26 -191 -262 -240 -124
4440 -124 -45 44 205 224 218 130 -19 -141 -198 -241 -138 -74 6 123 205 161 217 77 -99 -167 -242 -233 -151 -9 137 173
4466 173 230 210 132 -34 -108 -202 -244 -211 -27 47 168 214 211 165 63 -98 -180 -289 -185 -101 1 134 192 258 173 96
4492 96 -62 -130 -218 -217 -162 -79 76 185 186 137 99 42 -86 -203 -216 -235 -43 -8 160 224 211 175 77 -34 -149 -238 -271
4519 -271 -136 15 151 184 260 223 67 -4 -144 -199 -200 -196 -67 87 109 162 265 147 72 -50 -190 -215 -225 -74 0
4544 0 99 133 249 185 83 -11 -154 -180 -249 -129 -72 56 161 239 229 125 1 -80 -178 -226 -229 -119 -5 163 222 263
4570 263 128 96 -9 -166 -179 -233 -166 -44 87 132 151 197 158 -62 -141 -198 -248 -220 -60 -26 122 235 206 105 54
4595 54 -64 -183 -198 -240 -131 -37 88 166 210 247 108 -33 -163 -213 -223 -149 -50 27 91 199 225 126 49 -94 -159 -234
4621 -234 -235 -73 19 102 194 263 154 108 -10 -97 -204 -205 -106 -74 84 145 196 168 166 18 -75 -215 -205 -176 -82 1 98 201
4649 201 198 116 57 -66 -139 -149 -193 -132 -43 72 137 215 169 124 1 -106 -171 -204 -158 -47 43 155 194 209 159 58 -64
4676 -64 -143 -211 -170 -90 -43 85 141 209 187 76 -15 -91 -149 -185 -181 -47 35 134 167 197 196 14 -75 -175 -215 -187 -72 -43
4704 -43 115 183 225 165 51 1 -118 -164 -179 -91 -9 71 123 199 208 152 34 -88 -184 -155 -187 -89 14 143 190 215 173
4731 173 84 -27 -146 -202 -223 -148 2 74 135 139 206 91 38 -104 -184 -167 -185 -96 29 122 222 194 154 55 -41 -147
4757 -147 -187 -136 -102 16 88 188 203 162 16 -27 -108 -152 -174 -166 -45 18 121 253 207 99 15 -140 -142 -230 -179 -124 -40
4784 -40 135 169 191 139 72 -27 -107 -170 -166 -175 -19 71 146 180 184 132 -35 -113 -157 -186 -171 -51 -32 83 156 150 143 60 23 -107
4814 -107 -229 -175 -131 -34 62 143 219 146 93 32 -88 -192 -215 -146 -96 14 106 174 203 159 88 -47 -145 -165 -190 -103 -7
4841 -7 96 163 157 143 45 30 -126 -199 -139 -146 -54 34 125 163 160 119 27 -52 -166 -205 -114 -24 46 99 179 163 97 82 -52 -87
4871 -87 -176 -152 -155 -64 93 131 100 150 119 -33 -69 -172 -135 -177 -158 33 87 154 207 111 102 7 -169 -151 -197 -145 -23 53
4899 53 149 201 193 71 80 -84 -138 -171 -136 -119 20 54 160 183 156 75 -109 -129 -166 -210 -131 -45 55 114 156 209 128 12
4927 12 -112 -200 -181 -140 -60 49 127 193 151 168 26 -60 -166 -216 -169 -124 19 96 150 188 149 51 -29 -106 -191 -167 -141 -56
4955 -56 39 129 189 172 76 34 -39 -159 -193 -162 -83 -37 86 171 193 141 41 -45 -136 -124 -140 -139 -30 52 128 159 188 60
4983 60 -12 -44 -196 -191 -160 -46 42 129 185 196 155 44 -59 -160 -147 -201 -83 23 72 145 165 170 103 -9 -137 -171 -175
5010 -175 -190 -72 48 122 163 136 99 10 -87 -169 -161 -166 -98 -42 129 78 176 174 105 -17 -155 -162 -170 -121 -8 2 166 201 125
5039 125 95 5 -104 -168 -171 -133 -117 -12 149 183 164 151 2 -10 -106 -198 -183 -107 -14 25 117 167 174 85 0 -46 -106 -193 -165
5068 -165 -84 9 102 179 115 117 38 2 -103 -140 -122 -146 -55 76 139 115 182 46 12 -78 -126 -173 -160 -93 46 154 155 163 113
5097 113 61 -34 -168 -206 -120 -45 26 128 142 138 115 53 36 -101 -161 -164 -168 -66 52 96 184 168 38 -6 -43 -140 -172 -197
5125 -197 -95 40 100 197 166 104 36 -17 -91 -194 -172 -87 -36 31 206 181 250 93 11 -72 -115 -225 -133 -70 -32 90
5151 90 138 151 99 90 -2 -97 -169 -124 -72 -17 17 134 177 130 109 13 -79 -204 -178 -114 -48 43 100 151 189 67 56 -29 -175
5180 -175 -185 -140 -82 -1 64 157 184 170 50 -2 -107 -150 -163 -137 6 33 140 186 160 74 55 -95 -190 -170 -149 -59 29
5207 29 124 118 138 109 35 -38 -156 -167 -155 -34 41 76 126 226 136 105 4 -69 -181 -134 -119 -152 19 146 197 180 105
5234 105 68 -37 -105 -184 -150 -76 53 131 162 245 159 51 15 -127 -199 -133 -175 -74 78 127 134 109 104 -9 -58 -184 -192
5261 -192 -197 -62 3 91 161 198 134 47 -20 -91 -119 -131 -116 -32 20 102 130 132 102 23 -74 -175 -163 -117 -50 -2 105 135 181
5290 181 152 14 -49 -112 -135 -129 -157 -43 44 105 122 115 62 -30 -37 -139 -170 -142 -42 53 126 149 162 134 23 -58 -131 -132 -112
5319 -112 -119 35 89 192 132 128 116 4 -117 -147 -164 -99 -111 57 101 158 134 128 53 -23 -92 -168 -121 -53 36 69 173 144
5347 144 111 57 3 -138 -131 -139 -67 -69 29 137 168 128 108 5 -57 -158 -114 -136 -85 59 73 150 147 128 46 -43 -106 -146 -149 -98
5377 -98 2 131 139 151 121 97 -28 -93 -129 -173 -152 -56 25 113 166 143 54 33 -35 -114 -146 -160 -112 -13 83 138 136 143 58 -12
5407 -12 -93 -207 -147 -110 -6 68 135 143 122 83 -14 -77 -124 -161 -88 -68 17 130 166 165 163 55 -65 -129 -185 -128 -102 -42 43
5436 43 139 161 136 76 12 -98 -197 -176 -94 -23 -2 43 132 142 88 22 -97 -106 -112 -150 -120 -23 108 114 108 105 61 28 -95 -106 -178
5467 -178 -116 -33 17 115 145 182 65 21 -106 -113 -180 -136 -6 -20 97 120 139 111 48 -76 -97 -148 -104 -104 -22 51 142 144 125
5496 125 85 3 -85 -107 -138 -131 -51 30 126 139 114 98 46 -38 -116 -162 -160 -71 -25 39 116 133 157 29 36 -44 -137 -96 -127 -25
5526 -25 -23 105 171 116 139 34 -67 -162 -171 -162 -97 0 78 125 81 100 70 -26 -94 -158 -139 -105 -55 30 70 96 110 135 50 -81
5556 -81 -125 -167 -166 -90 -28 115 162 131 114 3 -14 -102 -116 -77 -63 -33 53 115 168 106 108 28 -49 -101 -174 -139 -101 43 102 114
5586 114 132 133 64 -23 -88 -105 -155 -99 -28 78 125 151 110 80 55 -76 -140 -145 -93 -20 34 129 152 176 104 38 -36 -141 -95
5615 -95 -121 -84 -11 117 124 137 125 115 -36 -87 -137 -126 -79 -73 42 95 101 141 61 25 -56 -169 -158 -81 -131 -26 33 107 170
5644 170 128 58 16 -73 -173 -95 -106 11 49 102 125 148 88 -29 -59 -70 -160 -102 -66 31 97 194 160 69 53 -23 -80 -115
5672 -115 -142 -103 6 77 113 175 159 77 28 -76 -126 -176 -146 -87 -5 82 159 199 126 82 -30 -111 -169 -162 -81 -10 99 147
5700 147 165 73 70 -22 -100 -119 -136 -73 -83 41 90 174 161 99 12 -37 -82 -116 -133 -84 -50 94 131 151 93 46 -24 -70 -98
5729 -98 -183 -107 -27 41 87 104 128 90 6 -40 -68 -180 -122 -87 11 97 169 155 88 44 -34 -140 -152 -105 -111 -2 94 121 142
5758 142 155 54 -9 -71 -109 -146 -122 -78 22 83 141 109 100 49 -60 -91 -116 -168 -97 7 54 133 140 113 71 -25 -138 -170
5786 -170 -154 -118 -51 22 123 161 115 72 25 -75 -130 -124 -114 -64 45 85 167 118 124 77 -12 -71 -139 -89 -88 -33 37 112 135 115
5816 115 76 42 -30 -97 -134 -134 -104 -36 110 67 159 105 57 -36 -76 -159 -152 -56 -18 -16 117 139 118 74 26 -94 -90 -149 -68 -69 35
5847 35 113 90 182 74 30 -55 -91 -124 -122 -81 -4 53 97 111 135 61 -28 -105 -142 -101 -169 -56 74 100 199 121 105 -6 -62
5876 -62 -94 -181 -109 -63 18 63 155 118 87 113 -37 -65 -113 -161 -60 -24 58 88 94 100 88 -4 -70 -152 -138 -111 -40 35 56 173
5906 173 144 84 9 -10 -117 -150 -88 -90 -55 69 124 165 93 43 19 -102 -156 -118 -128 -94 16 105 106 142 118 0 15 -81
5934 -81 -143 -94 -71 -40 97 73 152 155 40 -11 -74 -116 -113 -136 -51 47 64 148 134 39 50 -45 -133 -106 -115 -77 3 31 102 135 101
5965 101 80 -3 -76 -182 -147 -130 7 32 74 115 85 16 32 -83 -99 -160 -88 -34 15 73 110 200 86 78 -62 -119 -96 -116
5993 -116 -70 -5 83 67 151 97 26 11 -40 -107 -164 -109 -31 93 119 131 128 46 53 -63 -127 -163 -131 -39 2 68 108 158 115 109
6023 109 10 -96 -116 -103 -64 -51 37 67 135 150 69 52 -91 -111 -102 -90 -56 43 126 148 83 99 91 -48 -77 -136 -111 -66 18
6052 18 48 103 137 134 89 24 -80 -151 -91 -101 -101 -2 88 135 104 79 54 -23 -92 -97 -75 -114 4 63 103 129 83 79 11 -52 -56 -141
6084 -141 -96 -9 28 113 151 174 87 38 -45 -93 -89 -82 -52 19 18 110 103 93 110 10 -44 -88 -121 -110 -14 11 112 136 49 80 38
6115 38 -54 -95 -139 -105 -51 -22 87 139 136 99 93 -4 -86 -44 -134 -93 -17 69 98 102 91 5 23 -41 -125 -114 -111 -76 2 131 93
6146 93 147 156 19 -55 -100 -130 -73 -30 -23 43 122 127 64 82 -47 -52 -107 -188 -122 -49 4 61 96 71 101 48 -50 -103 -131 -98 -42
6177 -42 -4 58 114 108 102 9 -41 -104 -125 -148 -53 -67 27 92 66 72 83 0 -24 -82 -179 -80 -46 -1 53 105 112 27 43 -79 -95 -140
6209 -140 -136 -99 -51 55 132 140 119 60 15 -43 -122 -184 -67 -7 7 97 166 171 93 -38 -20 -18 -120 -89 -121 -38 -3 101 89
6238 89 126 84 46 -80 -91 -126 -88 16 61 140 106 99 97 62 -42 -74 -97 -112 -48 -42 55 94 120 102 37 -47 -10 -90 -102 -58
6268 -58 -3 28 114 125 84 64 13 -11 -75 -88 -106 -43 -1 54 96 68 102 37 9 -89 -124 -99 -88 23 41 96 154 56 26 -12
6298 -12 -34 -102 -126 -106 -10 41 33 76 93 62 29 -12 -84 -80 -53 -25 17 75 121 143 52 32 -7 -41 -69 -77 -84 -12 53 92 136 94
6330 94 80 15 -73 -80 -102 -62 -79 -7 31 119 103 89 41 -1 -28 -109 -105 -69 -18 50 29 169 106 63 31 -70 -134 -132 -91 -64 37
6361 37 46 103 153 103 39 -25 -66 -93 -113 -78 -31 17 94 106 62 52 3 -8 -76 -98 -104 -33 34 90 104 133 69 17 -56 -50 -151
6392 -151 -72 -84 19 28 52 141 91 26 -41 -66 -76 -100 -90 -18 28 114 79 108 77 -7 -6 -96 -104 -52 -56 38 94 71 84 71 75 28
6424 28 -64 -149 -63 -73 -16 22 34 108 76 73 -2 -38 -50 -99 -75 -5 25 90 89 64 88 41 9 -92 -95 -39 -12 -33 36 99 133
6455 133 82 53 -7 -50 -80 -99 -61 -6 49 17 107 84 57 33 -68 1 -88 -38 -72 17 83 72 116 108 29 -37 -53 -78 -88 -94
6485 -94 -43 76 110 118 69 106 3 -14 -97 -83 -40 -33 -34 66 72 45 62 -12 -11 -95 -72 -90 -33 -25 46 104 90 63 104 64 -48
6516 -48 -98 -86 2 -40 8 109 103 81 72 25 8 -21 -95 -81 -20 45 91 79 58 46 68 -7 -78 -78 -86 -99 -55 3 91 28 59 52
6548 52 44 -17 -114 -50 -74 -57 -11 38 110 90 40 31 35 -68 -55 -84 -115 -31 34 81 98 46 95 40 -20 -155 -68 -66 -68 9 50 61
6580 61 102 86 38 8 -42 -100 -92 -43 -53 35 24 64 17 18 38 -35 -114 -34 -58 -36 44 91 44 99 55 53 -5 -43 -87 -41 -68 32
6612 32 60 102 66 104 87 -6 -5 -106 -102 -45 -38 33 79 37 76 25 -20 -21 -77 -52 -83 -57 60 41 57 101 70 21 3 -85 -119
6643 -119 -100 -58 -11 10 71 86 106 57 -6 24 -27 -87 -67 -36 -14 86 95 95 49 36 -52 -16 -116 -129 -64 -14 64 36 49 53
6673 53 57 -39 -34 -79 -91 -40 -45 -8 69 70 58 46 -43 -58 -76 -119 -56 -50 -19 24 97 104 27 48 0 -10 -20 -71 -83 -81 46 34 70
6706 70 38 60 15 -20 -106 -85 -103 -34 32 96 95 84 61 56 34 -80 -75 -81 -87 -40 -1 57 106 88 60 -16 -70 -97 -89 -65 -18 0 72
6739 72 65 136 32 34 -21 -105 -79 -50 -58 20 -20 75 78 11 33 -14 -3 -57 -73 -79 -13 13 52 23 57 22 -8 5 -98 -61 -99 -63
6771 -63 34 -19 72 39 60 30 -12 -38 -49 -67 -44 -7 -2 32 74 60 57 39 -42 -58 -31 -11 -89 24 11 51 81 42 38 -43 -41 -40
6803 -40 -19 -37 40 3 40 85 35 9 -15 -51 -85 5 -41 -41 -11 64 80 78 17 45 -5 -94 -86 -50 -27 -31 11 61 59 19 -12 32 -45
6836 -45 -51 -35 -75 21 82 62 66 74 38 40 -12 -33 -23 -19 -35 13 56 63 64 25 26 -10 -36 -74 -67 -11 15 2 66 78 28 22 -24 -73 -52
6871 -52 -70 -63 -30 -11 47 86 57 63 24 -51 -91 -141 -40 -21 -6 0 39 69 53 59 -5 -47 -59 -47 -54 -22 31 4 39 82 65 -24
6903 -24 -12 -54 -107 -22 -2 39 27 39 57 51 33 -6 -14 -83 -37 -54 38 34 77 38 43 13 -30 0 -26 -72 -51 -77 -23 43 81 91
6935 91 32 85 -18 -2 -63 -26 -41 -24 16 59 79 43 44 10 -38 -25 -77 -54 16 12 64 42 76 51 45 -48 -64 -50 -51 -37 -44 31
6967 31 25 10 28 18 5 -44 -38 -26 -30 -26 52 33 45 76 22 2 18 -26 -37 -13 -55 -11 6 59 78 91 16 37 -23 2 -4 29 -22
7000 -22 21 20 90 73 -1 60 -26 -28 -42 -24 -46 -16 -25 20 22 22 17 1 -43 -103 -52 -49 -8 38 56 85 70 23 -24 7 -31 -65 -34 -33
7034 -33 47 29 44 66 62 20 -41 -28 -52 -34 -27 49 35 16 72 31 1 15 -2 -29 -46 -46 14 -4 40 44 22 67 -18 9 -49 -34
7066 -34 -18 5 -18 5 16 58 58 26 -33 -11 -30 -58 -45 -50 -29 31 53 48 -31 48 7 -44 -1 -34 -2 46 10 10 31 12 -3 7
7098 7 -15 -55 -24 -6 6 11 25 59 68 -28 61 -43 -46 -50 -53 4 21 50 60 30 8 22 16 -19 -75 -90 -11 -9 9 -6 54 47 93 6
7132 6 -7 1 -11 -81 3 55 33 3 23 14 -4 1 -6 -47 -78 -22 3 -37 6 69 23 16 -45 -42 -37 -96 -46 -52 31 22 34 86 -5 28 0
7167 0 -49 -64 -81 -52 51 -19 9 27 14 33 -67 -9 -5 23 -7 -27 13 -29 48 38 -14 -14 -12 6 -37 -57 -49 49 35 37 10 46
7199 46 50 -10 -36 -22 -66 -50 -5 -16 4 34 -23 47 14 -51 -53 -13 -46 -20 30 40 50 53 10 9 12 -20 -70 -29 8 -11 40 -12 99
7232 99 27 3 -4 -53 -52 -36 -14 -32 46 17 38 3 41 -12 -21 -27 -30 -26 -13 -24 38 35 56 47 0 17 -61 -81 -56 -51 -55 22 51 40 25
7267 25 54 -20 -30 -8 -18 -13 -37 -12 68 40 23 14 9 -27 -25 -32 -21 -35 11 49 -10 62 45 32 -9 -62 -36 -34 -55 -15 9 5 -6 26
7301 26 52 33 -55 -14 -17 -47 -43 17 -66 43 21 8 40 56 -34 -62 -16 -27 36 17 -1 -3 100 12 -4 10 -40 -17 -43 6 -8
7332 -8 -8 -15 25 21 18 -20 -52 -17 -74 -40 -19 3 39 32 96 23 -1 8 15 -54 37 -2 -45 19 -45 -4 -6 -15 -46 -15 -58 -34 -56 -8 -25
7367 -25 37 8 61 44 17 -32 -19 -16 -47 -19 -2 18 18 51 18 -17 -31 -67 -65 -30 -23 5 -4 82 -35 -49 39 -49 -31 -41 -75 -32
7399 -32 -30 4 15 60 14 46 35 -7 -22 -18 -6 1 15 24 44 30 34 45 -34 4 -45 -26 -15 -19 -11 5 34 44 20 -2 18 -33 -36 -22
7433 -22 -41 9 14 2 -8 -24 63 11 41 -41 -2 -23 -12 -20 10 9 16 37 -58 -23 -11 -20 -44 -41 -25 18 -40 50 36 25 -27 17 2
7466 2 -54 -55 18 3 68 54 27 -38 6 -60 -48 -29 -36 11 -64 19 14 15 2 26 10 -46 10 -7 -69 -22 49 12 60 -5 -5 8 10 -15
7500 -15 -35 5 -31 -25 23 47 8 4 -17 -81 9 -68 -12 1 -12 27 -36 21 46 12 -43 -62 7 -10 6 10 52 39 29 58 40 -5
7532 -5 -5 33 -1 -11 4 6 2 34 -1 48 -10 -10 -20 -25 -14 -16 0 5 -20 74 5 -4 -32 -22 -22 17 -29 -19 -4 75 34 32 14 0 -3 -24
7568 -24 -33 -26 46 -22 -34 2 -3 49 29 17 -45 -31 -8 -34 12 22 46 40 58 2 -16 -7 14 -23 -12 -34 -51 -18 23 79 -5 73 34
7601 34 -37 1 -44 -16 -28 -2 -12 45 36 28 61 46 -19 -5 12 -73 -77 27 -2 11 -4 56 16 -1 -11 -4 -22 -39 47 -16 30 -63
7633 -63 32 3 -25 -10 -31 1 7 -25 -20 13 5 49 -24 10 12 -28 -34 -24 -31 -18 24 -11 33 0 -47 -29 -36 -30 -7 6 5 4 11 47 -34 17
7669 17 17 -25 10 37 10 -52 29 48 -13 -2 -6 -36 -46 -20 49 -11 8 11 15 47 -42 57 -1 -12 -14 -24 -21 -12 40 3 -5 4 -6 4 -29
7704 -29 -10 -13 -26 -35 -25 -54 26 -9 0 8 41 25 -32 -20 -53 1 19 8 15 62 27 -1 -5 19 -45 -16 -8 -7 -20 60 56 12 -5 55 15
7739 15 -12 -48 -15 -10 28 32 -13 16 18 -8 -3 13 -28 10 -53 4 -54 4 40 -20 15 5 -50 -13 -32 -38 -38 -16 20 3 12 30 -5 -11
7773 -11 -29 -49 -57 -44 -7 -7 30 -8 -13 18 -8 -22 -27 5 -45 -31 -10 -2 -24 0 6 -6 -5 -17 -16 -12 -8 25 3 -12 67 29 -7 16 15 35
7809 35 -1 29 -7 36 26 16 -22 1 21 -2 -44 4 -15 -25 21 -51 -17 -24 17 -20 -5 -36 -46 -4 -53 -5 3 -6 43 -23 5 -39
7841 -39 26 -32 39 -33 -70 0 19 34 18 -4 13 22 21 -26 -9 -42 -34 -6 12 -7 14 19 5 -15 2 25 -8 -33 -30 -13 -14 22 -23
7874 -23 2 -35 18 61 -23 18 22 32 16 19 35 44 40 -26 16 38 -74 45 -24 -9 18 -7 2 -22 -25 32 -14 21 -16 15 3 6 0
7907 0 13 -9 -27 11 16 0 -31 -61 -36 -10 14 -4 -5 -11 33 24 -37 -35 -10 -29 -34 5 -13 -11 -19 -21 15 -25 -78 14 -26 -19 -10 -4 13 59 -34
7944 -34 -16 46 -42 4 7 8 -19 -16 -22 72 61 -21 -33 -46 31 -52 -39 38 -4 25 -14 -33 -30 -41 43 -31 -47 -32 47 33 6 -15 -12
7977 -12 -16 -26 3 14 14 -9 10 31 7 -25 -30 18 -30 -6 -21 7 -27 -14 10 8 7 31 55 -29 -3 -6 -20 -55 4 -53 -31 -16 -15 0
8011 0 -9 -15 -42 50 -11 -80 -45 29 7 35 22 -1 10 5 -57 -24 16 5 -36 -18 14 15 28 4 0 55 -3 -44 -43 -26 5 16 6 26
8045 26 9 59 42 -46 -25 7 -3 -25 -23 -25 14 21 -12 12 15 -30 -57 -27 -7 14 12 -11 26 28 24 -12 -8 -16 -2 12 22 23 6 -14 1
8080 1 -6 44 2 4 -22 39 -17 -22 32 55 84 26 13 -22 -15 22 -48 -29 -36 -42 8 -11 1 -3 3 -1 -65 -1 -20 -13 -22 -22 33 27 -28 -37 -12 -20
8118 -20 -41 0 -57 3 37 -4 -14 30 -40 8 -37 -1 -4 -22 -34 -19 -29 7 16 -47 6 -19 -15 -20 -36 -34 11 -77 48 -35 -9 12
8150 12 28 -27 -9 -52 -21 -36 -37 2 42 -18 43 -69 -10 -8 -13 -24 -22 37 12 2 -14 -4 -9 6 3 -18 -16 4 32 -1 13 9 3 23
8184 23 27 -22 -7 -58 -19 15 -12
8191a2
$$ Imaginary data points
##PAGE= N=2
##DATA TABLE= (X++(I..I)), XYDATA
0 0 0 0 0 0 0 0 0 0 0 0 0 0 0 8 -8 8 -8 8 -16 16 -16 24 -24 32 -32 40 -48 56 -64 72 -85 94 -109 122 -136
35 -136 156 -173 196 -216 242 -269 298 -331 365 -405 447 -494 545 -601 661 -727 802 -884 975
54 975 -1080 1196 -1330 1485 -1661 1876 -2131 2450 -2856 3391 -4139 5253 -7096 10715 -20588
69 -20588 108252 365803 321497 211785 90265 3991 -142173 -297928 -370035 -271641 -84919
80 -84919 92205 202065 270781 280972 207461 46022 -128274 -253123 -300207 -276476 -168945
91 -168945 3655 178045 274556 282009 229436 131451 -25960 -206780 -319429 -297776 -180095
102 -180095 -47571 68733 189229 293645 306795 185537 -6997 -162743 -235363 -253520
112 -253520 -234643 -149374 13638 189580 287466 277731 197274 82128 -58583 -200717 -285466
123 -285466 -269170 -167187 -29959 106170 221454 284531 258502 143012 -11669 -144990
133 -144990 -228166 -254367 -212631 -96561 62101 198462 262430 250020 180044 63069 -85677
144 -85677 -219824 -280786 -247159 -146590 -20151 105937 208875 253544 212786 97911 -44287
155 -44287 -165975 -239766 -251815 -193509 -72545 74079 193431 248914 234022 158901 38494
166 38494 -99528 -209724 -250594 -211875 -114689 10002 133082 222188 245714 192208 80643
177 80643 -50623 -163265 -228870 -229710 -162109 -43215 89751 193811 238681 215287 132466
188 132466 11637 -114046 -205637 -233693 -191512 -94435 29271 144869 217869 225586 166625
199 166625 60143 -62813 -167386 -222046 -209277 -133512 -19031 100303 190749 226155 195654
210 195654 107556 -12437 -128229 -205165 -221586 -174409 -78408 38826 143137 202767 199568
221 199568 135805 31059 -84754 -177527 -218091 -194487 -115338 -4719 106910 188278 214392
232 214392 176718 87464 -25332 -128215 -191948 -197953 -144691 -48115 63082 156062 203067
243 203067 190434 122737 19358 -89783 -171841 -201715 -171655 -92402 12963 115300 184746
254 184746 198871 153137 63528 -42138 -134588 -188047 -186163 -128318 -31936 73425 155574 190758
266 190758 170155 100876 2221 -98121 -170251 -191151 -154502 -73108 28113 120671 178029
277 178029 182729 133406 45328 -55398 -139775 -182950 -172043 -110770 -17991 78886 151700 178510
289 178510 151277 78824 -16551 -107603 -168235 -179974 -138942 -57634 39783 125147 173168 169847
301 169847 117175 31575 -61930 -136447 -169841 -151822 -87927 1972 91727 155416 173447 140186
313 140186 66422 -25482 -109322 -161049 -165243 -120647 -41002 49963 125851 164583 154354 98132
325 98132 13367 -74406 -139896 -163840 -139611 -74707 11570 94679 150250 160731 122803 49073
337 49073 -38082 -113760 -156331 -153098 -104698 -26078 59174 126777 157099 140720 82355 80
349 80 -81650 -138937 -154963 -125360 -59605 22959 98781 145575 148953 107598 34595 -47922 -116285
362 -116285 -150701 -140769 -89394 -12383 67457 127312 149928 128441 69302 -9504 -84854 -134693
374 -134693 -143989 -109935 -43249 35521 103986 142469 139620 95590 23702 -54410 -116236 -143819
386 -143819 -128874 -75905 -1282 72841 124998 140043 113681 54079 -20986 -90393 -133750 -137213
398 -137213 -99455 -32704 42081 103709 135344 127996 82712 12646 -61084 -116332 -136729 -116736
410 -116736 -62965 8189 76710 123208 133473 103647 42874 -29803 -92669 -127929 -125987 -87564
422 -87564 -23635 47563 105569 132136 118169 68563 780 -64983 -112069 -128713 -108171 -53692
434 -53692 18351 83927 121798 122836 89946 33267 -33243 -92640 -125804 -119324 -74692 -8965
446 -8965 55853 103218 122666 108431 61573 -5684 -71829 -115138 -122456 -93631 -39448 24121
458 24121 80784 115722 117682 83089 21658 -46046 -97656 -118485 -105313 -64149 -5862 56236
470 56236 104894 122173 99632 45855 -18364 -72994 -106467 -112777 -87624 -33711 32939 88968
482 88968 115059 105831 67964 13119 -45876 -94240 -115894 -101273 -54617 7262 64581 101978
494 101978 110649 87987 39460 -21170 -75935 -108353 -108311 -75161 -19918 39551 85963 107662 99514
507 99514 62694 5724 -54030 -96879 -108974 -88586 -43976 11912 65087 100947 107067 79520
519 79520 27930 -29864 -77361 -103222 -100325 -67378 -13205 44539 87417 103714 90617 51841
531 51841 -2801 -57402 -94894 -103325 -81074 -35931 18929 68576 98785 99678 70283 20316 -34289
544 -34289 -78371 -100107 -92676 -57173 -4607 48330 86376 99640 84321 43545 -10833 -61286
556 -61286 -92265 -96103 -72882 -28998 24306 71432 96880 92362 60373 12256 -38268 -78475
568 -78475 -96644 -85982 -48570 2856 51880 85256 94604 76486 34906 -17254 -63140 -89648
580 -89648 -90701 -65990 -21204 30913 73274 92180 83886 52768 7260 -41723 -80276 -94211
592 -94211 -77949 -38406 9451 52758 82421 90415 70791 27287 -24138 -65528 -86171 -83445
604 -83445 -58199 -14677 35086 74008 89076 77770 45335 386 -45914 -79444 -88200 -69775
616 -69775 -31826 13463 55244 82929 86174 61400 17708 -28315 -63733 -82472 -80245 -53297
628 -53297 -6768 42139 74234 81942 68967 39554 -2738 -48728 -80938 -85135 -61497 -22545
640 -22545 18870 55283 79346 81075 55740 11841 -33367 -65875 -79669 -72613 -44283 -894
652 -894 42894 72322 79887 65304 32175 -11765 -52835 -76742 -76456 -55071 -19863 21527 59390
665 59390 80436 74873 44842 3766 -34567 -62842 -76583 -69432 -38616 6628 48201 71646
677 71646 73582 57205 25762 -14987 -53456 -75477 -73243 -49119 -11887 27830 59857 74897
689 74897 67657 39900 817 -37958 -65682 -74581 -61176 -28897 11273 46861 68504 71256 53694
702 53694 19174 -21907 -55725 -71414 -66238 -42958 -7816 30379 60572 72636 62244 33250
714 33250 -4773 -40561 -64386 -69727 -54909 -23746 14496 48465 67986 67250 46543 12145 -25087
727 -25087 -54651 -68400 -62572 -38044 -1767 34812 60121 67442 55823 28354 -7943 -42686
739 -42686 -64454 -66176 -48234 -16785 18658 48780 65215 62695 41114 7017 -28733 -55349
751 -55349 -65505 -56713 -31316 3303 36697 59164 64367 50879 21971 -13740 -44841 -61802
763 -61802 -60745 -42748 -12529 22091 50920 64027 57045 33371 1142 -30465 -53883 -62661 -52858
776 -52858 -25988 9007 40133 57988 59134 44411 16979 -16490 -45723 -60795 -57146 -36592
788 -36592 -5954 25888 50184 60112 52408 28976 -3183 -34004 -54312 -58639 -46082 -20097 11817
801 11817 40468 57041 56557 39186 10390 -20925 -45615 -57075 -52335 -32265 -2171 28781 50830
814 50830 57199 46823 23132 -6828 -34959 -53011 -55598 -41567 -14939 15796 41409 54455
826 54455 51760 34395 6856 -23115 -46390 -55449 -47639 -26078 2375 29664 48681 54169 43617
839 43617 19180 -11373 -37470 -51222 -50284 -35996 -11535 17464 42142 53604 48061 28441 1737
852 1737 -24906 -44988 -52429 -44125 -21896 6600 32149 47693 50056 38274 14714 -13849 -38019
865 -38019 -49939 -47139 -31346 -6597 20663 42105 50396 43426 24230 -1372 -26827 -45076 -49849
878 -49849 -39122 -16563 9933 32628 46165 47127 34056 9991 -17263 -38348 -47173 -42967 -27212
891 -27212 -3158 23019 42380 47900 38741 19305 -4728 -27849 -43902 -46979 -35050 -12228 13184
904 13184 33532 44305 43195 29481 6190 -19414 -38452 -45227 -39152 -22518 755 24653 41363
917 41363 44992 34956 15260 -8220 -29416 -42558 -43181 -30403 -8592 15212 34064 42998 39801
930 39801 24898 2170 -21286 -37825 -42650 -35382 -18455 4044 25979 40354 42074 30983 11373
943 11373 -10826 -30006 -40884 -39854 -26456 -5089 17365 34059 40705 36051 20934 -781 -22563
956 -22563 -37269 -40314 -31630 -14422 6819 26596 38782 38962 27336 8019 -13217 -30621 -39192
969 -39192 -36239 -22275 -1737 18808 33486 38465 32737 17220 -3969 -24064 -36249 -37127 -27688
982 -27688 -10987 9131 27518 37688 35807 23045 4326 -14923 -30100 -37185 -33298 -18736 1560
995 1560 20677 32895 35641 28874 13741 -6207 -24820 -35361 -34607 -24052 -7293 11389 27345
1008 27345 35519 32687 19976 1660 -16772 -30261 -34877 -29274 -15038 3424 20744 32141 34210
1021 34210 25858 9562 -9294 -24623 -32330 -31305 -22028 -5832 13423 28787 34136 28315 15296
1034 15296 -357 -15956 -28701 -33915 -27697 -11757 7192 22236 29818 29770 22522 8513 -9518
1047 -9518 -25440 -32698 -29159 -17103 -1322 14148 25968 30875 26942 14602 -2689 -19442 -29546
1060 -29546 -29922 -21794 -8472 6519 20427 29681 30060 20151 3363 -13336 -24391 -28025 -25138 -16056
1074 -16056 -1368 15494 27892 30276 22511 9207 -5003 -17715 -26592 -28415 -21179 -6601 9897
1087 9897 22599 27773 25036 15820 2334 -12192 -23862 -28428 -24052 -12109 3093 16705 25023
1100 25023 26193 20270 8775 -5860 -19535 -27101 -25714 -16442 -3235 10097 20712 26005 23941
1113 23941 14109 -265 -14328 -23622 -25513 -20225 -9637 3745 16428 24457 25023 17895 5624
1126 5624 -8065 -19185 -24595 -22802 -14536 -2182 11044 21210 24944 20931 10731 -2093 -14001
1139 -14001 -21970 -23813 -18591 -7681 5614 17049 23147 22318 15147 3799 -8691 -18746 -23319
1152 -23319 -20867 -12182 -101 11945 20512 22676 18248 8681 -3221 -14279 -21389 -22136 -15999 -5062
1166 -5062 6932 16624 21541 20304 13205 2042 -9800 -18632 -21679 -18221 -9714 1372 12180 19703
1180 19703 21198 16120 6481 -4767 -14543 -20239 -19898 -13564 -3265 7674 16256 20333 18430 10909
1194 10909 67 -10630 -17925 -19801 -16033 -7883 2623 12664 18962 19361 13849 4478 -5753 -14385
1208 -14385 -19100 -18057 -11381 -1508 8533 15955 18953 16368 8784 -1405 -10935 -17067 -18251 -14154
1222 -14154 -6040 3949 12940 17905 17365 11740 3027 -6381 -14194 -18037 -16239 -9401 -74 9038 15381
1237 15381 17416 14378 7010 -2411 -10993 -16253 -16847 -12389 -4306 5024 12778 16527 15531 10072 1837
1252 1837 -7018 -14047 -16871 -14277 -7507 1070 9118 14691 16185 12762 5386 -3474 -11117 -15376 -15163
1267 -15163 -10498 -2865 5572 12398 15510 14202 8623 416 -7823 -13522 -15126 -12415 -6240 1672 9333
1282 9333 14353 14938 10725 3521 -4256 -10696 -14298 -13863 -9196 -1633 6341 12196 14378 12417 6856
1297 6856 -726 -8009 -12915 -13924 -10927 -4805 2742 9620 13623 13272 9036 2408 -4671 -10629 -13625
1312 -13625 -12514 -7405 -125 6823 11555 13093 11037 5630 -1582 -8345 -12473 -12726 -9361 -3296 3548
1327 3548 9413 12525 11906 7838 1490 -5367 -10651 -12720 -10792 -5667 675 6688 10892 12278 9916
1342 9916 4204 -2775 -8636 -11473 -11189 -7980 -2536 3899 9432 12107 10744 6163 157 -5610 -9777
1357 -9777 -11524 -9846 -4914 1505 7287 10631 10903 8097 3066 -2861 -8018 -11007 -10623 -6878 -1052
1372 -1052 4795 8976 10569 9362 5470 -163 -5890 -9924 -10736 -8195 -3436 2057 6832 9714 10138
1387 10138 7337 2115 -3767 -8221 -9990 -9048 -5631 -727 4692 8757 10254 8359 3931 -1274 -5813
1402 -5813 -8880 -9588 -7406 -2843 2728 7256 9375 8727 5842 1288 -3699 -7725 -9543 -8333 -4496
1417 -4496 422 5030 8185 9050 7281 3267 -1772 -6098 -8554 -8618 -6093 -1879 2953 6784 8725 7972
1433 7972 4878 368 -4190 -7427 -8542 -7123 -3679 885 5061 7871 8309 6167 2301 -2189 -5850
1448 -5850 -7892 -7723 -5221 -1069 3452 6691 7895 6893 3991 -76 -4226 -7199 -7902 -6099 -2595
1463 -2595 1492 4996 7167 7464 5383 1609 -2673 -5987 -7355 -6612 -4197 -512 3360 6362 7434
1478 7434 6140 3048 -837 -4334 -6542 -7010 -5365 -2035 1975 5059 6686 6484 4441 1023 -2879
1493 -2879 -5728 -6802 -5798 -3336 68 3561 6104 6715 5180 2187 -1267 -4191 -6073 -6282 -4549
1508 -4549 -1279 2378 4988 6130 5681 3625 412 -3148 -5496 -6070 -4952 -2662 533 3703 5819
1523 5819 5990 4221 1432 -1519 -4009 -5707 -5797 -3859 -527 2741 4647 5354 4890 3108 -8 -3335
1539 -3335 -5278 -5403 -4079 -1877 859 3649 5445 5311 3581 875 -1818 -4014 -5235 -4946 -2955 65
1555 65 2659 4381 4955 4349 2427 -658 -3479 -4799 -4545 -3438 -1546 1082 3678 5082 4682 2803
1571 2803 332 -1982 -3769 -4767 -4334 -2352 405 2749 4045 4456 3680 1721 -987 -3257 -4292 -4072
1587 -4072 -3044 -988 1545 3642 4497 3808 2169 131 -1950 -3701 -4424 -3659 -1587 818 2644 3713
1603 3713 3993 3160 1183 -1345 -3195 -3862 -3539 -2352 -494 1713 3486 4014 3246 1655 -278 -2135
1619 -2135 -3455 -3825 -2938 -1199 951 2599 3500 3408 2412 525 -1459 -2910 -3541 -3106 -1911 9 1975
1636 1975 3172 3383 2632 1260 -450 -2209 -3305 -3309 -2273 -506 1178 2493 3126 3001 1901 183 -1626
1653 -1626 -2797 -3078 -2475 -1294 291 1903 2920 2962 2218 768 -911 -2197 -2920 -2679 -1754 -343 1146
1670 1146 2331 2886 2471 1336 -292 -1645 -2533 -2656 -2061 -929 551 1871 2621 2543 1705 387 -987
1687 -987 -2095 -2446 -2237 -1324 -8 1315 2256 2467 1913 843 -480 -1627 -2208 -2268 -1627 -516 852 1810
1705 1810 2252 2015 1241 126 -1046 -1933 -2295 -1810 -837 318 1365 1976 1953 1499 552 -560 -1572 -2046
1723 -2046 -1862 -1133 -165 860 1578 1864 1677 870 -175 -1156 -1776 -1864 -1284 -495 424 1289 1771 1747 1106 148
1743 148 -746 -1417 -1638 -1367 -786 73 980 1572 1662 1221 468 -395 -1058 -1479 -1453 -980 -239 589 1221 1479 1268
1764 1268 719 -68 -806 -1239 -1390 -1084 -506 248 969 1365 1254 725 212 -475 -1000 -1234 -1173 -659 92 742
1784 742 1113 1157 992 437 -206 -793 -1124 -1063 -703 -166 394 912 1144 971 518 -13 -561 -925 -1031 -795 -250
1805 -250 253 653 916 912 643 126 -442 -852 -908 -753 -371 -19 435 796 894 591 157 -203 -542 -733 -818 -547
1827 -547 -83 389 657 717 615 295 -66 -462 -707 -619 -429 -171 192 549 734 623 333 5 -273 -512 -633
1848 -633 -535 -252 247 489 475 462 373 150 -253 -554 -562 -433 -173 15 262 523 566 292 21 -229 -353 -464
1870 -464 -496 -324 16 343 479 430 276 152 -109 -378 -499 -378 -175 25 209 331 455 371 93 -159 -348
1891 -348 -389 -349 -201 -9 276 404 403 279 123 -104 -344 -450 -406 -217 36 207 350 398 401 173 -159 -376 -402
1914 -402 -347 -239 -67 185 399 452 302 143 -82 -243 -456 -438 -305 -49 251 386 500 432 259 -110 -281
1935 -281 -460 -523 -334 -68 197 443 574 459 279 34 -223 -466 -577 -442 -223 140 432 486 453 394 106
1956 106 -243 -489 -651 -546 -223 64 326 527 648 517 196 -170 -494 -624 -572 -327 -99 261 569 716
1976 716 628 265 -102 -422 -589 -629 -491 -221 182 547 696 723 439 44 -312 -585 -696 -614 -282 84 471
1997 471 697 783 555 215 -232 -569 -754 -822 -487 -8 367 672 773 648 389 -47 -469 -817 -848 -604 -188
2018 -188 211 606 813 787 527 80 -337 -673 -836 -783 -403 99 524 808 854 682 301 -189 -630 -847 -847 -594
2040 -594 -146 331 708 895 818 464 -12 -525 -866 -959 -750 -380 135 639 902 893 661 214 -364 -782 -957
2061 -957 -903 -520 -16 422 882 1029 804 406 -156 -611 -919 -958 -687 -202 305 728 1042 953 615 58 -496
2082 -496 -875 -1003 -836 -431 95 619 971 973 840 247 -271 -708 -988 -949 -642 -182 431 880 981 878 482
2103 482 -31 -586 -976 -1019 -833 -362 216 744 1056 1052 705 210 -368 -872 -1036 -961 -550 19 574 959 1060
2124 1060 876 459 -121 -700 -1036 -996 -777 -267 292 785 1112 985 683 106 -500 -904 -1105 -876 -538 37
2144 37 677 989 1053 800 343 -285 -769 -1067 -1006 -703 -151 449 862 1069 972 504 2 -558 -981 -1110 -892
2165 -892 -351 207 757 1037 1073 803 156 -358 -847 -1030 -941 -586 10 578 975 1109 929 421 -146 -693 -1002
2186 -1002 -1042 -808 -251 322 755 1046 1045 662 80 -474 -907 -1102 -871 -507 131 613 1018 1037 803 359 -227
2207 -227 -777 -1096 -1006 -722 -131 402 928 1079 1020 584 20 -537 -938 -1055 -873 -415 202 730 1032 1006 688
2228 688 202 -340 -832 -1069 -980 -597 -80 494 940 1040 834 468 -78 -649 -1023 -1043 -781 -320 307 701 1013
2249 1013 1008 667 175 -413 -874 -1084 -892 -498 50 604 988 1001 844 368 -207 -750 -1024 -970 -675 -188 381
2270 381 882 1050 944 583 26 -521 -927 -996 -782 -397 171 694 1001 963 763 214 -330 -752 -994 -938 -625
2291 -625 -80 465 847 970 844 397 -81 -625 -922 -961 -757 -256 268 705 955 894 611 131 -370 -777 -965
2312 -965 -850 -455 39 572 894 1032 760 339 -168 -615 -959 -955 -651 -166 404 820 970 912 522 -7 -478
2333 -478 -875 -963 -814 -403 79 630 906 917 647 223 -307 -719 -974 -864 -531 -80 423 797 969 810 428
2354 428 -58 -605 -857 -957 -744 -278 208 708 932 917 586 172 -381 -801 -952 -852 -473 44 522 821
2374 821 978 752 320 -186 -665 -902 -885 -592 -194 339 724 903 837 529 -2 -484 -807 -938 -768 -450 113
2395 113 583 862 882 668 271 -293 -664 -912 -840 -542 -60 475 800 944 837 444 -11 -536 -901 -951 -700
2416 -700 -250 233 612 929 954 600 138 -344 -751 -937 -848 -532 25 461 785 879 746 330 -136 -624 -872
2437 -872 -904 -638 -227 299 714 866 838 550 83 -381 -766 -925 -753 -411 96 570 858 888 667 231 -206
2458 -206 -657 -907 -865 -534 -154 371 774 946 779 410 -33 -488 -856 -884 -722 -348 200 606 897 882 603
2479 603 155 -289 -688 -892 -800 -475 -27 446 738 856 779 347 -99 -573 -870 -896 -631 -178 253 721 879
2500 879 830 546 121 -390 -728 -837 -732 -365 79 576 823 881 677 264 -213 -647 -875 -848 -579 -117 329
2521 329 704 894 809 441 -18 -495 -734 -906 -701 -375 152 560 816 856 621 226 -297 -690 -865 -799 -502
2542 -502 -12 431 809 861 730 396 -119 -534 -805 -870 -618 -202 282 703 889 846 542 116 -396 -716 -852
2563 -852 -744 -402 88 518 842 862 671 312 -189 -587 -840 -848 -567 -164 382 712 846 765 430 22 -478
2584 -478 -794 -887 -737 -330 154 532 866 842 641 174 -263 -666 -842 -814 -466 -43 416 766 887 789 365
2605 365 -128 -535 -832 -871 -645 -253 275 632 872 796 534 132 -412 -720 -866 -773 -420 18 444 782 866
2626 866 690 296 -237 -629 -854 -792 -562 -168 296 688 842 772 413 -8 -458 -799 -881 -717 -311 151 575
2647 575 846 844 626 192 -188 -627 -801 -769 -533 -77 394 736 856 753 422 -51 -531 -764 -811 -668 -275
2668 -275 203 598 804 863 543 76 -351 -712 -835 -745 -444 22 524 773 832 687 274 -173 -544 -859 -785
2689 -785 -580 -196 260 679 821 826 453 4 -386 -729 -799 -732 -329 151 550 832 777 600 203 -259 -634 -863
2711 -863 -828 -509 -41 412 700 814 707 335 -146 -530 -791 -814 -603 -232 205 560 800 797 504 100 -320
2732 -320 -730 -827 -770 -398 45 477 772 875 668 331 -240 -597 -773 -750 -522 -98 377 698 823 729 460
2753 460 -11 -419 -757 -874 -705 -320 200 570 800 814 568 142 -269 -705 -837 -786 -482 9 431 683 880
2774 880 681 301 -88 -544 -801 -789 -601 -196 213 623 866 798 523 102 -381 -704 -795 -693 -370 45 464
2795 464 798 864 618 248 -185 -596 -820 -843 -573 -97 325 683 843 706 421 -36 -465 -764 -836 -692 -270
2816 -270 142 570 747 781 535 84 -322 -663 -827 -765 -479 -29 450 780 879 677 351 -65 -505 -737 -824
2837 -824 -594 -121 244 643 829 789 462 86 -328 -724 -812 -726 -367 97 488 773 820 638 261 -234 -596
2858 -596 -830 -816 -563 -104 315 710 850 731 464 -9 -529 -767 -809 -666 -295 193 616 861 834 581 184
2879 184 -305 -626 -848 -809 -470 -9 428 772 849 665 347 -117 -520 -777 -790 -600 -203 259 654 822 787
2900 787 513 76 -333 -692 -856 -749 -342 40 464 738 808 653 282 -171 -604 -799 -803 -588 -108 303 660
2921 660 829 725 457 -10 -478 -737 -874 -694 -315 160 497 792 822 572 150 -307 -676 -796 -776 -499 -30
2942 -30 367 783 809 675 327 -102 -511 -826 -828 -599 -214 240 605 790 746 492 100 -339 -704 -868 -667 -448
2964 -448 34 478 700 833 622 285 -166 -580 -774 -748 -565 -185 265 639 853 756 464 43 -436 -715 -795
2985 -795 -685 -307 157 490 815 827 613 177 -258 -652 -827 -794 -469 -96 344 706 840 681 308 -43 -532
3006 -532 -793 -800 -596 -219 167 570 795 753 513 81 -327 -645 -809 -726 -374 0 467 734 790 679 345 -169
3028 -169 -500 -729 -772 -548 -192 277 614 836 683 406 103 -393 -646 -770 -683 -384 67 494 725 779 590
3049 590 184 -229 -586 -786 -751 -480 -159 270 681 791 703 411 -56 -433 -673 -779 -618 -289 105 518 704
3070 704 760 529 139 -226 -596 -712 -785 -458 -36 399 683 788 661 310 -105 -485 -701 -722 -580 -261 211
3091 211 523 765 747 447 44 -360 -689 -745 -639 -405 -11 407 684 739 599 193 -108 -561 -703 -799 -557
3112 -557 -96 270 652 726 684 412 50 -355 -673 -789 -612 -334 140 465 754 759 528 180 -206 -552 -679
3133 -679 -690 -458 -81 292 605 721 695 328 -9 -417 -711 -749 -629 -278 110 486 675 698 447 140 -253
3154 -253 -647 -760 -676 -419 -19 425 680 709 606 291 -109 -469 -710 -696 -541 -184 257 561 752 661 447
3175 447 89 -319 -603 -684 -595 -308 52 443 692 693 542 241 -129 -487 -712 -750 -497 -142 240 559 738 640
3197 640 344 1 -372 -631 -695 -598 -276 77 461 737 685 538 205 -205 -556 -669 -661 -418 -60 309 596 722
3219 722 682 372 14 -394 -644 -688 -543 -261 102 507 681 698 492 100 -266 -605 -690 -641 -373 2 350 587
3241 587 747 582 282 -61 -466 -663 -728 -533 -198 203 497 669 667 417 93 -281 -622 -750 -608 -349 64
3262 64 435 618 739 520 279 -182 -467 -685 -685 -444 -87 298 551 722 619 313 -16 -349 -619 -703 -559
3283 -559 -259 66 425 645 650 514 159 -199 -524 -693 -646 -404 -54 313 530 639 582 303 -70 -417 -623
3304 -623 -710 -517 -223 144 483 660 621 437 157 -297 -510 -662 -582 -396 -36 361 609 729 547 324 -74
3325 -74 -420 -713 -705 -466 -156 207 489 695 608 398 59 -318 -609 -716 -622 -373 38 389 646 679 601 200
3347 200 -197 -466 -709 -662 -484 -103 287 559 714 615 382 8 -303 -609 -689 -544 -271 119 423 626 683
3368 683 510 167 -197 -553 -648 -648 -356 -78 289 558 717 629 282 6 -384 -612 -683 -525 -263 133 423 654
3390 654 609 417 131 -248 -541 -636 -581 -431 12 342 623 671 538 294 -83 -392 -622 -637 -441 -153 226 526
3412 526 694 600 434 87 -287 -568 -675 -542 -279 52 389 636 666 487 210 -145 -395 -695 -661 -445 -95
3433 -95 288 565 618 603 394 -22 -321 -595 -634 -601 -258 95 433 595 646 485 172 -172 -485 -624 -622 -377 -80
3456 -80 352 564 721 578 311 -23 -380 -597 -640 -541 -173 162 474 626 650 400 91 -277 -499 -650 -596 -323
3478 -323 -40 339 624 632 472 221 -143 -502 -611 -602 -480 -154 180 497 600 573 380 65 -277 -524 -615 -505
3500 -505 -260 66 384 585 616 498 163 -171 -448 -623 -593 -392 -38 220 468 587 545 306 13 -343 -600
3521 -600 -635 -529 -238 85 393 609 575 439 88 -220 -462 -620 -574 -396 -55 295 558 570 542 310 -72 -364
3543 -364 -584 -606 -460 -156 209 411 615 684 449 93 -236 -525 -606 -517 -292 26 363 574 617 537 240 -137
3565 -137 -431 -592 -582 -387 -103 199 452 619 575 262 -14 -268 -515 -569 -486 -265 98 406 563 540 435 95
3587 95 -167 -462 -558 -581 -322 -46 262 484 603 495 265 -21 -277 -524 -629 -453 -190 165 450 560 568 415
3609 415 106 -204 -514 -603 -494 -315 -52 262 522 578 423 225 -104 -396 -571 -566 -432 -147 148 495 587 559
3631 559 331 77 -249 -488 -549 -470 -267 13 342 541 582 464 156 -146 -421 -525 -566 -361 -80 205 446
3652 446 551 483 283 19 -327 -484 -529 -466 -225 76 358 555 549 374 123 -210 -449 -552 -564 -328 -34 222
3674 222 418 536 497 200 -89 -371 -512 -527 -424 -201 158 404 540 466 356 61 -206 -437 -567 -446 -258
3695 -258 15 286 486 566 456 223 -110 -390 -514 -510 -353 -112 178 441 555 459 275 -8 -278 -497 -526 -438
3717 -438 -218 13 253 509 550 369 105 -181 -390 -525 -484 -341 -73 232 424 510 443 270 -71 -271 -469
3738 -469 -493 -409 -167 151 342 481 506 360 144 -205 -399 -497 -422 -281 3 274 457 542 379 194 -67 -319
3760 -319 -492 -523 -354 -123 129 407 517 439 292 15 -272 -434 -534 -462 -290 42 270 461 475 421 241 -116
3782 -116 -334 -478 -473 -318 -95 220 393 497 477 242 -39 -239 -451 -499 -379 -132 105 285 465 500 288 115
3804 115 -211 -377 -452 -440 -300 -33 217 390 411 354 205 -42 -349 -476 -423 -375 -185 78 305 480 433 325
3826 325 42 -175 -425 -445 -429 -283 18 241 391 462 424 223 -47 -287 -447 -429 -310 -131 170 391 454 424
3848 424 317 18 -198 -398 -421 -398 -196 43 258 368 449 327 140 -131 -388 -448 -440 -292 -54 180 408 421
3870 421 368 185 44 -235 -434 -413 -323 -203 108 283 431 411 273 105 -141 -360 -390 -343 -192 -11 229 394
3892 394 437 367 193 -35 -225 -391 -410 -353 -144 121 292 368 398 328 59 -202 -364 -429 -376 -195 6 204 392
3915 392 421 351 154 -22 -259 -441 -330 -261 -93 145 333 427 400 269 37 -165 -340 -421 -296 -171 77 283
3937 283 413 407 349 101 -112 -255 -392 -398 -239 -58 122 326 417 341 185 -16 -257 -334 -367 -320 -151 108 202 353
3961 353 420 245 152 -87 -306 -404 -365 -227 -57 201 324 390 330 188 -38 -222 -379 -370 -303 -84 85 300 379
3984 379 300 275 8 -97 -303 -346 -336 -196 30 169 370 395 318 143 -10 -218 -289 -323 -248 -107 159 306 349
4007 349 317 242 -1 -176 -317 -392 -271 -147 9 243 345 333 244 127 -82 -273 -315 -314 -186 44 179 247 373
4030 373 355 196 -32 -172 -300 -370 -257 -106 86 274 317 275 213 81 -99 -306 -325 -331 -202 -59 159 293 331
4053 331 228 149 -62 -253 -358 -390 -252 -65 99 289 335 360 144 22 -106 -254 -356 -292 -116 45 194 336
4075 336 338 262 187 -138 -182 -343 -301 -216 0 81 238 300 259 128 19 -157 -294 -328 -284 -180 65 205 294 303 244
4100 244 47 -101 -283 -353 -300 -168 -9 128 254 362 262 166 -34 -225 -291 -296 -209 -65 60 225 335 363 219
4123 219 57 -83 -247 -258 -277 -194 17 197 278 321 285 189 -41 -278 -325 -347 -200 -78 122 210 345 240 171 53
4147 53 -120 -312 -313 -306 -167 64 131 321 269 234 120 -69 -214 -262 -326 -205 -35 118 277 357 289 162 -15 -81
4171 -81 -225 -327 -175 -71 84 207 320 273 238 66 -96 -218 -321 -276 -161 -15 161 226 281 228 142 15 -218
4194 -218 -295 -281 -235 -57 41 183 292 305 161 53 -97 -219 -256 -257 -88 9 161 254 311 246 123 -64 -179 -247
4218 -247 -300 -187 -36 154 173 313 296 146 20 -114 -316 -248 -214 -157 66 246 281 272 202 79 -4 -160 -325 -252
4242 -252 -238 -7 91 222 240 226 108 20 -154 -213 -302 -248 -66 64 180 300 296 193 57 -16 -192 -270 -232 -123
4266 -123 -30 145 212 280 292 167 3 -163 -265 -240 -195 -78 73 176 296 270 183 12 -111 -225 -295 -246 -122
4289 -122 16 131 271 254 200 103 -52 -164 -289 -280 -150 -62 39 211 277 271 132 43 -176 -201 -251 -209 -56 27 161
4314 161 243 279 223 144 -96 -197 -248 -218 -179 -49 88 225 279 230 169 29 -144 -202 -255 -197 -112 -9 216 264 259 173
4340 173 44 -85 -185 -282 -266 -129 9 117 185 267 242 130 -51 -150 -206 -259 -185 -84 102 156 277 244 195 47
4364 47 -101 -169 -256 -268 -128 47 159 227 262 184 83 -38 -238 -267 -258 -192 -91 70 168 274 240 84 30 -131 -235
4389 -235 -258 -228 -114 16 153 255 259 166 55 -79 -192 -241 -273 -188 -48 105 238 268 278 126 -17 -148 -214 -263
4413 -263 -222 -117 94 173 256 276 164 38 -72 -211 -279 -177 -174 -66 120 206 238 211 121 -23 -206 -204 -251 -184 -85
4438 -85 83 204 268 196 149 51 -106 -165 -286 -250 -123 51 169 222 224 192 82 -35 -193 -230 -232 -165 -19 156 209
4463 209 268 250 123 16 -136 -208 -166 -149 -94 44 155 191 219 177 42 -51 -155 -282 -252 -151 -66 94 203 225
4487 225 205 93 8 -140 -202 -232 -230 -82 59 173 206 236 170 74 -129 -177 -209 -156 -101 38 154 184 226 198 67 -38
4513 -38 -185 -198 -208 -134 -6 124 176 256 197 105 15 -131 -194 -197 -167 -76 29 163 204 183 165 18 -57 -176 -247 -221 -129
4540 -129 -52 69 170 235 220 97 15 -126 -237 -241 -154 -115 61 171 286 213 139 38 -47 -184 -235 -189 -133 18 119
4565 119 202 197 165 64 3 -162 -185 -193 -143 -83 15 207 171 174 146 23 -128 -179 -224 -226 -85 21 128 190 220 157 118 -34
4593 -34 -118 -161 -211 -161 8 119 171 245 164 147 13 -58 -129 -191 -175 -93 68 126 189 240 151 9 -74 -158 -203 -223 -157 -27
4621 -27 54 130 220 146 89 -73 -127 -206 -240 -182 -65 2 160 236 223 163 61 -67 -126 -237 -191 -144 20 124 157 241
4647 241 209 65 46 -143 -181 -172 -165 -17 51 159 225 228 75 26 -55 -191 -238 -172 -59 21 75 181 159 154 100 -62 -115
4674 -115 -211 -176 -121 -11 93 182 166 217 89 1 -95 -132 -158 -172 -95 -9 127 169 188 128 27 -41 -136 -170 -214 -127 8
4701 8 75 173 209 196 67 -25 -124 -154 -160 -127 -74 10 143 195 205 160 54 -79 -143 -189 -150 -89 -10 125 203 199 169 98 -23
4730 -23 -110 -206 -164 -149 -33 94 160 189 206 137 53 -87 -148 -220 -166 -70 -9 162 229 227 147 35 -49 -123 -144 -201 -144 -26
4758 -26 46 179 174 179 137 -16 -101 -185 -208 -129 -63 35 104 212 161 71 55 -13 -116 -217 -196 -90 -40 75 147 205 187 104
4786 104 -22 -94 -140 -192 -194 -26 7 109 212 155 159 55 -92 -138 -199 -160 -108 13 150 176 181 172 109 -64 -148 -200 -249
4813 -249 -148 -47 44 77 169 208 82 30 -117 -207 -195 -124 -87 8 118 208 180 136 61 -23 -128 -170 -196 -129 10 107
4839 107 182 193 162 95 31 -82 -171 -207 -138 -78 15 163 192 182 162 42 -44 -81 -188 -173 -114 -21 86 127 155 129 117
4866 117 13 -171 -158 -176 -168 -56 58 128 165 166 101 65 -9 -134 -217 -130 -100 -3 94 146 194 141 115 48 -60 -171 -158
4893 -158 -139 -35 55 143 185 174 135 37 -65 -131 -223 -198 -103 -29 103 142 197 102 21 -10 -100 -184 -166 -121 -39 71 144 156
4921 156 181 114 30 -47 -148 -177 -146 -76 1 59 187 167 155 48 -25 -149 -120 -138 -118 -7 88 170 159 174 81 -57 -93
4948 -93 -112 -126 -95 -53 0 98 157 170 115 20 -51 -131 -207 -181 -103 -11 89 190 161 161 92 -10 -91 -120 -187 -123 -11 25 141
4977 141 166 166 150 58 -46 -142 -155 -129 -77 59 163 137 164 170 32 -13 -88 -208 -125 -108 -12 33 117 115 168 80 9 -53 -147
5006 -147 -166 -144 -78 31 87 174 113 140 53 -75 -153 -191 -120 -100 -7 51 139 166 168 56 16 -150 -152 -143 -165 -37 106 82
5034 82 161 180 156 0 -45 -129 -210 -169 -73 -9 68 144 154 115 34 -11 -122 -215 -163 -100 -74 65 154 143 141 58 32 -47 -137
5063 -137 -150 -182 -107 14 106 153 157 127 11 -20 -116 -128 -159 -89 -19 60 127 220 231 107 29 -107 -137 -120 -166 -77 12 87
5091 87 207 129 104 69 -60 -149 -205 -160 -142 -18 48 132 171 155 124 -41 -99 -188 -222 -151 -62 11 145 221 258 141 39
5118 39 -74 -150 -150 -162 -42 -13 72 170 225 135 90 -12 -110 -140 -125 -92 -48 68 113 135 145 85 53 -77 -183 -180 -117 -106
5146 -106 -30 72 149 135 95 37 -4 -164 -145 -180 -112 -59 96 135 167 146 106 46 -61 -141 -162 -134 -108 60 131 111 183
5173 183 125 63 -62 -138 -182 -125 -120 16 59 141 142 160 95 -26 -116 -184 -186 -136 -91 28 153 202 140 99 31 -37 -102 -214
5201 -214 -179 -100 -36 93 155 158 127 86 -26 -98 -101 -150 -78 -18 43 157 144 143 109 43 -39 -141 -161 -156 -89 -6 85 162 185 106
5231 106 82 -31 -137 -176 -188 -108 2 61 163 161 105 90 23 -95 -149 -167 -101 -63 51 117 177 215 121 61 -54 -149 -123
5258 -123 -183 -104 15 82 209 200 142 48 -21 -66 -186 -146 -117 15 33 139 212 160 74 5 -116 -108 -123 -174 -116 15 102
5285 102 112 130 141 37 -2 -176 -175 -155 -93 -30 45 162 130 144 51 -41 -89 -195 -144 -96 -71 20 79 155 120 115 55 15 -87
5314 -87 -180 -174 -101 15 112 124 170 182 106 -57 -124 -151 -156 -112 -51 58 132 162 111 57 37 -71 -138 -130 -180 -138 -14 54 160
5343 160 184 128 73 -30 -127 -193 -173 -92 -37 62 136 176 161 62 86 -114 -79 -135 -118 -83 23 74 153 176 149 59 -7 -53
5371 -53 -183 -123 -122 -6 77 114 167 117 94 -2 -52 -167 -163 -117 -27 16 91 165 107 111 41 -47 -65 -170 -144 -77 -63 91 141
5400 141 172 167 74 9 -73 -125 -184 -106 -51 50 130 210 148 120 26 -44 -146 -170 -129 -96 27 78 140 174 165 61 -69 -126
5428 -126 -132 -107 -118 -62 41 113 101 126 96 12 -48 -85 -162 -165 -49 7 101 146 135 88 -4 -30 -85 -121 -157 -65 -6 74 149 162
5458 162 111 20 43 -78 -120 -124 -150 -42 -4 101 169 136 80 62 -44 -110 -172 -140 -105 -34 79 90 156 124 55 -110 -79
5485 -79 -164 -148 -106 -26 -17 90 134 184 70 33 -59 -155 -140 -165 -49 -35 42 186 145 146 76 39 -82 -104 -122 -109 -19 58 109
5514 109 136 115 99 -25 -62 -120 -159 -131 -72 -8 102 141 154 79 3 -21 -107 -147 -161 -112 -43 34 115 142 124 39 -15 -105 -154
5543 -154 -168 -119 -67 45 117 124 164 139 43 -61 -95 -61 -126 -51 21 85 125 163 80 83 -40 -90 -152 -141 -108 -73 -12 110 206
5572 206 114 63 26 -45 -108 -153 -94 -125 3 91 67 138 76 80 -41 -69 -132 -162 -155 18 94 99 121 135 139 26 -63 -118 -116 -154
5602 -154 -57 -19 63 146 134 139 58 -74 -85 -137 -134 -102 -78 46 91 149 145 74 -27 -100 -158 -149 -110 -62 10 93 109 167 140 72
5632 72 -39 -116 -154 -165 -94 -11 28 130 140 150 23 18 -88 -74 -110 -125 -48 27 123 114 193 136 11 -47 -87 -142 -116 -72 49
5661 49 103 121 121 101 54 -18 -84 -176 -146 -66 -67 64 97 143 128 63 33 -117 -107 -123 -107 -110 -10 42 183 173 106 58 -28 -94
5691 -94 -86 -147 -115 -72 44 88 128 97 66 22 -50 -122 -165 -124 -46 10 96 170 86 100 47 -33 -142 -176 -150 -86 -51 74 136
5720 136 123 101 67 -60 -46 -76 -107 -152 -52 -17 70 160 156 103 47 -11 -103 -151 -89 -14 -8 82 150 177 120 77 40 -98 -113
5749 -113 -175 -102 -38 66 109 122 117 95 -15 -84 -39 -126 -61 -60 25 61 110 142 130 26 -3 -121 -129 -126 -110 29 63 135 139 154
5779 154 64 11 -88 -124 -143 -112 -70 8 91 125 118 99 53 -25 -108 -105 -83 -50 -26 6 71 160 63 28 14 -74 -125 -165 -117 6
5809 6 5 50 119 155 80 30 -96 -83 -98 -177 -79 10 106 65 158 88 66 -13 -55 -159 -195 -108 -16 55 47 144 181 73 31 -14
5839 -14 -90 -91 -158 -14 -14 86 139 126 94 20 -52 -109 -183 -190 -136 14 59 89 209 95 64 -46 -110 -117 -174 -133 -59 12 108
5868 108 115 142 117 70 -65 -143 -151 -135 -48 34 45 124 157 142 66 6 8 -109 -119 -111 -9 11 117 151 105 111 -37 -40 -96 -104 -127
5899 -127 -63 -3 167 75 54 153 46 -59 -83 -114 -156 -101 19 29 106 114 66 60 6 -62 -101 -190 -130 -60 37 73 144 120 101
5928 101 57 8 -137 -102 -122 -65 -14 68 102 136 119 79 11 -36 -123 -163 -100 -49 15 142 111 137 51 7 -65 -131 -83 -132 -99
5957 -99 -65 50 100 169 96 56 -66 -125 -121 -170 -152 2 68 79 135 158 108 53 -33 -103 -139 -100 -64 31 94 139 124 117 60 -68
5987 -68 -96 -188 -145 -105 -37 7 85 79 124 98 5 -79 -137 -91 -151 -37 3 88 100 170 96 23 -71 -97 -131 -166 -34 -27 62 109
6017 109 141 153 53 -22 -39 -117 -166 -155 -8 65 142 135 115 74 4 -62 -89 -114 -113 -73 21 45 120 133 109 84 -40 -82 -149
6046 -149 -121 -97 -83 23 50 146 105 99 13 -97 -123 -141 -181 -56 8 18 143 146 98 61 8 -64 -114 -107 -70 -17 114 146 131
6075 131 100 42 24 -58 -86 -132 -89 -19 13 68 135 103 96 34 -74 -125 -88 -103 -100 10 49 105 126 93 87 -48 -65 -123 -64 -107
6105 -107 -54 9 70 134 97 106 54 -15 -131 -161 -110 -63 24 83 79 125 128 84 12 -105 -61 -53 -101 -11 1 81 115 126 84 43 -74
6136 -74 -155 -139 -105 -46 15 81 72 104 87 10 -83 -105 -156 -140 -91 -58 0 113 111 103 99 35 -40 -115 -122 -67 -29 28 82 72 128 95
6168 95 29 3 -138 -166 -92 -107 2 66 136 139 129 104 -4 -31 -90 -133 -91 -28 -5 82 38 84 87 26 -68 -71 -88 -135 -114 7
6198 7 52 76 109 102 5 -27 -93 -100 -139 -88 -52 50 86 123 89 3 19 -48 -115 -120 -39 -49 -1 56 74 109 105 81 -16 -52 -67 -59 -32
6231 -32 48 25 96 78 113 64 -74 -87 -108 -104 -124 -32 1 62 90 149 135 29 -11 -70 -170 -116 -32 -28 46 38 119 64 58 -6 -53
6262 -53 -61 -120 -86 -49 -8 135 136 120 109 11 -41 -81 -98 -127 -23 -52 75 36 136 51 6 -19 -92 -95 -136 -116 -41 79 70 117
6292 117 70 59 25 -46 -67 -103 -124 -60 -1 88 142 97 54 20 -70 -42 -107 -82 -37 40 5 87 121 95 105 30 -96 -113 -103
6321 -103 -105 -37 9 122 93 121 56 67 -13 -110 -135 -99 -81 -14 -8 96 97 100 50 -30 -30 -85 -99 -67 -16 8 30 110 50 31 33 -69
6353 -69 -26 -122 -74 -32 9 61 130 137 151 20 -19 12 -90 -92 -81 -3 47 72 119 79 14 30 -43 -121 -81 -107 -73 48 37 123
6383 123 80 55 48 -40 -63 -126 -85 -78 -17 73 -5 103 104 56 -13 -72 -120 -80 -66 -35 14 60 107 167 59 57 -3 -74 -84 -54 -46
6414 -46 -10 88 90 118 55 47 -49 -29 -59 -88 -39 -30 9 81 79 91 53 1 -38 -81 -82 -123 -86 -40 69 88 127 61 55 3 -72 -122 -78
6447 -78 -56 18 46 66 136 84 115 -18 -51 -120 -114 -103 -30 44 66 82 132 53 14 8 -58 -131 -60 -21 -4 98 67 88 58 16
6477 16 1 -95 -89 -111 -100 -12 20 80 98 79 23 18 -44 -45 -46 -67 -46 -9 71 123 83 106 19 -11 -62 -28 -79 -62 -22 41 141 101
6509 101 88 51 4 -41 -103 -131 -67 -86 34 77 110 52 50 73 -4 -86 -102 -70 -67 -18 -13 50 111 109 82 -18 -13 -95 -96 -66 -32 20
6541 20 80 130 90 81 19 -37 -31 -69 -65 -2 69 41 71 84 104 91 -5 -60 -58 -45 -98 9 -7 62 67 64 77 19 -76 -96 -119 -56 -20
6574 -20 9 48 81 73 102 -11 -43 -32 -55 -113 -61 -30 14 91 67 100 70 12 -57 -117 -115 -60 -15 5 78 106 59 30 23 22 -98
6605 -98 -107 -67 -98 18 45 61 64 72 51 28 -45 -138 -116 -66 -10 8 48 36 74 80 -4 -25 -79 -83 -90 -94 -18 61 89 54 119 67 -12
6638 -12 -60 -83 -91 -90 18 34 45 80 96 66 23 -50 -51 -114 -78 -37 21 44 70 79 41 -1 -57 -74 -104 -49 -82 -55 50 71 81
6669 81 96 75 2 -27 -124 -84 -81 -38 -26 103 73 49 73 -8 1 -77 1 -90 -61 58 67 112 87 109 29 25 -28 -112 -94 -80 -17
6700 -17 7 46 66 43 59 -1 -44 -60 -48 -60 -64 7 51 23 28 52 -3 -25 -71 -25 -46 -46 4 42 20 54 36 -3 2 -27 -34 -56 -20
6733 -20 -48 12 50 119 116 89 -15 -52 -41 -45 -35 -58 -23 17 57 60 46 24 1 -40 -81 -38 -52 -36 22 11 78 51 59 42 -37 -43
6765 -43 -63 -72 -82 9 23 28 49 46 31 -9 -43 -86 -97 -58 8 19 48 64 41 34 56 57 -3 -81 -43 -27 -21 1 68 112 86 17 -51
6798 -51 -46 -43 -60 -24 15 0 21 88 81 28 38 -54 -103 -68 -67 -5 22 35 42 107 56 6 -26 -59 -53 -50 -63 -18 37 65 52 30 58 -32
6832 -32 -29 -61 -27 -65 -20 29 30 39 77 55 65 -19 -82 -77 -54 -25 -28 57 63 45 66 -10 -24 -33 -70 -91 -70 -14 20 -2 42 42 64 20
6866 20 -72 -52 -60 -55 3 -40 34 77 97 62 -9 -1 -53 -39 -24 -70 6 66 -4 93 50 11 -22 -50 -48 -62 32 -21 -36 52 65 92
6898 92 26 30 -36 -76 -84 -75 -30 -30 41 76 80 53 20 16 -35 20 -27 -102 -5 24 77 25 68 67 7 -33 -56 -96 -104 -42 -55 50 57 21
6932 21 80 47 32 20 -36 -47 -33 -43 19 72 58 66 -2 52 -77 -64 -45 -107 -49 16 24 59 48 73 61 -62 -67 -47 -22 -43 51
6963 51 -21 44 39 41 37 -12 -29 -14 -51 -14 -20 38 78 35 87 29 66 6 -82 -69 -42 -7 9 11 66 71 38 8 -11 13 -49 -95 -64
6996 -64 -69 -82 77 4 27 16 38 -44 -35 -50 -51 -54 -17 8 81 46 51 21 0 56 -87 -32 -33 -31 -1 81 41 85 -30 -15 40 -10
7028 -10 -72 -32 -62 17 34 62 83 38 -20 10 -38 6 -13 -8 44 55 26 67 62 34 -42 -27 -41 -43 -59 -59 40 24 36 27 1 17 -3
7061 -3 -28 -24 -38 -97 38 5 49 103 67 1 14 -38 -58 6 -68 -16 27 11 85 72 48 8 -37 -1 -51 -10 6 -18 38 35 5
7092 5 35 13 36 -36 -52 -17 -1 -26 40 30 59 45 6 50 -22 -38 -84 -16 -20 8 10 47 78 31 22 58 -27 -33 -80 -51 5 43 49
7125 49 36 60 38 -47 6 -5 -3 -47 -37 31 58 36 32 52 17 -17 -58 -7 -57 -75 -33 17 53 89 20 -31 -12 -10 -96 -60 -65 40
7157 40 -13 -37 42 52 56 16 -24 -30 -45 -83 -16 -40 43 51 61 44 8 -34 49 -20 -74 -18 -2 -79 26 53 32 33 27 -50 -1 -91
7189 -91 -19 -15 -5 -26 -14 0 51 72 8 3 -10 -8 -38 -39 -30 42 69 75 -10 -13 -4 0 -89 -21 -6 2 17 39 87 35 22 27 -28 -17 -55 -41
7225 -41 -13 -12 57 36 20 37 -2 -55 2 1 -51 -16 39 11 6 -13 9 64 -9 -22 -42 -61 23 -14 2 41 79 32 -10 -25 -40 2
7257 2 -30 -58 44 74 50 -5 23 15 -5 51 -27 -43 -3 -4 -5 2 99 50 12 -10 3 -31 -34 -13 -44 15 19 22 37 46 35 -2 -25 -38
7291 -38 -27 4 -42 -12 16 10 52 35 -25 6 -9 -29 -32 6 -12 16 27 115 32 28 17 -3 -8 27 -37 27 22 24 14 62 47 -17 19
7324 19 -38 -23 -32 -30 -57 24 27 16 23 -18 -10 32 -51 -11 -47 -33 11 7 18 55 24 -5 -21 -40 -58 -28 0 -7 -17 18 53 1 36 -6
7358 -6 -7 -66 -37 -4 -55 38 -22 77 11 10 31 -4 -56 -56 -45 -53 -13 21 20 14 -50 -19 -24 -38 -19 -1 -49 -12 -4 -2 -9 14 -40 -60 -26 -86
7394 -86 23 -26 3 -2 20 47 52 34 63 -49 -45 9 -32 0 9 21 62 7 25 40 0 -33 -19 -20 -56 -14 -8 31 14 30 -26 -27 5
7427 5 -33 -20 -44 -73 -19 4 11 37 13 -16 -28 9 -26 -34 -34 -16 4 25 14 38 50 12 -16 34 -3 -3 -30 -14 42 -44 48 65 84
7460 84 31 -40 -38 -30 -2 -39 1 -15 -20 40 24 11 -14 -29 -10 -36 -8 -4 -19 27 30 1 13 -60 20 21 -27 14 41 -2 9 8 70 15
7494 15 23 15 -52 -19 9 0 -25 -3 -21 47 25 51 -14 -12 -9 17 -16 -49 19 59 32 -3 50 -13 -14 -43 10 -50 -15 -18 14 61 23 -1
7528 -1 23 -71 -65 -69 -20 11 25 9 17 77 -22 -11 3 -17 22 -8 -5 -18 28 34 -3 33 -5 10 16 -1 -13 -35 -8 32 22 11 49 -21
7562 -21 32 -1 -9 8 -15 -8 -35 11 23 -8 -1 2 13 -9 -42 -25 -33 -34 14 20 27 59 22 13 -8 2 30 25 -7 -43 -12 -11 90 -8 33
7597 33 -16 -13 -23 -30 34 -10 -5 -3 29 -7 -3 11 -2 8 -13 -15 -30 10 -6 36 14 -61 2 -33 -70 -46 -48 15 -19 -47 3 -28 5 25
7631 25 -21 10 -29 -13 -4 -31 15 56 27 36 -2 -11 -38 -51 -9 18 -4 -13 -22 25 12 13 18 45 -2 -22 -46 -14 -49 2 41 -35 19 45
7665 45 -8 -27 -13 -6 -14 -64 -10 34 95 58 -3 0 -24 -29 8 -25 -11 19 49 17 24 17 19 2 16 29 -13 -43 -3 26 -9 34 98 12
7699 12 2 22 -55 11 -25 17 -32 18 20 -14 -29 3 -51 -21 -6 -10 -6 -12 10 12 27 16 -8 16 -39 -11 -17 21 -18 -45 13 24 10
7732 10 0 20 17 25 -7 -32 -28 63 -5 16 22 5 16 29 -9 -43 -3 9 0 -37 0 15 11 10 -1 19 -13 6 -31 4 -69 5 -45 28
7766 28 8 7 0 22 -26 31 17 -10 -6 45 51 6 52 -9 14 27 5 -41 46 -10 23 16 23 36 17 6 1 -14 37 -15 -16 -6 39 -33
7800 -33 13 20 45 14 -50 -29 -37 -18 -21 -16 -36 -44 -3 36 6 31 49 -62 32 31 22 -7 -54 20 5 37 -1 25 -19 28 -16 -46 14
7833 14 58 -7 40 6 -14 76 39 21 10 32 8 42 10 5 8 9 -17 25 11 -13 11 -22 38 -34 6 27 -50 -22 -7 -33 13 -32
7865 -32 -4 19 43 63 -19 10 34 37 -6 -35 -65 43 -69 -1 33 48 35 11 12 -37 2 -3 30 42 22 -23 28 -9 -21 14 -16
7896 -16 36 -10 -57 -52 -15 -28 -2 -9 -13 -18 12 -21 -5 -57 15 -8 11 -20 17 5 -28 21 -14 28 27 -6 20 14 13 48 13 -15 18 -11
7930 -11 -18 -25 -18 42 21 15 30 -1 -31 -3 -20 38 38 -16 22 -56 -41 -34 -11 -17 4 1 7 -45 16 -38 -39 -11 -30 43 -2 13 23 19 -16 -26
7966 -26 1 -12 27 -35 33 -12 7 19 -7 5 24 -16 3 -44 -30 41 -12 45 64 5 60 -15 37 14 28 -26 -8 28 -23 7
7996 7 15 -4 0 0 0 -31 25 44 7 -39 1 11 -9 17 -20 -24 -40 -23 -35 1 0 22 35 30 -22 40 5 2 47 -24 -7 37 -3 22 -13
8031 -13 48 -15 -17 1 -27 -32 49 4 -33 15 5 32 -27 27 -35 -44 -23 39 4 -19 -11 33 14 22 18 -7 10 -9 -10 3 31 -4 -12 18
8065 18 -10 -4 48 -4 -9 0 -26 -45 -18 15 32 15 11 35 3 16 -4 18 -21 51 -20 -9 -35 -7 -20 -19 33 -3 -2 15 12 -27 18 -11
8099 -11 13 20 2 26 -6 -19 -29 18 53 32 -21 21 -8 -23 -16 -20 29 17 -8 3 -32 16 28 8 -25 -15 32 1 -56 2 -30 -21
8131 -21 31 11 -27 4 6 3 -13 5 -3 -32 -25 17 -44 21 11 18 31 -44 -4 -1 26 -20 -2 5 5 67 51 36 18 18 -41 24 -17 37 22
8166 22 54 36 -17 20 1 21 9 -17 -1 -9 26 3 1 6 40 3 9 -10 -18 -9 -32 -33 6 7 -16
8191a6
##END NTUPLES=NMR FID
##END=
