##TITLE=1H_PR163R_rmk
 D2O, 8 sc, 
 11.2.2019
##JCAMPDX= 6.0         $$ Bruker NMR JCAMP-DX V2.0
##DATA TYPE= NMR FID
##DATA CLASS= NTUPLES
##ORIGIN= UXNMR, Bruker Analytische Messtechnik GmbH
##OWNER= root
$$ XWIN-NMR		Version 3.5
$$ Mon Feb 11 15:59:33 2019 Russian Standard Time (UT+4h)  she@DPX200
##.OBSERVE FREQUENCY= 200.1313
##.OBSERVE NUCLEUS= ^1H
##.DELAY= (6, 6)
##.ACQUISITION MODE= SIMULTANEOUS
##.ACQUISITION SCHEME= undefined
##.AVERAGES= 8
##.DIGITISER RES= 18
##SPECTROMETER/DATA SYSTEM= spect
##.PULSE SEQUENCE= zg30
##.SOLVENT NAME= DMSO
##.SHIFT REFERENCE= (INTERNAL, DMSO, 0, 15.7039)
##AUDIT TRAIL= $$ (NUMBER, WHEN, WHO, WHERE, WHAT)
$$ ##TITLE= Audit trail, XWIN-NMR		Version 3.5
$$ ##JCAMPDX= 5.01
$$ ##ORIGIN= Bruker BioSpin GmbH
$$ ##OWNER= she
$$ F:/spectra/data/she/nmr/H-F/1/audita.txt
$$ ##AUDIT TRAIL=  $$ (NUMBER, WHEN, WHO, WHERE, WHAT)
(   1,<2019-02-11 15:57:49.70 +0400>,<she>,<DPX200>,
      <created by zg, POWCHK disabled, PULCHK disabled
       configuration hash MD5:
       00 E9 B6 7A A2 85 ED C7 34 08 36 98 17 FE 4E 26
       data hash MD5: 16K
       06 7A D0 6A AC 36 9F F8 07 44 1A FE C1 01 ED F8>)
$$ ##END=
$$ 
$$ hash MD5
$$ B9 18 BA C8 91 A9 8C E4 B1 A2 6C 04 EA 23 1C 7F
##$RELAX= 
##$RELAX= 
##$RELAX= 
##$RELAX= 
##$RELAX= 
##$RELAX= 
$$ Bruker specific parameters
$$ --------------------------
##$DU= <F:/spectra>
##$EXPNO= 1
##$NAME= <H-F>
##$PROCNO= 1
##$TYPE= <nmr>
##$USER= <she>
##$AMP= (0..31)
100 100 100 100 100 100 100 100 100 100 100 100 100 100 100 100 100 100 
100 100 100 100 100 100 100 100 100 100 100 100 100 100 
##$AQSEQ= 0
##$AQ_mod= 1
##$AUNM= <au_zg>
##$AUTOPOS= <>
##$BF1= 200.13
##$BF2= 200.13
##$BF3= 200.13
##$BF4= 200.13
##$BF5= 200.13
##$BF6= 200.13
##$BF7= 200.13
##$BF8= 200.13
##$BYTORDA= 1
##$CFDGTYP= 0
##$CFRGTYP= 5
##$CHEMSTR= <none>
##$CNST= (0..31)
1 1 145 1 1 1 1 1 1 1 1 1 1 1 1 1 1 1 1 1 1 1 1 1 1 1 1 1 1 1 1 1 
##$CPDPRG= <>
##$CPDPRG1= <>
##$CPDPRG2= <>
##$CPDPRG3= <>
##$CPDPRG4= <mlev>
##$CPDPRG5= <mlev>
##$CPDPRG6= <mlev>
##$CPDPRG7= <mlev>
##$CPDPRG8= <mlev>
##$CPDPRGB= <>
##$CPDPRGT= <>
##$D= (0..31)
0 1.2 0 0 0 0 0 0 0 0 0 0.03 0 0 0 0 0 0 0 0 0 0 0 0 0 0 0 0 0 0 0 0 
##$DATE= 1549886269
##$DBL= (0..7)
120 120 120 120 120 120 120 120 
##$DBP= (0..7)
150 150 150 150 150 150 150 150 
##$DBP07= 0
##$DBPNAM0= <>
##$DBPNAM1= <>
##$DBPNAM2= <>
##$DBPNAM3= <>
##$DBPNAM4= <>
##$DBPNAM5= <>
##$DBPNAM6= <>
##$DBPNAM7= <>
##$DBPOAL= (0..7)
0.5 0.5 0.5 0.5 0.5 0.5 0.5 0.5 
##$DBPOFFS= (0..7)
0 0 0 0 0 0 0 0 
##$DE= 6
##$DECBNUC= <off>
##$DECIM= 32
##$DECNUC= <off>
##$DECSTAT= 4
##$DIGMOD= 1
##$DIGTYP= 9
##$DL= (0..7)
0 120 120 120 120 120 120 120 
##$DP= (0..7)
150 150 150 150 150 150 150 150 
##$DP07= 0
##$DPNAME0= <>
##$DPNAME1= <>
##$DPNAME2= <>
##$DPNAME3= <>
##$DPNAME4= <>
##$DPNAME5= <>
##$DPNAME6= <>
##$DPNAME7= <>
##$DPOAL= (0..7)
0.5 0.5 0.5 0.5 0.5 0.5 0.5 0.5 
##$DPOFFS= (0..7)
0 0 0 0 0 0 0 0 
##$DQDMODE= 0
##$DR= 18
##$DS= 0
##$DSLIST= <SSSSSSSSSSSSSSS>
##$DSPFIRM= 0
$$ [...]
##$SUBNAM2= <"">
##$SUBNAM3= <"">
##$SUBNAM4= <"">
##$SUBNAM5= <"">
##$SUBNAM6= <"">
##$SUBNAM7= <"">
##$SUBNAM8= <"">
##$SUBNAM9= <"">
##$SW= 20.0189088683792
##$SWIBOX= (0..15)
0 0 2 0 0 0 0 0 0 0 0 0 0 0 0 0 
##$SW_h= 4006.41025641026
##$TD= 16384
##$TD0= 1
##$TE= 0
##$TE2= 300
##$TE3= 300
##$TEG= 300
##$TL= (0..7)
0 120 120 120 120 120 120 120 
##$TP= (0..7)
150 150 150 150 150 150 150 150 
##$TP07= 0
##$TPNAME0= <>
##$TPNAME1= <>
##$TPNAME2= <>
##$TPNAME3= <>
##$TPNAME4= <>
##$TPNAME5= <>
##$TPNAME6= <>
##$TPNAME7= <>
##$TPOAL= (0..7)
0.5 0.5 0.5 0.5 0.5 0.5 0.5 0.5 
##$TPOFFS= (0..7)
0 0 0 0 0 0 0 0 
##$TUNHIN= 0
##$TUNHOUT= 0
##$TUNXOUT= 0
##$USERA1= <user>
##$USERA2= <user>
##$USERA3= <user>
##$USERA4= <user>
##$USERA5= <user>
##$V9= 5
##$VALIST= <valist>
##$VCLIST= <CCCCCCCCCCCCCCC>
##$VD= 0
##$VDLIST= <DDDDDDDDDDDDDDD>
##$VPLIST= <PPPPPPPPPPPPPPP>
##$VTLIST= <TTTTTTTTTTTTTTT>
##$WBST= 1024
##$WBSW= 4
##$XGAIN= (0..3)
0 0 0 0 
##$XL= 0
##$YL= 0
##$YMAX_a= 171059
##$YMIN_a= -198139
##$ZGOPTNS= <>
##$ZL1= 120
##$ZL2= 120
##$ZL3= 120
##$ZL4= 120
##$ABSF1= 10
##$ABSF2= 0
##$ABSG= 5
##$ABSL= 3
##$ALPHA= 0
##$AQORDER= 0
##$ASSFAC= 0
##$ASSFACI= 0
##$ASSFACX= 0
##$ASSWID= 0
##$AUNMP= <proc_1d>
##$AZFE= 0.1
##$AZFW= 0.1
##$BCFW= 1
##$BC_mod= 2
##$BYTORDP= 1
##$COROFFS= 0
##$CY= 11.3945322036743
##$DATMOD= 1
##$DC= 2
##$DFILT= <>
##$DTYPP= 0
##$F1P= 18.9103706918063
##$F2P= -1.10871071338519
##$FCOR= 0.5
##$FTSIZE= 0
##$FT_mod= 4
##$GAMMA= 1
##$GB= 0.15
##$INTBC= 1
##$INTSCL= 1
##$ISEN= 128
##$LB= 0.24
##$LEV0= 0
##$LPBIN= 0
##$MAXI= 10000
##$MC2= 0
##$MEAN= 0
##$ME_mod= 0
##$MI= 1.114404
##$NCOEF= 0
##$NC_proc= 0
##$NLEV= 6
##$NOISF1= 3.799351
##$NOISF2= 2.8
##$NSP= 1
##$NTH_PI= 0
##$NZP= 0
##$OFFSET= 15.70392
##$PC= 1
##$PHC0= -8682.715
##$PHC1= 11.60018
##$PH_mod= 1
##$PKNL= yes
##$PPARMOD= 0
##$PSCAL= 0
##$PSIGN= 0
##$REVERSE= no
##$SF= 200.130013532006
##$SI= 16384
##$SIGF1= 3
##$SIGF2= 2
##$SINO= 400
##$SIOLD= 16384
##$SREGLST= <1H.CDCl3>
##$SSB= 0
##$STSI= 0
##$STSR= 0
##$SW_p= 3612.71676300578
##$SYMM= 0
##$S_DEV= 0
##$TDeff= 0
##$TDoff= 0
##$TI= <>
##$TILT= no
##$TM1= 0
##$TM2= 0
##$TOPLEV= 0
##$USERP1= <user>
##$USERP2= <user>
##$USERP3= <user>
##$USERP4= <user>
##$USERP5= <user>
##$WDW= 1
##$XDIM= 8192
##$YMAX_p= 0
##$YMIN_p= 0
$$ End of Bruker specific parameters
$$ ---------------------------------
##NTUPLES= NMR FID
##VAR_NAME=  TIME,          FID/REAL,        FID/IMAG
##SYMBOL=    X,             R,               I
##VAR_TYPE=  INDEPENDENT,   DEPENDENT,       DEPENDENT
##VAR_FORM=  AFFN,          ASDF,            ASDF
##VAR_DIM=   8192,          8192,            8192
##UNITS=     SECONDS,       ARBITRARY UNITS, ARBITRARY UNITS
##FACTOR=    0.0002496,     1,               1
##FIRST=     0,             0,               0
##LAST=      2.0444736,     0,               0
##MIN=       0,             -198139,         0
##MAX=       2.0444736,     171059,          0
$$ Real data points
##PAGE= N=1
##DATA TABLE= (X++(R..R)), XYDATA
$$ [...]
205 67124 46072 9462 -33609 -66042 -75287 -60001 -28512 9522 44334 67573 71829 52637
217 52637 16887 -24348 -56618 -70629 -63632 -38272 -2576 34726 62754 71214 56414 24452
229 24452 -13777 -46788 -66067 -66824 -47136 -11859 27008 55944 67029 59099 34662 -1477 -38424
242 -38424 -63087 -66151 -49616 -20247 14832 46993 66188 63717 40305 5217 -29070 -54274
254 -54274 -64823 -56543 -30097 7167 40925 60399 61983 46114 16818 -19074 -49163 -63518
266 -63518 -58094 -35732 -2783 30883 55515 63219 51128 23834 -10030 -40580 -59639 -60304 -42060
279 -42060 -11282 22699 48886 60707 54504 32003 -457 -33188 -55221 -60030 -46826 -19932
291 -19932 12711 42099 58720 57093 37963 7413 -24868 -49313 -58733 -51564 -28226 4203 35720
304 35720 54801 56963 42877 16779 -15041 -43277 -58361 -54025 -32827 -3052 26435 48165
316 48165 57313 49092 24065 -8655 -37176 -53407 -53825 -39508 -13282 18407 44732 56670 50286
329 50286 29434 727 -28534 -49892 -55587 -43855 -19297 10657 37594 53953 53306 35742 7625
342 7625 -21782 -44034 -53618 -48163 -27402 2706 32170 50248 52430 39653 16812 -12010 -39026
355 -39026 -53848 -50800 -31433 -3835 23331 44152 52734 45839 23653 -6455 -33640 -49193 -50422
368 -50422 -37479 -13432 15247 40065 52324 47615 27813 1545 -25076 -44863 -51662 -42934 -19645
381 -19645 9292 34634 48481 48496 35094 10361 -18173 -41358 -51059 -44685 -25660 826 26876
394 26876 45266 49863 39212 17074 -10447 -35165 -49495 -47714 -30682 -5287 19329 39196
406 39196 49435 45214 24841 -5481 -31876 -44540 -44593 -35552 -17490 10057 38396 52095 44860
419 44860 24154 1751 -18757 -37758 -49682 -44847 -21134 9350 32439 43379 43616 33938 13086
432 13086 -13933 -37603 -48611 -44178 -26212 144 25174 40897 44127 36791 20066 -4648 -32644
445 -32644 -49916 -46370 -26250 -3851 14221 31069 46300 47632 26624 -6166 -31646 -40431 -38784
458 -38784 -33212 -19976 5906 34877 49910 44115 24061 2524 -17121 -34518 -44678 -41168 -22734
471 -22734 3868 28869 43808 43823 30423 10173 -10600 -29615 -43813 -45300 -29051 -500 25853
484 25853 38448 38901 33368 21411 -545 -28492 -47143 -45526 -26793 -4819 13666 28814 41090
497 41090 42424 27298 -129 -25943 -39943 -40759 -31276 -15479 4945 26602 42211 43908 29774
510 29774 4604 -18774 -33315 -39008 -36316 -23904 -1619 24022 41484 42908 30447 11155 -8910
523 -8910 -27189 -39347 -40558 -27962 -5421 19071 36257 41081 33308 17205 -1903 -21558 -37778
536 -37778 -43559 -32672 -9124 14961 30268 35811 35753 27075 6410 -20439 -38917 -40766 -29993
549 -29993 -14708 2405 22803 39473 41662 27587 6185 -12847 -28531 -38972 -37935 -22024
561 -22024 1261 21217 32558 37292 33818 17247 -8685 -30437 -37166 -33260 -24804 -10621 12045
574 12045 34502 42374 32261 15117 -408 -17159 -34152 -41901 -31328 -8529 11417 23810
586 23810 33428 38173 28624 3696 -21279 -32576 -32382 -29630 -22108 -2083 25150 40957 36122 21340
600 21340 8353 -4527 -23606 -40572 -39649 -19937 2345 17454 26967 35483 34201 17908 -6891
613 -6891 -25155 -32412 -33614 -27933 -11193 13675 31525 34224 28399 20486 6617 -16248 -37522
626 -37522 -40068 -24702 -7157 4277 16195 33056 41490 28775 1490 -19585 -26218 -28159 -30753
639 -30753 -24110 -2550 23360 35734 33015 23431 11741 -4726 -24037 -36035 -33366 -20484 -4821
652 -4821 12208 29201 37600 30304 12431 -4315 -16694 -28086 -36236 -31037 -9100 15128 27677
665 27677 28627 27003 23301 8518 -15812 -34624 -36185 -24288 -10342 2030 17079 31549 36269
678 36269 25422 5737 -12315 -24848 -31920 -30490 -19003 -838 16720 28446 33009 28287 13211
691 13211 -7309 -23947 -30560 -28773 -21933 -8851 10219 28343 35240 28175 13747 -888 -14961
704 -14961 -27483 -33352 -27757 -10435 9179 23315 29718 29388 20902 5674 -12922 -27032 -32269
717 -32269 -27281 -14629 2017 18468 29122 30991 23762 9513 -8189 -23520 -31113 -29152 -18440
730 -18440 -3064 14001 26668 31484 26520 13482 -3588 -19002 -29163 -30744 -22143 -6930 10053
743 10053 23562 29805 28137 18016 1752 -15590 -27569 -30554 -24515 -11089 4606 19722 28834
756 28834 29454 21377 6074 -11316 -24965 -29948 -25931 -14770 -294 14768 27125 31172 23984
769 23984 8989 -7635 -20142 -27163 -27606 -20553 -5818 12539 26396 29976 24045 12474 -1019
782 -1019 -15132 -27077 -30540 -23255 -7811 9068 21839 27704 26278 17910 4117 -12365 -25875
795 -25875 -30333 -24199 -10882 4122 16534 25277 28073 22378 7946 -9904 -23548 -28379 -24502
808 -24502 -15236 -1919 12921 24783 29604 24223 10113 -6004 -18905 -25928 -25993 -19428 -7188 9096
822 9096 23542 29394 25144 12828 -954 -13650 -23702 -28091 -23614 -9707 7364 20480 26242
835 26242 24742 17505 4962 -10631 -23452 -28358 -23592 -12172 2229 15599 25007 26791 20210
848 20210 8053 -6578 -19863 -27242 -25790 -15961 -1498 12224 21901 26368 23539 12339 -3547
861 -3547 -18137 -25211 -24460 -18224 -7275 7141 21182 27711 23935 13642 25 -12072 -22483
874 -22483 -27015 -22146 -9663 5450 17377 24448 24900 18404 5213 -10399 -21458 -25431 -22502 -13803
888 -13803 -590 14369 24388 25681 19425 8259 -5013 -17531 -25738 -25341 -16276 -2357 10722
901 10722 20345 25362 23317 12472 -2221 -15842 -23575 -24307 -18979 -7751 6176 19457 25741 23057
915 23057 14309 2260 -10391 -21498 -26135 -21702 -9790 3705 15667 22963 24397 18530 5616
928 5616 -8883 -19924 -24605 -21767 -13680 -1340 12129 22522 25296 19475 8573 -4008 -15801
941 -15801 -23762 -24382 -16892 -3714 9608 19202 23725 21860 13149 -393 -14281 -22776 -23737 -18673
955 -18673 -8116 5155 17749 24359 22581 14400 3003 -9238 -20133 -25042 -21409 -9875 3126
968 3126 13557 20879 23765 19459 7039 -8318 -19443 -22641 -20046 -14201 -3647 10382 22588
981 22588 25426 18701 7829 -2854 -12962 -21947 -24735 -17643 -4261 8791 18225 22855 21284 13136
995 13136 548 -12230 -20544 -23088 -19414 -9216 4572 17283 22650 20720 14590 5480 -6978
1008 -6978 -19708 -25948 -20766 -8439 2441 10802 18008 23949 21204 7933 -8118 -18633 -20751
1021 -20751 -19086 -14537 -5327 8726 20695 24563 19240 9166 -2328 -12879 -20619 -22306 -17253
1034 -17253 -6921 5991 17473 24070 21208 11556 5 -9495 -16890 -22385 -21580 -11096 5141
1047 5141 17537 20956 18512 14117 7467 -4475 -18640 -25811 -21080 -9361 1945 10083 17441 21849
1061 21849 19871 9572 -5128 -17096 -21904 -20256 -13149 -3260 6945 16880 22286 21205 11519 -2297
1075 -2297 -14543 -19991 -18954 -15397 -8507 2633 15988 24225 21951 11508 -194 -8930 -15384 -20559
1089 -20559 -20942 -12227 2660 15961 21593 19530 13525 5887 -3963 -14947 -22624 -21851 -12734 733
1103 733 11676 17672 19156 17492 10745 -1064 -14787 -22714 -21130 -12779 -2649 6656 14338 20530
1117 20530 21124 13153 -373 -12956 -19988 -19908 -15146 -7623 2041 13477 21399 21801 14149 1911 -9529
1132 -9529 -16293 -18573 -17881 -11922 -560 12512 21363 20929 13706 4565 -4235 -12893 -20312 -21513 -13683
1147 -13683 -902 10978 17327 19322 17059 9639 -1121 -12743 -19794 -20712 -14606 -4147 6497
1160 6497 15428 19630 18231 11977 2071 -9742 -18827 -21074 -15811 -6506 3082 11704 18785 20807 14714
1175 14714 3277 -8620 -16173 -18792 -17402 -11584 -824 10954 19027 19998 15022 6639 -3785 -13517
1189 -13517 -19509 -19102 -13004 -2998 7615 16268 20019 17529 9059 -1666 -11109 -17709 -19448 -15722
1203 -15722 -6193 5670 14643 18930 17607 12159 2404 -8503 -17214 -19916 -16260 -8167 2206 11561
1217 11561 18286 19317 13996 4345 -5992 -14609 -19174 -17986 -11057 -640 9700 16775 19116 16089
1231 16089 7627 -3270 -12813 -18427 -18547 -13183 -3767 6792 15501 19092 16764 9452 20 -9975
1245 -9975 -17690 -18995 -14628 -5817 4233 12794 18395 18362 12240 2432 -7957 -15360 -18572 -16673 -8776
1260 -8776 1662 11326 17170 17903 13932 6012 -4898 -14593 -18599 -16598 -10567 -1927 7643 16011 19308
1275 19308 15647 7246 -2615 -11204 -16882 -18265 -13651 -3962 6447 14457 17754 16409 10392 714
1289 714 -9508 -16562 -17676 -14327 -7186 2855 12425 18252 17120 11217 3026 -5889 -13668 -18864 -17174
1304 -17174 -8833 1933 10200 15238 17138 14666 6828 -4377 -13827 -17863 -15991 -10500 -2342 6793
1318 6793 14930 18198 15538 7826 -1724 -10647 -16766 -17544 -12539 -4459 4297 12526 17651 17433 10208
1333 10208 150 -8874 -14378 -16679 -14543 -8546 1915 12414 17740 16138 10772 3306 -4434 -12860
1347 -12860 -17899 -16705 -9256 731 9380 15295 16392 13557 6587 -3029 -11961 -17271 -16598 -10751 -2155
1362 -2155 6739 13610 16503 15107 9302 -247 -10378 -16479 -16624 -11782 -4910 3303 11291 17201 16986
1377 16986 10853 1065 -8111 -14046 -15954 -13934 -8265 857 10705 16659 16352 11402 3443 -4938 -11822
1392 -11822 -15821 -15593 -10107 -584 8782 14878 16055 12776 6561 -1722 -10521 -16347 -16664 -11210 -2530
1407 -2530 6157 12579 15784 14660 9271 129 -9048 -15426 -16365 -12005 -5107 3029 10534 15694 16007
1422 16007 10944 1880 -7002 -13451 -15420 -13555 -7880 281 9157 15471 16468 11829 3726 -4437 -11025
1437 -11025 -15390 -15436 -10253 -1388 8152 14287 15311 12571 6673 -743 -9792 -15582 -15914 -11034 -2680
1452 -2680 4995 11477 15159 14767 9204 642 -8255 -14140 -15759 -12601 -5507 2503 10238 15016 15654
1467 15654 10934 2705 -6282 -12994 -15020 -12982 -7741 -528 8165 14702 16174 11709 3683 -3688 -10119
1482 -10119 -14078 -15242 -11024 -1951 7893 13474 14249 12191 7596 -91 -9113 -15460 -15615 -10483 -3386
1497 -3386 4423 10591 14921 14542 9290 1032 -7205 -12884 -15309 -13072 -5976 2637 9516 13540 14515
1512 14515 11469 3640 -5803 -12959 -14618 -12293 -7746 -1433 6911 14368 16313 11667 3702 -2981 -8656
1527 -8656 -13810 -15491 -11058 -1989 6788 12211 13701 12569 8107 -110 -8838 -14126 -14059 -10516 -5128
1542 -5128 2961 10814 15008 13732 8091 1682 -5217 -11849 -15871 -13536 -5925 2500 8631 12505 14262
1557 14262 11999 4355 -5087 -12046 -13609 -12406 -8625 -1969 6653 13372 14967 10946 5045 -1441 -8271
1572 -8271 -14184 -14844 -9787 -1829 4892 10487 13705 13501 8130 -818 -8395 -12666 -13264 -11243 -5763 2298
1588 2298 10348 14340 12607 8348 2245 -4821 -11364 -14815 -12593 -6068 820 7646 12338 14406 11202
1603 11202 3623 -4226 -10108 -12761 -13181 -9360 -1745 6804 12662 13466 10677 6239 -498 -8325 -13855
1618 -13855 -13987 -9592 -2822 3895 9912 13662 13162 7913 236 -6698 -11503 -13379 -11313 -5615 2629
1633 2629 8937 12615 12988 9689 3218 -5026 -11447 -13691 -11939 -6832 -383 6534 12268 14080 10768
1648 10768 3997 -3252 -9236 -12570 -12709 -8979 -2099 5576 11370 13346 11286 6274 -621 -7787 -12164
1663 -12164 -13012 -10234 -4065 3765 10013 13201 12114 7766 1445 -5636 -10882 -13766 -11564 -5398 1919
1678 1919 8200 11903 12541 9858 3538 -4253 -10254 -13064 -11718 -7099 -366 6288 11417 13226 10898
1693 10898 5302 -2122 -8783 -12334 -12241 -8470 -2609 4612 10028 13049 11699 6842 -545 -7430 -11456
1708 -11456 -12478 -9971 -4505 2672 9099 12744 12105 7860 1447 -5224 -10275 -12571 -11350 -6498 937
1723 937 7936 12001 12336 8939 3547 -3103 -9271 -12434 -12032 -7601 -1025 5995 10758 12199 10175 5303
1739 5303 -1168 -7532 -12071 -12631 -8874 -1973 4261 8859 11556 10976 7732 478 -6933 -11632 -11998 -9161
1755 -9161 -4553 1552 7616 12018 12429 8229 1905 -4804 -9583 -12024 -10523 -6235 -292 6697 11287
1770 11287 12484 9772 3473 -3365 -8252 -10862 -11253 -8418 -2228 5602 11045 11875 9086 5157 -109
1785 -109 -6326 -11707 -12658 -9092 -2574 3852 8319 10938 10864 7596 1375 -5899 -10490 -11884 -9692 -4745
1801 -4745 1816 7527 10657 11028 8539 3235 -3974 -10043 -11792 -9893 -5458 -448 4860 10069 12795
1816 12795 10025 3371 -3431 -7919 -10037 -10677 -8515 -2782 4948 10273 11460 9550 5348 -351 -6028
1831 -6028 -10544 -11635 -8577 -3532 2800 8195 11107 10606 6436 842 -4285 -9188 -11699 -10646 -5266
1846 -5266 1940 7257 9893 10213 8465 3949 -3092 -9417 -11470 -9719 -5374 -925 4382 9457 12076
1861 12076 9522 3767 -2461 -6937 -10212 -10988 -7920 -2197 4105 8798 10547 10128 6258 -256 -6170
1876 -6170 -10256 -10648 -8314 -4038 1750 7839 11374 10463 6539 1426 -3944 -8462 -11356 -10261 -5170
1891 -5170 1393 6426 9704 10486 8692 3478 -2949 -8479 -10991 -9843 -6506 -1195 4743 9641 11061
1906 11061 8936 4312 -1001 -6284 -10273 -11187 -7972 -2099 3619 8163 10357 10016 6313 405 -5774
1921 -5774 -9663 -10517 -8436 -3771 1731 7001 10370 10243 6961 1944 -3579 -8431 -10472 -9387 -5114
1936 -5114 361 5886 9422 10554 8653 3379 -2728 -7446 -9889 -9825 -6548 -1557 4139 8894 10828
1951 10828 8990 4512 -800 -5821 -9571 -10788 -7916 -2531 3097 7957 10127 9364 6208 1118 -4768
1966 -4768 -8906 -10550 -8887 -4040 1323 6481 9669 9914 7147 2204 -3226 -7945 -10423 -9165 -5568
1981 -5568 -246 4988 8771 10116 8418 3858 -1948 -6909 -9662 -9298 -6610 -1916 3552 8357 10503
1996 10503 9211 4721 -552 -5704 -8976 -10177 -8156 -3538 2591 7717 9874 9151 5939 1422 -3898
2011 -3898 -8259 -10499 -8860 -3995 1012 6019 9262 9471 7267 2821 -2826 -7578 -9970 -9079 -5658
2026 -5658 -577 4273 8333 9881 8391 4197 -1575 -6789 -9430 -9163 -6572 -1943 2630 7656 10076
2041 10076 9147 4728 -289 -5138 -7949 -9578 -8249 -4002 1916 7250 9637 8841 5618 1707 -3448
2056 -3448 -7842 -9890 -8752 -4671 697 5364 8883 9005 7306 3143 -1930 -6968 -9904 -9300 -5826
2071 -5826 -608 4120 7593 9213 8386 5004 -949 -6629 -9304 -8860 -5933 -2289 2171 6697 10111
2086 10111 9113 5364 -1 -4351 -7674 -8842 -7916 -4367 1630 6570 8927 8758 6079 1771 -3143
2101 -3143 -7240 -9047 -8443 -5233 -217 5311 8733 9153 6579 3057 -1499 -5886 -9055 -9563 -5890 -480
2117 -480 4091 7054 8543 8246 5330 -549 -5799 -8998 -8952 -6428 -2560 1977 6485 9357 8774 5539
2133 5539 632 -4109 -7806 -8973 -7346 -3704 740 5116 8443 9214 6575 1675 -3221 -6913 -8347
2148 -8347 -7982 -5564 -466 4814 8481 8747 6771 3057 -1139 -5372 -8813 -9123 -6082 -1438 3559 7094
2164 7094 8753 8257 4736 -276 -4812 -7908 -8882 -7011 -2814 2248 6355 8155 8052 5663 1186 -3705
2180 -3705 -7604 -8685 -7116 -3917 347 4787 8281 8727 6737 2032 -2726 -6217 -8210 -8147 -5152 -866
2196 -866 4237 7411 8599 7168 3750 -1127 -5459 -8315 -8324 -5964 -2002 2858 6952 8920 7505 4361
2212 4361 149 -4348 -7566 -8594 -7103 -2865 2033 5736 8163 8255 5396 1743 -3113 -6835 -8417
2227 -8417 -7261 -3951 626 4549 7861 8400 6169 2378 -1957 -6297 -8487 -8012 -5145 -581 3756
2242 3756 7007 8466 7073 3441 -943 -5317 -7986 -8163 -6067 -1927 2464 6576 8155 7682 4391
2257 4391 258 -4139 -7315 -8233 -6827 -3067 1581 5564 7964 8069 5658 1571 -2923 -6576 -8261
2272 -8261 -7222 -4004 -15 4186 7342 8156 6245 2735 -1817 -5639 -7725 -7541 -5301 -1213 3400
2287 3400 6910 8502 7137 3609 -421 -4664 -7326 -7890 -6116 -2202 2288 6306 7642 7226 4502
2302 4502 730 -3370 -6872 -7990 -6731 -3379 1196 4954 7231 7539 6047 2115 -2438 -6377 -8083
2317 -8083 -7224 -4204 -541 3973 7000 8193 6642 2921 -1467 -5385 -7601 -7551 -5101 -1309 2907 6137
2333 6137 8106 7275 3987 -314 -4419 -6970 -7745 -6198 -2786 1881 5791 7858 7547 4702 787 -2972
2349 -2972 -6379 -8273 -7108 -3583 962 4788 7161 7330 5632 2100 -2213 -5864 -7544 -6779 -4413
2364 -4413 -329 3657 6457 7439 6395 3402 -951 -5075 -7472 -7493 -4812 -1249 2355 5713 7769 7381
2380 7381 4249 -416 -4267 -6377 -7233 -6068 -2935 1422 5590 7536 6998 4428 1015 -2838 -5865
2395 -5865 -7585 -6713 -3748 532 4465 6853 7357 5333 2280 -1685 -5159 -7439 -7048 -4664 -859 3681
2411 3681 6013 7400 6128 3627 -579 -4786 -7141 -7174 -4847 -1679 2126 5259 7140 7121 4291 -11
2427 -11 -3848 -6417 -6731 -5911 -3081 1326 4897 7041 6697 4697 1315 -2751 -5740 -7138 -6457 -3597
2443 -3597 245 4003 6732 7280 5527 2487 -1624 -5037 -6918 -6923 -4627 -821 3339 5886 7367 6187
2459 6187 3252 -525 -4124 -6922 -7094 -5235 -1634 1836 5186 7170 6645 4322 310 -3620 -5993
2474 -5993 -7052 -6043 -3031 788 4572 6558 6643 4749 1552 -2293 -5463 -7130 -6239 -3967 -302 3597
2490 3597 6467 6855 5443 2691 -1317 -4496 -6522 -6807 -4772 -939 2829 5585 6644 6034 3426 -223
2506 -223 -4254 -6496 -6768 -5090 -1981 1603 4636 6932 6706 4288 524 -2928 -5852 -6995 -5627 -2711
2522 -2711 866 3938 6497 6406 4958 1781 -1976 -5333 -6500 -6027 -3815 -632 3191 5833 6754 5551
2538 5551 2095 -1103 -4402 -6254 -6541 -4778 -1256 2690 5305 6532 5910 3431 317 -3868 -6009
2553 -6009 -6593 -5130 -2028 1290 4602 6449 6422 4101 1243 -2695 -5407 -6490 -5704 -2981 276 3709
2569 3709 6091 6556 5180 1745 -1648 -4914 -6315 -5892 -4104 -716 3189 5614 6412 5401 2799 -1038
2585 -1038 -3851 -6102 -6247 -4608 -1318 2030 5064 6391 5808 3578 170 -3377 -5932 -6583 -5403 -2469
2601 -2469 1293 4180 6095 5988 4275 1207 -2337 -5154 -6324 -5762 -3157 -1 3673 5814 6549 4592
2617 4592 2165 -1497 -4516 -6151 -6171 -3947 -435 2612 5287 6170 5435 3084 -688 -3591 -5923 -5963
2633 -5963 -4300 -1888 1866 4986 6073 5837 3678 122 -3294 -5470 -6264 -4671 -2537 854 4082
2648 4082 5844 6107 4258 1247 -2236 -4569 -5818 -5533 -3547 88 3645 5539 5982 4537 2172 -1166
2664 -1166 -4299 -6121 -5927 -3712 -636 2446 5008 5824 5211 3184 -95 -3487 -5717 -5903 -4475 -1473
2680 -1473 1680 4325 5647 5415 3772 697 -2643 -5476 -6041 -4743 -2283 461 3553 5757 5818 4669
2696 4669 1217 -2017 -4453 -5691 -5392 -3308 -336 2947 5171 5921 4576 1897 -704 -3766 -5327
2711 -5327 -5552 -3965 -1034 1966 4441 6002 5259 3042 103 -3230 -5356 -6080 -4649 -1856 1415 4050
2727 4050 5387 5470 3826 827 -2336 -4906 -5713 -4643 -2456 310 3301 5395 5774 4237 1378 -1605
2743 -1605 -4228 -5316 -5334 -3383 -345 2706 4970 5713 4740 2170 -883 -3622 -5487 -5602 -4192 -1035
2759 -1035 1963 4503 5715 5140 2937 -117 -2583 -5162 -5727 -4370 -1884 1191 3892 5109 5271 3702
2775 3702 940 -2325 -4773 -5428 -4723 -2738 263 2815 4945 5521 4405 1590 -1318 -3997 -5394 -5250
2791 -5250 -3352 -682 2661 4618 5555 4837 2392 -650 -3239 -4837 -5232 -3862 -1506 1729 4194 5368
2807 5368 4989 2990 442 -2389 -4773 -5347 -4564 -1991 1246 3433 5198 5181 3697 1247 -1879 -4328
2823 -4328 -5417 -4749 -2681 197 2828 4697 5389 4140 1833 -1440 -3975 -5048 -4819 -3279 -601 2497
2839 2497 4642 5532 4804 2402 -501 -3095 -4610 -5110 -3867 -1678 1704 3989 5202 4734 2968 270
2855 270 -2614 -4354 -5346 -4247 -1914 814 3289 4805 4955 3547 1021 -1582 -4044 -5252 -4697 -2978
2871 -2978 15 2850 4429 5157 4076 1887 -1014 -3739 -4844 -4743 -3235 -908 1942 4137 5281
2886 5281 4455 2325 -442 -2755 -4294 -5342 -3795 -1365 1221 3486 4850 4582 3032 435 -2348
2901 -2348 -4332 -4889 -3889 -2082 645 3135 4792 4870 3699 1312 -1615 -3808 -4888 -4467 -2585 -158
2917 -158 2580 4220 4922 3966 1834 -938 -3088 -4909 -4692 -3430 -1069 1946 3920 4677 4083 2333
2933 2333 -41 -2580 -4163 -4922 -3740 -1565 1258 3404 4415 4366 2929 591 -1879 -3863 -4801 -4078
2949 -4078 -2403 417 2790 4464 4627 3501 1096 -1404 -3551 -4676 -4080 -3168 -312 2293 3939 4482
2965 4482 3817 1894 -676 -2991 -4718 -4519 -3005 -842 1490 3721 5015 4196 2523 222 -2402 -4123
2981 -4123 -4778 -3829 -1672 924 3329 4306 4315 3081 843 -1646 -3792 -4571 -4243 -2415 12 2603 4337
2998 4337 4477 3461 1137 -856 -3080 -4552 -4500 -2676 -443 2072 3753 4210 3972 2254 -417 -3089
3014 -3089 -4424 -4525 -3136 -1155 1464 3245 4483 4146 2615 7 -2495 -4150 -4805 -3731 -1799 705
3030 705 2889 4223 4337 3072 769 -1638 -3481 -4357 -3804 -2569 -139 2307 3985 4514 3380 1609
3046 1609 -909 -2929 -4461 -4220 -2627 -403 2026 3599 4328 3703 2231 -82 -2577 -3966 -4159 -3255
3062 -3255 -946 1338 3095 3972 3877 2758 512 -2172 -3985 -4318 -3508 -1745 437 2664 4038 4146
3078 4146 3250 985 -1385 -3249 -4230 -3880 -2445 -308 2127 4025 4314 3214 1512 -666 -2998 -3956
3094 -3956 -4157 -2982 -852 1536 3346 4002 3444 2262 -149 -2093 -3931 -4358 -3125 -1183 1151 3086
3110 3086 3912 3779 2664 861 -1589 -3868 -4269 -3505 -1323 232 2254 3760 4235 2859 1012 -1212
3126 -1212 -3128 -4060 -3545 -2402 -379 1939 3624 4126 3065 1256 -729 -2473 -3897 -3948 -2992 -991
3142 -991 1438 3258 3999 3547 1906 -51 -2011 -3579 -4217 -3281 -1360 892 2930 3751 3714 2618 524
3159 524 -1864 -3221 -3932 -3448 -1541 149 2113 3597 3999 3160 1109 -1115 -2966 -4098 -3608 -2397
3175 -2397 -579 1766 3452 3938 3354 1520 -560 -2496 -3696 -3545 -2713 -943 1337 3287 3754 3540
3191 3540 2054 84 -2109 -3217 -4074 -3326 -1500 808 2578 3333 3463 2348 645 -1266 -3307 -3811
3207 -3811 -3790 -2084 152 2426 3521 3720 2662 1603 -1143 -2713 -3586 -3535 -2232 -212 1711 3252
3223 3252 3549 3440 1690 -279 -2198 -3456 -3711 -2721 -981 1125 2768 3832 3466 1979 220 -2036
3239 -2036 -3352 -3783 -3023 -1782 778 2481 3486 3463 2659 959 -1210 -2758 -3852 -3495 -1966 22
3255 22 1955 3115 3822 3020 1171 -818 -2703 -3618 -3747 -2412 -599 1397 3096 3941 3343 1803 -238
3272 -238 -2153 -3290 -3588 -2807 -978 916 2813 3678 3315 2100 427 -1532 -3129 -3358 -2947 -1461 617
3289 617 2110 3423 3665 2456 906 -1218 -3069 -3370 -3323 -1959 27 1950 3324 3475 2810 1077 -834
3306 -834 -2439 -3498 -3317 -2317 -463 1395 2823 3682 3104 1672 -29 -2154 -3085 -3672 -2641 -926
3322 -926 728 2574 3460 3331 2421 361 -1429 -2935 -3652 -3029 -1346 475 2236 2812 3379 2559 1084
3339 1084 -1004 -2572 -3657 -3079 -1892 -8 1716 2964 3306 2788 1362 -304 -2168 -3461 -3136 -2582
3355 -2582 -677 1130 2987 3182 3053 1653 -72 -1807 -3050 -3393 -2551 -1344 568 2111 3366 3011
3371 3011 1934 559 -1471 -2683 -3365 -3163 -1593 127 2094 3119 3263 2455 982 -1040 -2519 -3473
3387 -3473 -3256 -1760 -227 1360 2880 3326 2788 1468 -245 -1958 -3299 -3341 -2594 -636 1208 2713
3403 2713 3198 3065 1767 126 -1642 -2801 -2992 -2311 -850 568 2288 3126 3119 2138 524 -1482 -2800
3420 -2800 -3194 -2831 -1545 211 1906 2972 3277 2261 1120 -678 -2340 -3406 -3370 -1900 -400 1273
3436 1273 2569 3302 2635 1415 -374 -2067 -2936 -3023 -2121 -840 1065 2550 3408 2865 1848 -18 -1490
3453 -1490 -2845 -3017 -2565 -1113 723 2225 3052 3288 2169 273 -1195 -2546 -3217 -2999 -1427 -52
3469 -52 1960 2849 3017 2389 775 -940 -2213 -2775 -2925 -1691 -172 1512 2661 3383 2582 1506 -413
3486 -413 -2021 -2881 -2874 -2185 -887 1521 2553 3159 2803 1960 164 -1467 -2949 -3156 -2552 -1341 398 2020
3504 2020 2950 2969 2193 761 -880 -2227 -3156 -2658 -1602 31 1778 2881 3023 2307 1047 -540 -2123
3521 -2123 -2940 -2685 -1992 -596 1359 2590 2969 2463 1095 -392 -1796 -2787 -2935 -2242 -725 597 2004
3538 2004 3144 2876 1848 244 -1244 -2603 -3022 -2581 -1336 544 1830 2762 2841 2026 731 -720 -2401
3555 -2401 -3012 -2780 -1508 -17 1671 2733 2861 2446 1029 -416 -1732 -2801 -2818 -2110 -354 1058 2559
3572 2559 2853 2491 1381 -316 -1604 -2641 -2758 -2175 -1137 423 2046 2979 2820 1753 407 -1450
3588 -1450 -2388 -3083 -2530 -1419 103 1900 2771 2833 2023 741 -967 -2483 -2796 -2531 -1570 -146 1214
3605 1214 2422 2745 2052 900 -530 -1958 -2738 -2719 -2272 -304 1273 2265 2968 2617 1502 174 -1508
3622 -1508 -2445 -2860 -2209 -1035 362 1960 2776 2742 1841 326 -1337 -2520 -2692 -2252 -1553 337 1586
3639 1586 2741 2620 2133 760 -706 -2086 -2813 -2618 -1687 -10 1277 2178 2728 2266 845 -401 -1607
3656 -1607 -2559 -2960 -1911 -792 975 2065 2745 2477 1380 101 -1270 -2423 -2832 -2216 -872 508
3672 508 1989 2631 2593 1856 322 -901 -2351 -2772 -2350 -1171 208 1636 2374 2669 1692 946 -925 -2203
3690 -2203 -2699 -2289 -1534 -146 1191 2144 2850 2214 1245 -134 -1619 -2508 -2723 -1747 -534 1018 2043
3707 2043 2732 2284 1167 161 -1259 -2321 -2661 -2045 -1064 583 1747 2659 2651 2082 512 -997 -1910 -2758
3725 -2758 -2384 -1342 -5 1265 2327 2745 1953 1086 -743 -1858 -2443 -2334 -1398 -350 775 2218 2706
3742 2706 2200 1531 -283 -1464 -2358 -2139 -1985 -835 885 2040 2731 2516 1338 12 -1393 -2021 -2755
3759 -2755 -2189 -912 658 1811 2395 2369 1482 362 -837 -2035 -2336 -2379 -1357 312 1406 2406 2578
3776 2578 1981 653 -744 -1920 -2458 -2430 -1596 -192 1038 2152 2717 2142 1092 -313 -1499 -2494 -2432
3793 -2432 -1728 -643 653 1890 2653 2184 1140 128 -1247 -1958 -2545 -2286 -969 564 1586 2373 2174
3810 2174 1572 515 -1096 -2058 -2639 -2271 -1445 300 1177 2575 2395 1913 680 -464 -1630 -2464 -2403 -1464
3828 -1464 -360 926 2139 2520 2164 912 -35 -1598 -2459 -2389 -1874 -451 777 1610 2281 2411 1458 156
3846 156 -1037 -2009 -2398 -1759 -1042 437 1513 2390 2493 1576 676 -702 -1991 -2405 -2075 -1361 50 1287
3864 1287 2083 2496 1764 493 -506 -1713 -2208 -2208 -1616 -345 1119 1938 2206 2263 1175 -148 -1315 -2143
3882 -2143 -2302 -1429 -643 630 1698 2232 2219 1234 -57 -1156 -2078 -2383 -1957 -1096 521 1514 2589 2490
3900 2490 1648 391 -787 -1804 -2286 -2189 -1556 336 1207 2268 2161 1860 882 -587 -1588 -2266 -2459 -1418
3918 -1418 -633 1072 1855 2241 2254 1082 -152 -1303 -2032 -2447 -1758 -682 812 1891 2333 2024 1199 -47
3936 -47 -1219 -1669 -2386 -1932 -947 186 1551 2308 2142 1527 579 -951 -1526 -2055 -1916 -1363 -91 1486
3954 1486 1866 2212 1870 809 -539 -1636 -1994 -2359 -1470 -342 799 1739 2186 1916 1093 -171 -1229
3971 -1229 -1764 -2086 -1693 -544 491 1580 1867 1593 1479 225 -1016 -2267 -2558 -2089 -985 285 1440
3988 1440 1958 2275 1710 381 -742 -1750 -2181 -2143 -1193 180 1162 1692 2441 1733 581 -607 -1277 -2199
4006 -2199 -2217 -1503 -366 866 1795 2318 2243 1054 -15 -1378 -1900 -2154 -1351 -599 697 1691 1970 2091
4024 2091 1377 76 -1079 -1998 -2015 -1785 -1089 189 1496 2042 2217 1601 473 -844 -1553 -1922 -1997 -1298
4042 -1298 -45 1108 2085 2413 1659 820 -588 -1558 -2139 -2305 -1256 -334 926 1938 2049 1706 894 12
4060 12 -1123 -1788 -2152 -1765 -620 554 1525 2122 1719 1026 90 -1130 -1812 -2139 -1745 -869 328 1150 2140
4079 2140 2293 1486 256 -492 -1713 -2035 -1829 -1166 -137 1123 1875 2054 1704 1001 -391 -1409 -1921 -2033
4097 -2033 -1273 -426 1120 1808 2019 2059 1083 -24 -1147 -1883 -2074 -1798 -596 407 1409 2102 2078 1181
4115 1181 -69 -644 -1939 -2203 -1872 -760 258 1251 1856 1866 1350 548 -863 -1574 -2097 -1814 -1266 -270
4133 -270 1127 1976 2072 1707 718 -550 -1162 -2075 -1882 -1396 -593 559 1552 1796 1805 1091 52 -1090 -2007
4152 -2007 -1973 -1329 -335 566 1353 1909 1943 1260 248 -994 -1704 -2153 -1880 -797 145 1239 1939 1887 1318
4171 1318 582 -564 -1293 -1963 -1612 -1216 -249 1008 1890 1648 1705 827 -343 -1279 -1846 -2010 -1444 -211 578
4190 578 1719 1922 1605 1186 4 -1064 -1724 -2128 -1664 -947 365 1397 1845 1957 1174 217 -992 -1604
4208 -1604 -1920 -1707 -837 289 1126 1769 1890 1830 586 -692 -1606 -2025 -1822 -919 -113 956 1684 1831 1652
4227 1652 755 -369 -1249 -1920 -1885 -1150 -646 664 1566 2053 1568 849 -50 -1008 -1997 -1933 -1347 -804 272
4246 272 1044 1727 1851 1355 335 -886 -1695 -1884 -1758 -1017 19 1111 1882 1998 1490 519 -209 -1641
4264 -1641 -1895 -1665 -1206 -84 1088 1788 1805 1623 745 -427 -1058 -1897 -1942 -1537 -355 720 1404 2266 1683
4283 1683 1227 -188 -972 -1632 -1815 -1625 -463 580 1187 1816 1685 1257 115 -656 -1445 -1788 -1326 -931
4301 -931 215 1027 1721 1883 1342 410 -315 -1538 -2188 -1829 -992 -171 1019 1488 1615 1503 911 -98 -1023
4320 -1023 -1766 -1862 -1329 -570 466 1445 1859 1661 864 -46 -1319 -1822 -1814 -1442 -675 564 1292 1916 1859 1148
4340 1148 186 -919 -1755 -2061 -1522 -999 272 778 1952 2049 1290 536 -548 -1390 -1692 -1782 -1055 -286 1043
4359 1043 1711 1894 1479 734 -386 -964 -1832 -1873 -1159 -311 618 1134 1842 1623 932 32 -1061 -1496 -1840
4378 -1840 -1672 -498 267 1071 1725 2039 984 349 -973 -1484 -1579 -1534 -895 45 1066 1721 1876 1181 804
4397 804 -325 -1368 -1845 -1861 -1108 -105 911 1313 1672 1571 799 -119 -1059 -1828 -1824 -1152 -573 609 1487
4416 1487 1836 1794 1303 -89 -838 -1934 -1778 -1205 -613 313 1182 1859 1829 1280 351 -685 -1759 -1603 -1517
4435 -1517 -954 -115 1161 1557 2074 1458 566 -285 -1157 -1728 -1475 -1000 -185 840 1300 1814 1385 724 -239
4454 -239 -1087 -1521 -1642 -1255 -621 878 1293 1881 1552 748 63 -533 -1641 -1625 -1551 -813 351 1381 1515
4473 1515 1517 1097 533 -649 -1355 -1760 -1751 -908 -9 976 1628 1847 1314 425 -329 -1372 -1849 -1547 -1212 -183
4493 -183 647 1491 1709 1453 764 -453 -1036 -1481 -1700 -1337 -390 511 1564 1688 1477 952 -5 -776 -1350
4512 -1350 -1539 -1535 -754 217 975 1629 1438 1213 494 -569 -1356 -1689 -1778 -831 102 917 1589 1801 1447 575
4532 575 -413 -1440 -1629 -1843 -1345 -254 987 1498 1746 1618 801 75 -1041 -1598 -1725 -1123 -324 707
4550 707 1465 1510 1555 897 -1 -901 -1561 -1780 -1484 -771 200 971 1474 1839 1342 412 -531 -1254 -1805 -1474 -1088
4571 -1088 -60 776 1460 1742 1367 533 -253 -1334 -1716 -1462 -1080 -515 794 1269 1697 1620 741 97 -1056
4590 -1056 -1367 -1665 -1446 -505 445 1077 1728 1784 1255 113 -510 -1457 -1680 -1279 -709 177 883 1846 1658 1136
4610 1136 702 -702 -1308 -1907 -1441 -930 -171 903 1833 1727 1381 580 -313 -1164 -1624 -1529 -1181 -234 703
4629 703 1564 1674 1724 891 59 -821 -1422 -1647 -1489 -517 406 1204 1739 1563 949 126 -648 -1206 -1925 -1374
4649 -1374 -819 172 887 1776 1550 1099 273 -421 -1263 -1327 -1470 -1057 -185 780 1457 1664 1596 683 -186 -834
4669 -834 -1894 -1863 -1383 -90 550 1241 1659 1321 751 -21 -912 -1409 -1517 -1551 -564 369 1194 1645 1681 1212
4689 1212 442 -624 -1190 -1712 -1470 -449 87 1105 1749 1901 1322 437 -295 -1204 -1930 -1504 -1111 122
4707 122 888 1494 1425 1434 720 -33 -1415 -1821 -1466 -1026 -281 510 1087 1588 1961 905 -230 -976 -1540 -1508
4727 -1508 -1378 -806 159 1090 1728 1555 898 229 -468 -1479 -1546 -1356 -879 133 936 1623 1717 1240 492 -369
4747 -369 -1081 -1419 -1631 -962 -157 800 1395 1636 1407 851 -338 -975 -1701 -1665 -1355 -391 899 1037 1656 1508
4767 1508 1047 159 -688 -1478 -1596 -1340 -253 303 959 1717 1604 1038 255 -657 -1462 -1639 -1747 -1063 110
4786 110 803 1631 1725 1302 148 -314 -1224 -1516 -1592 -826 -1 514 1455 1618 1355 740 -388 -916 -1498 -1850
4806 -1850 -1005 -447 586 1433 1437 1629 767 -43 -581 -1475 -1665 -933 -547 151 1305 1475 1385 1237 255 -542
4826 -542 -1355 -1612 -1420 -966 -31 883 1443 1569 1229 457 -562 -1025 -1765 -1631 -1253 -284 677 1215 1664 1527
4846 1527 900 -68 -1026 -1586 -1686 -1519 -306 182 1199 1495 1649 1063 343 -762 -1340 -1808 -1537 -632 209
4865 209 1237 1661 1520 1156 410 -518 -1395 -1597 -1386 -926 -10 779 1590 1635 1465 513 -210 -1223 -1494 -1569
4885 -1569 -1152 -57 522 1441 1598 1535 484 308 -1070 -1457 -1577 -1330 -428 403 1395 1473 1387 1050 386 -998
4905 -998 -1507 -1631 -1374 -679 -8 792 1528 1523 1391 719 -430 -1108 -1681 -1335 -570 -67 769 1536 1652 1163
4925 1163 459 -367 -1146 -1526 -1490 -1190 -233 552 1552 1441 1428 836 -73 -849 -1402 -1707 -1294 -578 518 1213
4945 1213 1538 1679 1080 396 -698 -1403 -1618 -1288 -706 223 1058 1440 1679 1192 165 -555 -1134 -1154 -1428
4964 -1428 -970 -31 946 1295 1442 1430 718 -125 -1066 -1637 -1629 -1397 -500 573 1117 1350 1266 830 90 -953
4984 -953 -1642 -1676 -1243 -337 654 1004 1685 1246 1086 447 -918 -1206 -1758 -1432 -758 360 861 1415 1662 1233
5004 1233 554 -496 -1033 -1953 -1358 -1088 -13 819 1262 1598 1236 595 -175 -1194 -1386 -1453 -1255 -400 445
5023 445 1469 2088 1358 1049 196 -815 -1491 -1514 -1302 -816 405 1366 1452 1553 1233 186 -661 -1083 -1612
5042 -1612 -1413 -843 272 740 1500 1519 1468 582 -336 -1042 -1422 -1496 -1088 -247 637 1299 1688 1615 602 -220
5062 -220 -1069 -1439 -1539 -1121 -436 535 1276 1492 1387 903 29 -828 -1444 -1698 -1542 -828 180 1225 1810
5081 1810 1606 910 154 -551 -1148 -1544 -1424 -959 68 851 1529 1698 1170 552 -275 -1258 -1393 -1502 -858
5100 -858 56 682 1257 1667 1700 811 -120 -1070 -1134 -1614 -1280 -371 338 1275 1543 1568 937 113 -742 -1262 -1459
5121 -1459 -1674 -541 131 1248 1449 1666 1317 266 -438 -1432 -1515 -1525 -924 291 964 1267 1649 919 461
5140 461 -455 -1388 -1535 -1802 -842 -353 603 1504 1541 1196 817 78 -878 -1720 -1717 -1329 -354 437 770 1493 1387
5161 1387 781 184 -1053 -1303 -1613 -1193 -487 155 858 1344 1574 1191 541 -635 -1351 -1535 -1214 -846 101
5180 101 637 1183 1735 1200 590 -346 -1104 -1464 -1574 -859 -226 521 1221 1485 1339 456 10 -736 -1421 -1502
5200 -1502 -1198 -400 302 1302 1617 1678 1070 -148 -666 -1194 -1302 -1421 -667 12 1109 1261 1239 1367 557
5219 557 -395 -1044 -1720 -1383 -1018 -151 1054 1581 1382 1190 451 -393 -1208 -1642 -1555 -1204 -361 792 1274 1697
5239 1697 1322 746 174 -780 -1367 -1546 -1359 -610 -20 895 1586 1379 926 67 -592 -1306 -1414 -1504 -891 306
5259 306 1229 1397 1593 1421 436 -511 -1028 -1665 -1488 -1064 -60 857 1271 1400 1457 627 -140 -971 -1441 -1580
5279 -1580 -1120 -358 479 1181 1544 1427 787 -52 -1037 -1425 -1543 -1076 -526 527 1098 1499 1282 1113 137
5298 137 -524 -1267 -1549 -1331 -713 123 775 1492 1307 1403 531 -290 -1552 -1625 -1505 -991 50 619 1397 1365
5318 1365 1368 489 -311 -952 -1613 -1346 -1131 -485 964 1158 1593 1305 941 73 -919 -1549 -1621 -1172 -738 199
5338 199 1136 1478 1339 836 105 -860 -1432 -1308 -1097 -613 -89 1025 1637 1393 1113 502 -555 -871 -1642
5357 -1642 -1558 -791 -110 773 1303 1471 1575 953 -257 -1041 -1470 -1466 -1105 -338 583 1191 1401 1368 758 -145 -541
5378 -541 -1428 -1662 -1165 -705 122 889 1748 1510 1067 75 -473 -1097 -1564 -1244 -659 74 873 1181 1491 1274
5398 1274 468 -313 -1064 -1497 -1195 -674 -313 523 1338 1489 1230 703 -316 -920 -1348 -1478 -1173 -351 374
5417 374 1094 1502 1246 991 58 -911 -1148 -1559 -1206 -443 280 851 1526 1383 880 100 -611 -1127 -1410 -1365
5437 -1365 -773 79 816 1179 1523 1051 431 -136 -970 -1469 -1312 -995 -498 405 1177 1547 1235 677 11 -884
5457 -884 -1233 -1454 -1037 -559 126 814 1393 1640 949 -59 -802 -1301 -1564 -1246 -644 176 1119 1387 1425 1146
5477 1146 323 -581 -890 -1310 -1463 -690 -135 779 1111 1816 1085 520 -147 -1217 -1329 -1386 -796 -207 872
5496 872 1183 1321 1327 659 -141 -573 -1436 -1470 -1136 -657 189 1103 1364 1561 1004 209 -557 -1383 -1422 -1248 -568
5517 -568 -2 942 1330 1545 811 377 -481 -1072 -1507 -1439 -1001 86 482 1268 1455 1270 630 -94 -871 -1200
5537 -1200 -1286 -926 -152 647 770 1612 1265 691 222 -654 -1554 -1361 -1083 -611 143 1007 1594 1205 912 16
5557 16 -531 -1071 -1401 -1530 -667 173 784 1356 1483 1035 382 -578 -1063 -1235 -1124 -947 164 598 940 1224
5577 1224 1358 754 67 -816 -1302 -1344 -1136 -323 521 1065 1310 1080 978 -165 -791 -1074 -1313 -1119 -508 288
5597 288 923 1137 1459 912 69 -680 -1141 -1491 -1134 -827 -75 514 1392 1435 1002 454 -197 -949 -1585 -1436
5617 -1436 -912 -171 548 1249 1399 1224 878 -256 -802 -1391 -1436 -1053 -457 451 965 1578 1315 1046 170 -1104
5637 -1104 -1372 -1324 -1124 -570 63 886 1227 1330 881 203 -507 -1325 -1544 -1284 -657 43 835 1150 1567 924
5657 924 556 -354 -1140 -1429 -1436 -937 -294 724 1074 1166 1471 643 -125 -977 -1339 -1393 -1069 -324 472 1074 1376
5678 1376 1141 1080 105 -668 -1256 -1556 -1046 -703 259 790 1222 1269 998 251 -280 -893 -1307 -1290 -495 -74 742
5699 742 1157 1416 897 394 -305 -739 -1338 -1329 -1002 104 482 1150 1680 1336 775 -113 -542 -1340 -1382 -1069 -387
5720 -387 328 1000 1524 1275 902 445 -764 -1285 -1325 -1288 -431 319 737 1236 1292 1007 347 -444 -990 -1370 -961
5741 -961 -534 76 751 1333 1351 1077 547 -191 -933 -1277 -1252 -1252 -333 477 1289 1306 1031 436 -162 -697 -1186 -1475
5763 -1475 -1025 -440 418 828 1319 1325 641 72 -612 -1253 -1585 -1313 -427 377 872 1376 1273 921 570 -459
5783 -459 -717 -1235 -1475 -962 -163 738 1201 1400 1148 618 100 -775 -1307 -1245 -623 -459 345 1002 1335 1067
5803 1067 699 39 -733 -1263 -1142 -1113 -524 354 984 1193 1153 884 140 -650 -966 -1037 -1080 -523 134 881 1242
5824 1242 1407 994 469 -310 -1065 -1270 -1065 -725 -199 762 1042 1171 959 685 -152 -754 -1633 -1185 -1079 -370
5844 -370 413 807 1404 891 528 23 -508 -1267 -1190 -1171 -578 -45 727 1380 1372 901 169 -329 -1104 -1330 -1334 -688
5866 -688 9 695 1149 1057 937 427 -182 -671 -1309 -1189 -804 -163 474 1164 1303 1185 742 139 -918 -1210
5886 -1210 -1195 -1242 -352 322 791 1295 1244 594 -24 -755 -1392 -1341 -1267 -246 -94 870 1361 1464 1050 500 -379
5907 -379 -1062 -1429 -978 -696 -163 989 1081 1186 1147 411 -229 -861 -1285 -1289 -670 75 577 989 1092 1151 612
5928 612 8 -645 -1067 -1363 -1136 -423 256 831 1150 1327 803 -45 -403 -1232 -1384 -1312 -382 170 706 1430
5948 1430 1213 831 439 -294 -867 -1229 -1297 -685 31 687 918 999 915 271 -212 -747 -1250 -1352 -1002 -341 171
5969 171 1025 1352 1132 881 65 -564 -1065 -1357 -1003 -328 472 628 1285 1171 994 470 -698 -1095 -1117 -1124 -411
5990 -411 -145 910 1440 1120 995 339 -278 -887 -1266 -1280 -893 -305 793 1220 1230 1191 389 -153 -1057 -1372
6010 -1372 -1294 -1073 -220 506 973 1176 1120 818 277 -711 -1162 -1451 -884 -426 168 980 1012 1204 499 345 -643
6031 -643 -911 -1081 -1356 -691 -101 634 1199 1297 1051 340 -21 -912 -977 -1121 -987 -160 660 1101 1301 1018 674
6052 674 -382 -758 -1088 -1101 -1045 -341 297 897 1419 1001 978 195 -663 -1065 -1216 -965 -536 167 701 1330 1322
6073 1322 1021 491 -647 -960 -1217 -955 -771 -120 564 1152 1386 901 481 -261 -616 -1218 -1199 -825 -173 753
6093 753 957 1348 837 958 -313 -627 -1372 -1142 -1069 -491 108 1094 1325 1150 611 123 -527 -1105 -1368 -1065
6113 -1065 -635 251 668 1261 1351 972 567 -403 -896 -1197 -1351 -858 -120 608 917 1343 1037 456 -150 -705
6133 -705 -1228 -1429 -740 -143 227 922 1066 1053 534 55 -675 -1149 -1282 -924 -246 347 921 1313 1208 696
6153 696 86 -395 -1106 -1072 -1157 -743 188 685 1296 1264 749 188 -201 -914 -1245 -1287 -786 -217 583 1293 1096
6174 1096 1028 193 -246 -849 -1228 -1188 -897 -99 447 1154 1034 1388 508 241 -740 -1058 -970 -1059 -408 221 906
6195 906 1263 1236 908 229 -645 -1149 -1180 -1122 -671 178 617 1361 1197 938 723 -202 -1130 -1050 -1305 -878 -105
6216 -105 640 1176 1225 1287 597 -306 -986 -1305 -1132 -1104 -246 181 1104 1197 933 513 96 -453 -1194 -990 -1049 -615
6238 -615 138 931 1278 1027 837 103 -590 -799 -1122 -1249 -722 -76 424 1136 996 878 353 -473 -791 -926
6258 -926 -1295 -579 -171 567 857 1183 940 566 -78 -707 -1277 -1214 -1049 -107 151 924 1364 1137 786 82
6278 82 -700 -1078 -1364 -1072 -596 54 521 1242 1165 809 229 -519 -962 -1228 -1039 -546 -198 499 698 1091 1198
6299 1198 432 -280 -639 -1217 -1160 -721 -129 729 965 1170 1220 429 -97 -427 -977 -1186 -1058 -670 245 758
6319 758 1146 1248 633 328 -707 -1040 -1324 -889 -676 210 860 1303 1194 1000 596 -321 -980 -1217 -1009 -865
6339 -865 32 543 1071 1326 979 370 -114 -974 -873 -1157 -681 -214 260 843 1348 1076 591 274 -644 -1049
6359 -1049 -1303 -926 -716 356 955 1247 1032 555 -21 -480 -1044 -1329 -1266 -429 126 687 927 1152 1034 276
6379 276 -341 -933 -1149 -1075 -764 -378 638 1015 1251 1114 434 -270 -552 -1023 -1155 -961 -336 363 925 1178
6399 1178 1179 769 -27 -527 -1090 -1201 -805 -530 347 837 1332 1228 782 278 -479 -1095 -812 -991 -522 84
6419 84 545 1110 1366 888 460 -341 -933 -1271 -1192 -811 -230 583 941 1492 1092 642 -94 -896 -1088 -1183 -1079
6440 -1079 -38 54 879 1035 1152 721 248 -541 -1059 -1170 -1090 -324 74 705 1029 1032 740 374 -117 -963 -1144
6461 -1144 -1053 -817 -63 549 1114 1450 906 420 -288 -950 -1179 -1358 -955 -233 237 897 1570 1007 543 -2
6481 -2 -683 -875 -1149 -798 -432 158 993 1064 1166 624 253 -428 -1203 -1283 -1126 -352 210 844 1183 1094 970 135
6503 135 -391 -1017 -1314 -1093 -505 64 658 951 1118 734 433 11 -567 -1155 -1091 -1018 -159 418 1022 1086 1223
6524 1223 675 193 -517 -923 -990 -838 -388 361 865 877 1109 490 44 -562 -864 -1240 -842 -362 225 795
6544 795 1381 1115 957 392 -531 -932 -1042 -1231 -725 4 442 1260 1382 738 358 -359 -599 -946 -1027 -680
6564 -680 -188 361 659 1152 1026 567 4 -814 -908 -1244 -863 -232 242 904 1036 1073 864 222 -584 -969 -884
6585 -884 -896 -644 264 492 867 964 908 267 -468 -691 -957 -1075 -690 -339 275 966 981 1055 806 -7 -623 -1181
6607 -1181 -1054 -797 -350 128 1043 1145 967 538 -32 -507 -1099 -1146 -871 -371 100 796 1064 1270 844 274
6627 274 -371 -726 -1180 -1198 -657 -30 635 1053 1340 770 371 -306 -635 -1005 -914 -663 -207 558 887 1232 1164
6648 1164 499 -118 -857 -885 -987 -796 -304 324 726 1120 927 585 -10 -449 -682 -1051 -912 -418 90 696
6668 696 1122 932 854 172 -352 -808 -1199 -700 -505 52 565 1085 1358 964 452 -140 -610 -791 -1035 -858
6688 -858 -121 434 859 1304 1004 535 203 -648 -782 -1087 -878 -418 176 847 883 1066 750 -143 -589 -858
6708 -858 -1231 -941 -307 185 759 1262 1187 919 122 -181 -875 -1084 -985 -508 82 921 1028 956 910 287 -222
6729 -222 -853 -1295 -1109 -480 107 640 732 815 1306 864 -58 -762 -1105 -1189 -804 -383 204 946 930 928 715 85
6751 85 -588 -961 -1180 -854 -748 95 393 1150 1115 842 199 -387 -844 -949 -909 -549 -119 398 1156 1169 800
6772 800 365 -238 -559 -1031 -1090 -560 -238 584 1035 950 1223 270 193 -561 -914 -913 -962 -362 119 802 765 1022
6794 1022 588 200 -651 -847 -808 -963 -503 218 578 1149 819 875 460 -245 -882 -1155 -947 -686 140 699
6814 699 999 1127 911 522 -39 -776 -818 -846 -746 -221 326 968 1012 1088 583 66 -620 -871 -1077 -785 -517
6835 -517 391 780 941 892 627 284 -446 -756 -961 -966 -721 220 245 969 1081 750 131 -427 -845 -1001 -1094 -1050
6857 -1050 -10 362 799 1173 614 521 -144 -766 -1016 -963 -846 -375 374 721 830 784 506 164 -476 -745
6877 -745 -984 -725 -475 207 849 992 1119 854 249 -353 -1014 -942 -868 -356 167 650 847 922 1019 329 -339
6898 -339 -568 -1069 -862 -795 -98 528 839 1092 707 415 -149 -751 -1041 -1128 -725 -97 451 850 1121 926 396
6919 396 -15 -316 -901 -758 -731 -388 145 695 984 862 652 237 -386 -974 -1020 -945 -555 -294 503 817 960
6940 960 737 433 -169 -765 -1139 -1033 -452 -375 434 723 1034 1074 396 -75 -399 -864 -1002 -860 -265 46 667
6961 667 730 913 752 191 -621 -980 -623 -916 -201 6 447 890 867 944 357 -554 -864 -1094 -913 -451 -240
6982 -240 413 861 794 627 445 -347 -766 -833 -919 -513 -228 388 732 1084 942 436 -168 -487 -913 -807 -802 -403
7004 -403 127 845 848 1201 706 201 -583 -822 -923 -860 -741 3 851 766 977 789 174 -159 -938 -927 -872 -766
7026 -766 -142 469 643 869 871 322 -2 -520 -931 -955 -633 -224 303 878 736 940 507 -14 -416 -699 -903
7047 -903 -733 -358 172 627 954 1146 683 110 -74 -789 -803 -1068 -248 -63 542 929 879 794 333 -247 -695
7068 -695 -1042 -550 -642 -20 284 618 954 956 476 -37 -516 -1055 -781 -699 -312 286 597 853 980 423 157
7089 157 -429 -645 -971 -683 -302 238 563 838 1006 704 205 -62 -750 -1158 -954 -572 -53 401 665 872
7109 872 425 272 -55 -350 -1003 -1016 -325 5 478 747 952 837 179 -266 -236 -748 -976 -673 -300 317 712
7130 712 899 918 430 222 -480 -812 -969 -752 -351 160 562 716 956 720 -3 -250 -817 -1071 -659 -732 59
7151 59 574 768 864 571 454 -413 -597 -1069 -813 -569 -2 448 915 992 746 495 -51 -616 -995 -815 -635
7172 -635 -279 176 595 793 743 504 12 -212 -800 -1021 -616 -455 214 562 754 922 726 122 -392 -781
7192 -781 -659 -694 -491 -215 442 840 922 701 101 -22 -792 -927 -835 -777 -179 303 563 995 869 439 270
7213 270 -415 -748 -773 -548 -170 213 700 845 890 617 249 -452 -709 -751 -882 -670 105 355 1076 837 235
7234 235 214 -445 -732 -793 -752 -526 1 512 865 943 603 218 -47 -539 -947 -913 -736 -391 338 699 741 845
7256 845 282 194 -247 -950 -973 -661 -273 176 717 775 774 796 67 -205 -1008 -993 -551 -617 -34 261 969 814 735
7279 735 174 -176 -676 -746 -731 -582 123 640 606 886 693 556 202 -338 -1044 -809 -218 -105 340 675 1026
7300 1026 902 340 -64 -599 -814 -778 -657 -415 151 702 626 648 649 448 -313 -825 -911 -618 -420 -101 570 643
7322 643 723 761 323 -179 -748 -893 -916 -711 -199 -14 578 737 541 395 -69 -492 -1239 -1121 -494 -50 302
7343 302 480 715 924 803 -86 -558 -729 -1159 -680 -309 445 390 703 876 676 321 -588 -722 -907 -492
7363 -492 -393 -340 423 836 1042 553 229 32 -541 -613 -916 -530 153 169 536 1007 751 430 -331 -542 -833
7384 -833 -936 -628 -343 342 755 1024 759 464 133 -334 -882 -651 -1014 -321 307 461 1015 912 708 324
7404 324 -345 -801 -744 -649 -505 -16 545 853 1013 739 490 -291 -720 -915 -760 -676 -147 125 673 734 682 548
7426 548 42 -205 -582 -558 -763 -309 372 710 814 831 370 113 -115 -794 -602 -680 -371 43 213 791 621
7447 621 851 382 455 -511 -695 -678 -633 -9 337 823 1126 881 296 -468 -668 -738 -535 -731 -102 109 485
7468 485 957 561 725 26 -540 -576 -759 -819 -390 1 571 693 814 550 -22 -705 -660 -578 -715 -428 88
7489 88 566 612 784 771 420 -265 -718 -647 -961 -394 -199 332 516 756 754 394 -14 -401 -636 -937 -843 -243
7511 -243 434 640 1065 766 428 91 -178 -472 -834 -913 -266 116 514 616 813 942 -33 -338 -597 -1022
7531 -1022 -496 -531 15 598 712 871 519 299 -42 -720 -627 -691 -571 -170 251 733 811 710 328 -290 -470
7552 -470 -715 -821 -496 23 410 840 615 711 291 77 -383 -724 -863 -885 -571 136 309 725 948 500 97
7573 97 -168 -692 -800 -657 -573 71 422 895 939 714 157 -153 -573 -806 -671 -845 -102 230 801 676 786
7594 786 510 -74 -574 -788 -727 -1073 -163 79 652 850 809 643 8 -697 -775 -689 -728 -484 137 544 897 752
7616 752 561 362 -330 -730 -896 -790 -316 -67 396 793 623 704 87 -140 -648 -866 -1123 -440 -347 228 507
7637 507 704 851 385 288 -418 -747 -817 -487 -427 52 554 746 605 515 -130 -122 -768 -852 -532 -183 301 728
7659 728 598 1098 624 111 -318 -937 -756 -571 -471 -232 449 754 606 655 156 -57 -617 -760 -757 -439 -249
7680 -249 387 802 1019 931 589 104 -331 -705 -836 -522 -46 121 468 717 898 351 202 -597 -1059 -663
7700 -663 -837 -216 -44 519 855 707 499 269 -173 -660 -718 -728 -354 -136 324 778 795 799 396 -46 -366 -788
7722 -788 -660 -494 -42 305 528 745 834 449 119 -387 -820 -925 -948 -222 56 442 941 611 559 37 -365
7743 -365 -570 -782 -507 -371 -48 403 764 895 387 392 -151 -663 -792 -849 -288 -5 433 834 793 973 431
7764 431 -48 -272 -840 -968 -579 -160 325 695 840 686 348 53 -612 -687 -855 -591 -350 363 505 937
7784 937 784 563 297 -146 -353 -554 -824 -414 65 262 784 837 648 164 -118 -673 -736 -727 -530 -275 257
7805 257 650 903 660 462 -221 -459 -645 -734 -417 -329 156 616 463 605 563 225 -173 -481 -790 -557 -521
7826 -521 304 314 731 678 575 81 -301 -566 -837 -592 -319 218 177 636 827 831 197 -200 -660 -803 -803 -487
7848 -487 -246 77 549 584 630 422 49 -364 -475 -650 -617 -381 59 832 711 431 629 207 -251 -542 -984
7869 -984 -810 -159 -187 606 687 863 411 228 -31 -573 -658 -590 -571 -191 313 708 723 339 361 51 -718 -852
7891 -852 -690 -575 -236 271 480 681 800 390 13 -459 -563 -751 -734 -334 214 484 837 757 288 22 -248
7912 -248 -730 -786 -634 -670 -4 310 545 349 395 336 -364 -689 -761 -685 -464 74 300 550 856 518 195 -58
7934 -58 -477 -614 -888 -466 -54 512 535 794 605 552 -119 -457 -578 -501 -484 -254 356 299 771 759 487 264
7956 264 -201 -843 -895 -743 -489 21 342 677 760 523 -38 -144 -755 -849 -671 -537 -240 137 742 575 605
7977 605 407 73 -592 -684 -773 -492 -109 287 664 739 492 574 -144 -403 -657 -878 -475 -281 130 381 808
7998 808 618 343 92 -359 -533 -620 -633 -380 -36 513 661 651 527 29 -463 -523 -784 -802 -407 131 404 594
8020 594 1048 712 415 -263 -371 -757 -725 -111 -386 429 537 857 953 463 -91 -445 -524 -711 -718 -219 255 492
8042 492 775 741 674 60 -720 -517 -798 -589 -300 2 373 600 888 671 307 -262 -526 -849 -674 -551 -65
8063 -65 416 854 928 516 250 -398 -747 -960 -585 -308 -113 248 619 571 532 343 0 -486 -479 -610 -599 -407
8085 -407 -36 394 471 620 434 325 112 -671 -476 -692 -416 -168 533 373 338 533 104 -36 -455 -870 -615
8106 -615 -379 29 485 749 586 585 351 -199 -515 -524 -771 -502 -359 36 481 686 895 423 202 -243 -790
8127 -790 -580 -699 -315 97 371 535 638 427 235 2 -693 -689 -726 -227 -318 372 615 876 268 360 -211 -594
8149 -594 -547 -598 -175 -64 349 708 564 454 439 -117 -170 -650 -643 -488 -88 437 561 866 628 371 17 -493
8171 -493 -447 -526 -600 -50 250 327 874 613 167 32 -149 -363 -598 -578 -319 3 357 551 641 559
8191E59
$$ Imaginary data points
##PAGE= N=2
##DATA TABLE= (X++(I..I)), XYDATA
0 0 0 0 0 0 0 0 0 0 0 0 0 0 0 0 0 -8 8 -8 8 -8 11 -16 16 -19 24 -26 32 -35 41 -48 53 -60 69 -78 89 -100 111
37 111 -125 140 -157 173 -194 214 -236 261 -290 318 -351 385 -427 469 -518 572 -631 697 -772
56 -772 859 -957 1073 -1211 1378 -1583 1844 -2189 2672 -3389 4577 -6895 13163 -69755 -198139
71 -198139 -110177 -22754 -6654 -33297 29175 136343 171059 81009 -24962 -67861 -66883 -87597
83 -87597 -106611 -76888 923 67425 102367 113758 98221 34951 -46661 -88360 -79439 -74499 -87399
96 -87399 -60074 41654 137822 134043 52794 2353 11967 -1918 -86740 -155471 -112606 4151
108 4151 74155 64753 51205 81799 98213 37414 -63289 -114996 -97311 -60505 -35979 -2615
120 -2615 51853 94996 97293 68553 28969 -22421 -80479 -108944 -83632 -31805 1729 21795
132 21795 61978 109505 106356 33486 -47735 -73128 -60441 -62321 -77053 -49855 30720 100582
144 100582 103656 60817 25657 7291 -25326 -76198 -102705 -77735 -22045 27426 59014 78636
156 78636 81267 56714 11691 -32773 -66070 -85174 -81114 -44403 12816 57768 72657 69241 60977
169 60977 37394 -13416 -69925 -93495 -73127 -34853 -3509 24823 60065 87023 78645 34289
181 34289 -18688 -54026 -69105 -71006 -58163 -24493 22800 63002 80153 70497 41325 1028
193 1028 -38571 -66533 -74523 -62098 -31098 10989 52076 75655 72610 47350 11387 -24891 -56953
206 -56953 -74758 -69063 -38854 3597 42287 65840 70493 56184 24909 -15205 -51172 -71498
218 -71498 -68479 -44236 -7538 30253 58699 70159 61687 33829 -5510 -42680 -65816 -68107 -50318
231 -50318 -18878 18604 51622 68822 63532 38721 3562 -31421 -58396 -68433 -57105 -26617
243 -26617 10908 43154 62320 64174 47659 14881 -23366 -53749 -65299 -57730 -34465 -1562
255 -1562 33302 59184 65880 50873 21183 -13636 -43850 -61937 -61674 -41801 -9150 25893 52176
268 52176 63178 55441 30322 -3768 -36847 -58052 -61302 -46960 -18334 16185 45625 61052
280 61052 57386 36193 5417 -27075 -52237 -61394 -51286 -25615 7681 38048 56704 58764 43237
293 43237 14342 -19078 -46492 -59017 -53656 -32747 -1938 29461 52548 59256 47414 20963
305 20963 -10889 -38670 -55281 -56467 -40034 -10145 22664 47193 56845 49653 29092 -605 -31658
318 -31658 -53337 -57564 -43015 -16553 13439 39528 54699 54078 35651 5940 -24702 -47236 -55465
331 -55465 -47607 -25086 5311 33898 51637 54038 40715 14676 -16422 -42451 -54237 -49330 -30455
344 -30455 -3504 25650 47766 55501 44795 20032 -9051 -34314 -50241 -52570 -38244 -10782
356 -10782 20054 43150 52472 46410 28046 582 -28176 -48420 -53324 -40955 -16603 10886 35530
369 35530 50557 50280 34457 7122 -21970 -43336 -51017 -44587 -25184 2370 29784 48420 51089
382 51089 37600 13862 -13213 -36535 -50217 -48633 -31044 -3838 23715 43403 50006 42309 21590
395 21590 -5700 -31301 -46904 -49103 -36486 -11634 16752 38942 48100 43728 27914 4114 -24082
408 -24082 -46215 -51248 -38083 -14950 8261 28682 45029 50191 36681 7441 -22520 -39828
420 -39828 -44105 -40053 -27352 -3163 26758 47612 49481 34558 12937 -10130 -30957 -45608 -46502
433 -46502 -32060 -6461 20680 40826 47687 39548 19768 -3341 -24707 -41037 -48642 -39076 -12679
446 -12679 17964 37338 41462 37687 28973 9982 -19841 -46150 -51274 -35120 -12487 6284 22739
459 22739 39753 48451 37756 9573 -19897 -37402 -41981 -37561 -25301 -4096 21524 41516 47569
472 47569 37131 15079 -10893 -30896 -40539 -39951 -30230 -11525 14861 39517 48594 37713 16764
485 16764 -3147 -20003 -35605 -45600 -39413 -14839 15473 34948 40090 35947 26751 9707 -15145
498 -15145 -38329 -47532 -37561 -16545 6210 24569 36510 40619 33988 14815 -11891 -35038 -44083
511 -44083 -37364 -21479 -2730 16706 34435 43654 38267 17999 -8439 -28820 -38672 -38133 -29205
524 -29205 -11550 11638 32933 43247 38733 21636 -1214 -21702 -34766 -38533 -33425 -18255 5959
537 5959 30004 42290 37882 23112 6234 -11724 -30256 -42651 -39485 -19741 5436 23496 33241
550 33241 37382 32911 15267 -10115 -31131 -38646 -35244 -25046 -7090 16408 35455 40094 31428
563 31428 16733 -664 -20788 -38587 -41940 -27772 -6568 11044 24721 36121 39507 25751
575 25751 46 -22046 -32185 -34073 -32087 -20067 3682 28056 38797 33819 23608 11064 -8424
588 -8424 -31142 -42647 -34242 -15291 1037 14045 29298 41300 35733 11710 -13284 -25352 -29755
601 -29755 -32792 -29694 -11484 16395 35492 36008 27561 17788 3285 -17947 -36380 -38649 -26398
614 -26398 -9716 6069 23302 37455 37541 21361 562 -13659 -24843 -35434 -36900 -19861 7529
627 7529 26650 29850 28165 27104 17580 -6655 -32532 -40787 -29433 -14167 -3464 9520 28531
640 28531 40315 33075 11966 -8295 -21234 -29752 -34013 -27534 -8516 12751 27080 32720 32247
653 32247 21505 938 -20672 -31527 -30770 -25242 -15894 1177 24356 38643 33843 17659 2516
666 2516 -8817 -21959 -35584 -35634 -18567 5411 21543 27631 29394 26932 14819 -6366 -26246
679 -26246 -34209 -30534 -19467 -5005 12974 27571 33433 28725 15442 -1336 -19028 -32335 -33914
692 -33914 -23248 -6829 8377 21408 31398 33113 21721 1325 -17539 -27829 -29618 -26110 -15848
705 -15848 1665 21168 32664 32081 21140 6616 -9258 -23391 -31940 -30400 -18395 -662 16120
718 16120 27801 31506 25739 12197 -4995 -20678 -30318 -30644 -21541 -5497 11290 24980 30980
731 30980 28042 16496 -456 -16991 -28344 -30677 -24464 -10490 6493 21956 30045 29144 18994
744 18994 4252 -11909 -24948 -31093 -27008 -14415 2572 17905 27908 29620 22767 9016 -7519
757 -7519 -22264 -30425 -28821 -18089 -1857 13810 24795 29226 25903 14354 -2930 -19833 -29289
770 -29289 -28279 -19620 -6956 7450 21626 30722 29051 16556 -421 -15213 -24534 -27728 -24152
783 -24152 -12971 3970 20253 29477 28159 18467 4932 -9279 -21601 -28622 -27174 -16117 964
796 964 16876 26492 27173 21422 10228 -4435 -19286 -28958 -28730 -17917 -2275 12266 22184 27163
810 27163 25121 15178 -822 -17419 -27336 -27604 -19890 -7232 6511 19096 27533 27532 17930 1710
824 1710 -14172 -24340 -26370 -22310 -13098 1490 17161 27775 27879 18791 5267 -8160 -19681
837 -19681 -27179 -26303 -16432 -748 14574 24110 26641 22130 10663 -4174 -17680 -25956 -26283 -18914
851 -18914 -5508 10225 22303 26745 23179 13617 795 -13815 -25002 -27825 -20407 -7303 6298
864 6298 17473 25158 26426 18109 3256 -12275 -22295 -25475 -22227 -13570 1000 15936 25246 25731
878 25731 18829 7302 -6349 -19288 -26446 -24744 -15074 -1467 11474 21933 26394 22708 10765
891 10765 -4057 -16352 -23312 -24551 -19393 -6687 8403 20869 25416 22538 14318 1749 -12137
904 -12137 -23253 -26386 -20417 -8946 4413 15937 24207 25417 17641 4027 -10026 -20016 -24272
917 -24272 -22458 -13668 295 14707 23610 24295 18621 8681 -4682 -17413 -25110 -24190 -15389 -2387
931 -2387 9782 19956 25141 22186 11739 -2616 -15339 -22638 -23575 -18595 -7513 6644 19172
944 19172 24802 22493 13772 2128 -10694 -21024 -25056 -20500 -9411 3621 15010 22882 24176
957 24176 17786 5128 -8912 -18415 -23027 -21748 -14273 -1000 13279 22394 22861 18231 9388 -2731
971 -2731 -15798 -24876 -24244 -14626 -2238 8214 17190 23459 23253 12985 -2576 -14837 -20798 -21470
985 -21470 -18327 -9269 4701 17873 24094 21942 14135 2633 -9362 -19519 -23621 -20234 -10646 1390
999 1390 13375 22363 24068 16639 4644 -6965 -15495 -21799 -23347 -16071 -1032 13739 21128 20559
1013 20559 16813 11355 112 -14930 -25172 -23992 -13797 -2435 6640 15140 22234 22847 14046 -587
1027 -587 -13663 -20469 -21552 -17502 -8155 3575 14775 21892 22528 16100 3966 -10253 -19501 -21168
1041 -21168 -18083 -11602 -1784 11488 23130 24853 15990 3494 -5869 -12757 -19779 -23346 -17165 -2299
1055 -2299 12888 20578 20383 16275 10538 429 -12169 -22325 -23476 -16025 -4241 7695 16079 20116
1069 20116 19498 13793 2945 -10150 -21012 -23719 -17327 -6698 3725 11821 18665 22497 18242 5249
1083 5249 -9955 -19196 -20561 -16786 -11330 -2734 9111 20809 24347 17442 5538 -6051 -13597 -18459
1097 -18459 -20191 -15991 -5365 8756 19710 22518 17394 8633 -552 -9625 -18166 -22724 -18698 -6506
1111 -6506 7413 16870 19424 17998 13248 4327 -8172 -19131 -23224 -18483 -7672 3371 12151 17979
1125 17979 20104 16855 6931 -6419 -17515 -21806 -18130 -10236 -1135 7867 17237 22402 19566 8059
1139 8059 -5395 -14471 -18259 -18121 -14756 -6193 6285 18180 21923 17930 9306 -443 -9494 -17813
1153 -17813 -20969 -16799 -7178 4739 14499 19806 19423 12705 2957 -7610 -16022 -20874 -18895 -10282
1167 -10282 2295 12883 17953 18674 15033 7237 -4145 -15844 -21105 -18925 -11034 -1578 7785 16176
1181 16176 20664 17928 8589 -3035 -12566 -18228 -19472 -14803 -5398 6162 15122 19495 18098 11574
1195 11574 1246 -10097 -17707 -19433 -15679 -7841 2523 12958 19642 19626 12930 3127 -6621 -14804
1209 -14804 -19489 -18135 -10517 580 11041 17576 18935 15438 6997 -4002 -13693 -18826 -18187 -12668
1223 -12668 -2894 7588 16044 19346 16547 9130 -819 -10921 -17855 -19029 -14445 -5275 5103 13608
1237 13608 18831 18078 11469 1355 -8753 -15957 -18817 -16308 -8250 2450 11971 17949 18076 13617
1251 13617 4965 -5769 -14836 -18776 -17036 -10205 -940 9208 17084 19074 15097 6454 -3146 -12063
1265 -12063 -17616 -18486 -12679 -2562 7224 14463 17933 16322 10060 -255 -10706 -16969 -17599 -13696
1279 -13696 -6473 3238 13049 18445 17312 11169 2115 -7175 -15339 -18609 -15794 -8292 1440 10482 16700
1294 16700 18138 14157 4587 -5845 -13412 -16838 -16310 -11705 -2273 8855 16836 17900 13909 6886
1308 6886 -1431 -10495 -17474 -18692 -12931 -3098 6299 13098 17076 16173 10287 402 -9155 -16068 -17599
1323 -17599 -14336 -6322 3689 11822 16631 16376 11883 3587 -6751 -15208 -18221 -14580 -7805 209
1337 209 8511 16020 18383 14000 4525 -5663 -12325 -15637 -15963 -11752 -2911 7872 15987 17518 13852
1352 13852 6735 -1473 -9840 -15818 -17471 -12985 -4641 5304 13521 17029 15004 9482 1317 -7701 -14750
1367 -14750 -17831 -14613 -6257 3516 10864 15343 15910 12416 4342 -6010 -14358 -17565 -14574 -7922 -84
1382 -84 7989 14610 17587 14450 5510 -3989 -11956 -16011 -15053 -10803 -3316 5991 14211 17509 14570 7355
1398 7355 -1440 -9186 -14638 -16426 -13384 -5361 4719 12861 16428 14742 9535 2024 -6475 -13628 -17221
1413 -17221 -14458 -7005 2270 10588 15089 15568 11740 4705 -4813 -13045 -16410 -14900 -8812 31 7318
1428 7318 13508 16075 13963 6820 -3220 -11379 -15405 -14666 -10556 -3691 5122 13136 16795 14385 7444
1443 7444 -911 -8324 -13492 -15890 -13289 -5791 3971 11681 15621 14317 9826 2471 -6042 -12988 -16557
1458 -16557 -14057 -6919 1661 9080 14396 15178 11749 4520 -3902 -11957 -15573 -14597 -8749 -820 7031
1473 7031 12592 15283 13713 7419 -2703 -10656 -14573 -13913 -10430 -4376 3625 12518 16634 13761 7167
1488 7167 -384 -7126 -12646 -15550 -13601 -6034 3597 10973 14347 14012 10209 3567 -5496 -12627 -15392
1503 -15392 -13458 -7736 171 8697 13916 14757 11081 4663 -2405 -10635 -15643 -14787 -8779 -623 6212
1518 6212 11306 14219 14026 8079 -2066 -10476 -13640 -13069 -10325 -5184 3306 11946 16068 13769 7367
1533 7367 737 -6159 -12392 -15589 -12736 -5371 2471 9061 13811 14835 10764 2970 -5817 -11155 -13756
1548 -13756 -13204 -8445 -554 8303 13918 14307 10395 5233 -1867 -9662 -15043 -14513 -8598 -1058 5388
1563 5388 10791 14564 13544 7249 -1892 -8737 -12455 -13452 -11473 -5189 3737 11209 14076 12685 8352
1578 8352 2383 -5671 -12743 -14797 -11424 -5349 1167 7643 13099 14950 10741 2874 -4952 -10034 -13424
1593 -13424 -13338 -9159 -667 7550 12624 13162 11227 6199 -1683 -9419 -14121 -13258 -8759 -2978 3838 10638
1609 10638 14663 13086 6681 -943 -7049 -11526 -13972 -11776 -5303 3470 9756 13099 12485 9069 2705
1624 2705 -5471 -11680 -13930 -11559 -6691 442 7695 12999 13626 10101 4068 -2891 -9261 -13607 -13587 -8020
1640 -8020 -702 6293 10908 13139 11841 6533 -1464 -9229 -12852 -12690 -9050 -3393 3433 10130 13728
1655 13728 12588 7470 311 -6271 -11627 -13309 -11010 -5047 1498 8698 12838 13187 9082 2170 -4785
1670 -4785 -10285 -12677 -11836 -7704 15 7265 12427 13103 9829 4348 -2264 -9022 -12830 -13019 -8509 -1628
1686 -1628 5708 10812 12875 11120 6186 -726 -7452 -12263 -12985 -9616 -3571 3616 9404 12486 12222
1701 12222 7968 1495 -5746 -11276 -13108 -10688 -5042 1343 7654 11840 12647 9595 3435 -4151 -9822
1716 -9822 -12397 -11141 -7243 -841 6021 11339 12981 10543 4367 -2455 -8530 -11796 -11952 -8697 -2699
1731 -2699 4509 10376 12814 11219 6265 -420 -6580 -10910 -12583 -9956 -4358 2766 9353 12066 10965
1746 10965 7308 2011 -4453 -10104 -13191 -10903 -5292 1525 7258 10731 11917 9662 3822 -3269 -9596
1761 -9596 -12380 -11186 -6937 -949 5342 10150 12158 10452 5265 -1526 -8090 -11860 -11347 -7608 -2827
1776 -2827 3543 8849 12557 11889 6181 -951 -6200 -9419 -11177 -10074 -5241 2084 8727 11624 10990
1791 10990 7164 2447 -3625 -9556 -12153 -11084 -5949 467 6675 10863 11373 8743 3457 -2437 -7786
1806 -7786 -11803 -11793 -7517 -495 5882 9235 10349 9877 6345 -388 -7858 -11798 -11106 -7414 -2827 2183
1822 2183 7960 12136 11484 6463 -35 -5695 -9120 -11220 -9831 -4838 1707 7390 10852 11452 7804
1837 7804 2685 -4186 -9283 -10728 -9732 -6350 -865 6131 10960 11315 7991 3125 -1691 -6783 -11268
1852 -11268 -11744 -7709 -695 5255 8721 10030 9699 6408 -524 -6927 -10858 -10527 -8090 -3563 2442
1867 2442 7985 11339 10522 6615 1171 -4555 -9505 -11281 -9466 -4487 1319 6491 9717 11172 8631
1882 8631 2702 -3884 -8680 -10217 -9686 -6567 -920 5340 10068 10800 8374 3790 -1388 -6732 -10791
1897 -10791 -11005 -7250 -1622 4020 8325 10616 9912 5824 -433 -6228 -9544 -10369 -8441 -3954 2135
1912 2135 8115 10719 9877 6786 1825 -4127 -8940 -11061 -9112 -4662 778 6062 9839 10812 7990
1927 7990 2866 -3015 -7896 -10276 -9698 -6745 -887 5159 9121 10387 8657 4480 -858 -6730 -10049
1942 -10049 -10554 -7336 -2061 3192 7928 10467 9768 5951 -11 -5832 -9132 -10210 -8196 -3970 1527
1957 1527 6987 10278 9800 6898 1780 -3840 -8284 -10133 -9177 -5350 466 5946 9754 10121 7868 3269
1973 3269 -2226 -7100 -10162 -10010 -6470 -1055 4666 8257 9916 8770 4850 -486 -6242 -9795 -9980
1988 -9980 -7225 -2518 2881 7136 10130 9719 6375 572 -5044 -8877 -9793 -8033 -4458 1204 6036
2003 6036 9768 9978 6722 1745 -3409 -7350 -9681 -9362 -5872 -305 5410 9270 9810 7435 3428 -1910
2019 -1910 -6374 -9843 -9961 -6576 -1344 4140 8072 9619 8651 4947 39 -5550 -9280 -10085 -7680 -2644
2035 -2644 2721 6765 9335 9247 6638 1369 -4749 -8797 -9498 -7774 -4336 173 5572 9395 10250 7123
2051 7123 1887 -3231 -7108 -9087 -8965 -5904 -501 4875 8766 9553 7618 3628 -1090 -6101 -9163
2066 -9163 -9272 -7094 -2130 3486 8010 9723 8136 4806 432 -4290 -8726 -10044 -7700 -2817 2524
2081 2524 6240 8467 8945 6870 1800 -4040 -8524 -9313 -7692 -4243 180 5125 9048 9849 7302 2461
2097 2461 -2599 -6656 -9050 -8634 -5465 -1034 3823 7611 9540 8186 4140 -1548 -5744 -8020 -8696
2112 -8696 -6929 -3077 3109 7840 9321 7863 4531 877 -3789 -7855 -9844 -7740 -3086 2059 5861
2127 5861 8078 8692 6604 1674 -3412 -7507 -8901 -7979 -4680 208 4864 8304 8656 7039 3274 -1972
2143 -1972 -6889 -9189 -8234 -5267 -1353 3126 7243 9564 8136 4055 -1378 -5236 -7640 -8828 -6970
2158 -6970 -2882 2462 6878 8912 7984 5242 756 -3976 -7658 -8907 -7507 -3831 1172 5769 8515
2173 8515 8571 6044 1943 -2730 -6509 -8896 -8418 -4901 -59 4745 7598 8646 7192 3540 -1096 -6074
2189 -6074 -8671 -8107 -5661 -1806 2823 6997 8752 7816 4217 -449 -4619 -7807 -8575 -6568 -2672 2123
2205 2123 6139 8155 8389 5383 961 -3904 -7363 -8387 -7057 -4063 558 5136 8076 8525 5972
2220 5972 2159 -2391 -6344 -8399 -7871 -5065 -466 4127 7140 8363 6760 3455 -1446 -5507 -8205
2235 -8205 -8329 -5607 -1612 3055 6309 8304 7495 4548 131 -4178 -7375 -8437 -6302 -3043 1672
2250 1672 5694 8134 8089 5374 1222 -3282 -6885 -8219 -7097 -3921 441 4684 7590 8268 6169 2483
2266 2483 -1992 -6053 -8036 -7582 -4968 -781 3599 6805 8083 7091 3535 -1120 -5199 -7613 -7869 -5580
2282 -5580 -1904 2350 5833 8011 7339 4567 408 -3986 -7245 -7947 -6628 -2959 1289 5419 7954
2297 7954 7988 5626 1605 -2928 -6428 -7800 -7304 -4431 170 4693 7420 7752 5922 2518 -1509 -5512
2313 -5512 -7739 -7983 -5189 -798 3733 6583 7769 6948 3800 -412 -5055 -7609 -7904 -5716 -2048 2472
2329 2472 5791 7852 7318 4728 578 -3538 -6840 -7825 -6213 -2952 702 4563 7276 7956 5703 1691
2345 1691 -2741 -6069 -7275 -7077 -4486 -248 4013 7209 7719 5765 2636 -1170 -5131 -7431 -7489 -5005
2361 -5005 -1238 2847 6573 7650 6547 3720 -523 -4073 -7089 -7819 -6043 -2169 2009 5420 7090
2376 7090 6896 4632 1228 -3324 -6779 -7735 -6198 -3102 449 4180 6905 7745 5775 1789 -2296 -5674
2392 -5674 -7233 -6678 -4406 -702 3804 6692 7474 6279 2950 -1239 -5063 -7102 -7205 -5236 -1530 2739
2408 2739 5780 7421 6676 3476 -84 -3648 -6463 -7377 -6016 -2659 2025 5332 6914 6783 4902 1322
2424 1322 -2904 -6213 -7418 -5986 -3517 273 4147 6872 7448 5632 1984 -2114 -5383 -7129 -6742
2439 -6742 -4529 -567 3341 6187 7279 5776 3171 -1289 -4766 -6920 -7069 -4983 -1784 2271 5745
2454 5745 7413 6603 4024 203 -3394 -6108 -7231 -5722 -2733 1323 4772 6769 6771 4810 1209 -2795
2470 -2795 -5875 -7388 -6026 -3435 127 3674 6600 7135 5492 2064 -1622 -5104 -6903 -6438 -4381
2485 -4381 -755 2898 5920 6958 6262 3271 -788 -4335 -6198 -6693 -4928 -1640 1738 5376 7153
2500 7153 6250 3612 428 -3067 -5730 -6824 -6013 -2734 1356 4366 6289 6323 4807 1706 -2186 -6025
2516 -6025 -6976 -6062 -3546 -16 3626 6079 6800 5240 2680 -1579 -4773 -6628 -6468 -4226 -1095 2659
2532 2659 5496 6898 6201 2994 -744 -3830 -5968 -6477 -5273 -2164 1667 5209 6795 6199 3976 407
2548 407 -2839 -5676 -6685 -5808 -2710 661 4209 6206 6426 4621 1564 -2370 -5055 -6493 -5929 -3914
2564 -3914 -45 3369 5952 6369 5408 2269 -1039 -4303 -6138 -6446 -4206 -1089 2288 4885 6581 6016
2580 6016 3281 150 -3659 -5971 -6259 -5091 -2291 1702 4653 6324 6290 4001 786 -2753 -4814 -6147
2596 -6147 -5309 -3101 144 3936 6110 6439 4460 1842 -1575 -4739 -6312 -5835 -3888 -427 2893 5387
2612 5387 6700 5481 2650 -1090 -4205 -5685 -6371 -4447 -1478 2327 4827 6335 5607 3227 295
2627 295 -3032 -5557 -6239 -4578 -2132 1452 4241 5765 6134 4318 984 -2458 -5014 -6151 -5587 -2942
2643 -2942 440 3478 5527 6204 4695 1875 -1544 -4620 -6356 -5505 -3528 -892 2679 5111 6403
2658 6403 5442 2433 -764 -3637 -5796 -6092 -4508 -1885 2047 4828 6024 5375 3209 272 -3099 -5503
2674 -5503 -5832 -4868 -2401 986 3835 5776 5811 4181 1216 -2011 -4695 -6439 -5307 -3080 322 3134
2690 3134 5242 5781 4805 2017 -1374 -4500 -5972 -5567 -3624 -812 2305 4885 6190 5279 2734 -516
2706 -516 -3430 -5266 -5579 -4501 -1948 1341 4270 5697 5181 3620 563 -2852 -4987 -5793 -4858 -2591
2722 -2591 783 3700 5423 5614 3882 1347 -1692 -4337 -5990 -5525 -3353 29 3125 4947 5254 4761
2738 4761 2505 -1218 -4017 -5612 -5386 -3455 -622 1960 4574 5437 5007 3151 -533 -3344 -5054 -5668
2754 -5668 -4220 -1752 1487 4197 5444 5349 3368 83 -2568 -4410 -5576 -4835 -2519 548 3399 5522
2770 5522 5429 3843 1380 -1803 -4151 -5505 -4975 -3004 -322 2635 4703 5399 4349 2146 -936 -3434
2786 -3434 -5372 -5271 -3755 -1004 1998 4183 5495 5072 2956 -248 -3068 -4664 -5268 -4531 -1905 1383
2802 1383 3797 5225 5179 3782 632 -2211 -4504 -5440 -4740 -2577 367 3072 5016 5235 3889 1392
2818 1392 -1492 -3743 -5041 -4981 -3250 -236 2356 4612 5323 4406 2305 -449 -3279 -5281 -5045 -3794
2834 -3794 -1026 1591 4191 5267 4715 2881 -155 -2645 -4948 -5264 -4251 -1924 1147 3430 5058
2849 5058 5216 3195 582 -1914 -4189 -4949 -4640 -2532 153 2887 4808 5174 3981 1606 -1181 -3730
2865 -3730 -5052 -4749 -3302 -530 2231 4069 5116 4256 2253 -587 -3212 -4811 -4874 -3720 -1243 1609
2881 1609 3989 5011 4779 2751 193 -2605 -4470 -5005 -4074 -2130 633 3307 4612 4879 3292 1274
2897 1274 -1727 -4136 -5003 -4648 -2721 -58 2587 4510 4907 3948 1612 -1095 -3607 -4806 -4607 -3153
2913 -3153 -812 2194 3957 5126 4452 2054 -321 -2852 -4584 -4681 -3732 -1295 1226 3498 4776 4327
2929 4327 2787 282 -2041 -4154 -5063 -3948 -1729 531 2975 4758 4638 3244 996 -1344 -3816
2944 -3816 -4695 -4354 -2696 -249 2422 4302 4830 3712 1716 -803 -3129 -4510 -4794 -2980 -814 2087
2960 2087 3896 4779 4096 2357 -39 -2707 -4311 -4654 -3404 -1388 1079 3311 4419 4425 2933 551
2976 551 -2241 -4053 -4496 -4046 -1934 129 2894 4292 4448 3799 1057 -1368 -3423 -4511 -4427 -2581 -586
2993 -586 2220 3979 4439 3988 1705 -514 -2759 -4478 -4181 -3333 -1196 1614 3863 4697 4069 2521 68
3010 68 -2296 -4278 -4676 -3742 -1670 1022 3522 4304 4069 2939 850 -1811 -3743 -4471 -4121 -2119 372
3027 372 2626 4132 4242 3428 1528 -1255 -3521 -4357 -4179 -2665 -140 1806 3800 4617 3808 1729 -925
3044 -925 -2790 -4002 -4410 -3236 -1072 1236 3585 4222 4020 2351 150 -2227 -3712 -4624 -3553 -1652
3060 -1652 944 2985 4315 4284 3122 783 -1538 -3493 -4050 -4022 -2273 367 2389 3777 4189 3399 1858
3077 1858 -588 -3204 -4317 -4191 -2530 -440 1707 3250 4321 3777 1732 -429 -2689 -3939 -4176 -3075
3093 -3075 -1341 1191 3430 4148 3976 2530 228 -2002 -3636 -4070 -3686 -1778 345 2835 4033 3943
3109 3943 2957 875 -1427 -3170 -4241 -3917 -2228 96 2593 4023 3940 3282 1418 -579 -2776 -4059
3125 -4059 -4198 -2417 -583 1715 3271 3922 3751 2278 -41 -2416 -3837 -4052 -2972 -1232 1101 2886
3141 2886 3980 3897 2798 184 -1993 -3255 -4110 -3101 -1788 557 2637 4048 4360 2755 932 -1296
3157 -1296 -3199 -4116 -3776 -2140 -82 1962 3587 3892 3313 1523 -756 -2737 -3877 -4227 -2650 -847
3173 -847 1332 3056 3726 3344 2013 -138 -2301 -3664 -3918 -2870 -1230 633 2799 3854 3918 2581
3189 2581 489 -1740 -3345 -3993 -3265 -2105 513 2279 3707 4024 2801 966 -1051 -2751 -3761 -3610
3205 -3610 -2337 -274 1734 3011 3983 2967 1449 -584 -2112 -3605 -3836 -2564 -624 1346 3194
3220 3194 3940 3532 1985 -67 -1856 -3469 -3773 -3156 -1523 556 2635 3419 3682 2445 494 -1356
3236 -1356 -3041 -3733 -3234 -2067 186 2025 3545 3835 2867 1212 -976 -2772 -3528 -3644 -2240 -441
3252 -441 1779 3163 3615 3236 1493 -219 -2382 -3523 -3515 -2617 -789 1019 2745 3352 3255 2023 104
3269 104 -1916 -3212 -3684 -2796 -1515 567 2396 3358 3398 2153 591 -1330 -3037 -3666 -3247 -1878 192
3286 192 1959 3280 3427 2505 1082 -937 -2618 -3474 -3460 -2491 -422 1768 3058 3514 3085 1755 -103
3303 -103 -1902 -3441 -3366 -2606 -896 1209 2718 3516 3263 2078 196 -1590 -3035 -3487 -3014 -1325 402
3320 402 2319 3652 3345 2447 663 -1098 -2625 -3606 -3390 -1647 -145 2050 3244 3541 2773 1157 -559
3337 -559 -2608 -3546 -3372 -2396 -724 1545 2798 3200 3005 1755 -340 -2210 -3115 -3390 -2555 -860 1002
3354 1002 2529 3360 3142 2116 240 -1541 -2850 -3294 -2928 -1165 175 2007 3277 3500 2096 913
3370 913 -1237 -2821 -3313 -3196 -1795 -2 1707 3266 3451 2528 1056 -457 -2072 -3208 -3257 -2266 -589
3387 -589 1395 2689 3232 2959 1660 -11 -2094 -3070 -3221 -2646 -837 1175 2338 2979 2990 2333 616
3404 616 -1514 -2763 -3308 -2726 -1407 294 2020 2998 3202 2523 889 -757 -2579 -3163 -2793 -1819 -360
3421 -360 1364 2690 3194 2560 1338 -661 -2275 -2968 -3217 -2148 -589 1042 2722 3015 2847 1725 -14
3438 -14 -1575 -2903 -3059 -2460 -1065 1030 2514 3022 2818 2142 650 -1459 -2761 -3007 -2856 -1469 73
3455 73 2023 2971 2960 2446 935 -984 -2257 -3318 -3089 -1881 -287 1282 2929 3188 2560 1599 -417
3472 -417 -1789 -2986 -3017 -2410 -715 930 2329 3086 2887 1710 -142 -1779 -2568 -3197 -2560 -1190 647
3489 647 2227 3147 3011 2210 321 -1455 -2683 -3175 -2716 -1351 266 1614 2705 2942 2536 866 -794
3506 -794 -2047 -3176 -2925 -1647 -479 1364 2576 3000 2459 1293 -407 -1639 -2782 -2832 -2467 -680 954
3523 954 2346 3084 2689 1602 30 -1573 -2628 -3146 -2226 -1207 757 1897 2956 2718 2129 662 -980
3540 -980 -2501 -2664 -2602 -1804 122 1876 2682 3223 2417 932 -706 -1629 -2918 -3008 -1855 -131 1597 2462
3558 2462 2978 2388 1088 -305 -1852 -2643 -2949 -2334 -722 857 1898 2884 2831 1537 163 -1306 -2779
3575 -2779 -2908 -2553 -1186 539 1845 2818 2876 1882 473 -898 -2287 -2865 -2618 -1443 -220 1580 2406
3592 2406 2952 2292 894 -693 -1903 -2823 -2696 -1762 -391 1127 2559 2741 2645 1575 -156 -1284 -2765
3609 -2765 -2700 -2299 -786 774 2218 3029 2980 1446 275 -1345 -2448 -2778 -2734 -1104 387 1438 2713
3626 2713 2857 2023 550 -1009 -2297 -2651 -2598 -1703 -175 1577 2419 2987 2083 1231 -506 -1927 -2975
3643 -2975 -2916 -1759 -387 1065 2367 3055 2502 1379 -454 -1455 -2304 -2659 -2087 -718 626 2039 2875
3660 2875 2730 1548 562 -1199 -2352 -2634 -2232 -1288 149 1463 2680 2779 1968 857 -843 -1889 -2814
3677 -2814 -2585 -1510 -37 1323 2632 2793 2215 962 -305 -1896 -2645 -2703 -1582 -349 898 1989
3693 1989 2603 2352 1419 6 -1487 -2444 -2765 -2076 -752 723 1731 2521 2510 1748 326 -1137 -2138
3710 -2138 -2569 -2230 -1326 256 1498 2413 2637 2015 620 -961 -1881 -2697 -2543 -1560 -319 1365 2371
3727 2371 2701 1785 1070 -308 -1940 -2206 -2384 -1561 -431 1066 2003 2481 2274 1395 -134 -1560 -2328 -2570
3745 -2570 -1985 -1050 572 2066 2663 2402 1829 361 -909 -2304 -2594 -2259 -903 -20 1527 2376 2498
3762 2498 1841 382 -835 -1900 -2633 -2520 -1446 -265 1359 2025 2521 1986 769 -386 -1670 -2518 -2235
3779 -2235 -2247 -717 803 2065 2539 2287 1151 390 -1149 -2230 -2322 -2032 -648 473 1749 2528 2385
3796 2385 1796 472 -870 -1980 -2450 -2144 -1318 226 1240 2277 2430 1895 654 -711 -1721 -2372 -2421
3813 -2421 -1712 -118 1090 1999 2245 1926 838 -184 -1855 -2358 -2434 -1823 -646 795 2055 2483 2251
3830 2251 1228 129 -1470 -2394 -2489 -1635 -1032 352 1666 2276 2273 1613 381 -691 -1893 -2454 -2063 -1060
3848 -1060 161 1490 2380 2415 1916 759 -869 -1951 -2421 -2313 -1450 -107 968 1986 2529 1734 1186
3865 1186 -145 -1455 -2092 -2451 -2056 -591 805 1869 2468 2086 1146 258 -936 -2153 -2354 -2263 -574
3882 -574 280 1642 2356 2206 1661 223 -878 -1892 -2044 -2019 -1002 375 1262 2058 2159 1624 702 -582
3900 -582 -1610 -2444 -2283 -1740 -86 971 2044 2164 1922 1087 -177 -1420 -2171 -2319 -1776 -386 564 1875
3918 1875 2131 2171 1319 231 -942 -2008 -2401 -1928 -970 420 1649 1953 2102 1366 422 -794 -2016 -2375
3936 -2375 -1883 -891 -76 1457 2053 2077 1704 500 -545 -1450 -2210 -2131 -1201 -313 1019 1896 2187 1855 971
3955 971 -174 -1271 -2156 -2259 -1682 -525 629 1972 2334 2039 1496 137 -1200 -2062 -2405 -2002 -821
3972 -821 532 1212 2148 2276 1695 481 -670 -1945 -2095 -1959 -972 154 949 2253 2095 1543 645 -564
3990 -564 -1549 -2151 -2166 -1462 -289 1020 1687 2145 1946 948 -183 -1530 -1952 -2161 -1696 -569 325 1757
4008 1757 2061 1808 1281 -252 -1174 -2015 -2205 -1785 -940 449 1601 2165 2044 1557 443 -958 -1868 -2373
4026 -2373 -1892 -1086 162 1216 2004 2092 1784 1016 -269 -1649 -2341 -1931 -1521 -293 831 1789 2206 1734
4044 1734 937 -317 -1168 -1942 -2391 -1751 -799 545 1682 2363 2006 1157 -19 -1060 -1766 -2162 -1678 -881
4062 -881 274 1398 2064 2345 1316 330 -620 -1475 -2199 -1847 -986 87 1061 1602 1982 1919 679 -287 -1561
4081 -1561 -2175 -2135 -1238 -20 838 1321 1885 1813 985 -266 -1327 -1962 -2195 -1789 -487 443 1248 2085 1530
4100 1530 1362 34 -1080 -1838 -2013 -1723 -1025 118 1286 1716 1919 1522 222 -828 -1611 -2101 -1944 -1044
4118 -1044 90 1073 1952 1822 1489 483 -496 -1382 -1683 -1804 -1535 -282 831 1739 2035 2007 936 -10
4136 -10 -1069 -1607 -2060 -1648 -432 321 1499 1834 1991 1423 -66 -1058 -1586 -1979 -1612 -834 128 1673 1642
4155 1642 1979 1365 91 -673 -1377 -2019 -1821 -776 102 1171 1594 2083 1822 830 -422 -1497 -2189 -1967
4173 -1967 -1107 -276 716 1653 2166 1771 818 -325 -1313 -1664 -1833 -1380 -469 461 1552 1908 1749 1075 213
4192 213 -838 -1476 -2062 -1658 -779 417 1147 1970 1664 1295 417 -713 -1398 -1913 -1530 -1169 291 904 1699
4211 1699 1924 1343 848 -271 -1687 -2013 -1864 -971 -193 789 1584 2094 1963 797 -195 -1220 -2055 -2061 -1792
4230 -1792 -645 407 1123 2029 1565 1197 7 -875 -1497 -1829 -1669 -860 368 1382 1866 1858 1605 342
4248 342 -688 -1356 -1889 -1931 -1068 90 1008 1583 1998 1481 552 -267 -1460 -2200 -1932 -1295 -142 634 1341
4267 1341 2119 1951 821 -182 -987 -1626 -2028 -1472 -595 456 1227 1781 1766 1296 294 -893 -1448 -2173
4285 -2173 -1494 -613 137 1182 1620 1751 1419 576 -489 -1321 -2186 -1903 -1347 3 1026 1778 1895 1869 829
4304 829 -500 -1496 -1790 -1958 -1085 -311 649 1599 1753 1394 1021 -85 -923 -1644 -1997 -1381 -721 277 1334
4323 1334 1628 1579 1080 494 -644 -1641 -2032 -1493 -694 277 1375 1709 1850 1091 701 -510 -1649 -2046 -1659
4342 -1659 -1082 -144 881 1839 1865 1491 943 -440 -1246 -1698 -1612 -1295 -238 681 1527 1858 1724 892 -222
4361 -222 -960 -1696 -1832 -1752 -580 558 1230 1861 1816 1220 120 -852 -1899 -1909 -1729 -791 187 974 1706 1749
4381 1749 1317 572 -698 -1622 -1894 -1616 -972 -137 779 1118 1624 1442 956 -283 -950 -1939 -1950 -1192 -445
4400 -445 610 1488 1781 1628 797 -148 -888 -1581 -1990 -1246 -531 448 1217 1791 1674 1039 18 -502 -1820
4419 -1820 -1641 -1742 -1059 186 1115 1740 1761 1234 377 -567 -1397 -1918 -1721 -938 -16 805 1532 1726 1473 941
4439 941 -278 -1165 -1831 -1702 -905 -135 809 1117 1927 1705 1046 178 -721 -1623 -1671 -1294 -721 416 987 1771
4459 1771 1693 1184 286 -628 -1571 -1963 -1804 -682 258 934 1851 1737 1267 598 -565 -1163 -1755 -1619 -1063
4478 -1063 55 620 1587 1714 1464 402 -326 -1230 -1745 -2092 -1476 -311 659 1417 1638 1655 908 29 -919
4497 -919 -1501 -1696 -1298 -646 405 1306 1836 1622 1335 150 -842 -1436 -1903 -1621 -840 228 983 1655 1901
4516 1901 1487 647 -517 -1368 -1584 -1808 -911 -610 765 1366 1850 1577 795 -99 -1201 -1690 -1856 -1464 -639
4535 -639 765 1425 1731 1402 883 -74 -837 -1718 -1748 -1443 -629 361 806 1617 1891 1330 629 -491 -1447 -1794
4555 -1794 -1389 -914 -194 965 1523 1810 1026 501 -389 -958 -1525 -1356 -1040 -298 519 1316 1567 1272 846
4574 846 -230 -1206 -1384 -1727 -1060 -353 431 1395 1757 1523 959 71 -788 -1372 -1752 -1507 -616 278 1243 1609
4594 1609 1510 1245 507 -561 -1469 -2010 -1644 -843 -54 726 1733 1758 1392 373 -241 -835 -1661 -1623 -1038 -314
4614 -314 746 1359 1713 1473 920 125 -681 -1471 -1564 -1285 -495 425 1057 1779 1569 758 351 -817 -1669 -1755
4634 -1755 -1331 -620 186 1117 1514 1527 890 286 -595 -1288 -1467 -1197 -1135 -187 974 1449 1715 1781 575 -292
4654 -292 -1507 -1636 -1578 -1335 -90 611 1417 1706 1469 726 42 -1083 -1566 -1703 -1565 -349 462 1134 1612
4673 1612 1587 1074 167 -820 -1324 -1452 -1391 -689 49 860 1506 1495 1105 418 -644 -1168 -1760 -1784 -935 17 830
4694 830 1536 1571 1354 863 -313 -1217 -1560 -1539 -1023 -366 667 1226 1701 1617 805 -13 -1036 -1954 -1507 -1487
4714 -1487 -790 307 1370 1374 1490 1168 274 -559 -1366 -1680 -1623 -857 192 932 1475 1516 1209 410 -477 -1165
4734 -1165 -1584 -1546 -877 -204 699 1772 1768 1339 644 -156 -1210 -1567 -1609 -1157 -288 591 1274 1719 1575 657
4754 657 293 -615 -1238 -1616 -1319 -518 275 1066 1571 1685 1153 436 -725 -1380 -1576 -1432 -770 101 907 1383
4774 1383 1501 1427 409 -318 -1371 -1761 -1476 -1179 -158 731 1590 1790 1419 814 -330 -888 -1754 -1603 -1163
4793 -1163 -360 479 1565 1999 1239 1050 -30 -757 -1399 -1649 -1389 -477 157 1297 1714 1778 826 368 -550
4812 -550 -1317 -1680 -1548 -640 -30 888 1545 1775 1138 426 -155 -1155 -1536 -1767 -860 -365 605 1583 1731 1476
4832 1476 611 -145 -945 -1729 -1553 -1134 -350 283 1278 1605 1514 1025 58 -767 -1477 -1589 -1468 -746 46 821
4852 821 1754 1486 959 571 -621 -1290 -1515 -1370 -928 47 684 1446 1819 1201 786 -427 -1059 -1553 -1478 -1193
4872 -1193 -349 665 1377 1509 1337 787 87 -990 -1527 -1717 -1087 -381 311 1362 1579 1554 1005 72 -727
4891 -727 -1244 -1836 -1237 -666 356 1214 1689 1701 1263 434 -712 -1111 -1620 -1614 -936 -83 671 1605 1647 1332 430
4912 430 -129 -1122 -1417 -1642 -821 -339 529 1285 1433 1567 1045 -19 -837 -1521 -1542 -1214 -335 504 1154 1533
4932 1533 1478 938 98 -840 -1460 -1523 -1292 -656 240 960 1578 1592 1136 359 -404 -1354 -1633 -1540 -1049 -155 656
4953 656 1257 1565 1436 699 18 -951 -1490 -1442 -928 -525 846 1213 1524 1307 1114 104 -973 -1444 -1724
4972 -1724 -897 -670 229 1106 1497 1500 1124 15 -705 -1286 -1461 -1306 -732 449 728 1464 1505 1081 273 -354
4992 -354 -1175 -1587 -1521 -916 -83 928 1604 1941 1227 555 -253 -1193 -1598 -1779 -1104 -386 547 1194 1747 1081
5012 1081 622 -56 -956 -1534 -1442 -1147 -724 340 960 1470 1573 983 101 -491 -1278 -1496 -1318 -610 24 962
5032 962 1576 1534 1208 487 -182 -905 -1693 -1391 -917 -33 658 1206 1594 1303 730 -229 -1182 -1625 -1520 -1107
5052 -1107 -488 774 1382 1711 1264 640 -32 -830 -1550 -1620 -1132 -564 339 1227 1336 1604 1281 14 -909
5071 -909 -1659 -1529 -1432 -869 374 1014 1413 1489 1391 475 -598 -1154 -1631 -1434 -922 -120 762 1411 1361 1310 583
5092 583 -66 -685 -1486 -1352 -1228 -270 596 1351 1453 1493 924 73 -975 -1611 -1677 -1267 -535 357 1106 1474
5112 1474 1604 993 247 -569 -1373 -1610 -1410 -821 -2 1009 1540 1409 1221 549 -430 -923 -1386 -1462 -971 -12
5132 -12 662 1328 1692 1339 708 -207 -853 -1342 -1482 -1045 -467 321 1537 1370 1390 854 139 -845 -1509 -1588 -1072
5153 -1072 -512 155 640 1503 1438 967 526 -673 -1079 -1400 -1643 -900 56 817 1297 1617 1394 501 -237 -1171
5173 -1171 -1493 -1457 -1052 -22 856 1298 1787 1531 657 -122 -1033 -1462 -1868 -1111 -466 369 1159 1831 1519 714
5193 714 -153 -865 -1158 -1658 -1458 -617 214 984 1596 1469 1025 61 -594 -1336 -1761 -1666 -941 -118 964 1450
5213 1450 1564 1282 515 -400 -1128 -1532 -1612 -1055 -69 654 1234 1195 1634 843 -435 -797 -1812 -1273 -1294 -435
5233 -435 362 1196 1425 1444 853 121 -570 -1229 -1436 -1146 -603 500 968 1420 1411 1004 581 -672 -1063 -1530
5253 -1530 -1455 -860 -122 773 1558 1313 1313 586 -234 -742 -1749 -1397 -1117 -89 435 1336 1821 1485 944 -123
5273 -123 -923 -1678 -1449 -1253 -375 416 1037 1660 1284 816 247 -599 -1131 -1746 -1199 -720 375 893 1650 1651
5293 1651 1148 366 -482 -1490 -1502 -1568 -997 -45 971 1500 1553 1223 460 -238 -1124 -1549 -1497 -822 -210 609
5313 609 1054 1658 1477 1122 -251 -945 -1387 -1576 -1210 -510 396 1001 1337 1319 950 271 -599 -1232 -1362 -1452
5333 -1452 -720 -89 961 1283 1306 921 441 -581 -1106 -1602 -1430 -920 46 693 1192 1388 1160 755 -348
5352 -348 -1221 -1405 -1692 -1183 -360 469 1053 1546 1240 448 246 -800 -1370 -1319 -1151 -381 494 1151 1499 1618
5372 1618 1089 314 -726 -1019 -1407 -1229 -700 218 844 1313 1527 1006 267 -500 -1119 -1477 -1283 -947 40
5391 40 769 1040 1513 1118 504 -186 -921 -1339 -1449 -1185 -213 462 1140 1607 1493 844 64 -822 -1383 -1213
5411 -1213 -965 -373 276 1200 1317 1239 1230 213 -505 -1171 -1563 -1516 -566 64 704 1407 1408 972 626 -307 -937
5432 -937 -1406 -1310 -783 -3 879 1450 1645 1131 541 -74 -935 -1667 -1587 -1193 -432 473 1238 1624 1262 788 131
5453 131 -740 -1070 -1623 -1036 -480 254 804 1638 1503 979 437 -577 -1008 -1719 -1298 -686 -86 860 1268 1571
5473 1571 1029 505 -388 -1153 -1587 -1341 -1001 -46 840 1274 1422 1206 721 -212 -870 -1274 -1246 -937 -449 336
5493 336 1032 1392 1300 756 32 -962 -1374 -1527 -1343 -668 314 950 1123 1443 935 450 -386 -1175 -1405 -1225
5513 -1225 -884 271 686 1174 1573 1088 675 -526 -1009 -1646 -1361 -946 -135 909 1268 1520 1152 881 -206
5532 -206 -674 -1317 -1300 -913 -453 366 1049 1212 1450 822 71 -489 -1384 -1255 -1130 -811 -162 844 1274 1416
5552 1416 919 527 -665 -909 -1481 -1376 -564 -46 794 1266 1563 1090 329 -216 -753 -1357 -1436 -862 -300 564
5572 564 1085 1395 1183 859 -243 -637 -1285 -1162 -1112 -574 181 1079 1279 1373 690 309 -790 -1153 -1269 -1243
5592 -1243 -552 157 642 1331 1164 862 83 -448 -1025 -1438 -1233 -744 64 730 1166 1344 1205 84 -294
5611 -294 -879 -1391 -1415 -1073 -368 583 1086 1554 1225 551 -67 -828 -1243 -1261 -941 -516 367 1077 1371 1370 1021
5632 1021 250 -389 -1095 -1354 -1259 -740 81 772 1111 1518 1124 360 -430 -751 -1100 -1425 -557 -33 771 1509
5652 1509 1377 1258 551 35 -1032 -1237 -1480 -1104 -228 320 1098 1181 1358 1010 163 -835 -1364 -1319 -899 -654
5672 -654 208 716 1120 1191 1063 194 -456 -1302 -1583 -1462 -852 -66 802 1210 1377 851 384 -334 -1212 -1304 -1196
5693 -1196 -808 122 651 1226 1589 1104 465 -309 -846 -1388 -1459 -1094 -467 478 1039 1364 1187 489 -5 -796
5713 -796 -1228 -1360 -1087 -301 424 874 1308 1344 984 514 -507 -981 -1320 -1384 -918 -6 492 1064 1418 1335 405
5734 405 -187 -1259 -1321 -1354 -839 -227 680 942 1284 1009 653 -140 -677 -1243 -1193 -754 -368 312 835 1233 1483
5755 1483 755 94 -516 -947 -1270 -830 -781 45 1104 1697 1330 1088 247 -425 -1101 -1171 -1068 -558 104 778
5775 778 985 1300 1172 461 -85 -1193 -1248 -1354 -815 -366 471 1076 1207 1368 793 -80 -646 -1249 -1280 -683
5795 -683 -510 317 850 1144 1241 792 180 -340 -1077 -1056 -1119 -631 160 942 1162 1398 771 208 -509 -986 -1428
5816 -1428 -1299 -899 -20 668 1407 1477 1267 529 -322 -968 -1306 -1355 -1044 -292 545 1275 1423 1159 496 -172
5836 -172 -664 -1104 -1533 -1450 -557 140 607 1271 1193 974 35 -315 -1093 -1378 -1049 -688 1 694 1303 1525 904
5857 904 207 -88 -690 -1224 -1187 -568 -31 642 1323 1281 1089 328 -122 -781 -1123 -1458 -1024 -447 363 1024 1324
5878 1324 1278 740 17 -625 -1085 -1333 -1101 -664 54 747 1550 1102 1077 104 -392 -761 -1091 -1246 -798 -27
5898 -27 841 1301 1311 1120 437 -118 -757 -1388 -1168 -788 -152 655 929 1308 1240 540 -306 -710 -1312 -1248 -1037
5919 -1037 -266 273 1030 1442 1107 1044 247 -574 -1237 -1592 -1127 -681 246 830 836 1071 831 342 -375 -853 -1396
5940 -1396 -990 -580 -121 631 1222 1211 1191 486 -347 -665 -1079 -912 -1071 -364 404 1437 1189 1167 579 -260
5960 -260 -769 -1084 -1301 -869 -422 429 880 1006 1493 769 -191 -627 -1166 -1379 -984 -500 -23 679 1293 1342
5980 1342 764 491 -366 -1061 -1320 -1329 -748 -108 838 976 1327 812 342 -135 -897 -1338 -1377 -819 -233 543 1067
6001 1067 1326 1121 645 63 -429 -1266 -1497 -1061 -533 404 719 1163 1261 901 455 -426 -1045 -1143 -1128 -665 44
6022 44 671 1272 1364 1183 266 -191 -764 -1246 -1098 -801 -103 517 1037 1123 979 642 64 -1038 -1116 -1458 -776
6043 -776 -590 361 978 1405 1026 829 -28 -730 -1310 -1406 -895 -424 266 820 1440 1294 888 142 -270 -914
6063 -914 -1571 -976 -344 67 682 1083 1345 937 641 -286 -1062 -1051 -1464 -825 49 264 1064 1154 1197 670 -116
6084 -116 -749 -1190 -1417 -1014 -230 524 1090 1390 1355 626 197 -451 -1063 -1279 -1054 -470 -51 725 1227 1364
6104 1364 1077 366 -359 -805 -1205 -957 -744 28 312 1199 1269 1082 463 -297 -664 -1171 -1389 -735 -299 562
6124 562 938 1233 1131 647 -173 -784 -1220 -1421 -616 -358 239 1024 1251 1059 891 191 -742 -904 -1523 -1114
6144 -1114 -709 399 1025 1156 1204 981 423 -262 -944 -975 -1007 -572 -298 798 1235 1373 1033 644 -310 -803
6164 -803 -1285 -1068 -631 -448 596 765 1440 1025 743 295 -850 -883 -1314 -1207 -383 555 888 1042 827 656
6184 656 242 -781 -1178 -1319 -968 -576 -58 646 1077 1123 634 233 -316 -930 -1287 -1016 -562 -206 492 829
6204 829 1398 962 548 -148 -779 -1164 -1153 -1105 -378 258 832 1101 993 956 218 -475 -929 -1167 -881 -535 260
6225 260 787 1148 1034 818 292 -533 -939 -1190 -1112 -647 46 781 1230 1212 918 261 -81 -679 -1110 -990 -1106
6246 -1106 -224 554 1091 1180 871 410 64 -917 -1176 -1160 -788 -177 144 650 1283 1110 611 -36 -808 -862 -1079
6267 -1079 -820 -487 40 773 1158 986 938 326 -507 -997 -1279 -1004 -1010 236 478 1275 1239 1032 482 -27 -656
6288 -656 -933 -1065 -942 -51 582 1045 987 1267 449 -200 -865 -1152 -1059 -872 -205 606 947 1391 932 751 -1
6309 -1 -304 -1135 -1187 -953 -757 -45 893 1077 1220 749 178 -490 -825 -1275 -1157 -498 -29 790 1004 1170 847
6330 847 578 -16 -672 -1084 -1111 -675 -148 635 967 1129 1075 454 -32 -497 -1043 -1235 -761 -507 218 966 1003
6351 1003 1139 671 110 -558 -988 -1114 -1044 -396 70 824 1124 1136 665 261 -333 -886 -1042 -1147 -608 -70
6371 -70 457 901 960 946 120 -235 -938 -1127 -1188 -629 -286 442 930 1352 993 520 -48 -641 -1104 -1066 -1084 -419
6393 -419 340 658 1327 1088 616 281 -521 -960 -1084 -1063 -583 -37 610 1309 1291 1001 472 -270 -790 -1249 -965
6414 -965 -953 -4 496 982 999 934 450 -100 -636 -1051 -1270 -887 -128 291 870 1320 993 586 -30 -944 -1076
6435 -1076 -930 -792 -535 208 525 1064 1094 880 321 -740 -883 -993 -1180 -630 159 541 1238 1369 709 371
6455 371 -122 -844 -1044 -984 -610 -46 495 701 1118 896 522 -237 -640 -1071 -1211 -974 -346 322 819 1027
6475 1027 1070 561 -47 -728 -875 -1329 -717 -158 157 908 1022 1036 692 99 -284 -881 -1048 -1053 -498 164 663
6496 663 1185 1135 813 81 -261 -733 -1233 -1221 -701 -274 482 908 1229 860 480 151 -651 -1097 -1119 -754 -277
6517 -277 243 964 1322 1188 924 338 -610 -1037 -1408 -921 -706 332 657 922 1380 1046 92 -640 -894 -1169
6537 -1169 -1174 -784 92 843 970 1252 982 314 -143 -557 -1026 -1148 -639 -113 460 846 1003 1051 468 -191 -676
6558 -676 -1068 -1048 -845 -356 367 1244 1252 1074 550 -134 -591 -1051 -1256 -996 -330 209 677 1199 1168 821 294
6579 294 -49 -991 -1035 -1018 -875 101 593 1054 1396 895 214 -336 -902 -971 -1260 -774 -338 429 876 959 859
6600 859 475 179 -645 -1049 -1127 -860 -417 111 929 935 1072 593 266 -333 -1193 -1211 -980 -554 79 644 1091
6621 1091 1167 822 -70 -513 -896 -1153 -903 -897 40 283 964 975 1116 370 -205 -752 -1074 -1293 -774 -232 174
6642 174 830 1270 1066 815 98 -613 -1094 -959 -834 -547 127 977 1108 1155 795 58 -457 -1105 -1173 -820 -388
6663 -388 248 577 938 1171 889 282 -201 -796 -1130 -817 -754 -212 423 941 1057 975 434 -257 -837 -919 -831
6684 -831 -966 -426 306 585 1162 990 408 219 -570 -1119 -974 -906 -726 88 630 974 992 769 359 -238 -947
6705 -947 -1006 -961 -586 -112 613 1009 1213 961 381 -108 -751 -841 -954 -426 -175 523 676 1062 939 440 0
6726 0 -395 -1022 -1060 -811 -357 382 776 1130 1006 583 128 -492 -1071 -1009 -1051 -389 188 597 1020 1240 752 325
6748 325 -269 -576 -979 -879 -564 -142 339 928 1126 959 340 -286 -536 -988 -1015 -703 -311 397 860 1271
6768 1271 700 500 -416 -555 -961 -1001 -1070 -336 276 926 1079 957 604 49 -486 -1188 -1023 -825 -446 39
6788 39 621 892 986 783 46 -278 -664 -1107 -942 -915 -72 610 815 1191 847 231 -108 -685 -815 -1057 -823
6809 -823 -219 118 749 958 922 555 173 -635 -1012 -888 -801 -250 542 653 928 937 630 187 -455 -786 -948
6830 -948 -764 -674 71 649 749 949 730 208 -525 -545 -950 -947 -830 67 543 783 997 1080 468 -202 -852 -950
6852 -950 -820 -542 -211 265 777 1056 946 609 148 -566 -861 -1219 -914 -163 239 900 1138 817 725 131
6872 131 -567 -898 -871 -888 -649 -102 448 975 862 794 453 -485 -686 -1305 -696 -724 -63 557 677 836 960
6893 960 448 -181 -661 -999 -984 -766 -104 458 841 1299 752 619 351 -212 -1103 -935 -704 -474 226 797
6913 797 955 838 585 85 -56 -756 -880 -866 -481 66 693 880 842 606 421 -96 -707 -952 -905 -518 -93
6934 -93 159 811 1047 812 529 -266 -492 -905 -930 -670 -230 258 840 1215 883 428 246 -702 -886 -981 -786
6955 -786 -357 -32 616 1072 854 460 29 -388 -944 -1017 -917 -809 -126 439 1074 1081 795 288 118 -825 -1121
6976 -1121 -1023 -1068 -216 400 700 883 882 567 38 -649 -890 -786 -641 -120 393 693 1144 1229 614 -70 -374
6997 -374 -896 -846 -780 -487 125 615 966 1155 581 400 -203 -737 -950 -813 -423 106 611 935 1028 760 280
7018 280 -135 -580 -1087 -769 -582 -194 293 969 1051 871 494 93 -415 -700 -902 -641 -373 262 788 804 918
7039 918 363 -223 -342 -633 -1082 -818 -394 -20 763 945 878 670 74 -155 -963 -661 -996 -442 -156 437
7059 437 602 1152 769 405 -156 -428 -881 -862 -868 -125 384 710 1027 895 642 125 -410 -933 -837 -632 -443
7080 -443 98 970 808 1101 856 184 -315 -752 -1034 -700 -533 -4 625 614 1054 609 329 -66 -812 -842 -1048
7101 -1048 -665 38 398 854 971 824 482 -139 -337 -796 -865 -749 -330 392 722 1007 977 761 111 -376
7121 -376 -854 -969 -555 -395 189 549 1155 1080 447 229 -476 -741 -636 -569 -91 207 518 630 936 645 245
7142 245 -402 -771 -624 -991 -705 -156 393 354 862 806 570 -23 -547 -736 -834 -475 -492 207 684 1083 728
7163 728 411 101 -330 -837 -1012 -651 -421 250 415 917 976 598 358 -327 -743 -892 -802 -492 -196 732 757
7184 757 740 599 427 -132 -830 -934 -881 -484 70 340 733 1162 499 353 -201 -773 -813 -930 -764 -268 -63
7205 -63 631 947 846 374 315 -500 -551 -836 -864 -469 186 648 827 1023 688 202 -407 -863 -845 -640 -500 -72
7227 -72 356 1141 908 714 241 -151 -470 -1029 -844 -841 79 361 630 704 655 281 13 -485 -1036 -791 -440 101
7249 101 139 585 808 918 559 -95 -505 -1013 -1011 -794 -470 193 542 755 798 637 234 -249 -689 -1015 -852
7270 -852 -335 60 325 561 793 714 608 -254 -450 -933 -865 -468 -218 -78 899 678 675 277 -9 -126 -823
7291 -823 -760 -804 -358 35 772 591 762 213 -31 -487 -772 -947 -461 -311 120 470 843 624 392 254 -259
7312 -259 -410 -1192 -838 -405 -68 387 796 818 1002 388 52 -532 -694 -854 -738 -417 173 473 1004 927 617
7333 617 137 -598 -953 -1030 -636 -432 23 552 1051 749 472 48 -472 -565 -875 -767 -428 252 435 1067 1031
7354 1031 741 250 -354 -638 -1049 -856 -304 -165 620 963 1040 954 268 -26 -473 -835 -915 -544 14 132 984
7375 984 834 845 508 241 -307 -913 -753 -682 -368 109 767 967 1046 663 452 -393 -593 -632 -822 -357 129
7396 129 417 871 689 368 166 -77 -569 -792 -1214 -657 -207 367 1019 722 971 263 112 -586 -930 -562
7416 -562 -432 -551 328 849 1013 886 620 279 -525 -447 -952 -868 -417 309 608 789 974 696 314 -355 -329
7437 -329 -836 -651 -350 -127 589 783 1108 647 353 -336 -657 -628 -915 -659 -128 235 886 907 877 714 -125
7458 -125 -262 -687 -646 -578 -479 262 380 856 696 510 -52 -429 -602 -698 -831 -542 156 597 943 890 633 93
7480 93 -295 -611 -805 -719 -719 -68 482 701 1021 404 406 63 -585 -656 -846 -580 -48 155 726 929 607 575 -71
7503 -71 -524 -603 -701 -910 -164 133 728 912 635 588 180 -540 -654 -739 -888 -193 17 374 612 897 538 92
7525 92 -281 -655 -606 -532 -610 -220 470 818 1009 536 255 -54 -344 -771 -820 -912 -135 464 547 728 643 330 36
7548 36 -540 -675 -987 -597 -88 34 478 890 890 497 147 -282 -841 -851 -713 -291 181 302 922 684 551
7569 551 376 -234 -763 -520 -584 -429 102 179 830 907 765 269 -129 -309 -699 -923 -493 -97 372 819 916
7590 916 734 359 106 -223 -706 -599 -484 -380 190 526 607 696 452 169 -192 -534 -957 -498 -487 -6 563
7611 563 743 690 963 199 -347 -792 -905 -755 -596 -4 336 642 832 718 579 77 -193 -689 -1101 -535
7631 -535 -242 419 373 625 1100 521 -104 -458 -479 -677 -553 -171 96 848 904 692 687 323 -231 -717 -725 -435
7653 -435 -270 359 376 613 756 761 14 -79 -470 -683 -953 -634 -190 205 606 835 966 460 111 -426 -781
7674 -781 -902 -625 -314 294 742 593 813 436 77 -195 -519 -537 -689 -184 378 795 304 537 645 327
7694 327 -591 -683 -913 -781 -184 -79 579 532 801 427 378 -216 -569 -872 -870 -489 -43 116 705 947 547 132
7716 132 14 -410 -691 -810 -669 -78 166 1072 763 671 621 -23 -173 -616 -655 -720 -346 301 364 791 586 686
7738 686 282 -313 -628 -836 -797 -434 24 282 814 667 406 329 13 -558 -654 -834 -499 -160 445 681 756
7759 756 852 444 93 -225 -745 -810 -663 -302 34 928 715 811 593 157 -218 -846 -807 -881 -371 -26 505 972
7781 972 784 685 444 -291 -515 -861 -858 -541 -124 405 648 574 510 371 -219 -382 -831 -609 -508 -294 182 560
7803 560 799 806 362 53 -337 -847 -673 -561 -598 154 643 721 559 735 6 -328 -661 -730 -771 -302 -5 513
7825 513 846 771 535 -72 -90 -573 -768 -637 -497 -130 182 550 780 672 245 -202 -476 -614 -878 -491 -95
7846 -95 145 517 851 583 415 97 -511 -801 -788 -437 -161 180 515 817 741 299 -35 -58 -788 -566 -614 -162
7868 -162 4 463 603 853 660 198 -108 -522 -563 -558 -295 -222 103 541 905 571 161 -97 -775 -590 -660 -414
7890 -414 -353 475 562 797 363 668 100 -211 -482 -757 -512 -265 -156 713 655 925 657 187 -201 -581 -530
7911 -530 -878 -393 119 396 766 743 542 440 -236 -570 -752 -504 -527 -58 364 520 841 837 449 -218 -459
7932 -459 -780 -852 -520 -457 171 690 856 691 588 55 -86 -543 -824 -607 -146 318 528 680 753 700 -146
7953 -146 -56 -654 -617 -375 -362 123 542 699 695 853 324 -27 -729 -763 -773 -408 -206 249 553 637 296 413 -128
7976 -128 -579 -734 -525 -414 -379 196 604 926 589 386 0 -162 -726 -733 -762 -373 234 602 807 815 513 131
7998 131 -233 -401 -547 -768 -353 110 378 547 925 647 154 -184 -475 -913 -786 -362 -35 168 603 699
8018 699 548 490 -39 -342 -505 -493 -452 -168 461 641 697 638 489 190 -152 -875 -698 -608 -112 -109 445 625 652
8041 652 431 223 -166 -582 -704 -572 -522 83 363 508 742 566 434 -12 -269 -683 -953 -270 23 288
8061 288 691 736 507 473 172 -401 -596 -777 -487 -480 571 465 1044 646 480 150 -325 -534 -742 -282 -394
8082 -394 45 378 681 586 722 228 -207 -548 -720 -960 -300 -153 291 681 522 553 440 -67 -455 -721 -809
8103 -809 -458 -160 506 618 880 696 371 -70 -407 -871 -545 -569 -527 270 377 751 594 639 182 -448 -621
8124 -621 -862 -561 -511 -5 254 458 761 731 51 -365 -644 -897 -434 -552 1 280 626 758 365 221 -14
8145 -14 -565 -870 -922 -471 -143 324 546 859 799 469 140 -380 -708 -737 -640 -266 139 478 886 587 22 193
8167 193 -464 -577 -684 -522 -268 43 626 514 674 534 28 -160 -419 -791 -916 -868 104 45 384 698 539
$$ [...]
8191b19
##END NTUPLES=NMR FID
##END=
