##TITLE=1H_PR163-1
 D2O, 8 sc, 
 16.1.2019
##JCAMPDX= 6.0         $$ Bruker NMR JCAMP-DX V2.0
##DATA TYPE= NMR FID
##DATA CLASS= NTUPLES
##ORIGIN= UXNMR, Bruker Analytische Messtechnik GmbH
##OWNER= root
$$ XWIN-NMR		Version 3.5
$$ Wed Jan 16 16:11:52 2019 Russian Standard Time (UT+4h)  she@DPX200
##.OBSERVE FREQUENCY= 200.1313
##.OBSERVE NUCLEUS= ^1H
##.DELAY= (6, 6)
##.ACQUISITION MODE= SIMULTANEOUS
##.ACQUISITION SCHEME= undefined
##.AVERAGES= 8
##.DIGITISER RES= 18
##SPECTROMETER/DATA SYSTEM= spect
##.PULSE SEQUENCE= zg30
##.SOLVENT NAME= CDCl3
##.SHIFT REFERENCE= (INTERNAL, CDCl3, 0, 15.7039)
##AUDIT TRAIL= $$ (NUMBER, WHEN, WHO, WHERE, WHAT)
$$ ##TITLE= Audit trail, XWIN-NMR		Version 3.5
$$ ##JCAMPDX= 5.01
$$ ##ORIGIN= Bruker BioSpin GmbH
$$ ##OWNER= she
$$ F:/spectra/data/she/nmr/H-F/1/audita.txt
$$ ##AUDIT TRAIL=  $$ (NUMBER, WHEN, WHO, WHERE, WHAT)
(   1,<2019-01-16 16:10:53.14 +0400>,<she>,<DPX200>,
      <created by zg, POWCHK disabled, PULCHK disabled
       configuration hash MD5:
       00 E9 B6 7A A2 85 ED C7 34 08 36 98 17 FE 4E 26
       data hash MD5: 16K
       AE 3A E2 66 F9 38 9D EE E6 F5 53 E6 22 A3 1C AA>)
$$ ##END=
$$ 
$$ hash MD5
$$ A4 6E 2D 20 DF 11 13 29 A4 63 77 4F 6C 56 6D 45
##$RELAX= 
##$RELAX= 
##$RELAX= 
##$RELAX= 
##$RELAX= 
##$RELAX= 
$$ Bruker specific parameters
$$ --------------------------
##$DU= <F:/spectra>
##$EXPNO= 1
##$NAME= <H-F>
##$PROCNO= 1
##$TYPE= <nmr>
##$USER= <she>
##$AMP= (0..31)
100 100 100 100 100 100 100 100 100 100 100 100 100 100 100 100 100 100 
100 100 100 100 100 100 100 100 100 100 100 100 100 100 
##$AQSEQ= 0
##$AQ_mod= 1
##$AUNM= <au_zg>
##$AUTOPOS= <>
##$BF1= 200.13
##$BF2= 200.13
##$BF3= 200.13
##$BF4= 200.13
##$BF5= 200.13
##$BF6= 200.13
##$BF7= 200.13
##$BF8= 200.13
##$BYTORDA= 1
##$CFDGTYP= 0
##$CFRGTYP= 5
##$CHEMSTR= <none>
##$CNST= (0..31)
1 1 145 1 1 1 1 1 1 1 1 1 1 1 1 1 1 1 1 1 1 1 1 1 1 1 1 1 1 1 1 1 
##$CPDPRG= <>
##$CPDPRG1= <>
##$CPDPRG2= <>
##$CPDPRG3= <>
##$CPDPRG4= <mlev>
##$CPDPRG5= <mlev>
##$CPDPRG6= <mlev>
##$CPDPRG7= <mlev>
##$CPDPRG8= <mlev>
##$CPDPRGB= <>
##$CPDPRGT= <>
##$D= (0..31)
0 1.2 0 0 0 0 0 0 0 0 0 0.03 0 0 0 0 0 0 0 0 0 0 0 0 0 0 0 0 0 0 0 0 
##$DATE= 1547640652
##$DBL= (0..7)
120 120 120 120 120 120 120 120 
##$DBP= (0..7)
150 150 150 150 150 150 150 150 
##$DBP07= 0
##$DBPNAM0= <>
##$DBPNAM1= <>
##$DBPNAM2= <>
##$DBPNAM3= <>
##$DBPNAM4= <>
##$DBPNAM5= <>
##$DBPNAM6= <>
##$DBPNAM7= <>
##$DBPOAL= (0..7)
0.5 0.5 0.5 0.5 0.5 0.5 0.5 0.5 
##$DBPOFFS= (0..7)
0 0 0 0 0 0 0 0 
##$DE= 6
##$DECBNUC= <off>
##$DECIM= 32
##$DECNUC= <off>
##$DECSTAT= 4
##$DIGMOD= 1
##$DIGTYP= 9
##$DL= (0..7)
0 120 120 120 120 120 120 120 
##$DP= (0..7)
150 150 150 150 150 150 150 150 
##$DP07= 0
##$DPNAME0= <>
##$DPNAME1= <>
##$DPNAME2= <>
##$DPNAME3= <>
##$DPNAME4= <>
##$DPNAME5= <>
##$DPNAME6= <>
##$DPNAME7= <>
##$DPOAL= (0..7)
0.5 0.5 0.5 0.5 0.5 0.5 0.5 0.5 
##$DPOFFS= (0..7)
0 0 0 0 0 0 0 0 
##$DQDMODE= 0
##$DR= 18
##$DS= 0
##$DSLIST= <SSSSSSSSSSSSSSS>
##$DSPFIRM= 0
$$ [...]
##$SUBNAM2= <"">
##$SUBNAM3= <"">
##$SUBNAM4= <"">
##$SUBNAM5= <"">
##$SUBNAM6= <"">
##$SUBNAM7= <"">
##$SUBNAM8= <"">
##$SUBNAM9= <"">
##$SW= 20.0189088683792
##$SWIBOX= (0..15)
0 0 2 0 0 0 0 0 0 0 0 0 0 0 0 0 
##$SW_h= 4006.41025641026
##$TD= 16384
##$TD0= 1
##$TE= 0
##$TE2= 300
##$TE3= 300
##$TEG= 300
##$TL= (0..7)
0 120 120 120 120 120 120 120 
##$TP= (0..7)
150 150 150 150 150 150 150 150 
##$TP07= 0
##$TPNAME0= <>
##$TPNAME1= <>
##$TPNAME2= <>
##$TPNAME3= <>
##$TPNAME4= <>
##$TPNAME5= <>
##$TPNAME6= <>
##$TPNAME7= <>
##$TPOAL= (0..7)
0.5 0.5 0.5 0.5 0.5 0.5 0.5 0.5 
##$TPOFFS= (0..7)
0 0 0 0 0 0 0 0 
##$TUNHIN= 0
##$TUNHOUT= 0
##$TUNXOUT= 0
##$USERA1= <user>
##$USERA2= <user>
##$USERA3= <user>
##$USERA4= <user>
##$USERA5= <user>
##$V9= 5
##$VALIST= <valist>
##$VCLIST= <CCCCCCCCCCCCCCC>
##$VD= 0
##$VDLIST= <DDDDDDDDDDDDDDD>
##$VPLIST= <PPPPPPPPPPPPPPP>
##$VTLIST= <TTTTTTTTTTTTTTT>
##$WBST= 1024
##$WBSW= 4
##$XGAIN= (0..3)
0 0 0 0 
##$XL= 0
##$YL= 0
##$YMAX_a= 504376
##$YMIN_a= -622338
##$ZGOPTNS= <>
##$ZL1= 120
##$ZL2= 120
##$ZL3= 120
##$ZL4= 120
##$ABSF1= 10
##$ABSF2= 0
##$ABSG= 5
##$ABSL= 3
##$ALPHA= 0
##$AQORDER= 0
##$ASSFAC= 0
##$ASSFACI= 0
##$ASSFACX= 0
##$ASSWID= 0
##$AUNMP= <proc_1d>
##$AZFE= 0.1
##$AZFW= 0.1
##$BCFW= 1
##$BC_mod= 2
##$BYTORDP= 1
##$COROFFS= 0
##$CY= 11.3945322036743
##$DATMOD= 1
##$DC= 2
##$DFILT= <>
##$DTYPP= 0
##$F1P= 18.9103706918063
##$F2P= -1.10871071338519
##$FCOR= 0.5
##$FTSIZE= 0
##$FT_mod= 4
##$GAMMA= 1
##$GB= 0.15
##$INTBC= 1
##$INTSCL= 1
##$ISEN= 128
##$LB= 0.24
##$LEV0= 0
##$LPBIN= 0
##$MAXI= 10000
##$MC2= 0
##$MEAN= 0
##$ME_mod= 0
##$MI= 1.114404
##$NCOEF= 0
##$NC_proc= 0
##$NLEV= 6
##$NOISF1= 3.799351
##$NOISF2= 2.8
##$NSP= 1
##$NTH_PI= 0
##$NZP= 0
##$OFFSET= 15.70392
##$PC= 1
##$PHC0= -9055.568
##$PHC1= 7.400039
##$PH_mod= 1
##$PKNL= yes
##$PPARMOD= 0
##$PSCAL= 0
##$PSIGN= 0
##$REVERSE= no
##$SF= 200.130013532006
##$SI= 16384
##$SIGF1= 3
##$SIGF2= 2
##$SINO= 400
##$SIOLD= 16384
##$SREGLST= <1H.CDCl3>
##$SSB= 0
##$STSI= 0
##$STSR= 0
##$SW_p= 3612.71676300578
##$SYMM= 0
##$S_DEV= 0
##$TDeff= 0
##$TDoff= 0
##$TI= <>
##$TILT= no
##$TM1= 0
##$TM2= 0
##$TOPLEV= 0
##$USERP1= <user>
##$USERP2= <user>
##$USERP3= <user>
##$USERP4= <user>
##$USERP5= <user>
##$WDW= 1
##$XDIM= 8192
##$YMAX_p= 0
##$YMIN_p= 0
$$ End of Bruker specific parameters
$$ ---------------------------------
##NTUPLES= NMR FID
##VAR_NAME=  TIME,          FID/REAL,        FID/IMAG
##SYMBOL=    X,             R,               I
##VAR_TYPE=  INDEPENDENT,   DEPENDENT,       DEPENDENT
##VAR_FORM=  AFFN,          ASDF,            ASDF
##VAR_DIM=   8192,          8192,            8192
##UNITS=     SECONDS,       ARBITRARY UNITS, ARBITRARY UNITS
##FACTOR=    0.0002496,     1,               1
##FIRST=     0,             0,               0
##LAST=      2.0444736,     0,               0
##MIN=       0,             -622338,         0
##MAX=       2.0444736,     504376,          0
$$ Real data points
##PAGE= N=1
##DATA TABLE= (X++(R..R)), XYDATA
$$ [...]
120 -404915 -328070 -105897 156785 330062 386520 361225 253825 45211 -208928 -385277
130 -385277 -409565 -313164 -159549 29174 237743 395968 414600 283702 80098 -119448
140 -119448 -285975 -392437 -383722 -235183 -8299 197279 329933 384071 343315 186801 -47510
151 -47510 -260026 -369401 -366202 -277034 -115259 99154 299734 397274 354781 211116 27395
162 27395 -158536 -318520 -396538 -340668 -163611 53400 231956 339635 364486 289136 114361
173 114361 -105208 -286216 -370442 -344338 -224193 -40599 159222 314155 372724 317164 167489
184 167489 -29235 -216923 -340842 -362665 -274763 -105845 92147 262495 356258 342917 224483
195 224483 39898 -152267 -297340 -357753 -312606 -170832 24076 208084 326011 347669
205 347669 268599 108834 -84600 -251946 -342874 -330699 -219668 -43668 144584 288980
215 288980 347804 302806 167580 -16438 -194491 -313908 -338902 -261350 -106133 78370 238382
226 238382 330093 323566 217022 44393 -138106 -275394 -332802 -294930 -167814 11343 186334
237 186334 302729 327276 255619 108372 -71246 -229493 -318329 -310863 -211631 -51151 123814
248 123814 263717 325771 288072 161463 -11278 -175095 -286907 -317101 -254600 -112564 65131
259 65131 220178 306174 301541 209636 55763 -115233 -252304 -313456 -279295 -161725 2039
270 2039 163577 276849 309292 249042 112415 -57207 -207117 -293961 -294632 -207589 -58837
281 -58837 107474 240902 302312 273951 163041 4132 -154299 -265843 -298149 -241637 -112063
292 -112063 50284 195974 283194 287690 205592 61121 -100875 -231077 -291641 -265610 -161359
303 -161359 -9465 144496 254785 288994 236832 113450 -44234 -187380 -274208 -279025 -200430
314 -200430 -62421 92166 218782 281306 260910 160845 11810 -139257 -245961 -279627
324 -279627 -231213 -113843 38310 177760 263142 270584 197808 65452 -85951 -211451 -273075
335 -273075 -252343 -156395 -14833 128862 234804 272657 228795 114756 -33754 -169647 -252891
346 -252891 -262332 -194970 -68101 78915 201567 262724 246261 156488 20802 -120928 -226572
357 -226572 -264984 -222726 -113882 28103 159604 243351 256567 193784 71634 -71958 -192479
368 -192479 -254571 -240816 -155648 -24652 112575 216328 255638 218939 115644 -22189 -151691
379 -151691 -235358 -249893 -190394 -73663 65475 183394 245404 234595 154799 28848 -105048
390 -105048 -208339 -249238 -215242 -114728 18626 143552 225381 241981 187926 75710 -60365
401 -60365 -177312 -238623 -228304 -151530 -31121 98653 200320 242862 210739 114382 -14926
412 -14926 -136210 -216787 -235659 -185417 -76546 57110 170625 230658 221223 149352 34984
423 34984 -91922 -193400 -237195 -206912 -112657 12781 130305 208233 228337 182047 79431
434 79431 -50014 -163948 -225713 -217644 -145411 -33860 85527 181297 228207 206647 117251
445 117251 -10216 -129345 -202612 -217083 -175120 -83827 38715 156230 224242 215961 140745
456 140745 32068 -78295 -169158 -219830 -205850 -121071 6249 124525 196230 211128 171635
467 171635 84663 -32860 -146590 -214312 -212500 -144861 -37692 75833 166242 210775 195932
478 195932 120545 5725 -111405 -192802 -213383 -169928 -78577 31503 132837 199956 210033
489 210033 152700 43544 -75677 -164503 -202394 -186457 -120443 -15037 101458 187645 211247
500 211247 167905 78736 -27896 -126451 -193336 -204524 -149439 -46082 67314 155776 198616
511 198616 187149 119891 13148 -98755 -177418 -200533 -166634 -85885 21598 125010 191513
522 191513 197494 142673 48192 -57503 -146693 -196058 -187069 -118093 -12774 92864 167384 194614
534 194614 167090 88521 -19109 -120773 -183012 -190296 -143027 -54037 52409 144291 191285
545 191285 179039 115255 19929 -81594 -162570 -195572 -165824 -84062 18788 110499 171207
556 171207 187564 148129 57858 -52274 -141165 -182281 -171993 -117072 -26889 76645 159279
567 159279 189751 159993 85452 -10482 -103545 -170005 -185726 -142114 -55296 43714 127236 177065
579 177065 177237 120622 23380 -77659 -148373 -175857 -158648 -96074 2013 104425 169971 177128
591 177128 133705 58759 -31358 -119360 -176751 -176927 -117057 -23978 68624 138883 173561 160093
603 160093 95235 -2310 -96747 -157807 -173011 -139793 -64227 33106 119367 166891 164854 118224
615 118224 36359 -60897 -141441 -174826 -151812 -87302 -4041 81631 151022 177318 142768 59129
627 59129 -35544 -110431 -153966 -162347 -124376 -40522 61865 138498 165570 146032 91281 10762
639 10762 -79917 -150166 -170679 -135555 -62300 24199 103688 156246 163081 117483 35814 -52968
651 -52968 -124308 -161663 -152384 -94610 -6072 80512 139102 158547 136650 72541 -19371 -106262
663 -106262 -154526 -153403 -111338 -42186 41395 119812 162928 151314 90436 7658 -71302 -130807
675 -130807 -157608 -137826 -71434 18395 97857 145271 151639 116969 45601 -42882 -116807 -152617
687 -152617 -143391 -94451 -18227 66424 131950 155868 130660 68937 -10142 -86993 -141074 -154147
699 -154147 -116954 -43182 39945 107359 144911 143352 98607 20376 -64437 -126506 -148901 -129197
711 -129197 -72614 5471 83720 136885 148184 114933 47790 -32794 -103268 -143686 -140721 -95509
723 -95509 -21915 57127 119067 146068 129848 73751 -4152 -80020 -130644 -143761 -114226 -49780
735 -49780 29592 99271 138510 137175 95866 25306 -53182 -115831 -142803 -126423 -72927 943
747 943 73712 125944 141595 114459 51017 -27604 -95271 -133433 -132844 -95310 -29042 47772 111447
760 111447 140301 125137 71888 546 -68854 -119501 -137727 -114393 -53490 24611 92589 129637
772 129637 129165 93499 30826 -43069 -106239 -137025 -124084 -73108 -2168 66200 114714 132357
784 132357 111833 56272 -18718 -87971 -128253 -127917 -91208 -30311 38663 98375 131736 124452
796 124452 75794 4103 -64788 -111385 -126893 -108593 -57833 13882 82873 124616 126005 90908
808 90908 31452 -35828 -94375 -127026 -120887 -76417 -8549 59764 108473 125603 106975 56827
820 56827 -11288 -76741 -118899 -124719 -92024 -32114 34685 90602 121227 117761 77951 12321
832 12321 -56959 -105971 -121975 -103671 -56887 7586 72069 115370 122288 90780 33713 -30990
844 -30990 -86475 -118149 -115805 -76425 -12877 52403 100072 118936 104151 57993 -7088 -70157
856 -70157 -110460 -117423 -90224 -36717 28064 84813 115530 111161 74686 16613 -47369 -97530
868 -97530 -118164 -102084 -56022 5544 64110 104964 115777 91466 37487 -27081 -80722 -110203
880 -110203 -108848 -75998 -18393 45554 94323 113340 98897 57290 -889 -61241 -103571 -113825
892 -113825 -87808 -36999 22726 75286 107462 108524 75398 18324 -42470 -88659 -109152 -99147
904 -99147 -59143 92 59528 99239 108583 86679 40105 -18717 -73139 -105549 -105045 -73070 -20545
917 -20545 37419 84889 107555 98054 57966 1061 -54724 -93558 -106346 -87806 -41841 17318
929 17318 70473 100710 101240 73114 23530 -34108 -82414 -104867 -95362 -57545 -3944 50641 90627
942 90627 104382 86031 41208 -15490 -66045 -96442 -99760 -73609 -24319 32874 79084 100951
954 100951 93114 58550 6150 -48484 -88364 -100898 -83278 -42184 11238 62419 95290 98903
966 98903 71435 23212 -29797 -73147 -96623 -92836 -60192 -6906 47749 85358 96331 80881
978 80881 43216 -7996 -58905 -92877 -96957 -69965 -23492 27461 69591 93226 90989 59735
990 59735 8836 -44526 -82116 -94233 -79113 -42282 6922 55180 87849 94402 71401 25813
1002 25813 -26457 -68861 -89620 -85977 -58214 -12575 38738 79572 94522 78987 40167 -7554
1014 -7554 -51395 -81953 -91102 -72437 -28854 24748 67500 87425 82782 56784 13963 -35195
1026 -35195 -75318 -91978 -78420 -41465 5434 49205 79575 87999 70030 29362 -20776 -62830
1038 -62830 -85142 -82525 -56230 -13500 33690 71151 87346 77242 43436 -2874 -47953 -77999
1050 -77999 -85246 -67377 -29258 17556 59173 82469 81417 56068 14122 -31918 -68292 -84361
1062 -84361 -74922 -43122 1092 44887 74746 82728 66775 30099 -16092 -57303 -79763 -78424
1074 -78424 -54623 -15092 28973 65051 81948 73727 42841 -966 -42726 -71190 -80004 -65618
1086 -65618 -30625 14077 54257 76905 76324 54060 16008 -26936 -62332 -79492 -71934 -42583
1098 -42583 -765 39904 68843 77765 64101 30365 -12480 -50844 -73876 -74774 -54260 -16743
1110 -16743 25627 59873 75902 69747 42378 3107 -37259 -66299 -75783 -62556 -30466 10870
1122 10870 48496 70855 72506 52793 17882 -22481 -56811 -73922 -68424 -41833 -3287 35168
1134 35168 62847 72519 61812 31792 -8724 -46479 -68736 -70306 -51552 -18212 20647 53826
1146 53826 71161 66847 42198 4731 -33314 -60906 -69845 -59103 -31185 6584 43078 66585
1158 66585 69215 50832 17747 -19264 -50432 -67597 -65378 -42782 -5923 31582 58376 67808
1170 67808 57740 31033 -5569 -40769 -63314 -66486 -49804 -18878 17663 48921 65901 62530
1182 62530 40686 6892 -28447 -55712 -66673 -57216 -30294 5372 38397 59778 64235 50125
1194 50125 19855 -16950 -47425 -62631 -60096 -40342 -8618 26479 54067 64262 54593 29848
1206 29848 -3445 -35462 -57874 -63309 -48393 -18832 15023 43823 60213 59384 40473 8468
1218 8468 -25718 -50892 -60895 -53673 -30937 2147 34612 55927 60096 46647 20211 -12327
1230 -12327 -42210 -59126 -57357 -38442 -9240 22111 47739 59706 53278 29890 -2352 -32098
1242 -32098 -52320 -57598 -46685 -21090 11752 40625 56170 55085 38496 10803 -21207 -46571
1254 -46571 -57135 -50639 -29493 -327 29557 51065 57229 45049 19698 -10281 -36888 -53301
1266 -53301 -54249 -38691 -10419 20407 43860 54358 49646 30325 1039 -28494 -48663 -54034 -43633
1279 -43633 -20570 8589 35948 52017 51913 36751 11235 -17476 -41588 -53616 -48624 -28627
1291 -28627 -551 26146 45110 52043 44059 21308 -8733 -34970 -48838 -49007 -35834 -12211 16346
1304 16346 40268 51459 46380 28111 2229 -24352 -43856 -50881 -41948 -20401 6865 31772
1316 31772 46833 48608 35731 11641 -15324 -37485 -48671 -45524 -28904 -2731 23532 41904
1328 41904 47546 40245 21354 -4792 -30396 -46494 -47083 -33789 -11780 12784 34604 47346 45114
1341 45114 28026 2571 -22511 -39472 -45914 -39833 -21663 4241 29148 44088 44980 33127 12406
1354 12406 -12047 -33275 -45405 -42999 -27541 -3844 20469 38031 44554 38028 20501 -3440
1366 -3440 -26587 -41497 -44316 -33019 -12045 11861 31568 42429 41206 27858 5007 -19339
1378 -19339 -36984 -42635 -36249 -19870 2158 24592 40306 42891 32084 11948 -11034 -29869
1390 -29869 -40514 -39923 -27190 -5413 18141 35092 40895 35412 19401 -2074 -23130 -38202 -40814
1403 -40814 -31032 -12056 9740 28381 39003 38389 26144 5645 -16516 -33299 -39674 -34356 -19214
1416 -19214 1261 22084 35975 39217 30399 12740 -8847 -27172 -37489 -36766 -24953 -5996 14806
1429 14806 31209 38000 33880 19054 -1120 -20430 -34134 -37379 -29528 -12912 7651 25689 36023
1442 36023 35275 24285 6372 -13648 -29622 -36543 -32710 -19058 140 18913 32453 35901 28657
1455 28657 12965 -6538 -23957 -34100 -34560 -24362 -6541 12813 28221 34466 31409 18877 893
1468 893 -17866 -31218 -35045 -27625 -12370 6030 22034 32002 33145 24030 7268 -12185 -26940
1481 -26940 -32954 -29786 -18136 -1807 16172 29893 33605 26969 12055 -5110 -20775 -30492 -32001
1494 -32001 -23511 -6964 11026 25146 31479 28971 18148 1571 -15572 -28165 -31473 -25965 -12819
1507 -12819 4196 20102 29575 29939 21679 7453 -9145 -23468 -31083 -28403 -17103 -1220 14170
1520 14170 25314 30268 25979 13096 -4310 -19284 -27700 -28421 -21440 -8236 8300 22972 29353
1533 29353 26935 16470 2626 -12440 -24900 -29576 -24662 -12004 3535 16942 26072 27892 21468
1546 21468 7938 -8408 -21012 -27259 -25681 -17169 -3261 12459 23869 27340 22865 12353 -1715
1559 -1715 -15895 -25657 -27001 -19808 -7064 6690 18867 26101 25659 16810 2457 -11809 -21663 -25207
1573 -25207 -22483 -12786 1667 15472 23972 25107 18938 7903 -6061 -18456 -25229 -23709 -15297
1586 -15297 -3079 9912 20427 25400 22224 11609 -2198 -13937 -21799 -23861 -19292 -8227 5918
1599 5918 17771 23521 22108 15058 3701 -9140 -19738 -24070 -20482 -11022 1107 12779 21095
1612 21095 23143 18354 7243 -5280 -15896 -22086 -21673 -14941 -3628 9114 18450 22227 19440 11541
1626 11541 -38 -12318 -20415 -21771 -16834 -7011 3929 14496 20927 20937 14201 3298 -8253 -17195
1640 -17195 -20936 -18959 -10999 -143 11199 18910 20881 16554 7483 -4041 -14245 -19728 -19382 -13524
1654 -13524 -4256 6970 16427 20534 18193 9943 -251 -10094 -16864 -19940 -16535 -7732 3449 13531
1668 13531 18505 17965 12840 4235 -6368 -15124 -19453 -17377 -9917 -198 9331 16061 18282 15215 7243
1683 7243 -2874 -12416 -17718 -17586 -12170 -3451 6211 13789 17701 16542 10175 280 -9309 -15702 -16972
1698 -16972 -13972 -6735 2142 11256 17040 16781 12115 3268 -5573 -12938 -16784 -15636 -9652 -520 8369
1713 8369 14691 16391 13568 6349 -2356 -10558 -15290 -15707 -11296 -3611 5281 12353 15963 14609 8674
1728 8674 622 -7648 -13672 -15607 -12903 -6140 2362 10133 14529 14730 10580 3514 -4684 -11518 -14815
1743 -14815 -13556 -8255 -729 7257 12853 14583 12157 6050 -1862 -9006 -13576 -14169 -10184 -3473 4245
1758 4245 10644 13939 13141 8191 802 -6611 -11816 -13698 -11116 -5751 1412 8572 13077 13043 9542 3115
1774 3115 -4089 -9709 -13036 -12188 -7336 -733 6430 11214 12800 10695 5684 -1468 -7920 -11971 -12317
1789 -12317 -9142 -2948 3597 9431 12212 11323 6903 863 -5554 -10516 -11985 -10037 -4673 1534 7426
1804 7426 11251 11615 8739 2717 -3602 -8567 -11171 -10563 -6643 -543 5446 10167 11367 9271 4656
1819 4656 -1323 -6875 -10487 -11120 -7649 -2712 3412 8404 10890 9909 6166 944 -5002 -9267 -10517
1834 -10517 -8927 -4508 1356 6425 9973 10088 7218 2366 -3053 -7953 -10088 -9267 -5731 -591 4672
1849 4672 8886 10290 8204 3919 -1518 -6078 -9064 -9433 -6983 -2240 3307 7416 9349 8759 5419
1864 5419 462 -4399 -8169 -9204 -7700 -3547 1334 6008 8691 9001 6402 1985 -2903 -6953 -8865
1879 -8865 -8106 -4906 -282 4100 7481 8417 6944 3672 -1332 -5675 -8284 -8197 -5662 -1822 2876 6554
1895 6554 8317 7316 4378 246 -4256 -7435 -7993 -6483 -2934 1395 5373 7688 7687 5480 1565 -2698
1911 -2698 -6372 -7705 -6774 -4091 153 3806 6804 7415 6148 2892 -1324 -5024 -7000 -7200 -4903 -1327
1927 -1327 2636 6033 7251 6437 3724 52 -3992 -6554 -6883 -5405 -2389 1267 4796 6939 6535 4754
1943 4754 1176 -2763 -5490 -6851 -5792 -3300 52 4011 6014 6557 5115 2178 -1592 -4425 -6174
1958 -6174 -6318 -4220 -1198 2676 5192 6298 5291 3072 -72 -3715 -5822 -6153 -4636 -1839 1729
1973 1729 4060 5736 5644 4093 708 -2684 -5159 -6288 -5002 -2612 551 3193 5390 5791 4290 1507
1989 1507 -1790 -3999 -5648 -5127 -3547 -531 2423 4684 5750 4763 2420 -755 -3513 -5053 -5260 -4048
2005 -4048 -1502 1569 4061 5327 4782 2861 489 -2667 -4596 -5501 -4558 -1882 919 3315 4594 4853
2021 4853 3405 1157 -1610 -3916 -4832 -4384 -2708 -122 2490 4508 4723 3918 1787 -704 -3228 -4589
2037 -4589 -4371 -3180 -953 1426 3789 4856 4143 2369 -126 -2477 -3762 -4537 -3545 -1452 843 3193
2053 3193 4333 4090 2860 772 -1739 -3662 -4681 -3673 -1972 292 2338 4079 4268 3681 1442 -1053
2069 -1053 -2967 -4068 -4003 -2435 -515 1632 3335 4173 3330 1694 -347 -2606 -3768 -3743 -2796 -1099 1092
2086 1092 2941 4116 3627 2074 153 -1708 -3306 -3952 -3206 -1463 707 2505 3701 3604 2702 694
2102 694 -1626 -3118 -3662 -3210 -1989 -6 1940 3210 3432 2483 1066 -695 -2242 -3322 -3131 -2148 -265
2119 -265 1475 3031 3491 2807 1648 -185 -2022 -3087 -3398 -2468 -913 966 2329 3327 3029 1777 329
2136 329 -1405 -2775 -3393 -2711 -1087 679 1977 2967 2853 2370 638 -995 -2344 -2945 -2775 -1498 -99
2153 -99 1683 2640 3050 2306 880 -824 -2282 -2916 -2927 -1733 -320 1110 2538 3006 2582 1453 -459
2170 -459 -1609 -2662 -2660 -2153 -735 768 2193 2673 2648 1734 269 -1278 -2443 -2843 -2134 -1210 644 1871
2188 1871 2467 2772 1759 540 -1006 -2166 -2655 -2550 -1211 173 1711 2556 2605 2136 783 -962 -2045
2205 -2045 -2967 -2656 -1411 -131 1252 2167 2492 2342 866 -632 -2001 -2619 -2510 -2122 -517 976 2328
2222 2328 2448 2097 1301 -245 -1482 -2446 -2524 -1708 -546 614 1943 2676 2454 1574 118 -1306 -2369
2239 -2369 -2547 -2129 -1178 410 1671 2411 2479 2187 501 -1052 -2219 -2791 -2476 -1405 65 1217 2299
2256 2299 2574 2153 751 -633 -1759 -2561 -2548 -1830 -328 1037 2238 2656 2403 1361 -274 -1915 -2630
2273 -2630 -2661 -1841 -558 957 2225 2744 2531 1522 47 -1510 -2522 -2676 -2139 -1063 472 1946 2684
2290 2684 2696 2045 465 -1087 -2245 -2873 -2418 -1358 94 1495 2400 2895 2130 1035 -653 -2281 -2635
2307 -2635 -2674 -1656 -237 1131 2484 2793 2328 1212 -445 -1720 -2833 -3134 -2017 -710 990 2245
2323 2245 2889 2665 1594 218 -1452 -2582 -2906 -2333 -1217 402 1903 2919 2829 2235 695 -1013 -2533
2340 -2533 -2912 -2865 -1701 38 1572 2808 3030 2535 1115 -614 -2013 -2983 -2888 -2153 -588 1322 2441
2357 2441 3155 2707 1485 136 -1768 -2920 -3323 -2384 -980 966 2212 2928 2975 2057 488 -1660 -2794
2374 -2794 -3234 -2848 -1589 278 1893 2959 3171 2268 896 -1026 -2324 -3370 -3208 -2077 -364 1689
2390 1689 3099 3560 2665 1196 -422 -2064 -2945 -3328 -2363 -813 1210 2850 3483 3082 1700 269 -1508
2407 -1508 -2962 -3609 -2940 -1331 718 2187 3264 3120 2527 919 -1201 -2774 -3480 -3199 -1882 23
2423 23 1646 3153 3580 2736 1350 -717 -2501 -3459 -3409 -2437 -536 1161 2806 3635 2884 1766 139
2440 139 -2038 -3190 -3689 -2978 -1591 546 2672 3267 3457 2380 791 -1629 -3024 -3517 -3103 -1843 45
2457 45 2013 3301 3685 2912 1251 -953 -2419 -3702 -3651 -2332 -405 1425 3247 3834 3245 1679 -271
2474 -271 -2051 -3179 -3807 -2856 -1006 1001 2770 3683 3655 2341 493 -1742 -3231 -3862 -3401 -1742 330
2491 330 2173 3449 3761 2904 968 -1070 -2909 -3897 -3591 -2321 -350 1623 3136 3880 3135 1860 -340
2508 -340 -2522 -3697 -4010 -2782 -1075 996 2970 3703 3563 2296 220 -1854 -3202 -3885 -3333 -1564
2524 -1564 495 2457 3946 3914 2966 1220 -1105 -2791 -3946 -3616 -2480 -246 1793 3397 3893 3488
2540 3488 1457 -645 -2449 -3908 -3751 -2934 -903 1238 3143 3940 3654 2431 199 -1863 -3441 -3951
2556 -3951 -3373 -1556 493 2647 3785 3741 2912 1254 -1314 -3068 -4102 -3813 -2293 -477 2082 3478
2572 3478 4181 3545 1638 -550 -2609 -3909 -4190 -2823 -797 1423 3148 4064 3713 2307 179 -1889
2588 -1889 -3364 -4113 -3360 -1725 1005 2430 4080 4015 2798 779 -1492 -3122 -4134 -3565 -2330 -7
2604 -7 2135 3521 3957 3097 1720 -731 -2786 -3821 -4090 -2642 -810 1310 3332 4121 3502 2280 -75
2621 -75 -2208 -3544 -4239 -3482 -1330 623 3156 4140 4095 2922 854 -1817 -3350 -4482 -3872 -2075 -57
2638 -57 2476 3630 4300 3359 1608 -658 -2755 -3951 -3997 -2716 -742 1373 3593 4042 3760 2214 -131
2655 -131 -2297 -3948 -4291 -3220 -1509 1051 2924 4232 4068 2895 907 -1425 -3551 -4467 -3873 -2258
2671 -2258 27 2306 3852 4223 3438 1576 -824 -3154 -4052 -4063 -2858 -860 1790 3482 4279 3870 2057
2688 2057 137 -2502 -4082 -4144 -3415 -1523 790 3118 4303 3956 2848 579 -1681 -3568 -4372 -3818
2704 -3818 -1931 454 2218 3898 4236 3362 1408 -955 -3212 -4271 -3987 -3000 -569 1541 3566 4277
2720 4277 3840 2361 29 -2482 -3784 -4389 -3376 -1523 987 2990 4365 4169 3065 507 -1777 -3551
2736 -3551 -4146 -3923 -2301 200 2392 3677 4145 3403 1365 -943 -2964 -4285 -4288 -2912 -817 1688 3539
2753 3539 4447 3717 2282 -133 -2294 -4118 -4601 -3692 -1469 793 3076 4074 4149 2665 507 -1900 -3562
2770 -3562 -4466 -3709 -2017 -40 2345 4143 4387 3148 1518 -807 -3088 -4169 -4203 -2927 -738 2023
2786 2023 3575 4582 3904 2147 -194 -2390 -4023 -4383 -3426 -1184 1031 3022 4346 3867 2952 552
2802 552 -1747 -3706 -4582 -3781 -2146 -67 2483 3848 4289 3648 1381 -1045 -3264 -4211 -4239 -3220 -747
2819 -747 1799 3641 4152 4002 2182 -54 -2654 -4120 -4450 -3371 -1337 857 3233 4306 4491 2822
2835 2822 630 -1801 -3605 -4259 -3875 -2253 228 2710 4056 4462 3464 1571 -943 -3121 -4371 -4113
2851 -4113 -2796 -746 1711 3461 4344 3636 2036 -423 -2664 -4113 -4462 -3466 -1356 1036 3192 4328
2867 4328 4090 2786 842 -1753 -3717 -4629 -3906 -2171 313 2356 4041 4500 3277 1604 -1023 -3081
2883 -3081 -4309 -4131 -3081 -701 2070 3516 4503 4084 2192 -146 -2374 -4082 -4479 -3423 -1383 928
2899 928 3211 4355 4408 3268 698 -1898 -4041 -4376 -3872 -2169 24 2440 4094 4213 3531 1534 -1125
2916 -1125 -3148 -4247 -4260 -2704 -569 1574 3689 4594 3651 2133 -206 -2392 -4046 -4486 -3552 -1556
2932 -1556 1176 2940 4365 4316 2883 767 -1724 -3850 -4511 -3843 -2249 95 2481 3853 4390 3522
2948 3522 1588 -921 -3030 -4351 -4414 -3041 -931 1620 3598 4437 3999 2295 -3 -2235 -4165 -4373
2964 -4373 -3763 -1538 1119 3118 4205 4377 2866 759 -1987 -3576 -4272 -4022 -2196 136 2486 3999
2980 3999 4308 3548 1456 -991 -3454 -4351 -4379 -2876 -664 1604 3584 4348 3933 2146 -163 -2418 -4090
2997 -4090 -4218 -3425 -1427 903 3174 4330 4334 3239 756 -1764 -3701 -4502 -4116 -2186 89 2616 4206
3014 4206 4542 3696 1668 -760 -3186 -4375 -4254 -2966 -761 1885 3787 4447 4183 2284 -65 -2263
3030 -2263 -4210 -4507 -3578 -1721 842 3225 4427 4280 2939 843 -1591 -3720 -4481 -4141 -2507 37
3046 37 2421 4287 4620 3505 1710 -784 -3361 -4532 -4351 -2994 -811 1612 3651 4604 3866 2465
3062 2465 -241 -2597 -4047 -4822 -3692 -1494 954 2857 4472 4327 2952 976 -1806 -3397 -4812
3077 -4812 -4219 -2470 51 2685 4027 4603 3809 1580 -845 -3328 -4264 -4300 -3113 -996 1626 3639
3093 3639 4691 4173 2663 -17 -2557 -4017 -4625 -3890 -1793 706 3108 4612 4579 3268 651 -1589
3109 -1589 -3608 -4474 -4150 -2634 -247 2411 4018 4520 3801 1679 -698 -3018 -4420 -4560 -3200 -968
3125 -968 1655 3401 4560 4104 2439 142 -2352 -4139 -4610 -3985 -1699 766 3102 4425 4428 3177 1166
3142 1166 -1208 -3511 -4602 -4031 -2554 -277 2339 4293 4518 4034 1883 -884 -2978 -4452 -4629 -3519
3158 -3519 -1117 1508 3574 4439 4362 2977 474 -2296 -4176 -4663 -4023 -1966 592 2791 4447 4626
3174 4626 3444 1147 -1346 -3551 -4888 -4629 -2906 -363 2252 4403 4681 4061 1945 -770 -3103 -4517
3190 -4517 -4442 -3565 -1261 1390 3578 4503 4520 2852 478 -2084 -4082 -4593 -4216 -2426 472 2857 4296
3207 4296 4531 3642 1364 -1279 -3433 -4550 -4671 -2986 -406 2316 3800 4629 4168 2139 -139 -2825
3223 -2825 -4609 -4677 -3358 -1322 1349 3333 4747 4712 2839 405 -2200 -3912 -4706 -4114 -2382 479
3239 479 2774 4350 4760 3575 1607 -1271 -3188 -4880 -4547 -2896 -339 2086 3856 4745 3901 2474
3255 2474 -205 -2734 -4471 -4906 -3719 -1522 1173 3133 4752 4713 2959 709 -2040 -4045 -4884 -4204
3271 -4204 -2339 135 2900 4238 4637 3548 1600 -1065 -3436 -4596 -4496 -3153 -526 1771 4146
3286 4146 4901 4142 2527 -379 -2539 -4207 -4692 -3672 -1510 1109 3088 4527 4483 2972 820 -2195
3302 -2195 -3978 -4741 -4086 -2174 110 2663 4193 4641 3583 1556 -912 -3359 -4415 -4599 -3213 -761
3318 -761 1884 3835 4835 4367 2451 -4 -2450 -3965 -4529 -3663 -1785 1072 3161 4688 4313 3102
3334 3102 795 -1934 -3892 -4775 -4077 -2421 162 2590 4263 4799 3678 1604 -935 -3282 -4754 -4760
3350 -4760 -3167 -665 1807 3699 4832 4150 2261 -51 -2293 -4211 -4713 -3716 -1458 876 3198 4656
3366 4656 4540 3121 1117 -1455 -3784 -4780 -4204 -2360 69 2574 4025 4831 4042 1610 -630 -3360
3382 -3360 -4542 -4593 -3007 -1262 1669 3712 4448 4246 2520 18 -2525 -4190 -4754 -3837 -1839 689
3398 689 3021 4458 4452 3061 862 -1745 -3902 -4997 -4152 -2640 -200 2508 3897 4566 3806 1911 -864
3415 -864 -3029 -4558 -4347 -3085 -1079 1518 3699 4475 4278 2670 163 -2409 -3959 -4621 -3719 -1760
3431 -1760 804 3086 4318 4257 3225 879 -1462 -3546 -4622 -4208 -2607 -128 2481 3899 4362 3562
3447 3562 1784 -684 -2796 -4315 -4443 -3134 -955 1442 3575 4733 4302 2624 220 -2274 -3931
3462 -3931 -4832 -3816 -1693 592 3047 4303 4539 3039 1176 -1640 -3633 -4726 -4293 -2467 84 2249
3478 2249 4271 4768 3606 1678 -707 -2862 -4523 -4565 -3220 -1010 1342 3741 4432 4070 2534 393
3494 393 -2361 -4093 -4644 -4024 -1911 615 2820 4207 4457 3319 1131 -1523 -3623 -4726 -3990 -2674
3510 -2674 -325 2136 3700 4582 3812 1890 -608 -2806 -4339 -4282 -3171 -1233 1420 3365 4425 4089
3526 4089 2661 427 -2005 -3781 -4526 -3862 -2080 662 2722 4341 4490 3326 1168 -1225 -3268 -4542
3542 -4542 -4000 -2753 -291 2280 3754 4519 3872 1855 -665 -2936 -4040 -4463 -3008 -1253 1487 3500
3558 3500 4236 4168 2330 660 -2351 -3924 -4259 -3513 -1983 417 2600 4439 4363 3111 1440 -1448 -3345
3575 -3345 -4197 -4029 -2380 -362 2061 3822 4520 3736 1798 -734 -2749 -4137 -4371 -3263 -1153 1365
3591 1365 3218 4332 4100 2555 524 -1990 -4046 -4368 -3778 -2069 469 2816 4002 4399 3322 1310
3607 1310 -1255 -3253 -4174 -3972 -2500 -224 2090 3546 4517 3472 2043 -414 -2741 -3796 -4431 -3132
3623 -3132 -1281 1081 3422 4397 4247 2776 587 -1656 -3688 -4239 -3693 -2029 411 2735 4062 4317
3639 4317 3157 1399 -1081 -3284 -4383 -4060 -2537 -354 1729 3757 4440 3962 1847 -411 -2468 -3893
3655 -3893 -4211 -3089 -1208 1312 3417 4251 4077 2567 862 -1701 -3656 -4278 -3613 -1969 364 2727
3671 2727 3827 4260 3150 1393 -883 -3365 -4145 -4018 -2957 -442 1776 3461 4299 3606 2066 -116
3687 -116 -2337 -4079 -4213 -3241 -1032 1131 3278 4205 4084 2694 385 -1694 -3795 -4147 -3687 -1918 336
3704 336 2550 3980 4214 3221 1196 -1118 -2985 -4080 -4209 -2507 -657 1771 3373 4335 3689 1934
3720 1934 -79 -2206 -3975 -4108 -3348 -1326 649 2933 3989 4160 2838 786 -1688 -3171 -3932 -3824
3736 -3824 -2121 204 2368 3759 3985 3080 1543 -945 -3094 -3989 -3975 -2549 -744 1481 3350 4109
3752 4109 3541 2119 -175 -1890 -3591 -3944 -2934 -1425 765 2719 3948 3994 2650 437 -1439 -3164
3768 -3164 -3919 -3645 -2245 -112 2305 3480 3945 3205 1544 -911 -2890 -3863 -3731 -2862 -889 1438 3129
3785 3129 3886 3554 2115 60 -2104 -3695 -3936 -3122 -1323 803 2637 3666 3856 2855 964 -1356
3801 -1356 -3054 -3864 -3727 -2175 9 1876 3483 3821 2977 1592 -389 -2650 -3822 -3652 -2601 -828
3817 -828 1481 2914 3714 3456 2043 322 -1747 -3590 -3949 -2923 -1663 174 2446 3637 3886 2709
3833 2709 1005 -1163 -3006 -4024 -3474 -2259 -271 1796 3450 3569 3248 1740 -532 -2309 -3447 -3650
3849 -3650 -2931 -746 1221 2988 3390 3541 2416 393 -1958 -3304 -3605 -3061 -1659 300 2025 3517
3865 3517 3845 2928 922 -1031 -2743 -3388 -3429 -2160 -215 1632 2975 3531 3099 1567 -352 -2118 -3307
3882 -3307 -3523 -2689 -739 1031 2896 3643 3541 2138 258 -1551 -3062 -3678 -3165 -1626 270 2134
3898 2134 3339 3053 2611 866 -966 -2640 -3460 -3307 -2295 -460 1645 3042 3543 2992 1563 -276
3914 -276 -1947 -2971 -3575 -2751 -1019 908 2483 3380 3301 2093 446 -1444 -2987 -3289 -2720 -1662 419
3931 419 1658 3323 3333 2589 1085 -750 -2455 -3208 -3097 -1947 -384 1359 3168 3239 2995 1374 -87
3948 -87 -1832 -3056 -3261 -2396 -885 900 2448 2982 3086 2182 505 -1325 -2778 -3312 -2567 -1677 112
3965 112 2001 3243 3307 2643 1132 -461 -2142 -3216 -3115 -2197 -443 1248 2600 3170 2905 1619 -163
3982 -163 -1778 -2719 -3278 -2390 -1105 775 2319 2988 2983 2078 471 -1120 -2575 -3279 -2617 -1646 135 1548
4000 1548 2844 3033 2689 1127 -245 -2018 -3185 -2846 -1733 -663 1103 2376 3087 2737 1697 63
4016 63 -1616 -2456 -3101 -2654 -1114 721 2118 3102 3055 2170 922 -1162 -2401 -3038 -2768 -1448 -57 1477
4034 1477 2830 3035 2703 1245 -519 -2049 -2840 -2863 -2113 -352 1170 2073 2952 2664 1582 146 -1401
4051 -1401 -2512 -3168 -2165 -981 407 2024 2665 2881 1987 659 -898 -2174 -2778 -2656 -1598 -146
4067 -146 1566 2482 3080 2350 1251 -643 -1898 -2890 -2947 -2142 -890 976 2251 2560 2709 1759 62 -1269
4085 -1269 -2561 -2670 -2331 -1089 279 1795 2681 2662 1900 743 -802 -2134 -2888 -2674 -1652 -379 1484
4102 1484 2388 2635 2573 1093 -149 -1847 -2566 -2675 -2108 -834 819 2168 2689 2693 1751 102 -1359 -2683
4120 -2683 -2722 -2413 -1377 434 1545 2716 2632 2054 558 -834 -2016 -2651 -2621 -1551 -346 1220 2330
4137 2330 2630 2431 1180 -127 -1649 -2489 -2701 -2087 -642 996 2078 2622 2627 1557 300 -1222 -2445
4154 -2445 -2695 -2289 -1244 122 1421 2382 2625 2104 867 -759 -2056 -2597 -2493 -1744 -437 1102 2097
4171 2097 2714 2339 1390 -120 -1709 -2413 -2417 -2091 -782 458 2075 2542 2414 1669 285 -1022 -2054 -2539
4189 -2539 -2464 -1184 -3 1505 2470 2603 2115 757 -469 -1774 -2759 -2389 -1809 -537 1184 2133 2432
4206 2432 2048 1412 -207 -1434 -2493 -2477 -2091 -975 345 1867 2458 2359 1611 455 -1210 -2122 -2345 -2159
4224 -2159 -1183 -8 1331 1990 2421 1950 760 -505 -1599 -2375 -2491 -1561 -538 1099 1931 2657 2202
4241 2202 1467 -187 -1118 -2205 -2412 -2047 -995 560 1561 2365 2477 1691 509 -750 -1867 -2258 -2061
4258 -2061 -1333 169 1488 2147 2366 1682 750 -215 -1499 -2516 -2323 -1514 -298 776 1594 2140 2258 1184
4276 1184 -182 -1179 -2099 -2101 -1734 -975 192 1672 2001 2100 1767 153 -801 -1765 -2017 -1864 -1126 4 1057
4295 1057 1795 2410 1869 866 -233 -1436 -2299 -2265 -1836 -647 630 1584 2165 1823 1415 6 -991 -1871
4313 -1871 -2054 -1690 -934 145 1384 2089 2214 1470 602 -464 -1710 -2037 -2114 -1168 55 851 1759 2116
4331 2116 1681 918 -282 -1316 -2107 -2292 -1475 -510 586 1665 2385 1859 1128 308 -941 -1920 -1978 -1713
4349 -1713 -857 369 1272 2071 2050 1488 463 -653 -1561 -1999 -1790 -1302 -40 1150 1816 2093 1720 1022
4367 1022 -454 -1331 -1824 -2107 -1473 -386 599 1461 2071 2006 1203 20 -900 -1696 -2087 -1712 -588 365 1354
4386 1354 1932 1959 1241 431 -645 -1541 -1966 -1904 -1052 -115 923 1593 1752 1556 731 -140 -1280 -1927 -1741
4405 -1741 -1415 -357 509 1379 1956 1915 1155 101 -838 -1649 -1951 -1725 -727 259 1109 1743 2019 1516 612
4424 612 -610 -1454 -1757 -1661 -1241 -240 638 1389 1951 1720 947 -196 -1317 -1579 -2063 -1534 -473 425 1368
4443 1368 1986 1682 1127 165 -851 -1631 -1701 -1435 -832 38 1088 1697 1581 1512 410 -597 -1161 -1846 -1376
4462 -1376 -1133 148 829 1551 2016 1684 834 -40 -991 -1988 -1900 -1255 -485 644 1404 1870 1348 971 137
4481 137 -716 -1540 -1771 -1481 -724 336 1068 1583 1775 1101 511 -479 -1221 -1677 -1632 -1103 -179 1019 1596 1380
4501 1380 1512 704 -333 -1113 -1376 -1659 -1196 -486 489 1322 1855 1710 844 -151 -732 -1252 -1734 -1356 -756
4520 -756 226 1052 1705 1689 1032 160 -601 -1365 -1759 -1780 -1094 -143 767 1533 1872 1219 711 -430 -1019 -1642
4540 -1642 -1624 -1143 -348 745 925 1606 1518 714 68 -577 -1425 -1365 -1505 -699 151 1241 1652 1415 1357 288
4560 288 -354 -1172 -1576 -1402 -888 -14 871 1413 1628 1426 1047 -287 -975 -1555 -1553 -1241 -417 655 1209 1404
4580 1404 1330 1055 178 -453 -1380 -1655 -1302 -641 302 844 1438 1559 1145 252 -298 -1002 -1391 -1461 -785 -32
4600 -32 933 1412 1567 1363 713 -42 -951 -1453 -1559 -923 -485 393 1215 1764 1319 616 -2 -690 -1428 -1295
4620 -1295 -1402 -604 11 830 1434 1226 1006 577 -526 -1155 -1799 -1466 -818 148 683 1117 1328 1412 693 -211
4640 -211 -971 -1447 -1378 -1182 -413 311 955 1534 1451 871 102 -716 -1300 -1208 -1417 -463 2 654 1266 1453 1169
4661 1169 653 -299 -951 -1574 -1295 -939 -181 587 1167 1504 1322 697 -234 -698 -1416 -1384 -984 -327 372 1164
4681 1164 1134 1163 949 217 -523 -1230 -1352 -1232 -472 239 877 1089 1553 1096 339 -494 -849 -1191 -1169 -906 -47
4702 -47 681 1044 1275 1161 488 -156 -708 -1040 -1080 -1097 -228 493 1030 1312 1049 714 25 -485 -1008 -1128 -1115
4723 -1115 -804 -16 1001 1080 1133 898 258 -226 -928 -1209 -1096 -595 -134 470 1002 1333 956 592 -347 -639
4743 -639 -1108 -1165 -700 -77 247 872 1091 859 540 140 -605 -1049 -1142 -1041 -649 -104 710 1090 1302 889 461
4764 461 -560 -845 -987 -665 -782 -197 573 860 1088 628 561 -200 -892 -922 -1150 -860 -262 541 882 1047
4784 1047 924 573 16 -565 -1031 -913 -897 -501 254 628 717 1115 686 188 -380 -812 -1028 -1101 -360 -190 636
4805 636 915 917 796 577 5 -572 -1135 -892 -674 -225 453 725 1013 927 507 131 -654 -962 -1077 -776 -436
4826 -436 126 587 1056 1177 653 -8 -538 -595 -1114 -932 -647 128 451 985 1139 827 289 139 -711 -797 -913
4847 -913 -497 -201 294 787 879 924 470 -133 -299 -957 -972 -1074 -346 119 595 883 990 608 -4 -388 -792
4868 -792 -811 -935 -355 -40 576 908 1033 764 184 -185 -449 -999 -1026 -621 -378 129 650 1050 958 504 197
4889 197 -383 -1041 -887 -692 -170 43 622 1034 1034 667 170 -354 -963 -884 -894 -648 -39 526 1014 720 649 188
4911 188 -78 -616 -1054 -972 -424 -86 289 750 1055 575 475 17 -458 -839 -799 -787 -276 288 434 820 755
4932 755 782 166 -304 -570 -868 -565 -496 17 602 619 887 649 298 -125 -537 -795 -758 -578 -81 460 709
4953 709 789 821 530 154 -456 -743 -991 -813 -239 236 562 825 755 424 -5 -280 -680 -681 -943 -263 133 436
4975 436 842 787 529 112 -388 -550 -1007 -706 -404 11 390 394 663 721 335 -7 -582 -480 -830 -587 -25
4996 -25 104 560 790 963 582 203 -358 -564 -967 -990 -354 9 434 707 871 616 242 -184 -670 -846 -561
5017 -561 -156 -177 225 532 687 714 294 -69 -616 -754 -920 -761 -186 22 590 939 691 625 219 -312 -494
5038 -494 -584 -469 -150 4 344 791 851 550 387 -98 -539 -936 -618 -543 -143 318 638 917 415 156 117
5059 117 -496 -687 -905 -704 -414 347 757 794 720 405 150 -327 -697 -730 -979 -417 -107 307 535 884 519
5080 519 143 -294 -521 -737 -1049 -520 -94 282 835 607 772 233 -44 -502 -707 -826 -654 -293 267 470
5100 470 978 527 698 32 -112 -764 -940 -788 -523 -76 584 727 654 514 125 -174 -574 -736 -902 -656
5120 -656 -29 467 825 787 541 406 -62 -232 -788 -746 -549 -86 92 245 804 909 311 298 -291 -735 -811
5141 -811 -802 -536 -68 515 543 838 803 271 -89 -501 -952 -642 -385 -284 632 657 851 734 321 155 -28 -668
5163 -668 -758 -629 -341 -6 558 846 851 526 -173 -267 -501 -594 -616 -451 17 392 670 764 646 469 -78 -581
5185 -581 -756 -712 -638 -132 166 474 496 683 440 182 -211 -565 -676 -484 -255 365 436 627 740 387 300 -130
5207 -130 -451 -538 -763 -435 -18 166 573 664 707 79 37 -347 -778 -859 -460 -70 282 572 729 733 459 -25
5229 -25 -422 -728 -456 -751 -208 -9 584 716 627 436 270 -274 -499 -619 -572 -419 -204 453 549 742 520
5250 520 291 168 -528 -420 -774 -395 -272 213 449 669 654 366 248 -457 -464 -611 -900 -522 210 90 787
5271 787 350 585 197 -449 -566 -634 -559 -340 171 237 551 904 512 137 -92 -436 -614 -589 -587 -286 211 649
5293 649 613 413 413 -14 -453 -418 -734 -494 -339 -157 451 559 604 463 159 -496 -527 -904 -557 -521 81 185
5315 185 598 872 638 526 -196 -534 -663 -585 -628 -36 35 515 536 666 448 128 -370 -700 -657 -609 -358 -154
5337 -154 526 663 815 657 -136 -314 -453 -754 -616 -275 130 447 572 516 835 263 -147 -645 -618 -702 -574
5358 -574 -29 100 618 537 531 382 231 -257 -528 -774 -585 -308 54 115 675 567 566 94 -217 -459 -484 -355
5380 -355 -333 173 423 627 590 503 421 -62 -511 -562 -796 -516 -345 308 596 473 585 434 -120 -175 -412 -672
5402 -672 -608 -198 152 349 747 614 413 186 -294 -479 -587 -561 -525 -161 397 567 726 887 353 -60 -459
5423 -459 -611 -622 -437 -243 282 394 564 609 529 -203 -371 -588 -740 -498 -644 -124 408 541 647 569 -202
5444 -202 24 -341 -691 -615 -471 69 208 751 708 703 497 -222 -405 -433 -479 -631 -103 296 298 655 654 445 118
5467 118 -280 -598 -436 -567 -257 189 448 857 825 479 292 -375 -364 -720 -704 -151 -277 427 647 452 448 454
5489 454 29 -330 -624 -715 -444 -60 113 549 743 701 587 98 -176 -302 -410 -491 -317 -186 262 432 612
5510 612 494 488 -86 -413 -424 -514 -553 -258 292 362 553 615 333 -67 -498 -389 -798 -469 -318 -163 552 576 562
5533 562 339 101 -337 -622 -681 -636 -341 204 209 528 921 594 265 -98 -576 -713 -490 -537 -186 270 526 878
5555 878 597 360 2 -234 -762 -488 -535 -513 67 582 821 530 742 177 -223 -444 -538 -726 -77 113 -44
5576 -44 685 831 628 317 -80 -377 -484 -995 -602 -292 161 461 567 649 479 20 -377 -570 -752 -750 -247
5597 -247 10 440 528 532 616 113 -163 -655 -755 -618 -260 -90 60 453 711 624 303 -15 -403 -571 -630 -549
5619 -549 -187 435 314 684 717 490 14 -476 -615 -548 -516 -317 220 295 559 661 473 217 -17 -646 -597 -485
5641 -485 -349 91 140 812 802 616 410 -377 -443 -688 -566 -429 -219 271 588 787 665 511 73 -306 -509
5662 -509 -369 -386 -248 244 492 604 488 566 134 -84 -333 -663 -739 -345 -160 383 497 669 611 482 -165
5683 -165 -655 -548 -743 -593 -336 189 202 432 615 491 -47 -240 -582 -508 -550 -202 2 377 764 551 461
5704 461 368 -310 -354 -665 -826 -489 -192 142 504 665 638 539 -216 -288 -128 -700 -679 -425 207 451 650 522
5726 522 411 -5 -420 -688 -813 -534 -270 -161 219 706 788 682 -62 -160 -481 -533 -517 -222 -134 44 618 891
5748 891 562 333 -175 -81 -670 -532 -584 -218 290 325 651 496 573 135 -216 -598 -594 -546 -374 -152 278 887
5770 887 792 655 363 -7 -683 -764 -622 -331 -165 381 536 568 558 539 43 -178 -414 -678 -471 -397 246 88
5792 88 665 335 571 180 -313 -474 -438 -617 -152 -9 236 685 658 800 203 -103 -378 -636 -406 -458 -14
5813 -14 150 439 652 799 420 218 -209 -648 -523 -702 -228 15 242 757 796 269 299 -193 -515 -606 -594 -515
5835 -515 -109 303 518 424 342 118 113 -233 -343 -567 -504 -487 138 539 738 472 275 172 -92 -633 -504 -602
5857 -602 -263 148 160 463 683 454 73 -211 -476 -526 -608 -522 -221 395 511 581 360 251 156 -401 -454 -367 -408
5880 -408 -118 62 390 411 699 346 -30 -432 -660 -729 -391 -316 -52 466 614 608 547 128 -236 -397 -404 -400 -266
5903 -266 -72 231 566 538 497 393 127 -296 -401 -831 -351 -81 265 234 577 515 395 55 -107 -493 -537 -350
5925 -350 -242 -52 391 471 641 443 115 -32 -343 -341 -567 -461 -302 272 487 589 444 466 -91 -156 -470 -544
5947 -544 -478 -237 62 204 562 502 543 -7 -314 -480 -495 -461 -373 15 190 490 739 584 94 -185 -453 -267
5969 -267 -507 -378 -221 333 254 304 493 401 261 -183 -468 -377 -491 -363 80 135 471 479 248 75 -123 -696
5991 -696 -346 -545 -569 -93 425 411 432 484 280 -81 -239 -353 -213 -440 -124 22 455 707 612 338 197 -176
6013 -176 -633 -525 -620 -306 133 410 546 817 385 136 -184 -695 -427 -467 -454 -68 277 222 452 346 82
6034 82 60 -168 -548 -628 -316 -296 52 471 526 480 89 182 -19 -488 -649 -485 -177 250 434 527 354 256 160
6057 160 -71 -48 -636 -319 -521 -86 234 337 329 423 255 -165 -363 -489 -423 -247 -122 294 354 556 423 262
6079 262 -16 -156 -407 -600 -541 -183 -54 354 481 473 444 310 -63 -309 -448 -471 -257 -337 133 412 593 436
6101 436 564 258 -163 -513 -461 -317 -266 -5 225 330 650 337 201 -335 -535 -567 -592 -286 53 330 251 645
6123 645 490 112 26 -288 -553 -436 -490 -452 132 391 469 550 256 -253 -141 -508 -573 -407 -106 -129 193 528
6145 528 419 305 282 48 -205 -597 -218 -493 -342 135 426 765 407 264 -92 -202 -566 -420 -423 -134 -100
6166 -100 100 358 600 363 202 -140 -320 -526 -451 -64 -153 358 524 663 578 174 -120 -524 -371 -508 -177
6187 -177 -174 111 301 787 356 169 -119 -131 -290 -625 -482 -411 43 254 342 610 415 66 -71 -445 -173 -509
6209 -509 -400 40 384 389 707 560 289 -15 -223 -454 -184 -329 -323 5 321 319 405 180 -11 -118 -456 -714
6231 -714 -650 -232 -13 209 418 328 230 12 -134 -174 -622 -276 -278 6 -52 296 281 187 161 153 -190 -336 -432 -376 -199
6256 -199 29 135 501 510 510 171 14 -418 -528 -539 -317 -32 233 102 288 606 229 62 -351 -485 -327 -247
6278 -247 -5 426 276 133 580 179 -56 -275 -353 -550 -352 -350 123 243 236 154 351 160 -27 -179 -449 -471
6300 -471 -384 -270 163 218 556 416 238 -69 -155 -259 -330 -271 -86 -72 280 449 407 141 136 -359 -530 -440 -294
6323 -294 -293 -23 200 619 287 600 407 -24 -301 -492 -689 -429 -5 12 349 342 384 488 68 -336 -465 -236
6345 -236 -360 -54 41 155 186 236 84 158 -281 -188 -552 -515 -113 -164 -9 472 435 525 397 141 -268 -604 -343
6368 -343 -293 -123 104 442 436 755 388 -80 -132 -263 -461 -508 -185 -8 411 407 233 395 86 11 -297 -399 -420
6391 -420 -80 -228 41 400 684 478 160 -107 -288 -522 -717 -263 -64 -66 366 574 347 380 -48 -211 -403
6412 -403 -352 -499 -329 -170 95 467 360 577 72 -133 -406 -671 -276 -138 -81 239 346 308 319 376 -243 -199
6434 -199 -346 -581 -413 -97 -60 320 580 346 306 201 -133 -480 -580 -622 -289 -27 110 372 621 488 211
6455 211 86 -172 -438 -411 -453 -221 18 129 436 263 -15 291 -435 -303 -146 -499 -101 35 502 384 491
6476 491 194 257 -287 -205 -467 -444 -187 -116 469 310 527 315 179 -229 -208 -412 -456 -498 -497 316 423 583 313
6499 313 367 -60 -104 -488 -584 -609 -359 -83 164 586 539 287 82 -157 -101 -551 -629 -386 -125 -9 229 555
6521 555 435 400 74 -288 -314 -314 -454 -245 20 275 442 517 407 -22 -348 -225 -352 -572 47 -228 206 484
6543 484 458 643 39 -176 -126 -404 -622 -253 -153 105 358 617 600 189 48 -423 -464 -632 -157 -146 238 411
6565 411 490 509 241 135 -195 -382 -538 -375 -432 -22 179 452 712 564 65 -118 -159 -517 -470 -348 -274 114
6587 114 302 454 513 375 147 -44 -466 -521 -387 -121 183 309 455 810 358 -58 -402 -602 -480 -331 -546
6608 -546 11 374 464 246 490 208 153 -397 -382 -435 -340 -188 248 109 446 429 273 209 -235 -311 -596 -461 -223
6631 -223 -52 278 590 366 433 201 92 -419 -529 -406 -214 44 -32 546 559 349 181 -35 -173 -398 -525
6652 -525 -388 -291 -89 318 687 444 260 140 -301 -375 -525 -492 -281 8 217 683 508 414 281 35 -132
6673 -132 -528 -822 -212 -65 -37 402 468 265 269 -29 -198 -325 -588 -282 -269 -143 174 447 419 346 -9 -84 -615
6696 -615 -639 -325 -169 -104 -5 389 663 517 95 -53 -243 -241 -142 -139 -311 232 268 284 468 358 -42 -137 -380 -646
6720 -646 -385 -176 77 328 372 325 299 153 22 -501 -634 -468 -358 -184 114 159 797 647 3 104 -289
6741 -289 -223 -568 -334 -113 82 170 555 422 77 96 -306 -415 -465 -398 -122 -128 159 378 692 253 169 -40 -339
6764 -339 -481 -299 -20 -95 22 436 569 227 236 314 -249 -424 -443 -514 -459 -56 214 311 606 392 161 2 -273
6787 -273 -382 -447 -474 -68 111 397 382 531 238 -46 -408 -597 -376 -436 -32 175 449 430 319 520 -105 -167
6809 -167 -17 -483 -299 -320 216 120 311 463 208 62 39 -291 -420 -120 -293 73 198 408 597 307 367
6830 367 -149 -167 -256 -487 -188 -379 175 382 545 406 37 228 -275 -277 -506 -370 -154 -118 85 517 539 198
6852 198 87 148 -104 -449 -548 -330 9 235 356 410 287 151 61 -267 -391 -561 -403 -261 -55 286 590
6873 590 670 409 52 -222 -446 -320 -357 -212 35 192 353 390 368 214 72 -309 -458 -223 -424 16 91 303
6895 303 455 561 9 71 -304 -293 -475 -565 117 45 94 245 243 407 46 -65 -313 -308 -309 -306 -70 252 202 252 433
6920 433 174 13 -460 -455 -637 -435 -147 8 115 389 567 398 -37 -58 -550 -642 -340 -11 -31 381 191 251
6942 251 268 347 -80 -157 -508 -399 -352 114 313 374 303 357 223 147 -117 -344 -758 -187 -30 103 196 598 301
6965 301 158 -36 -138 -383 -340 -524 -245 143 75 532 213 221 150 -138 -273 -497 -511 -444 -191 143 353 632
6987 632 503 196 32 -175 -369 -384 -314 -148 -15 329 402 525 181 108 -264 -368 -435 -278 -208 48 95 441
7009 441 353 270 22 -79 -324 -267 -373 -252 -150 30 301 465 371 203 72 -479 -566 -433 -391 -66 -67 463 466
7032 466 423 424 112 117 -610 -391 -309 -261 170 249 570 494 428 130 19 -336 -348 -373 -229 -90 -168 136 298 432
7056 432 81 126 -151 -431 -704 -309 -322 211 -14 411 716 377 229 -125 -322 -285 -484 -112 20 217 389
7077 389 465 416 78 -126 -308 -512 -690 -321 -32 133 297 402 419 392 31 -137 -236 -432 -497 -34 -18 253
7099 253 413 388 424 31 63 -297 -496 -619 -448 -97 230 267 190 297 37 -50 -323 -221 -451 -371 -216 -95
7121 -95 354 701 414 99 -138 -152 -393 -386 -449 -132 -89 336 555 206 291 200 -85 -427 -376 -498 -500 55 146 201
7145 201 248 304 340 -120 -164 -315 -556 -384 -166 -38 187 477 511 92 23 -23 -293 -427 -483 -345 89 69 476
7168 476 410 679 231 69 -340 -364 -667 -250 -223 -109 455 351 488 410 222 -342 -252 -546 -346 -183 -19 241
7190 241 396 424 389 13 -31 -353 -380 -310 -282 -127 133 300 568 381 393 -100 -309 -514 -416 -716 -71 -38 268
7213 268 408 338 194 -77 -444 -444 -503 -421 21 26 283 225 419 383 -20 -137 -352 -423 -246 -273 -70 108 487 299
7237 299 198 172 -203 -359 -516 -319 -213 -119 202 277 364 543 237 33 -303 -364 -315 -319 -35 131 325 386 358
7260 358 205 267 66 -141 -256 -302 -466 8 80 502 382 249 323 -50 -143 -447 -275 -293 -87 69 -61 302
7282 302 473 519 328 -290 -226 -377 -403 -351 -51 281 254 649 280 136 -199 -315 -515 -473 -236 -174 240 301 556
7305 556 512 425 138 -420 -413 -326 -337 -300 57 5 499 594 538 212 35 -167 -543 -375 -128 280 94 319 335 331
7329 331 501 -83 -376 -348 -480 -182 -107 55 317 451 511 374 43 -145 -433 -512 -461 17 11 397 330 277 256
7352 256 205 -48 -146 -428 -276 -355 -97 142 381 599 288 3 -37 -128 -333 -364 -174 -51 -229 305 386 319 366
7375 366 13 -367 -366 -339 -262 -273 156 -19 247 305 360 127 50 -264 -251 -242 -210 -100 132 364 674 376 463 -51
7399 -51 -333 -280 -547 -475 -88 131 131 442 338 126 104 -374 -471 -544 -457 -440 -51 -97 442 546 438 313 -75 -96
7423 -96 -381 -420 -435 27 247 235 406 442 -162 -106 -212 -284 -602 -265 -287 -28 303 213 263 258 -46 -146 -358 -417
7447 -417 -574 -412 16 139 414 377 370 -37 -96 -137 -363 -515 -128 115 171 44 559 451 355 128 -78 -560
7469 -560 -492 -229 -8 61 265 442 367 71 119 -84 -466 -513 -679 -94 24 123 160 437 206 91 -48 -427
7491 -427 -517 -583 -402 92 123 203 557 288 159 36 -211 -267 -255 -469 -8 126 334 486 229 327 234 30 -374
7514 -374 -528 -159 -357 160 172 217 277 356 175 -240 -129 -365 -436 -322 205 47 460 409 466 228 -27 -134
7536 -134 -476 -399 -470 -351 49 36 474 257 259 -8 -154 -114 -234 -313 -461 -73 -7 369 339 674 106 50 -125
7559 -125 -332 -530 -234 -16 -28 65 456 274 94 -96 -14 -236 -204 -316 -21 120 301 333 349 354 106 -93 -447
7582 -447 -347 -376 -79 -147 187 260 198 156 98 227 -124 -376 -517 -215 51 201 490 483 306 142 142 -214 -302 -485
7606 -485 -366 -155 -33 230 232 365 274 -12 -118 -232 -194 -154 -464 142 245 355 224 424 90 -74 -168 -265
7628 -265 -450 -392 -278 25 217 322 353 -65 110 -357 -425 -274 -188 -233 -8 170 552 442 328 265 -27 -230
7650 -230 -329 -566 -268 -160 151 407 371 206 155 -102 -145 -299 -429 -181 -143 -152 73 564 177 97 124 -55 -387
7673 -387 -395 -282 -271 -53 115 319 460 486 19 131 -295 -273 -386 -99 -318 438 409 439 414 282 -33 -127 -360
7696 -360 -269 -47 -100 349 -22 575 342 94 150 -27 -317 -363 -373 -55 -31 74 544 200 318 290 182 -98
7718 -98 -411 -456 -289 -247 91 138 217 223 62 -170 -54 -342 -612 -348 -162 -112 86 290 106 437 340 93 -485
7741 -485 -368 -302 -335 41 -24 183 348 348 169 -97 -385 -445 -193 -408 -25 -27 13 500 447 107 42 -33 -441 -268
7765 -268 -375 -43 -9 56 413 228 272 -95 220 -80 -359 -295 -70 -65 9 160 283 306 572 -125 -65 -439 -329
7788 -329 -440 -336 -103 343 565 154 455 -68 -161 -52 -224 -448 -241 -186 202 197 231 405 227 8 -139 -564
7810 -564 -492 -228 -173 193 345 -114 335 306 53 23 -230 -221 -235 -26 170 309 144 283 54 38 -73 -381 -414
7833 -414 -201 -257 123 500 220 197 104 213 17 -382 -426 -365 -319 -122 -52 100 290 421 -50 4 -250 -88 -411
7856 -411 -512 -59 158 183 328 447 292 127 60 -213 -345 -171 -43 -160 -59 272 345 202 230 24 -191
7877 -191 -428 -160 -226 -234 -90 105 278 143 175 125 -189 -14 -105 -135 -187 -84 257 472 238 29 162 63 -195
7900 -195 -165 -377 -182 -126 -153 226 558 423 152 -117 -198 -463 -399 -348 118 222 142 321 124 160 218 153 -307
7923 -307 -241 -423 -41 -41 49 210 460 278 -13 192 -76 -233 -266 -141 -132 247 245 237 423 169 -87 -156 -214 -459
7947 -459 -249 -214 120 209 301 193 248 121 -209 -209 -371 -324 -126 -96 22 42 309 143 313 -39 -179 -477 -147
7970 -147 -41 -221 219 248 466 196 14 177 -168 -174 -333 -302 -85 89 299 209 301 434 -206 -221 -159 -152 -314
7993 -314 -213 90 88 379 312 127 -62 38 -245 -233 -326 -133 -408 48 405 337 412 -22 2 -456 -266 -336 -231
8016 -231 -115 444 191 219 532 118 146 -215 161 -45 -179 -303 28 158 119 284 554 316 -75 -64 -307
8037 -307 -518 -3 -82 273 461 372 313 146 -26 -251 -234 -295 -452 -244 162 144 346 309 319 276 -259 -122 -197
8060 -197 -402 -198 -84 79 184 355 485 298 -56 -45 -177 -430 -436 -194 83 -45 457 218 166 3 152
8081 152 -141 -318 -401 -137 -88 503 398 172 273 -86 -96 -347 -407 -118 -180 -94 343 -27 109 232 272 49
8103 49 -73 -247 -485 -315 -12 -40 232 320 326 303 158 -63 -287 -290 -482 10 108 303 143 221 316 165 -121 -49
8127 -49 -313 -198 -100 -147 -127 158 386 160 62 -294 -150 -41 -257 -433 -254 100 213 115 225 217 -35 66 29
8150 29 -321 -254 -297 86 241 357 162 502 204 -74 -154 -81 -260 17 -68 -185 104 566 349 208 -11 93
8172 93 -288 -353 -352 -39 95 176 302 350 221 97 -133 -442 -298 -462 -295 -34 137 265 343
8191C43
$$ Imaginary data points
##PAGE= N=2
##DATA TABLE= (X++(I..I)), XYDATA
0 0 0 0 0 0 0 0 0 0 0 0 8 -8 8 -10 11 -16 21 -24 32 -35 43 -51 59 -74 84 -100 116 -132 153 -174 203 -228 260
33 260 -295 331 -376 419 -469 525 -585 653 -721 804 -888 981 -1087 1197 -1321 1453 -1602
50 -1602 1766 -1944 2146 -2365 2617 -2898 3219 -3591 4018 -4534 5148 -5906 6872 -8140 9900
65 9900 -12502 16764 -24982 46802 -236794 -622338 -366561 -150988 2078 81884 310789
76 310789 504376 490535 200275 -108521 -300922 -367440 -406594 -352307 -162359 123136 340119
87 340119 433435 410305 295024 62850 -208861 -394231 -416772 -344264 -222708 -26924 248550
98 248550 459817 462644 281664 80630 -72576 -235378 -418529 -480216 -310141 -2284 236045
109 236045 329402 355732 362925 266903 14611 -277979 -430338 -400640 -282501 -136772 58900
120 58900 287467 433838 406026 242802 45659 -142849 -317450 -426534 -387160 -197428
130 -197428 42404 231295 345095 388612 332394 151643 -98181 -302302 -388999 -366917 -262805
141 -262805 -80535 150320 340287 403763 335945 189388 3761 -199195 -363284 -407978
151 -407978 -306176 -115147 85499 254045 368439 386294 273251 60210 -160370 -310297
161 -310297 -366596 -335744 -214423 -10569 212246 359439 377773 286471 130858 -58101 -245302
172 -245302 -369233 -372823 -253525 -62411 136738 292921 368116 336434 201582 3908 -192832
183 -192832 -329270 -367215 -297478 -139579 60988 242251 348697 351076 250967 75871 -124117
194 -124117 -285888 -358112 -323613 -196714 -12837 178316 317518 358131 288735 135865 -54438
205 -54438 -228608 -336452 -343481 -247298 -77214 113947 270484 345199 316277 193357 13350
216 13350 -170361 -302749 -343587 -282693 -136783 50041 221046 324489 331149 241952 81314
227 81314 -105339 -260990 -334650 -305332 -187836 -17684 158281 290410 334992 276712 135692
238 135692 -43622 -208423 -311897 -322203 -235806 -79163 99566 246876 320315 300102 190978
249 190978 22961 -153463 -281469 -321011 -266070 -136213 32445 195246 301647 314164
259 314164 230426 79757 -91586 -235186 -310430 -293272 -188622 -26912 142398 266862
269 266862 310526 262963 139030 -26816 -186443 -289638 -303612 -226731 -84435 81521 223671
280 223671 299202 284633 185270 31248 -132380 -256026 -302060 -257829 -137765 22772 176573
291 176573 277381 294164 223761 88633 -72876 -213353 -289422 -276620 -181528 -33342 123701
302 123701 244392 291995 252068 137742 -16854 -166737 -267043 -286195 -220126 -88964 68322
313 68322 204395 277788 268027 180205 39065 -114668 -235555 -283974 -245975 -135157 13270
324 13270 157700 255977 276941 215015 89288 -62222 -194823 -269462 -263573 -178598 -40592
335 -40592 109157 224728 272091 239209 136795 -6465 -150014 -248203 -269680 -209903 -89847
346 -89847 55274 184905 260186 256507 175940 43563 -100602 -214484 -264615 -235812 -137043
357 -137043 3046 142086 237607 260525 206649 93356 -47424 -175398 -251105 -250349 -174069
368 -174069 -46699 93807 205879 256338 230747 136933 2898 -132407 -228248 -254314 -203815
379 -203815 -94595 42029 166767 242310 243855 171777 49663 -86398 -196407 -248031 -225988
390 -225988 -136937 -6458 126218 220306 245975 198423 95012 -36371 -158658 -234775 -239107
401 -239107 -169792 -50645 81200 188118 239122 220238 135943 9603 -120535 -212997 -238894
412 -238894 -194447 -95273 31712 151914 228358 233596 166256 51174 -75824 -178858 -231090
423 -231090 -216513 -136103 -12457 115793 206424 232067 189309 94580 -26727 -143537 -219773
434 -219773 -228880 -166494 -53592 73339 174212 222776 208148 135048 20433 -105445 -201514
445 -201514 -230975 -185886 -89739 25255 131856 206706 224660 170629 57277 -72461 -171421
456 -171421 -213896 -198725 -133919 -28332 96108 195630 227721 184136 89471 -21593 -125080
467 -125080 -198703 -217673 -168085 -62259 62382 163218 211197 198203 130745 26261 -88760
478 -88760 -180608 -218242 -187346 -98533 18584 126139 193587 205162 160815 69400 -47625
489 -47625 -154930 -211789 -198625 -126041 -23971 81405 167558 209986 188199 103047 -14581
500 -14581 -121946 -187528 -199661 -158501 -70605 43546 147742 203066 193505 128287 30211 -77110
512 -77110 -165771 -205756 -179897 -98925 8348 110203 180625 200291 159696 68567 -43692
523 -43692 -140082 -191602 -188318 -132068 -36001 73922 162820 198503 173378 99459 -1277 -102628
535 -102628 -176615 -197416 -155915 -68148 37423 130672 187003 188094 131613 34483 -70614 -152069
547 -152069 -189518 -173432 -105935 -2586 102906 173020 187402 149080 72938 -25963 -123981
558 -123981 -186123 -186826 -126994 -34065 62911 142117 185235 174075 105793 3722 -95882 -163067
570 -163067 -182997 -152160 -76061 26657 121541 176161 176326 128620 45365 -55833 -143805 -184987
582 -184987 -165434 -98659 -10107 80961 155122 186642 155870 72371 -28266 -112347 -162949 -172510
594 -172510 -134461 -50751 54352 140246 176310 159558 102041 17349 -77275 -153047 -179879 -148852
606 -148852 -75083 17214 104802 163979 173376 128311 45829 -46571 -124915 -170556 -165984 -107155
618 -107155 -13231 79389 142702 166116 147257 85509 -10201 -106765 -164322 -164254 -119753 -49868
630 -49868 34388 118686 171706 165156 101982 13614 -70445 -133493 -164918 -149601 -83376 11242
642 11242 99461 152254 160932 126203 54537 -37203 -118549 -161408 -154164 -104501 -25410 64428
654 64428 137023 164891 140427 77647 -3837 -85689 -147918 -165617 -127712 -49016 37424 108259
666 108259 150047 153947 111116 28298 -64762 -132718 -156013 -136370 -82052 -2947 82981 145331
678 145331 159166 122893 53698 -27560 -102998 -150972 -152801 -105150 -27517 55002 121181 153692
690 153692 141349 84381 587 -80624 -135147 -150655 -124520 -61613 23459 102480 147223 145369
702 145369 102823 33653 -46531 -117150 -152573 -139154 -82498 -4109 72839 129315 148870 124448
714 124448 60937 -20373 -95068 -140432 -144174 -105797 -35501 45473 112464 145049 134761 84800
726 84800 10229 -68567 -126867 -146126 -120958 -61396 16087 89327 136387 141517 104354 36782
738 36782 -40871 -106552 -141300 -134135 -85306 -11382 65370 121102 140600 119715 64082 -11716
750 -11716 -85335 -133556 -138852 -102449 -37263 36424 100349 136550 132332 86924 13736 -62637
762 -62637 -117240 -135911 -116523 -64718 7129 79915 129847 137349 101501 37775 -33777 -95557
774 -95557 -131296 -129611 -87673 -16915 58740 114238 133360 113838 63647 -4394 -74178 -123348
786 -123348 -135022 -103465 -39661 32886 92890 125507 124034 87175 22255 -52748 -111307 -132558
798 -132558 -112188 -61892 3148 68180 117228 131830 103682 42247 -29850 -89868 -122785 -121517
810 -121517 -86067 -23587 47648 105063 128424 112483 64163 -1337 -66436 -112757 -126489 -101765
822 -101765 -45631 24684 86441 120579 118841 83469 24898 -42494 -99400 -126151 -112244 -63908
834 -63908 589 62842 107457 122780 101119 47226 -21969 -82451 -116150 -116176 -83732 -26633 40309
847 40309 96405 121391 108524 64657 3712 -58932 -105636 -120955 -97957 -46389 18539 76836
859 76836 112899 115560 83053 25731 -38195 -90581 -116274 -108095 -66986 -4689 58123 102391
871 102391 115265 95613 48519 -13874 -74090 -111157 -112684 -80858 -27228 33565 86588 114611
883 114611 106586 65051 5940 -53131 -96320 -113145 -96393 -49218 13763 71236 105725 108498
895 108498 81237 30665 -31056 -84569 -111435 -102748 -64718 -9474 48341 94173 111949 93951
907 93951 47806 -11233 -65536 -101055 -107733 -82258 -30917 29913 80274 105883 100875 66520
919 66520 12234 -46837 -91382 -107618 -91071 -49174 6429 61746 99291 105945 79775 30538
931 30538 -26283 -74509 -102493 -100260 -66916 -12761 44131 86806 103715 90330 50738 -4550
943 -4550 -59384 -95742 -102216 -78307 -32790 22587 72175 100265 97945 65310 14394 -40134 -83151
956 -83151 -101625 -89427 -49917 3800 55837 90871 99662 79263 34312 -21649 -70439 -96222
968 -96222 -93496 -64185 -17803 35939 80897 100804 87615 48369 -3139 -51449 -85799 -97373
980 -97373 -79169 -35247 20311 68041 92830 90501 63571 18927 -33063 -77207 -97356 -86411
992 -86411 -48765 1579 49470 83236 93524 76794 36502 -15861 -64314 -91815 -90161 -62110
1004 -62110 -17294 30896 71202 92549 86219 51930 647 -49525 -82061 -89353 -72799 -36792
1016 -36792 11385 59315 89744 90168 61394 17311 -29162 -67755 -88399 -83671 -52314 -3233
1028 -3233 45904 78843 87734 71887 36494 -10296 -55892 -85076 -87265 -61935 -19504 27358
1040 27358 66299 85853 80510 51026 5817 -41335 -75513 -86764 -71625 -35946 9945 53089
1052 53089 80714 83929 62235 21471 -25155 -63853 -83664 -78570 -49952 -6567 38790 72403
1064 72403 83799 70119 36440 -7741 -50174 -78202 -82435 -60704 -21232 23320 60597 80320
1076 80320 76605 50159 8115 -36469 -70091 -81370 -68542 -36228 6066 47256 75358 80266
1088 80266 59874 21748 -21313 -57805 -77431 -74746 -49817 -9133 34485 67033 78673 67098
1100 67098 36387 -4947 -45092 -72456 -76974 -58620 -23189 18522 55150 75521 72882 48230
1112 48230 9723 -31605 -63405 -75949 -66178 -36603 3642 42947 69828 74776 57615 23291
1124 23291 -17140 -52401 -72060 -70779 -48386 -11156 29878 61390 73570 63643 36305 -1637
1136 -1637 -39611 -66764 -73307 -56811 -23420 15738 49682 69169 68587 47712 12255 -27207 -58433
1149 -58433 -71514 -62766 -35753 981 37361 62926 70455 56525 24908 -13900 -48254 -66972
1161 -66972 -66074 -46313 -13367 24485 55879 69877 61429 35285 -106 -35363 -60389 -68164 -54974
1174 -54974 -24957 12268 45138 64449 64818 45938 13290 -23540 -52580 -65795 -59742 -36092
1186 -36092 -1540 33831 59104 65172 52451 24777 -9984 -42407 -62848 -63552 -44415 -12921
1198 -12921 21221 49555 63750 59130 35518 1342 -32193 -55288 -62568 -52167 -25673 8895
1210 8895 41383 60083 60541 43261 14380 -19311 -48429 -62234 -56532 -34487 -2766 28739 53101
1223 53101 62028 51013 24607 -8098 -37773 -56559 -59239 -43809 -14516 18850 45531 58381
1235 58381 54636 35475 4829 -28002 -52114 -58941 -48471 -24472 5549 35386 55313 57978
1247 57978 42291 14547 -16385 -42623 -57007 -53690 -34167 -4543 25843 48044 56605 48770
1259 48770 25782 -5630 -34996 -52593 -54403 -41294 -16057 14224 41408 55265 51961 33181
1271 33181 5364 -22916 -46184 -55337 -47194 -24665 4618 31434 50044 53855 40711 15478
1283 15478 -13999 -38826 -51926 -50258 -34153 -6723 23065 44867 52324 44365 24871 -1978
1295 -1978 -29795 -49297 -52546 -38744 -14691 12353 35702 49813 49690 33375 6312 -21718 -42134
1308 -42134 -50402 -44072 -25155 1866 28629 46264 49562 38517 16217 -10803 -35049 -48592
1320 -48592 -46969 -31929 -7856 18655 40141 49535 42896 23872 -1493 -25842 -43564 -48802 -38356
1333 -38356 -16072 11105 33197 44902 44813 32205 9018 -17826 -39370 -47489 -40641 -23201 -27
1346 -27 23863 41620 47561 37262 15513 -9728 -31078 -43439 -43663 -31383 -9076 16542 36746
1359 36746 45303 40480 23259 316 -23072 -39430 -44662 -36115 -16617 7854 29914 42470 42149
1372 42149 29571 9178 -14343 -34257 -43895 -39606 -22593 -55 21801 37276 42343 35326 17033
1385 17033 -7497 -28655 -40584 -40454 -28455 -9246 13293 32999 42434 38225 22479 647 -20423
1398 -20423 -35734 -40992 -34096 -16450 6208 26816 38966 39084 28022 9178 -12589 -31003 -40247
1411 -40247 -36839 -22274 -1569 19306 34172 39408 32653 16142 -5295 -24800 -36812 -38181 -27759
1424 -27759 -9351 11573 29302 38113 35510 22472 2698 -18157 -33093 -37944 -31569 -15885 4057
1437 4057 23048 35369 36842 27335 9695 -10646 -27794 -36655 -33985 -21962 -3141 16570 31067
1450 31067 36490 30829 16065 -3277 -21865 -33523 -34780 -26480 -10108 9545 25978 35049 33131
1463 33131 21244 3438 -14911 -29328 -35103 -30398 -15973 2786 20967 31964 33132 25155 10246
1476 10246 -7928 -24616 -33799 -32249 -20351 -3204 13719 27177 33139 29390 16285 -2157 -19645
1489 -19645 -30389 -31847 -24501 -10219 7070 23617 32287 30779 19735 3813 -12933 -26274 -32037
1502 -32037 -27802 -15208 1609 17635 28775 31400 24379 9633 -7154 -21569 -29711 -29506 -20640
1515 -20640 -4635 12630 25515 30039 26256 15428 -264 -16501 -28227 -30313 -22787 -9255 5770
1528 5770 19698 28615 29119 19577 4159 -11759 -23030 -28360 -25929 -15684 -146 16394 26485
1541 26485 28041 22031 10275 -4580 -19072 -27686 -27343 -18476 -4903 9640 21838 27928 25371
1554 25371 14394 -482 -14026 -23918 -27272 -22292 -10203 5170 18342 25382 25226 18403 5959
1567 5959 -8861 -21534 -26751 -23545 -13678 -841 12470 23130 26584 21137 9440 -4448 -16372
1580 -16372 -24183 -25073 -18028 -5331 8950 19465 24526 22800 14347 1203 -12479 -22198 -24427 -19450
1594 -19450 -9635 2780 15186 23656 24453 16769 4446 -8004 -17913 -23644 -22244 -13865 -904 11737
1608 11737 20817 23006 19149 9592 -2827 -14795 -21863 -22313 -16157 -5740 6750 17306 22581 20631
1622 20631 12633 1210 -10063 -18711 -22484 -18866 -9204 2845 13714 20243 21131 16014 5991 -6166
1636 -6166 -16218 -21438 -19779 -12242 -1838 9300 17958 21131 17748 9070 -1948 -12513 -19471 -20400
1650 -20400 -15054 -5427 5501 14720 19791 19422 12762 1580 -9215 -17393 -19341 -16554 -9162 1070
1664 1070 11499 18781 19858 14328 4761 -5146 -13507 -18430 -18150 -12119 -2094 8248 16019 18704
1678 18704 15715 8375 -1248 -10531 -17034 -18537 -14013 -5221 4778 13166 17281 16657 11053 2420 -7333
1693 -7333 -15059 -18007 -15606 -8041 1442 10039 15673 17183 13677 5501 -4421 -12776 -16552 -16056 -10535
1708 -10535 -2484 6778 13922 16915 14364 7762 -1121 -9223 -15229 -16184 -12319 -5005 3901 11459 15689
1723 15689 15029 9938 1798 -6673 -12834 -15500 -13816 -7517 767 8815 14332 15485 11561 4633 -3307
1738 -3307 -10629 -14460 -14330 -9639 -1772 5983 12230 14849 12944 7048 -569 -8078 -13037 -14337 -11383
1753 -11383 -4609 3281 10170 13527 13136 9085 2099 -5253 -11267 -14083 -12086 -6712 494 7255 12209
1768 12209 13627 10677 4519 -3032 -9342 -12895 -12543 -8710 -2015 4947 10884 13147 11589 6421 -336
1783 -336 -7145 -11461 -12908 -10179 -4026 2599 8783 12224 11889 8129 1895 -4551 -9772 -12107 -10797
1798 -10797 -6114 319 6645 10939 11992 9245 3775 -2711 -8412 -11616 -11057 -7425 -1843 4233 9172
1813 9172 11491 10114 5498 -510 -6253 -10036 -10982 -8686 -3645 2446 7922 10573 10452 7000 1649
1828 1649 -4169 -8928 -10675 -9223 -5540 492 5901 9751 10566 8053 3116 -2339 -7221 -10065 -9574
1843 -9574 -6516 -1365 3930 8261 9985 9016 5009 -330 -5797 -9054 -9847 -7490 -3240 2156 6801
1858 6801 9358 9062 5909 1237 -3995 -7897 -9492 -8047 -4317 632 5289 8545 9065 6750 2764
1873 2764 -2264 -6513 -8828 -8297 -5567 -1133 3762 7298 8888 7608 4078 -631 -4937 -8259 -8530
1888 -8530 -6462 -2568 2052 6361 8252 7935 5228 1258 -3695 -6831 -8188 -7190 -3811 627 4791
1903 4791 7556 8031 6003 2400 -2053 -5557 -7687 -7469 -4983 -939 3589 6603 7779 6551 3383
1918 3383 -450 -4658 -6984 -7628 -5652 -2042 2229 5315 7331 6880 4364 876 -3348 -6256 -7279
1933 -7279 -5863 -3023 797 4139 6513 7006 5342 1658 -2239 -5317 -6705 -6144 -3819 -367 3332
1948 3332 5838 6698 5688 2660 -1116 -4498 -6266 -6333 -4741 -1740 1799 5101 6505 5861 3697 176
1964 176 -3104 -5256 -6010 -5159 -2826 1135 4137 6009 5824 3968 1326 -2003 -4487 -6244 -5579 -2955
1980 -2955 -8 3087 5057 5793 4760 2213 -1013 -3940 -5688 -5286 -3851 -817 2126 4402 5626
1995 5626 5036 3082 -323 -3264 -5112 -5450 -4267 -1783 1017 3503 5094 5411 3342 550 -2096 -4154
2011 -4154 -4992 -4656 -2846 243 3107 4867 4913 4143 1713 -1003 -3818 -4829 -4798 -3147 -586 2095 4027
2028 4027 4975 4152 2326 -359 -2706 -4509 -4709 -3500 -1212 1447 3449 4617 4286 2713 369 -2231
2044 -2231 -4403 -4295 -3455 -2131 445 2772 4427 4525 3062 947 -1352 -3279 -4330 -3986 -2561 -7
2060 -7 2346 3810 4031 3292 1595 -569 -2692 -4115 -3983 -2746 -634 1454 3097 3775 3675 2232 108
2077 108 -2122 -3459 -4056 -3221 -1093 914 2712 4002 3759 2724 346 -1658 -3473 -3754 -3239 -1682
2093 -1682 -46 2421 3596 3852 2872 957 -1083 -2536 -3602 -3391 -2187 -293 1862 3070 3704 2913
2109 2913 1434 -475 -2192 -3400 -3285 -2430 -893 1345 2626 3526 3124 1670 175 -1661 -2638 -3339
2125 -3339 -2615 -1392 687 2337 3126 3178 2309 520 -1204 -2577 -3348 -3120 -1289 111 1830 2805 3228
2142 3228 2513 997 -989 -2400 -2944 -2903 -2003 -419 1241 2619 2890 2521 1299 -374 -1941 -2875 -2846
2159 -2846 -2133 -517 1195 2258 3037 2427 1654 277 -1513 -2682 -3046 -2296 -981 696 2216 2731 2863
2176 2863 1886 314 -1200 -2275 -2766 -2543 -1069 377 1690 2479 2586 2052 685 -571 -2078 -2746 -2337
2193 -2337 -1679 74 1396 2505 2604 2239 842 -329 -1843 -2714 -2723 -1661 -485 952 2130 2598 2307
2210 2307 1255 -135 -1583 -2498 -2710 -2159 -841 896 1961 2653 2603 1884 177 -1299 -2199 -2656 -2227
2227 -2227 -856 342 1757 2473 2476 1768 742 -995 -1983 -2379 -2325 -1491 -57 1425 2467 2710 2045 723
2245 723 -850 -2025 -2651 -2465 -1520 -286 1000 2233 2850 2027 1193 -363 -1565 -2631 -2283 -1982 -885
2262 -885 785 2302 2508 2275 1573 25 -1392 -2487 -2683 -2090 -849 438 1917 2613 2891 1763 306
2279 306 -951 -2185 -2791 -2244 -1288 296 1549 2328 2905 2053 816 -854 -1962 -2707 -2475 -1620 -297
2296 -297 1443 2030 2824 2360 1314 -595 -1975 -2812 -2774 -1824 -769 985 2152 2702 2503 1339 28
2313 28 -1368 -2436 -2891 -2099 -879 494 2050 2727 2747 1978 525 -1095 -2633 -2889 -2367 -1362 124
2330 124 1765 2510 3000 2178 881 -833 -2252 -2936 -2841 -1760 -383 1302 2521 3119 2601 1248 -400
2347 -400 -1634 -2770 -3012 -2211 -730 1058 2456 3211 2825 1993 117 -1439 -2710 -3278 -2640 -1306 416
2364 416 1946 2976 3018 2150 232 -1138 -2134 -3045 -2747 -1723 34 1724 3002 3111 2643 1230 -696
2381 -696 -2076 -2972 -3137 -2193 -526 1343 2785 3260 2859 1760 -37 -2032 -3061 -3310 -2493 -974 627
2398 627 2142 3341 3319 2379 478 -1366 -2639 -3468 -2961 -1707 287 1886 3365 3645 2593 877 -874
2415 -874 -2490 -3468 -3199 -2327 -480 1538 2987 3244 3198 1377 -283 -2178 -3423 -3716 -2533 -933 977
2432 977 2780 3621 3349 2100 188 -1854 -3197 -3600 -3091 -1596 365 2313 3454 3545 2756 970 -1280
2449 -1280 -2676 -3521 -3451 -2228 -252 1761 3344 3629 3044 1436 -584 -2246 -3451 -3559 -2700 -873 1187
2466 1187 2955 3653 3334 2213 98 -1769 -3387 -3732 -3062 -1561 437 2267 3563 3705 2422 639
2482 639 -1379 -2873 -3516 -3422 -1971 -228 1987 3346 4030 3024 1371 -377 -2396 -3619 -3667 -2589 -594
2499 -594 1411 2907 3826 3361 2028 -122 -1937 -3465 -3834 -3022 -1233 790 2665 3695 3895 2626
2515 2626 942 -1271 -3114 -3741 -3392 -2143 102 2173 3575 3832 3079 1382 -773 -2634 -3978 -3443
2531 -3443 -2747 -652 1612 3196 3762 3493 2046 -348 -1927 -3594 -4146 -3288 -1308 984 2803 3967
2547 3967 4014 2580 646 -1585 -3389 -4083 -3390 -1840 -44 2463 3712 4128 3150 1536 -993 -2835
2563 -2835 -4035 -3841 -2653 -804 1683 3329 4134 3385 1950 -240 -2516 -3862 -3938 -3359 -1270 972
2579 972 2927 4005 3704 2655 434 -1779 -3531 -4080 -3661 -2017 244 2384 3975 4029 3065 1226 -925
2596 -925 -3133 -3762 -3744 -2442 -530 1712 3697 3922 3591 1796 -313 -2616 -3876 -3938 -3081 -1119 930
2613 930 3186 4181 4023 2648 335 -1792 -3376 -4240 -3739 -1928 167 2607 3836 4259 3400 1100 -1148
2630 -1148 -3258 -4177 -3895 -2453 -391 1842 3362 3964 3573 1919 -409 -2545 -3847 -4022 -2938 -1171
2646 -1171 1044 3215 4329 3940 2494 368 -2028 -3717 -4375 -3684 -1936 560 2671 3920 4250 3130
2662 3130 1155 -1330 -3255 -4288 -3938 -2562 -173 1866 3840 4541 3768 1776 -524 -2731 -3991 -4509
2678 -4509 -3278 -1288 1194 3285 4161 3817 2405 300 -1974 -3626 -4291 -3647 -1674 455 2699 3860
2694 3860 4311 3289 1075 -1490 -3512 -4183 -3947 -2498 -471 1759 3866 4419 3629 1545 -475 -2646
2710 -2646 -4305 -4361 -3249 -1132 1426 3256 4400 4267 2523 312 -2457 -3785 -4297 -3886 -1944 597
2726 597 2587 3990 4294 3239 1175 -1309 -3258 -4337 -4134 -2691 -436 2042 3730 4320 3680 1753
2742 1753 -694 -2646 -4001 -4098 -3144 -1076 1407 3250 4387 3867 2575 319 -1922 -3817 -4349 -3657
2758 -3657 -1993 671 2769 4279 4339 3388 1270 -1311 -3395 -4216 -3989 -2379 -177 2044 3697 4515
2774 4515 3850 1770 -526 -2676 -3921 -4265 -3323 -1065 1236 3614 4314 4000 2704 87 -2026 -3996
2790 -3996 -4414 -3913 -1817 233 2761 4087 4422 3067 1007 -1226 -3304 -4286 -3890 -2423 -167 2248
2806 2248 3822 4379 3610 1800 -533 -2765 -4132 -4195 -3356 -1031 1310 3311 4449 4102 2474 302
2822 302 -2047 -4032 -4692 -3896 -1935 622 2933 4241 4332 3273 1106 -1132 -3270 -4391 -3916 -2499
2838 -2499 -369 1954 3870 4325 3767 1705 -471 -2744 -4077 -4283 -3039 -1170 1196 3391 4649 4035
2854 4035 2647 266 -2181 -3741 -4508 -3896 -1853 545 2986 3876 4342 2851 1010 -1202 -3508 -4326
2870 -4326 -4008 -2500 -150 1999 3693 4485 3714 1821 -741 -2737 -4076 -4053 -3172 -1111 1220 3412
2886 3412 4335 3880 2446 365 -2223 -3798 -4525 -4001 -2013 746 2669 4257 4551 3221 866 -1369
2902 -1369 -3604 -4209 -4162 -2496 -406 2234 3827 4364 3729 1884 -417 -2933 -4221 -4328 -3050 -1223
2918 -1223 1441 3371 4436 4186 2330 506 -2011 -3863 -4350 -3691 -1919 549 3009 4336 4304 3142
2934 3142 1152 -1277 -3591 -4220 -4052 -2384 -356 1998 3732 4497 3663 1745 -915 -2951 -4146 -4597
2950 -4597 -3340 -1041 1374 3341 4557 3988 2697 408 -2160 -3972 -4435 -3627 -1886 631 2997 4021
2966 4021 4398 3402 1064 -1317 -3397 -4462 -4153 -2606 -243 2362 4029 4435 3842 1663 -387 -2782
2982 -2782 -4111 -4489 -3051 -1183 1145 3414 4553 4103 2646 431 -2272 -3725 -4582 -3898 -2110 327
2998 327 2813 4305 4386 3375 1096 -1485 -3080 -4636 -4219 -2706 -496 2167 3900 4266 3842 1928
3014 1928 -528 -2855 -4168 -4275 -3172 -1276 1369 3407 4377 4413 2729 449 -2236 -3710 -4741 -3675
3030 -3675 -2047 521 2823 4376 4532 3340 1358 -1220 -3357 -4529 -4317 -2868 -474 2137 4014
3045 4014 4515 3952 1961 -517 -2677 -4378 -4493 -3345 -1271 1163 3422 4294 4211 2862 212 -1938
3061 -1938 -3711 -4725 -3842 -2046 267 2682 4124 4639 3490 1397 -1349 -3231 -4596 -4232 -2788 -401
3077 -401 1827 3947 4739 3970 2240 -338 -2770 -4430 -4454 -3324 -1032 1156 3441 4447 4284 3186
3093 3186 456 -2158 -3922 -4765 -4086 -2447 545 2436 4407 4722 3555 1466 -1237 -3359 -4643 -4168
3109 -4168 -2807 -725 1931 3851 4553 4163 2294 -378 -2817 -4320 -4669 -3560 -1525 1159 3373 4663
3125 4663 4422 2976 596 -2145 -3805 -4642 -4038 -2259 139 2627 4229 4395 3582 1610 -1443 -3434
3141 -3434 -4423 -4437 -2851 -667 1825 3735 4771 4216 2282 -60 -2900 -4222 -4759 -3427 -1521 1307
3157 1307 3489 4520 4740 3158 758 -1890 -3798 -4784 -3877 -2407 62 2575 4298 4782 3628 1380
3173 1380 -1021 -3412 -4589 -4472 -3243 -663 2027 3977 4705 4172 2361 -245 -2608 -4192 -4473 -3866
3189 -3866 -1602 1088 3595 4466 4479 3084 848 -1642 -3907 -4654 -4309 -2458 -33 2348 4308 4817
3205 4817 3785 1628 -797 -3348 -4382 -4513 -3206 -699 1608 3920 4842 4364 2572 331 -2443 -4336
3221 -4336 -4749 -3839 -1673 974 3131 4820 4465 3466 888 -1704 -4101 -4699 -4376 -2393 -119 2245
3237 2245 4201 4676 3859 1637 -771 -3106 -4504 -4676 -3425 -960 1549 3681 4740 4385 2594 12
3253 12 -2306 -4313 -4764 -3954 -1752 875 3162 4529 4648 3333 1050 -1595 -3478 -4697 -4278 -2612
3269 -2612 -102 2193 4060 4672 3918 2071 -501 -3040 -4451 -4746 -3429 -1054 1534 3744 4566 4344
3285 4344 2923 188 -2123 -4123 -4802 -4091 -2000 829 3124 4411 4666 3524 1098 -1495 -3559 -4534
3301 -4534 -4324 -2634 -343 2383 4138 4828 4124 2108 -378 -2983 -4610 -4715 -3640 -1235 1583 3680
3317 3680 4621 4351 2953 472 -2403 -4026 -4723 -3998 -2061 661 2930 4399 4579 3450 1140 -1287
3333 -1287 -3610 -4944 -4250 -2922 -452 2144 3988 4696 4095 2052 -370 -3045 -4635 -4657 -3612 -1323
3349 -1323 1430 3449 4622 4569 2889 512 -2081 -4159 -4690 -4018 -2239 459 2857 4400 4624 3443
3365 3443 1289 -1384 -3573 -4665 -4227 -2995 -395 2289 4238 4529 4102 2162 -262 -2675 -4530 -4667
3381 -4667 -3703 -1284 1143 3409 4651 4463 2837 799 -1908 -3909 -4725 -4122 -2189 451 2785 4333
3397 4333 4591 3446 1131 -1172 -3379 -4428 -4328 -2837 -573 1733 3873 4739 4018 2342 -169 -2803
3413 -2803 -4393 -4382 -3570 -1221 915 3224 4319 4298 2948 522 -2057 -3939 -4430 -3900 -2139 164 2510
3430 2510 4094 4532 3603 1222 -1297 -3300 -4423 -4573 -2689 -470 2026 4140 4592 4053 1991 -427
3446 -427 -2479 -4229 -4571 -3373 -1329 1156 3307 4368 4452 3019 513 -1848 -3829 -4627 -3861 -2366
3462 -2366 272 2528 4441 4580 3520 1465 -1064 -3316 -4293 -4326 -3060 -729 1607 3973 4566 4023
3478 4023 2233 -179 -2528 -4134 -4616 -3331 -1549 1146 3243 4336 4346 2764 647 -1755 -3579 -4501
3494 -4501 -4102 -2093 84 2373 4333 4737 3621 1363 -897 -3131 -4313 -4034 -2969 -510 1692 3776
3510 3776 4465 3879 2337 -133 -2274 -4411 -4507 -3415 -1592 926 3054 4603 4126 2881 830 -1725
3526 -1725 -3775 -4622 -4139 -2403 316 2423 4146 4597 3676 1322 -1036 -2994 -4231 -4199 -3016 -654
3542 -654 1659 3649 4606 3910 2372 -60 -2281 -4074 -4509 -3590 -1482 1066 2912 4463 4111 2976
3558 2976 558 -1778 -3608 -4540 -3970 -2254 10 2363 4048 4445 3450 1395 -1009 -3178 -4420 -4402
3574 -4402 -2858 -660 1761 3688 4352 4058 2393 -77 -2495 -3690 -4455 -3368 -1424 788 3177 4330
3590 4330 4311 2992 769 -1346 -3548 -4478 -3892 -2220 32 2492 3834 4309 3433 1570 -822 -3237
3606 -3237 -4189 -4087 -2706 -790 1619 3620 4413 3936 2157 -165 -2383 -3828 -4128 -3506 -1485 859
3622 859 2962 4201 4190 2992 781 -1584 -3485 -4435 -3934 -2305 -267 2368 3559 4306 3432 2008 -750
3639 -750 -2962 -3976 -4073 -3064 -1114 1532 3516 4051 4098 2285 0 -2167 -3834 -4153 -3249 -1539 620
3656 620 2770 4226 4314 3027 711 -1357 -3386 -4217 -3866 -2411 -173 2489 3714 4419 3520 1661 -910
3673 -910 -2842 -4046 -4213 -2882 -797 1509 3478 4499 3759 2328 182 -2113 -3695 -4330 -3517 -1321
3689 -1321 590 2878 3911 4173 2938 717 -1429 -3333 -4331 -3887 -2229 -16 2121 3497 4058 3507
3705 3507 1436 -698 -2738 -4189 -4133 -2941 -1233 1290 3329 4018 4038 2761 5 -2042 -3971 -4203
3721 -4203 -3477 -1895 568 2644 3818 3969 3043 1139 -1239 -3187 -4108 -3955 -2463 -229 2053 3662
3737 3662 4131 3418 1859 -419 -2481 -3846 -4260 -3096 -1248 1273 3141 4057 3782 2295 223 -1796
3753 -1796 -3595 -4033 -3587 -1816 654 2367 3716 3928 2911 931 -1178 -3147 -4131 -3685 -2414 -382
3769 -382 1856 3635 4020 3505 2023 -435 -2242 -3716 -3829 -2773 -1237 1208 3168 3890 3816 2539 548
3786 548 -1648 -3252 -4016 -3396 -1976 440 2219 3701 3997 2753 1203 -1031 -2825 -3777 -3864 -2590 -470
3803 -470 1770 3457 3892 3295 1977 -267 -2135 -3598 -3963 -2700 -1182 908 2822 3917 3681 2544
3819 2544 410 -1632 -3319 -3707 -3395 -1836 181 2216 3456 3864 3087 1441 -701 -2750 -3702 -3668 -2375
3836 -2375 -313 1473 3070 4040 3161 1715 -28 -2324 -3441 -3638 -2818 -1315 719 2506 3623 3489
3852 3489 2422 631 -1384 -3216 -3833 -3295 -1742 -166 1933 3410 3555 2734 1196 -812 -2571 -3729
3868 -3729 -3247 -2583 -895 1482 2791 3538 3207 1826 155 -1797 -3367 -3434 -2612 -1051 564 2291 3475
3885 3475 3717 2348 527 -999 -2988 -3420 -3280 -2052 -53 1603 3284 3766 2844 1409 -773 -2098
3901 -2098 -3442 -3312 -2507 -775 1340 2881 3469 3193 2089 -49 -1740 -3120 -3465 -2818 -1274 649
3917 649 2277 3233 3259 2446 1031 -1088 -2799 -3396 -3219 -1879 -143 1797 3005 3456 2843 1457 -372
3934 -372 -2387 -3030 -3211 -2336 -670 1174 2496 3340 3010 1940 254 -1493 -2989 -3358 -2901 -1362 486
3951 486 2192 3148 3330 2561 863 -1060 -2520 -3270 -3197 -1916 -285 1759 3004 3238 2755 1331 -385
3968 -385 -2091 -2863 -3323 -2506 -614 995 2497 3187 2947 1783 31 -1558 -2852 -3207 -2655 -1396 388
3985 388 1970 3094 3118 2554 598 -929 -2340 -3061 -2909 -1905 -131 1328 2714 3180 2536 1442 -418
4002 -418 -1833 -3020 -3118 -2219 -812 910 2247 2980 2875 1914 250 -1204 -2408 -2977 -2377 -1513 115
4019 115 1969 2917 3226 2089 730 -1032 -2260 -2899 -2733 -1881 -218 1222 2679 2959 2495 1456 -177
4036 -177 -2117 -2851 -3124 -2516 -885 723 2165 2860 2965 1840 225 -1369 -2486 -2952 -2547 -1592 196
4053 196 1805 2928 2992 2293 820 -723 -2103 -2907 -2726 -1697 -412 1063 2326 2940 2358 1213 -137
4070 -137 -1567 -2497 -2520 -2253 -811 637 2125 2760 2726 1813 355 -982 -2268 -2853 -2578 -1468 -1 1586
4088 1586 2607 2855 2214 941 -490 -2041 -2731 -2770 -1849 -429 1035 2114 2728 2582 1196 -7 -1741
4105 -1741 -2605 -2753 -2185 -833 524 1800 2841 2625 1882 479 -1373 -2140 -2720 -2310 -1403 -61 1444
4122 1444 2486 2982 2361 1132 -645 -2079 -2452 -2563 -1887 -499 1356 2069 2522 2265 1436 -238 -1527
4139 -1527 -2321 -2757 -2224 -1339 226 1658 2538 2739 2013 447 -937 -2184 -2467 -2309 -1536 -313 1355
4156 1355 2519 2606 2252 1352 -539 -1619 -2515 -2749 -1971 -521 880 2000 2703 2346 1291 88 -1325
4173 -1325 -2377 -2444 -2092 -928 546 1702 2521 2617 1814 617 -698 -1792 -2697 -2291 -1386 -290 1200
4190 1200 2192 2678 2093 1052 -377 -1783 -2420 -2663 -1824 -516 945 2064 2501 2450 1672 -56 -1275
4207 -1275 -2246 -2614 -1990 -1054 340 1670 2457 2572 1821 654 -656 -1856 -2556 -2354 -1305 -190 1443
4224 1443 2174 2586 2048 897 -112 -1475 -2206 -2609 -1744 -659 785 1776 2387 2170 1504 210 -1013
4241 -1013 -2200 -2621 -2001 -1059 215 1263 2194 2291 1875 708 -574 -1678 -2314 -2072 -1346 -83 1034
4258 1034 1959 2516 1785 1029 -396 -1321 -2343 -2441 -1533 -565 660 1753 2366 2019 1382 151 -1133 -1897
4276 -1897 -2381 -2137 -1182 56 1355 2019 2229 1805 700 -428 -1566 -2371 -2041 -1112 -268 986 1914 2416
4294 2416 1931 1225 -31 -1464 -2139 -2435 -1466 -603 500 1539 2303 2336 1374 125 -734 -1816 -2332 -1889
4312 -1889 -909 187 1335 1975 2038 1492 831 -414 -1533 -1868 -2100 -1635 -210 926 1828 2297 1897 1155
4330 1155 82 -1436 -1862 -1961 -1675 -652 392 1551 2094 2044 1453 57 -842 -1583 -2355 -1620 -950 -178
4348 -178 1128 2083 2257 1748 541 -474 -1578 -2188 -2119 -1456 -145 861 1831 1987 1769 944 -320 -1147
4366 -1147 -2005 -2380 -1633 -644 457 1513 1973 2158 1359 243 -750 -1716 -2199 -1544 -1007 84 1145 1671
4384 1671 1860 1689 603 -300 -1374 -1938 -1756 -1301 -382 1040 1456 1929 1758 1004 47 -1160 -1718 -2007
4402 -2007 -1387 -1008 284 1365 1980 2031 1355 330 -891 -1733 -1764 -1892 -1035 180 909 1802 1867 1528 817
4421 817 -504 -1513 -1607 -1848 -1216 -300 642 1581 1774 1679 970 -53 -1082 -1703 -2115 -1746 -369 599 1520
4440 1520 1778 1763 1246 358 -790 -1424 -1676 -1471 -1031 163 1006 1790 2007 1432 700 -125 -1174 -1736 -1769
4459 -1769 -1326 -72 790 1612 1843 1726 1029 -218 -1110 -1617 -1948 -1436 -551 407 1185 1980 1775 1167 305
4478 305 -751 -1324 -1780 -1661 -985 114 880 1669 1825 1315 769 -254 -1260 -1672 -1704 -1245 -390 655 1343
4497 1343 1746 1646 824 -106 -906 -1630 -1802 -1677 -759 257 1177 1603 1698 923 224 -936 -1559 -1652 -1430 -846
4517 -846 178 952 1712 1768 1333 748 -565 -1169 -1630 -1637 -1193 -215 781 1291 1814 1358 913 -100 -876 -1434
4537 -1434 -1652 -1198 -365 400 1026 1515 1581 1198 308 -548 -1114 -1680 -1326 -812 0 939 1179 1380 1188 679
4557 679 -497 -1276 -1698 -1531 -1124 -374 566 1440 1554 1352 1081 9 -777 -1321 -1694 -1259 -668 424 1060
4576 1060 1472 1573 929 105 -552 -1363 -1602 -1184 -600 59 713 1370 1369 1369 491 -158 -1077 -1586 -1549 -944 -315
4597 -315 776 1194 1405 1375 532 69 -707 -1254 -1340 -1324 -461 194 1144 1405 1501 856 246 -544 -1302 -1445 -1503
4618 -1503 -962 -1 803 1245 1399 1407 367 -295 -874 -1439 -1480 -892 -89 423 998 1453 1229 702 -37 -852
4638 -852 -1487 -1472 -1174 -739 174 995 1204 1427 764 289 -689 -1229 -1188 -1425 -681 -103 906 1182 1476 1086
4658 1086 326 -542 -841 -1450 -1495 -612 -211 362 972 1444 1252 734 -44 -764 -1245 -1372 -970 -666 447 1076
4678 1076 1362 1258 1025 378 -530 -972 -1424 -1026 -541 -179 833 1124 1148 1202 453 -74 -972 -1213 -1351 -1071
4698 -1071 -100 543 1191 1330 1087 895 60 -702 -1372 -1314 -886 -293 232 734 1327 1374 815 169 -336 -1023
4718 -1023 -1072 -1183 -779 -71 540 1253 1425 1025 419 -332 -791 -956 -974 -733 -273 503 1024 1191 919 810
4738 810 -93 -783 -1019 -1432 -877 -324 516 1167 1105 1159 572 117 -514 -1026 -1097 -1213 -741 101 710 972 1204
4759 1204 777 109 -245 -1056 -963 -1008 -949 -60 444 1100 1288 1000 617 -100 -615 -1056 -1189 -909 -295 358 716
4780 716 1226 1158 751 252 -403 -853 -1153 -838 -439 -119 657 840 977 838 540 -176 -802 -922 -1133 -634
4800 -634 -377 327 1110 1174 1015 376 154 -507 -704 -1130 -900 -618 233 854 921 1069 760 263 -431 -866 -1074
4821 -1074 -851 -507 270 680 1051 891 604 693 -282 -998 -970 -1018 -662 -77 462 941 1088 783 555 -286 -527
4842 -527 -871 -1023 -522 -295 400 514 1102 875 677 168 -267 -638 -938 -857 -446 -73 507 844 900 761 278
4863 278 -39 -718 -862 -917 -536 -157 623 859 868 719 400 102 -719 -1038 -821 -347 -290 126 726 975 815
4884 815 417 110 -389 -611 -844 -743 -325 -132 637 849 1142 461 353 -247 -601 -674 -927 -567 56 448
4904 448 662 827 606 395 -258 -673 -890 -1076 -694 -222 383 599 972 1026 543 174 -504 -769 -809 -710 -173
4925 -173 99 665 885 1098 497 190 -352 -516 -972 -813 -479 -222 550 526 755 760 431 35 -572 -968 -609
4946 -609 -414 -186 286 544 1006 570 370 -102 -471 -812 -662 -672 -602 187 377 801 848 857 345 -186 -719 -891
4968 -891 -564 -546 71 353 564 846 821 312 -204 -538 -654 -878 -510 -266 323 567 727 746 348 58 -457
4989 -457 -589 -916 -561 -538 108 385 630 780 519 152 -372 -600 -790 -651 -418 -35 366 508 832 738 353
5010 353 -57 -522 -684 -828 -491 -230 261 808 782 712 484 185 -382 -967 -636 -777 -268 431 430 814 747 527
5032 527 146 -387 -593 -646 -614 -494 -155 341 626 586 412 513 -168 -506 -672 -755 -577 -74 347 725 909
5053 909 608 517 197 -566 -567 -720 -748 -257 113 223 846 757 464 -43 -217 -682 -764 -620 -307 -101 487 879
5075 879 803 604 375 -424 -431 -729 -739 -580 -98 213 496 799 611 651 1 -439 -822 -1067 -647 -451 -6 465
5097 465 570 690 669 282 50 -507 -867 -710 -386 -175 452 961 540 777 158 16 -416 -632 -670 -577 88
5118 88 406 580 792 619 545 241 -360 -606 -622 -654 -398 0 309 651 741 522 408 -345 -569 -737 -941 -442
5140 -442 -76 498 575 865 776 423 29 -343 -478 -890 -781 -280 121 643 938 907 565 -37 -272 -534 -591
5161 -591 -697 -442 -128 515 529 960 604 197 -79 -503 -813 -502 -429 -3 443 731 643 459 232 -250 -666
5182 -666 -689 -731 -607 -346 389 596 731 752 436 195 -364 -759 -798 -895 -45 62 508 557 914 705 399 -35
5204 -35 -498 -762 -838 -516 -147 264 428 661 672 420 -18 -421 -601 -712 -678 -313 -68 464 513 595 518 142
5226 142 -574 -515 -649 -631 -337 67 192 676 678 598 515 -260 -672 -636 -568 -604 136 529 505 661 569 264 -97 -564
5250 -564 -636 -702 -389 -487 -2 399 762 824 535 94 -344 -567 -514 -564 -230 47 461 554 749 557 225 148 -774
5273 -774 -839 -650 -382 -126 549 161 534 739 574 69 -245 -642 -525 -605 -179 171 400 566 563 358 -94
5294 -94 -294 -691 -572 -536 -489 29 426 785 586 415 313 -37 -551 -483 -635 -461 -73 336 638 869 561
5315 561 313 120 -189 -585 -514 -513 -273 3 422 749 831 377 -31 -193 -329 -767 -782 -155 193 407 794 530
5337 530 380 413 -115 -497 -677 -710 -485 -220 306 626 698 545 469 15 -464 -766 -433 -504 -212 238 415 629
5359 629 749 504 -86 -371 -410 -736 -780 -420 118 407 514 724 409 171 -213 -446 -486 -614 -446 -181 292
5380 292 674 548 370 413 -225 -409 -479 -750 -526 -154 115 465 770 522 329 53 -371 -254 -796 -511 -449
5401 -449 -342 552 629 641 673 103 -319 -592 -400 -577 -485 -82 278 619 542 560 214 -235 -473 -679 -534 -475
5423 -475 -421 11 346 708 667 460 278 -262 -425 -725 -585 -603 201 377 507 694 677 84 -160 -537 -837
5444 -837 -687 -371 -272 22 569 701 686 567 11 -505 -616 -628 -513 -126 271 578 465 503 508 385 -486 -453
5466 -453 -589 -738 -272 -34 192 556 670 479 356 -306 -443 -735 -818 -432 -142 131 521 825 662 540
5486 540 178 -300 -472 -584 -477 -167 154 666 636 881 569 73 -241 -420 -771 -462 -472 71 201 411 402
5507 402 512 410 118 -509 -809 -602 -547 -300 279 638 625 601 403 230 -319 -576 -681 -608 -475 331 450
5528 450 578 839 745 189 -173 -515 -676 -675 -249 148 348 569 614 720 417 210 -378 -649 -725 -397 -95 49
5550 49 482 496 742 376 -82 -512 -441 -726 -502 -378 81 551 683 418 668 -135 -26 -408 -480 -512 -450 -102
5572 -102 169 562 809 751 361 39 -366 -666 -578 -374 -96 210 736 645 710 267 87 -342 -768 -821 -844 -492
5594 -492 80 491 472 739 442 331 -271 -456 -500 -587 -439 -30 280 562 758 527 222 98 -265 -514 -658
5615 -658 -477 -358 169 479 540 633 402 3 -422 -568 -459 -616 -349 -106 365 559 530 552 381 -286 -690
5636 -690 -417 -646 -585 46 494 708 692 673 301 67 -424 -731 -847 -680 -195 195 358 558 629 209 395
5657 395 -409 -594 -762 -647 -236 150 282 665 579 547 347 -249 -398 -775 -620 -708 -334 120 609 503 529
5678 529 541 51 -530 -559 -723 -393 -495 180 537 783 605 468 265 -254 -335 -859 -454 -464 61 336 705
5699 705 700 562 181 -104 -425 -494 -491 -511 -127 326 693 756 436 411 174 -498 -669 -659 -408 -215 53 342 476
5722 476 695 469 101 -367 -438 -604 -695 -347 173 125 262 607 541 277 126 -490 -629 -617 -434 -113 303 542
5744 542 728 473 477 49 -409 -794 -806 -459 -177 143 153 385 598 583 268 -33 -540 -682 -789 -528 65 344
5766 344 556 601 789 437 76 -341 -642 -558 -469 -183 397 506 646 649 642 247 -300 -519 -528 -604 -221 -120 114
5789 114 609 751 541 176 -251 -647 -670 -611 -545 -237 76 429 626 523 253 -50 -365 -409 -567 -467 -394 218
5811 218 408 489 707 374 298 -338 -512 -587 -554 -303 -84 293 565 567 527 386 -12 -620 -685 -570 -335 -228 267
5834 267 463 542 642 401 222 -411 -544 -559 -408 -194 161 341 767 594 164 386 -272 -284 -724 -707 -269
5855 -269 108 157 644 569 389 228 -192 -155 -768 -582 -413 -201 135 249 397 662 325 -63 -274 -671 -576
5876 -576 -495 -3 -1 476 783 698 605 34 -135 -221 -506 -407 -299 162 281 428 586 237 331 169 -74 -538 -599
5899 -599 -349 -104 21 343 281 741 400 60 -57 -492 -575 -711 -280 -221 490 748 561 500 29 33 -640 -667
5921 -667 -464 -319 30 309 371 394 631 291 -20 -433 -770 -591 -471 -147 316 274 844 550 479 -63 -429
5942 -429 -261 -586 -608 -151 -25 394 698 700 318 127 -90 -281 -399 -596 -565 -191 375 520 624 462 328
5963 328 134 -213 -479 -448 -414 -218 21 433 496 510 523 163 -198 -576 -449 -406 -252 -56 383 537 478 422 215
5986 215 -296 -349 -676 -660 -559 -218 347 127 753 427 372 107 -403 -573 -713 -493 -216 -143 375 398 716 276
6008 276 188 -46 -353 -361 -671 -479 162 454 718 542 617 305 -73 -717 -484 -501 -319 -14 236 544 580 633
6030 633 324 -78 -399 -382 -444 -435 -269 158 92 346 603 260 166 -44 -517 -628 -586 -457 -112 363 349 617 612
6053 612 354 -96 -513 -452 -709 -366 -306 98 424 525 635 361 63 -139 -416 -555 -550 -399 46 353 570
6074 570 595 305 338 -421 -132 -285 -733 -369 -115 215 451 460 547 516 64 -255 -520 -328 -418 -278 39 226
6096 226 627 601 314 94 -283 -566 -619 -476 -403 -82 162 721 351 480 79 -60 -172 -558 -581 -241 -218 -9
6118 -9 389 597 503 228 -294 89 -316 -634 -365 -87 -16 393 277 439 415 -18 -215 -301 -590 -337 -269 131
6140 131 174 477 620 457 274 62 -35 -484 -563 -501 -309 179 338 509 505 365 59 -48 -116 -602 -457 -228
6162 -228 82 217 474 378 309 30 63 -312 -433 -630 -240 -98 294 518 539 520 294 -34 -262 -282 -419 -555
6184 -555 -278 -144 443 314 325 527 221 -174 -277 -473 -477 -140 -74 109 271 405 241 97 -2 -455 -611 -556
6206 -556 -602 -166 338 520 419 419 403 63 -346 -329 -362 -443 -105 126 318 593 819 442 -1 -224 -398 -410 -455
6229 -455 -188 60 -19 543 340 438 309 -138 -487 -349 -485 -702 -181 22 358 648 640 350 169 -100 -474
6250 -474 -482 -501 -333 30 410 480 292 538 368 -101 -363 -509 -327 -298 -48 304 242 676 355 303 16 -214
6272 -214 -273 -496 -272 -145 133 304 501 420 203 188 -78 -384 -293 -389 -20 63 247 154 610 340 229 -113
6294 -113 -380 -397 -424 -341 -237 126 -10 591 425 257 171 -304 -260 -543 -238 -333 -20 330 314 324 368 -136 -345
6317 -345 -457 -498 -411 -281 -289 46 352 446 287 229 -160 -125 -578 -297 -435 -223 124 302 393 650 198 277 20
6340 20 -289 -502 -320 -269 -59 353 524 566 274 40 -50 -527 -646 -274 -299 26 70 381 436 517 -168 66 43
6363 43 -568 -574 -476 -202 67 234 399 376 156 9 -111 -245 -506 -446 -239 -167 9 380 423 431 257 -36 -291
6386 -291 -634 -467 -167 -22 196 323 370 332 214 140 -280 -238 -696 -644 -328 248 199 351 385 652 110 -260
6408 -260 -378 -611 -363 -516 -148 99 384 464 525 242 -143 -278 -213 -442 -336 -186 298 431 412 551 30
6429 30 -66 -151 -546 -521 -177 -113 71 239 440 552 265 58 -21 -212 -566 -371 -303 210 219 525 573 432 125
6452 125 -4 -67 -418 -322 -431 -241 124 161 380 392 334 141 -240 -218 -266 -225 -344 99 283 273 233 433 336 8
6476 8 -306 -521 -636 165 -132 383 189 278 372 72 122 -248 -427 -355 -330 -334 166 154 525 359 345 87 43 -368
6500 -368 -496 -708 -452 64 197 231 386 464 281 -233 -363 -322 -347 -257 3 150 377 610 411 518 44 -204
6522 -204 -504 -350 -573 -373 -10 349 284 349 320 31 -21 -250 -416 -382 -150 -153 291 290 339 393 146 -54 -555 -239
6546 -239 -431 -412 -107 124 284 406 458 307 151 -267 -240 -271 -461 -206 -18 96 502 573 299 228 -334 -390
6568 -390 -460 -390 -469 -357 41 236 540 349 130 43 -238 -408 -532 -579 4 171 144 383 464 289 70 -38
6590 -38 -377 -370 -497 -197 -92 147 374 581 387 -2 153 -270 -374 -438 -484 -62 60 321 361 462 352 101
6612 101 -233 -506 -547 -303 -21 185 386 703 494 333 344 -114 -379 -593 -383 -91 74 192 352 362 441
6633 441 222 73 -201 -346 -520 -273 -93 258 456 672 418 465 116 -251 -281 -293 -610 -274 -9 177 387
6654 387 450 374 112 42 -138 -439 -261 -251 95 240 467 540 378 418 168 18 -430 -582 -357 -299 132 257
6676 257 419 605 315 206 -240 -241 -432 -332 -371 143 507 558 558 168 194 169 -146 -609 -458 -318 -129 143 478
6699 478 534 438 310 -223 -338 -443 -617 -472 -43 100 314 367 517 154 330 -61 -410 -387 -465 -39 -70 95
6721 95 505 447 648 163 -70 -207 -692 -456 -186 -127 206 592 434 522 257 164 -328 -233 -657 -526 -109 -273
6743 -273 328 183 393 267 193 23 -201 -345 -406 -245 41 68 426 533 557 200 -49 -275 -395 -485 -331 -153
6765 -153 199 503 515 528 293 129 -257 -428 -329 -465 -158 -253 260 428 651 379 128 52 -204 -312 -339 -413
6787 -413 -242 145 340 495 436 199 -69 -191 -618 -491 -137 -186 47 151 457 356 339 127 -54 -540 -729
6808 -729 -156 -184 4 293 156 475 254 -55 -111 -331 -466 -551 -352 -75 -100 186 424 382 172 -49 -165 -532
6830 -532 -498 -356 -347 -148 133 763 379 372 129 -17 -518 -516 -394 -282 -10 188 518 442 260 196 121 -298 -496
6853 -496 -457 -314 -157 279 325 296 309 363 -144 -34 -546 -536 -320 -123 201 351 402 408 403 140 -97 -270 -396 -589
6877 -589 -230 75 110 447 545 488 67 -139 -274 -438 -574 -547 -121 175 294 446 500 204 -8 -217 -385 -444
6899 -444 -163 -214 -39 182 308 274 365 160 -54 -268 -178 -439 -361 94 169 432 597 145 288 61 -402 -534
6921 -534 -611 -304 -81 -3 464 322 585 458 -118 -235 -108 -403 -315 -385 -106 105 488 301 249 375 -212 -244
6943 -244 -580 -414 -325 -95 138 451 625 244 315 19 -248 -274 -573 -267 -134 71 115 348 387 379 121 34 -352
6966 -352 -242 -268 -364 -10 95 267 592 308 85 -306 -512 -176 -274 -375 -210 230 299 591 589 250 -191 -145
6988 -145 -486 -502 -432 -367 18 249 406 312 278 104 -34 -409 -90 -332 -109 -240 103 219 506 313 335 178
7010 178 -216 -542 -430 -166 -297 25 298 329 529 261 79 -138 -298 -526 -332 -170 -86 393 343 437 291
7031 291 185 -200 -140 -305 -439 -340 -32 275 359 503 279 294 -95 168 -307 -457 -562 -176 -234 414 516 317
7053 317 500 28 13 -235 -358 -303 -101 252 210 447 102 147 56 -69 -466 -290 -501 -360 -83 232 396 363
7075 363 182 342 -51 -230 -214 -408 -409 -152 162 198 224 273 149 86 -101 -273 -435 -516 -209 -244 109 345 471
7098 471 493 225 124 -234 -412 -498 -287 -28 -46 401 218 360 445 84 -20 -424 -295 -89 -390 114 329
7119 329 256 362 403 115 -96 -172 -374 -676 -111 -375 129 506 326 256 230 -19 -381 -384 -414 -284 -107 156 323
7142 323 448 438 318 -132 -122 -429 -475 -360 -188 72 204 389 439 383 192 -14 -251 -527 -146 -197 -223 265
7164 265 398 406 374 399 23 -41 -274 -302 -156 -264 215 97 415 314 158 158 -324 -190 -436 -446 -291 -91 216
7187 216 155 599 368 117 -341 -439 -380 -554 -411 -14 -6 454 539 429 287 6 -49 -425 -583 -409 -287 -104
7209 -104 59 328 624 407 63 -192 -422 -535 -177 -29 -100 46 426 450 432 27 -54 -249 -270 -401 -420 -163
7231 -163 -91 162 523 240 273 -205 -336 -516 -511 -373 -180 127 324 106 365 422 211 31 -406 -665 -297 -124
7253 -124 10 -11 341 231 336 229 75 -249 -451 -282 -295 132 228 171 333 311 217 35 -211 -309 -479 -287
7275 -287 -155 -34 117 308 338 191 105 -227 -322 -581 -249 -225 34 72 478 621 262 309 181 -325 -586 -571
7297 -571 -409 -239 -143 110 354 398 244 14 -251 -466 -273 -151 -84 119 274 207 471 172 198 42 -312 -371
7319 -371 -343 -319 -180 186 168 615 305 0 87 -321 -542 -434 -438 -250 319 334 263 460 160 78 -358 -219 -670
7342 -670 -315 -382 11 -57 382 421 305 290 -34 -451 -356 -311 -247 -215 210 420 411 362 162 -71 -102 -331 -377 -257
7366 -257 -426 91 302 393 535 211 -48 -113 -172 -378 -149 -146 -221 209 299 504 345 133 9 -350 -487 -596
7388 -596 -147 -67 226 308 349 638 129 57 -426 -206 -414 -192 -33 4 559 162 426 178 91 -64 -175 -500
7410 -500 -311 -105 -10 325 599 301 286 163 -90 -411 -287 -385 -516 60 124 368 349 355 180 261 -252 -420 -474
7433 -474 -110 -78 -3 298 411 252 247 118 -196 -480 -65 -164 -319 49 128 357 467 332 -31 -30 -421 -55 -217
7456 -217 -364 -182 -15 422 133 342 425 344 -283 -314 -333 -349 -366 -223 292 727 381 206 115 -34 -111 -345 -284
7479 -284 -235 -42 216 445 386 193 208 -150 -326 -240 -516 -487 -243 67 244 279 555 25 76 -196 -248 -316 -320 -90
7503 -90 37 309 320 552 4 -13 -151 -245 -444 -284 -296 49 274 353 429 150 72 -54 -281 -92 -428 -150 -12
7526 -12 64 234 466 463 297 33 -233 -186 -404 -370 -357 -91 122 322 426 381 70 121 -150 -243 -482 -213 35
7549 35 325 471 387 554 277 2 -224 -253 -570 -337 -1 307 437 161 359 303 116 -420 -387 -461 -266 -51
7571 -51 -222 167 251 497 277 288 84 -244 -459 -360 -177 -217 200 494 341 500 545 177 -49 -242 -314 3
7593 3 -282 185 395 182 414 187 402 -62 -177 -295 -417 -314 38 228 268 170 226 120 -57 -196 -412 -349
7615 -349 -407 -129 166 263 287 157 163 -169 59 -340 -570 -491 -375 106 430 237 215 107 418 -6 -479 -505 -406
7638 -406 -304 20 175 538 507 425 94 186 -1 -571 -551 -27 -275 344 380 400 224 159 -261 -142 -143 -304 -403
7661 -403 -214 36 222 105 430 350 -81 34 -260 -386 -393 -139 -197 75 193 238 368 87 -108 -417 -507 -392
7683 -392 -522 -98 325 240 486 216 406 174 70 -509 -340 -292 42 -47 233 310 349 282 147 -50 -113 -298
7705 -298 -337 -252 76 -68 157 297 376 43 -76 -313 -282 -443 -496 -105 -268 305 368 527 236 4 -73 -525
7727 -525 -295 -605 -445 -2 290 335 217 302 283 -5 -308 -453 31 -387 -248 67 289 437 185 268 56
7748 56 -219 -314 -325 -207 -52 156 200 233 275 427 -37 -141 -497 -460 -435 -114 50 182 491 337 414 320 -46
7771 -46 -254 -330 -273 -233 83 258 209 162 191 305 -211 -398 -190 -431 -197 83 -17 313 269 324 382 -81 -115 -79
7795 -79 -166 -292 -293 -38 64 218 358 226 278 -153 -293 -212 -255 -212 -104 -43 312 374 407 172 138 -150 -425 -383
7819 -383 -341 -200 -170 191 480 330 357 -54 -92 -210 -247 -374 -400 -30 44 355 470 432 194 32 -327 -210 -357
7842 -357 -138 13 -41 179 172 186 4 132 -267 -79 -176 -262 -103 179 426 263 341 17 82 -95 -310 -51 -117
7865 -117 -236 60 314 337 518 391 40 15 -209 -148 -384 -381 -316 -236 157 194 427 145 -176 -132 -165 -367 -350 -242
7889 -242 107 94 285 274 363 36 -282 -349 -420 -360 -100 67 24 227 197 169 45 63 -214 -313 -41 73 -20 120
7913 120 391 181 157 89 -96 -135 -467 -325 -307 -86 -246 168 632 259 196 275 108 -279 -209 -306 -160 -37 66
7936 66 189 484 418 -79 -158 -180 -483 -574 -334 -288 40 -98 480 204 312 124 -432 -366 -194 -301 -193 -86
7958 -86 -51 76 396 -40 12 23 20 -194 -488 -105 -170 -99 140 148 160 449 114 -69 -330 -496 -263 -232 168 204
7982 204 269 355 448 -43 90 -300 -376 -309 -323 79 62 29 184 243 254 -4 -1 -352 -316 -297 -305 -59 313 263 385 152
8008 152 64 -84 -252 -110 -213 -101 -25 369 374 280 236 242 -168 -91 -97 -244 -220 -21 134 465 194 213 126 83 -48
8033 -48 -296 -319 -369 -39 -147 133 168 304 304 29 -68 -317 -310 -140 -98 -39 -123 251 184 204 36 -116 -81 -32 -258
8058 -258 -243 30 -24 246 481 136 58 -5 -197 -450 -395 -113 183 37 220 413 244 390 154 -71 -210 -65
8080 -65 -247 -257 -2 -23 92 222 55 85 155 94 -205 -228 95 -59 159 69 172 277 316 194 -219 -101 -290
8103 -290 -362 -100 -46 306 281 467 286 58 -223 -309 -210 -153 -168 -71 205 552 453 379 186 18 -64 -285 -229 -221 -106
8128 -106 72 132 225 -53 160 3 -1 -208 -461 -109 -174 188 222 49 211 342 100 -143 82 -395 -136 -122
8150 -122 -99 336 -56 336 126 191 100 -207 -438 -278 -269 -203 190 -72 353 24 150 -199 -378 -146 -55 -113 -163
8173 -163 25 377 319 204 210 153 16 -110 -332 -74 -10 -141 180 -3 93 273 58 -136
8191a36
##END NTUPLES=NMR FID
##END=
