##TITLE=1H_PR162_KP
 CDCl3, 8 sc, 
 28.5.2019
##JCAMPDX= 6.0         $$ Bruker NMR JCAMP-DX V2.0
##DATA TYPE= NMR FID
##DATA CLASS= NTUPLES
##ORIGIN= UXNMR, Bruker Analytische Messtechnik GmbH
##OWNER= root
$$ XWIN-NMR		Version 3.5
$$ Wed May 29 13:41:57 2019 Russian Standard Time (UT+4h)  she@DPX200
##.OBSERVE FREQUENCY= 200.13155
##.OBSERVE NUCLEUS= ^1H
##.DELAY= (6, 6)
##.ACQUISITION MODE= SIMULTANEOUS
##.ACQUISITION SCHEME= undefined
##.AVERAGES= 8
##.DIGITISER RES= 18
##SPECTROMETER/DATA SYSTEM= spect
##.PULSE SEQUENCE= zg30
##.SOLVENT NAME= CDCl3
##.SHIFT REFERENCE= (INTERNAL, CDCl3, 0, 15.7039)
##AUDIT TRAIL= $$ (NUMBER, WHEN, WHO, WHERE, WHAT)
$$ ##TITLE= Audit trail, XWIN-NMR		Version 3.5
$$ ##JCAMPDX= 5.01
$$ ##ORIGIN= Bruker BioSpin GmbH
$$ ##OWNER= she
$$ F:/spectra/data/she/nmr/H-F/1/audita.txt
$$ ##AUDIT TRAIL=  $$ (NUMBER, WHEN, WHO, WHERE, WHAT)
(   1,<2019-05-29 13:40:51.18 +0400>,<she>,<DPX200>,
      <created by zg, POWCHK disabled, PULCHK disabled
       configuration hash MD5:
       00 E9 B6 7A A2 85 ED C7 34 08 36 98 17 FE 4E 26
       data hash MD5: 16K
       E3 2E F0 0A 12 26 C4 A4 F3 AA A5 58 1D E5 EE 23>)
$$ ##END=
$$ 
$$ hash MD5
$$ F0 29 8D 3D D5 30 AC 7E 5F 26 D2 E2 46 62 38 3E
##$RELAX= 
##$RELAX= 
##$RELAX= 
##$RELAX= 
##$RELAX= 
##$RELAX= 
$$ Bruker specific parameters
$$ --------------------------
##$DU= <F:/spectra>
##$EXPNO= 1
##$NAME= <H-F>
##$PROCNO= 1
##$TYPE= <nmr>
##$USER= <she>
##$AMP= (0..31)
100 100 100 100 100 100 100 100 100 100 100 100 100 100 100 100 100 100 
100 100 100 100 100 100 100 100 100 100 100 100 100 100 
##$AQSEQ= 0
##$AQ_mod= 1
##$AUNM= <au_zg>
##$AUTOPOS= <>
##$BF1= 200.13
##$BF2= 200.13
##$BF3= 200.13
##$BF4= 200.13
##$BF5= 200.13
##$BF6= 200.13
##$BF7= 200.13
##$BF8= 200.13
##$BYTORDA= 1
##$CFDGTYP= 0
##$CFRGTYP= 5
##$CHEMSTR= <none>
##$CNST= (0..31)
1 1 145 1 1 1 1 1 1 1 1 1 1 1 1 1 1 1 1 1 1 1 1 1 1 1 1 1 1 1 1 1 
##$CPDPRG= <>
##$CPDPRG1= <>
##$CPDPRG2= <>
##$CPDPRG3= <>
##$CPDPRG4= <mlev>
##$CPDPRG5= <mlev>
##$CPDPRG6= <mlev>
##$CPDPRG7= <mlev>
##$CPDPRG8= <mlev>
##$CPDPRGB= <>
##$CPDPRGT= <>
##$D= (0..31)
0 1.2 0 0 0 0 0 0 0 0 0 0.03 0 0 0 0 0 0 0 0 0 0 0 0 0 0 0 0 0 0 0 0 
##$DATE= 1559122850
##$DBL= (0..7)
120 120 120 120 120 120 120 120 
##$DBP= (0..7)
150 150 150 150 150 150 150 150 
##$DBP07= 0
##$DBPNAM0= <>
##$DBPNAM1= <>
##$DBPNAM2= <>
##$DBPNAM3= <>
##$DBPNAM4= <>
##$DBPNAM5= <>
##$DBPNAM6= <>
##$DBPNAM7= <>
##$DBPOAL= (0..7)
0.5 0.5 0.5 0.5 0.5 0.5 0.5 0.5 
##$DBPOFFS= (0..7)
0 0 0 0 0 0 0 0 
##$DE= 6
##$DECBNUC= <off>
##$DECIM= 24
##$DECNUC= <off>
##$DECSTAT= 4
##$DIGMOD= 1
##$DIGTYP= 9
##$DL= (0..7)
0 120 120 120 120 120 120 120 
##$DP= (0..7)
150 150 150 150 150 150 150 150 
##$DP07= 0
##$DPNAME0= <>
##$DPNAME1= <>
##$DPNAME2= <>
##$DPNAME3= <>
##$DPNAME4= <>
##$DPNAME5= <>
##$DPNAME6= <>
##$DPNAME7= <>
##$DPOAL= (0..7)
0.5 0.5 0.5 0.5 0.5 0.5 0.5 0.5 
##$DPOFFS= (0..7)
0 0 0 0 0 0 0 0 
##$DQDMODE= 0
##$DR= 18
##$DS= 0
##$DSLIST= <SSSSSSSSSSSSSSS>
##$DSPFIRM= 0
$$ [...]
##$SUBNAM2= <"">
##$SUBNAM3= <"">
##$SUBNAM4= <"">
##$SUBNAM5= <"">
##$SUBNAM6= <"">
##$SUBNAM7= <"">
##$SUBNAM8= <"">
##$SUBNAM9= <"">
##$SW= 24.9336996594482
##$SWIBOX= (0..15)
0 0 2 0 0 0 0 0 0 0 0 0 0 0 0 0 
##$SW_h= 4990.01996007984
##$TD= 16384
##$TD0= 1
##$TE= 0
##$TE2= 300
##$TE3= 300
##$TEG= 300
##$TL= (0..7)
0 120 120 120 120 120 120 120 
##$TP= (0..7)
150 150 150 150 150 150 150 150 
##$TP07= 0
##$TPNAME0= <>
##$TPNAME1= <>
##$TPNAME2= <>
##$TPNAME3= <>
##$TPNAME4= <>
##$TPNAME5= <>
##$TPNAME6= <>
##$TPNAME7= <>
##$TPOAL= (0..7)
0.5 0.5 0.5 0.5 0.5 0.5 0.5 0.5 
##$TPOFFS= (0..7)
0 0 0 0 0 0 0 0 
##$TUNHIN= 0
##$TUNHOUT= 0
##$TUNXOUT= 0
##$USERA1= <user>
##$USERA2= <user>
##$USERA3= <user>
##$USERA4= <user>
##$USERA5= <user>
##$V9= 5
##$VALIST= <valist>
##$VCLIST= <CCCCCCCCCCCCCCC>
##$VD= 0
##$VDLIST= <DDDDDDDDDDDDDDD>
##$VPLIST= <PPPPPPPPPPPPPPP>
##$VTLIST= <TTTTTTTTTTTTTTT>
##$WBST= 1024
##$WBSW= 4
##$XGAIN= (0..3)
0 0 0 0 
##$XL= 0
##$YL= 0
##$YMAX_a= 152280
##$YMIN_a= -213318
##$ZGOPTNS= <>
##$ZL1= 120
##$ZL2= 120
##$ZL3= 120
##$ZL4= 120
##$ABSF1= 10
##$ABSF2= 0
##$ABSG= 5
##$ABSL= 3
##$ALPHA= 0
##$AQORDER= 0
##$ASSFAC= 0
##$ASSFACI= 0
##$ASSFACX= 0
##$ASSWID= 0
##$AUNMP= <proc_1d>
##$AZFE= 0.1
##$AZFW= 0.1
##$BCFW= 1
##$BC_mod= 2
##$BYTORDP= 1
##$COROFFS= 0
##$CY= 11.3945322036743
##$DATMOD= 1
##$DC= 2
##$DFILT= <>
##$DTYPP= 0
##$F1P= 18.9103706918063
##$F2P= -1.10871071338519
##$FCOR= 0.5
##$FTSIZE= 0
##$FT_mod= 4
##$GAMMA= 1
##$GB= 0.15
##$INTBC= 1
##$INTSCL= 1
##$ISEN= 128
##$LB= 0.24
##$LEV0= 0
##$LPBIN= 0
##$MAXI= 10000
##$MC2= 0
##$MEAN= 0
##$ME_mod= 0
##$MI= 1.114404
##$NCOEF= 0
##$NC_proc= 0
##$NLEV= 6
##$NOISF1= 3.799351
##$NOISF2= 2.8
##$NSP= 1
##$NTH_PI= 0
##$NZP= 0
##$OFFSET= 15.70392
##$PC= 1
##$PHC0= -8502.942
##$PHC1= 22.40025
##$PH_mod= 1
##$PKNL= yes
##$PPARMOD= 0
##$PSCAL= 0
##$PSIGN= 0
##$REVERSE= no
##$SF= 200.130013532006
##$SI= 16384
##$SIGF1= 3
##$SIGF2= 2
##$SINO= 400
##$SIOLD= 16384
##$SREGLST= <1H.CDCl3>
##$SSB= 0
##$STSI= 0
##$STSR= 0
##$SW_p= 3612.71676300578
##$SYMM= 0
##$S_DEV= 0
##$TDeff= 0
##$TDoff= 0
##$TI= <>
##$TILT= no
##$TM1= 0
##$TM2= 0
##$TOPLEV= 0
##$USERP1= <user>
##$USERP2= <user>
##$USERP3= <user>
##$USERP4= <user>
##$USERP5= <user>
##$WDW= 1
##$XDIM= 8192
##$YMAX_p= 0
##$YMIN_p= 0
$$ End of Bruker specific parameters
$$ ---------------------------------
##NTUPLES= NMR FID
##VAR_NAME=  TIME,          FID/REAL,        FID/IMAG
##SYMBOL=    X,             R,               I
##VAR_TYPE=  INDEPENDENT,   DEPENDENT,       DEPENDENT
##VAR_FORM=  AFFN,          ASDF,            ASDF
##VAR_DIM=   8192,          8192,            8192
##UNITS=     SECONDS,       ARBITRARY UNITS, ARBITRARY UNITS
##FACTOR=    0.0002004,     1,               1
##FIRST=     0,             0,               0
##LAST=      1.6414764,     0,               0
##MIN=       0,             -213318,         0
##MAX=       1.6414764,     152280,          0
$$ Real data points
##PAGE= N=1
##DATA TABLE= (X++(R..R)), XYDATA
$$ [...]
1906A36M15l20J37Q6J28O9k48N02r1k13n6O35m85j42n8LL77p10K41J6M49p29j06
1929C6M21%j84m07L02l97R0l1j44N40m78K3k56P6o6o5o5j8K17j54q6K08j89J96
1953d31o6K50O0k27L35k93N6J7J28j25m0L30M97k95l73K03M97j35k96K85m78N67
1975D66l53J73L88m84J56k6j46r0L88k60j84K65%P4p13N17j47J8n84K33L87J97
1997B75l30m07N45k72K02k67p1L04Q4j88O5J81k93j10J87J79J41o91M74L17q1
2018B44m67K14K42m12M79k37J23l10K61J50j53J73n51N33m8m20J40K95k34m35
2038d13K99L09k55j07l0L94l26K4m32J89K9k77J10J00R6p8L3J26j46o9J92J46
2060h6l48K40K24j0N8j49J74K9j11j09M12j44k5K49J1K40l16R0J68J19o86J38
$$ y = [136, 551, 231, 368, 454, 582, 651, 403, 905, 814, 601, 545, 1180, 695, 553, 495, 498, 875, 165, 406, 422, 871, 142, 36, 457, 457, 273, -134, 168, -229, -139, -170, -314, 226, -252, -229, -485, -409, -475, -540, -605, -623, -406, -560, -646, -438, -627, -431, -497, -247, -187, -414, -79, -372, -316, -299, -171, -296, -336, -6, 491, 196, -177, 26, 523, 388, 92, 377, -101, 466, 113, 286, 674, 190, 346, 320, 174, 84, 472, 212, 28, 293, 293, 367, -346, 171, 24, 42, -542, -309, 78, 275, -55, -462, 83, -189, 13, -254, -325, -21, 63, -125, -60, 121, -172, -282, -95, 84, 225, -466, 8, 325, 244, -223, -9, 233, -179, 300, 63, 186, -124, 137, 287, 134, 307, -244, 289, 241, -179, -39, 256, 22, -413, -114, 195, -60, -167, -197, 197, -129, -105, -537, -348, -319, -596, -486, -386, -290, -368, -335, -209, -355, -424, -232, -86, -434, -194, 30, 20, 78, -71, 103, 132, 21, -88, 324, 180, 155, 404, 415, 655, 339, 429, 597, 716, 30, 168]
2082A68J99K6M1p9J94k31j3j48J16L5j38o0r1k9k3k5Q5m70m01N56p4k41K06k24
2106f21J19j10N3M7R6l36L11L4q3n2J6K45j31N8jJ67M14q4n4l39L21M6j5P7K46
2131D24k97M09n0J68j57KJ90P0k55J27K22k69l94M91O9n66K05J3O7j34j73j4K63
2154D11p75K91j15K64l32n0K0N8r9l67J94k11M17l50N07n9k97J50j03K05q0l02
2176f23K27R4m29M79n7J87j73K2L00L75n99%L27J85j00R5L0pj15L72K17k48j61
2199C98L3K2n0j94J01J15l29L4M48k28J22k43k23O3J1l3R1m09j27J78%K02o1j44
2223b23j17K07j68Ol90M49k89L98j70O6l3o4P0K18k65N5K67p0J47j35K16l35j3
2246a73K80K88j46O5m05K34K23j06k1K20Lj92o8K9p0l7k04K08Q8j45j8r6J28o1
$$ y = [168, 367, 393, 434, 355, 549, 318, 305, 157, 273, 308, 170, 110, 19, -10, -33, -58, 27, -443, -844, -288, -362, -603, -397, -621, -502, -612, -559, -512, -416, -752, -441, -407, -490, -542, -526, -281, -412, -354, -355, -188, 226, 142, 88, -251, 70, 116, 101, 178, 424, 127, 536, 486, 654, 497, 499, 689, 759, 504, 631, 853, 584, 190, 681, 750, 184, 389, 402, 469, 335, 162, 148, 411, -364, -73, -188, 76, -256, -306, -286, -228, -327, -694, -500, -711, -294, -644, -137, -196, -493, -343, -446, -241, -321, -623, -396, -302, -731, -252, -309, -122, -295, -273, 27, 402, -197, -197, 130, 315, 215, 310, 340, 333, 218, 590, 807, 559, 398, 431, 453, 403, 209, 310, 425, 96, 130, 578, 350, 472, 229, 6, 69, 80, 47, 138, -271, -398, -220, -220, -18, -79, -223, -340, -133, -301, -295, -685, -236, -525, -127, -297, -231, -264, -328, -258, -40, -305, -250, 17, -53, 94, -41, 175, -160, -173, 107, 395, 249, 314, -91, 143, 366, 260, 239, 459, 462, 270, 202, 231, 161, 124, -80, 128, 216, 71, 53, -43, 85, 24]
2270B4j03M43m27O2k26n1J38m1JN5k64p6N97n62kM47m8Q7m72J78J39J25k3R6j61
2295f4p7K01J07l88K64K56j57J46M5L13l78p1K63k79K31l40K99q4l67M55M3k21
2317A97j60k17L38j21j42K03j64j10p7J68j59j17M34k91j32R9q8L80m00J11j35
2338c83N0M4k35M61k05Q9K8J07M0j76M95o11k9N21j63K3J49o1K40j94L52n0j91
2361C01k37M88j55k6O1r6K12m52N55k05j38k44K33j19j29q1K60k52l36J90P6j00
2383a94Nk26K17p5J6k93L60m29K29K91k21l05M68j37L5j27k35L01j17J8J51L9
2405b29J29l2j95K68j56M47J06k48M7r6P2K92j7J82k34r4J46J12k68L02k92pL26
2428E61J2k4n00J91J21k33K5r2O3J05m28K14l26J63j13k89J80r8K95j40N5j36
$$ y = [24, -79, 364, -63, -1, -227, -278, -140, -181, -180, -125, -389, -465, 132, -430, -432, 15, -33, 54, -418, -240, -101, 24, 1, 97, -64, -141, 60, 167, -221, 43, 299, 142, 288, 333, 646, 268, 197, 460, 181, 412, 72, 371, 287, -80, 375, 418, 197, 37, -180, 158, 37, -105, 98, -66, -176, -253, -85, -244, -361, 73, -218, -350, -251, -339, 41, -359, -248, -383, -333, -289, -524, -63, -268, -179, -151, -44, -4, -180, 315, -296, -325, 196, 33, 56, 205, 144, 384, 190, 542, 492, 301, 64, 552, 397, 371, 432, 336, 548, 96, 651, 446, 308, 64, 297, 178, 49, -32, 228, -24, -360, -170, -94, -194, -189, -415, -198, -273, -257, -550, -190, -619, -390, -99, -320, -625, -157, -294, -259, -386, -621, -320, -437, -419, -268, -229, -100, -132, -327, -59, -215, 232, 338, 90, 137, 41, 113, 405, 388, 570, 336, 242, 388, 500, 232, 534, 242, 235, 561, 573, 549, 49, 240, 361, 128, 153, 61, 124, 229, -199, 15, -311, -148, -261, -550, -370, -468, -173, -313, -258, -394]
2450c94j15K18j24K73J38k25j89M26R8k76kJ0K81j96J23j60O7L71m3o9k0J89j50
2473B31k1L07l12N5M37m07J34l60j8M67k97j18K16J09j55r4j00J43l10p5K34k
2495F4j91k63J01J36j21L00j93j66L38j50j04N9MJ0k69N3Q5J51o2K42k42l1N52
2518C03m37l6j19L87j01P6j61L93O0m39J89qJ74j73M2K29K33k73l55M77l36j50
2540b5L70k18j73K16j05j1J62l61j13J55J67k47p9K35P4r4j82R7r9J07j53l06
2562e83O58l23N7R1%p6L36n24L13K2m7j34k7K00J69l1k20J95l0M9k6L1j37L94
2586C57l4O0j03L3k85L93l25k2k34M80r3J79p9R7l63j4K15k45j19n7M6n7R%j48
2611c09j44J4J64l7j68L59k22J24J95M9l09j9P8o7M32m61K07l26L4L62K32k74
$$ y = [-394, -509, -291, -415, -142, -4, -229, -418, 8, 106, -170, -172, -162, 119, -77, 46, -114, -47, 324, 281, 212, 192, 381, 231, 210, 517, 205, 260, 697, 290, 424, 64, 46, 513, 216, 98, 314, 423, 268, 174, 74, 217, -93, -168, 66, 64, -127, -390, -289, -153, -274, 26, -167, -333, 5, -145, -249, -190, -186, -176, -445, -392, -307, -156, -218, 24, -218, -249, 303, -134, -170, -289, 98, -3, 73, -88, 305, 365, -74, 115, 107, 281, 108, 150, 379, 612, 339, -16, 461, 125, -25, 345, 127, -46, 170, 65, 54, 216, -145, -258, -103, 64, -183, -262, -27, 47, -47, -229, -132, -231, -124, -277, -583, 75, -248, -191, -100, -100, -176, 160, -364, -51, -29, -76, -210, -237, -37, 132, 101, -119, 76, 46, 95, 69, 100, -37, 357, 323, 383, 280, 313, 28, 421, 96, 74, -160, 320, 227, 406, 327, 424, 61, 47, 262, 17, -102, -159, -113, -170, -161, -161, -309, -453, -439, -275, -312, -480, -121, -343, -219, -24, 25, -284, -303, -225, -292, 140, -321, -114, -440, -406, -44, 188, -86]
2633h6M24j48qj63L00k03L85l39O3n8j75M9K14P2k49L82j2L6M2k5l56j09K39N7
2657C32j54M0o7j75m0j40L00l52J87K07k89k25K66o7K23k31L6p5k66L19J28o9
2679a12k58J21j24L90m54L89j00K11k80MK58K27j94q3J63K63m63M00m66K96J65
2700C53j90J17o0L9J7K10j66K9q1N1J3k60K17k83K6J93k72K90k01o3kj3rJ21p5
2725AL8m32j61L63k7J8L5q4j8j31j37J36L52o1j69j36M80k38J7o2J04o4K34kL07
2750C63l75M46k19J51k32j08L22m05K16k66L14K5j49K56j36j04J84k37O4m6m5
2771A9N1J0k39N2J06j35J48m24J87J61J74q0k30k6o3J54Jj21M6r6Q0J90j51M5
2795a41J3Q1m68L02K75J36j06J32k64J10p9J2L78l16J61m29M16m%J65j85J75K
$$ y = [-86, 338, 190, 182, 19, 319, 116, 501, 162, 225, 167, -8, 41, 255, 327, 78, 460, 448, 484, 526, 501, 145, 36, 275, 332, 178, 218, 151, -24, -64, -204, 96, -256, -69, 138, -151, -376, -110, -177, 46, -185, -149, -224, -490, -171, -43, -112, -370, -249, -373, 17, -437, -48, -148, 63, -217, -213, 45, 272, 78, -5, 158, 421, -42, 358, -108, 188, 353, 163, 280, 220, 259, 276, 486, 320, 349, 268, 319, 332, 72, 289, 6, 32, 225, -47, 243, 42, -21, -23, -36, -45, 76, 1, 39, -393, -554, -191, -218, -200, -165, -249, -267, -398, -535, -399, -47, -108, -277, -413, 67, -171, -154, -216, -112, -176, 58, 56, 363, -12, 434, 215, 366, 134, 26, 348, -57, 159, -107, 207, 232, 83, 339, 203, 99, 283, 46, 110, 64, 19, 70, 80, -159, -107, -1, -136, 12, -412, -225, -64, 110, 30, -200, -226, -289, -135, -134, -255, -209, -305, -225, -35, -186, -141, -128, -47, -515, -213, 62, 198, 92, 224, -40, 70, -9, 3, 381, 65, 226, -203, 213, 209, 209, 374, 189, 364, 366]
2818C66k44R0P2k54R0K0m4l83M10o7K4k45r1k35N48mR1j59k53J80k84L74m52n4
2842e04K44l4L25j73ok51K42q7j6K11k3k03L94l57L7K47j02K23k34R5o8J67J20
2865B47mJ4j70J47k65L84k41r4L45p9J25k53p2r9N6j0nJ46j83KJ01P2j52q9k31
2890c08J3J87j43k78M00J47l13P4j89P8L6o7l5R8l9L5K94j13j04K0K43k47p3L69
2914H5j41l2rK27l18M50l14M05J89k29N5j30J77l69P7M84n72J22P6R7k66J52l5
2937A81l02L76j61L6K5k03J59o2o2j17O9J60j84J29m53L59k9k00L5N6r8P0m2j57
2961d15M5J07J5P5J55N7N4l13Q7j47M47l75J20K49o7N0j94J67J05K9R3r7j44K11
2985C14J16q0l70K61j08K16o6m00L80j50j08J28qj26j27J28k13L12j31Q3p7K19
$$ y = [366, 122, 212, 284, 30, 120, 140, 96, -287, 123, 56, 80, -165, -256, -491, 57, 53, 144, -15, -268, -88, -372, 2, -450, -504, -260, -294, 31, -142, -148, -399, -157, -244, -260, -49, -72, -275, 119, -238, -201, 46, -56, 167, -67, 28, -40, 127, 247, 243, 257, 87, 234, -31, 353, 112, 18, 363, 284, 409, 156, 84, -15, 41, 31, 26, 172, -11, -9, 92, 164, 12, -77, -308, -295, -108, -251, -529, -129, 18, -295, -221, -410, -332, -296, -363, -398, -300, -339, -304, -10, -123, -227, -207, 36, -211, -284, 85, -56, -88, -97, 130, -188, 262, -52, 353, 542, 313, 368, 238, 415, 46, 123, 607, 35, 157, 233, 330, 64, 216, 181, -121, 255, 94, 130, 155, -48, 111, 49, -13, -130, -61, 99, -85, 44, -409, -50, -79, -279, -244, -188, -286, -216, -258, -415, -370, -263, -248, -173, -18, 39, 93, -220, -133, -280, 167, -208, -88, 161, 94, 144, -50, 117, 222, 251, 344, 247, 103, 314, 430, 350, -20, 241, 133, 349, 283, -117, 263, 113, 5, 133, 125, -1, -128, 0, -213, 99, -32, 51, -26, 193]
3007A93k62k65M44m62J24K25k01l3N1j32M79k84n0m8L91k25k34R6k25J78J8K90
3029F8J04r9J08j51J07m35M02J85q2q0j01K10Q5m41M03P8Oj06k18k59J74oJ74
3052A26l8l56J69pJ56p9r7J81m55j85L87J70p6q1J19J99l29R3J57l75L44k16L9
3075a54j5J43l01M17J43j55j37J19K2q0K40k88P6l1K69l39K16L8m8j15N62m71
3097A11RJ3M3j80o8J40J92j05j12K5P3l0l10K26o5M5j2j5NK26m50m3J79l7K2l51
3123d69K64K1K70l91J39J37j51K8J58k43L02k51n8J76j7M6K12j38K27j80j63K90
3145B09j67J5n3J43O3m2j9R7q3k68M47K85m01l17K91m5j82R2J00J81m50j32M39
3168B03N3n21J11J07P0k38j72k5Q8p6Q2K3P9O2k7j20K02k02M20l34J89l91M29
$$ y = [193, -69, -334, 110, -352, -228, -3, -204, -237, -186, -318, 161, -123, -173, -221, 170, -55, -289, -193, -418, -240, -222, 68, 172, 73, 181, 30, 137, -298, 104, 289, 207, 127, 26, 236, 321, -120, 283, 361, 367, 261, 43, -216, -42, -48, 126, 88, -268, -99, -106, 50, -29, -126, 55, -400, -585, -198, -28, -104, -185, -66, 133, -196, -103, 54, -321, 23, -193, -154, -169, -26, -327, 90, 233, 78, -59, 60, 82, 2, 242, -46, 30, -1, 268, -71, 145, 183, 135, 20, 582, 111, 120, 133, 176, -4, -72, 68, 260, 155, 43, 68, 141, 111, -199, 27, -38, 7, -5, -20, -15, 211, -239, -282, -103, -140, -118, -469, -205, -184, 86, -305, -166, -29, -180, -152, 6, -237, 65, -186, -244, -68, -85, -39, 173, 35, 262, 82, -81, 209, 42, 57, 4, 147, 210, 168, 149, 246, 163, -105, 342, 627, 226, -91, 200, 155, -27, 65, 165, 346, -104, -236, 203, 256, -265, -154, -47, 23, -215, -387, -412, -324, -400, -318, -295, -216, -154, -181, -301, -99, -301, 119, -215, -26, -417, 12]
3191A2j29j98L02j5J58Q4k72M1K34j28Q7j12j02j3r1K6L95l15M03M0k29l04K98
3214A72O3r1j44k69N75p0K7M0q0k30O2J98l68K64j95J16J73k29k13k4L5O4Q0j2
3238e6j55k44L25M5O8J9j68l1J37k47L39j1K54k82j29R2K4J04L9k3j3k18K66q6
3262D9K12l03PJ82J93n6n5K99j89k94O1k35K33l21M47J45l29n6Q2L3j57j22L42
3285A68Lj65Q3j44Q4q2j86L44k78R8k80o6K25J35K36l45j9K10m8M8K8k47O14o10
3309a94J95j29N4N1O3q1q2K86NK96k14n1l29J8K44j06J98j15K20j72J02n2k60
3332e3P8n9k24M6M12j74J09l49K08j30L1Q5j32k07K40l03K62m6J43J58n41M39
3354gl31L57j29P4q3K3J23O7Q1j39J14K03m17L47k84j99K13M7L30O4k58j95K98
$$ y = [12, -117, -315, -13, -28, 130, 214, -58, -17, 217, 89, 176, 64, -38, -51, -142, -116, 279, -36, 367, 407, 178, -126, 172, 235, 144, 0, -269, 306, 236, 263, 303, 223, -7, 55, 253, -115, 149, -46, 70, 243, 14, -199, -223, -188, -124, -44, -56, -211, -455, -130, -85, -17, 2, -166, -197, -60, -307, 32, 21, 275, -7, -136, -44, -20, 84, 123, 100, 87, -131, 135, 49, 261, -42, -35, 147, 340, 284, 229, 528, 339, 45, 106, -129, 104, -217, 230, 375, 46, -10, 72, 105, -52, -174, 168, 171, 6, 89, -55, 29, -53, -239, 105, -173, -75, -355, -421, -196, -61, 175, -170, -189, 21, -27, 21, 49, -198, 416, -194, 1, -128, -74, -23, 40, -41, -123, 163, 168, 464, 250, 199, -130, -112, 132, 26, 224, 109, 329, 157, 259, 207, -53, 25, -34, -258, -212, 200, 26, 135, -214, -6, -136, -105, -20, -152, -359, -119, -422, -160, -206, -63, 95, -446, -7, -338, 19, -110, -36, -119, -96, 27, 94, 175, 36, 150, 353, -64, 283, -1, -200, 13, 60, 390, 454, 196, 1, 299]
3377B99k27K05k2k39M0J38j35j0p8L44n68L25k0q6N5k19P7J67k14J60j14J17j59
3400a64o8N6M8J00o6k35j58L11Qk26L1M30k82j57N19j79J21m9N2kJ49l24J10k73
3424b48L72L6l03L19K84l79K60J94k68Q7j01R5o9J4j20L8r6L73k29k05J5J67m6
3447A90k40O2K24o5k41kl9j85M72k08l74j4k2K41k7o0L51n01J86K22k17j69N00
3470H4N4n30n1O69j43K3l16J84J40j49j06L2J4K16l7J59k18J10L73l44J9L87k89
3493B81q1k85J00q3j59K57P8M7J37p7l84J24j69J09R6P8J95j47l32n0L45k0J6
3516G6j76l3n5K35k43K50j73l3k62K84k5j70K92k75J61K23k37L23j90j7K9k01
3538b17K91L0n8J20o0k2l5l1l9oj19J23K41k18j46L7K44M1l78J36J22j79k14K24
$$ y = [299, 72, 277, 255, 16, 56, 194, 59, 49, -29, 315, -253, 72, 52, -34, 21, -198, -121, 46, -168, -8, -122, -5, -164, -232, -176, -128, -28, -94, -329, -487, -176, -168, -394, -363, 67, -215, -372, 147, -32, 89, 40, 92, 90, 239, -85, 25, -248, 124, 160, -143, 176, 460, 81, 341, 535, 267, 354, 253, 348, 279, 293, 173, 211, 115, 488, 259, 54, 69, 236, 190, -50, 12, 236, 171, -70, -72, -111, -296, 176, -32, -406, -420, -442, -201, -228, -288, 63, -438, -252, -30, -247, -416, 84, 138, -392, -443, 226, 83, 106, -210, -26, 114, -35, -141, -109, -95, 121, 84, 243, 25, 135, 508, 164, 183, 570, 281, 200, -85, 15, -68, -227, 30, 108, 155, 292, 215, -169, -45, -214, -105, -9, 69, 264, 117, -215, -265, 80, 60, 76, -100, -133, -188, 47, -196, 54, -119, -152, -414, -130, -155, -325, -33, -308, -147, 76, -161, 162, -28, -45, -16, -217, 74, 104, 46, 166, 106, 84, 49, 18, -21, -27, -146, -23, 218, 0, -146, -109, 135, 176, -202, -66, 56, -123, -337, -113]
3562a13j12K29O0Q8k79j31J73m5n6K45k97J03J13k6k05M13k62nl9OR1l54Q02l72
3586B7M1R0mj14l4j20K2L41j55k20L00l44M1J32K86l02L3J51K21m18K60j6j36
3609H2O2J08j13l05K50j37J18J43l09j92J33J40rj42J03r8M1m71K38L65m1j66
3631b00L45l33K53M9k77j52R4M4qL36j86J04K42k81P5p0k40L46rk46J35Q7J49
3654B57j0p7j9q8J1r4kK79m0j32L31l14j08k37L21k55K03j49K49l4m11L06N4J71
3678B12n73M40Ll02J4o8p0L60j65K1j62p1L65k24q6J71L6P4r8J11k8KK57n3j79
3703a3K12p6R9%m06J97J40l1J24j11k52Q9k76M90k91K77q2J97o6j74K50k28k53
3726a84K64O4K37k42p1j11K26j19o0m3n5J42N5J2l37l5J50N6N6m89O71o86L50
$$ y = [-113, -225, 4, 64, 152, -127, -258, -85, -130, -186, 59, -238, -135, -22, -48, -253, 160, -102, -107, -146, -140, -49, -403, 399, 27, 68, 158, 154, 40, 6, -114, -92, 249, 94, -126, 174, -170, -129, 3, 289, -13, 20, 171, 392, -26, 234, 218, 82, 144, 252, 139, -166, 84, -53, 65, 208, -101, -293, -160, -20, -29, -171, -68, -166, -125, -596, -358, 7, -34, -200, 145, -188, 65, 114, -163, -315, -221, -177, -185, 151, -35, 69, 311, 30, 105, 35, -205, 141, 132, -114, 21, 108, 257, 247, 170, 151, 63, 74, -20, -22, 257, 217, 85, 416, 102, -6, -243, 78, -177, 26, -123, 126, 92, -319, -13, 41, 212, -361, 79, 82, -220, -206, -274, -344, 16, -149, -128, -290, -361, 4, -220, -306, -135, -99, -25, -123, -12, -40, -38, 219, 166, -13, 199, 123, 222, 222, -184, 13, 153, 122, 246, 135, -117, -28, -304, 186, -105, 172, 90, 287, 221, 47, 297, 69, -184, 80, 144, 381, 139, 68, -43, 183, 64, 4, -39, -94, 48, 103, 115, -222, -257, -107, -51, 5, -484, 187, -499, -149]
3749a49L13k52L9j4n9J50j02R1N6j54K91l47J43r0J45j33J75m9o2j17K27j82K15
3772A35r6j21q0l8mL57J83k57J31k59mK3k8J43J7p4L13j93K9j86LJ04k91J9J98
3797B4PK0r9k79J13K46p5q3%m9p0J84p2K59m21K59j04J11j16L07m2r6j26qM7m
3823f7o4K40J52q5O9k09j01M02m33M67o53L05q9K06K92k13r6l55M58l29j65L74
3845A06j70j41J43lJ7k82K81q2K37l48N9oK08j90K90j98J26k49N9J46k83K84j44
3868a40L63m53N14j42j02J93J7m08J30L34k39k46K60j35J47Q0j23J0O3L2l38J30
3890e3L07k13L0K3j10j67N01n68L13l02K26J50pm6m68M30k49k2J84J24l88K18
3912h7p6J00k4J01J73m43O78m97J34m5l73M10m5J30j3m9j07J38Q1j64O9j20K68
$$ y = [-149, 164, -88, -49, -63, -122, 28, -74, 17, 73, -81, 210, -137, 6, -84, 61, -72, 103, 54, -8, -125, 102, -80, 135, 39, -82, -162, -200, -204, 153, 336, 79, 210, -49, -53, -30, -58, 85, 102, 28, 341, 148, 177, -9, -6, 98, -193, -174, 24, 31, 51, -48, -327, -214, 32, -43, -126, -126, -175, -245, -61, -133, 126, -295, -36, -140, -29, -145, 162, 120, 24, -102, -110, -63, -67, -131, 109, 261, 176, 245, 36, -65, 337, -96, 371, -282, 23, -66, 140, 432, 219, 123, -232, 226, -103, -268, 106, -64, -205, -62, -65, -48, -330, -49, -131, 106, -242, -183, -189, 19, -171, 119, -79, 47, -202, -143, 3, -280, 4, -140, 223, -230, 284, 142, 40, 233, 250, -158, -28, 306, 67, -179, 81, -54, 93, 173, 50, 60, 123, 155, -183, -53, 254, 41, 71, 94, -16, -183, 318, -250, 63, -239, -13, 137, 130, 84, -384, 46, -203, -225, -41, 83, -305, -87, -163, -63, -87, 14, 187, -256, 422, -75, 59, 14, -359, 51, 6, 136, 123, 74, -33, 105, 186, 22, 91, -29, 239]
3935B39l32J22J43p3q8l7M15m39l6K37k54J41k23L27QRj42K2lj76Q2j55M7J73
3959Gm8J25l38R1L00m91N07l37j27R5m9M48k34J3k1l74M07o7J14J65k25j47Q1
3982a05J18j27K70j52N61m25pj75MK63m4K37j19j05n5n8Q9Jk8nj6j17j02M02l59
4007e4k01K03j07M60m36L55k39l0P1l42P1K37J70m28J52K35l22j31L90o0R7j61
4029g0l54L05R7k1J80j14j75J21o4N8J97l13k1K43kJ02r4j32m3p0L14j65J15j11
4053a7J64j40J80J41j75j87LL68n05K32J78J71n51K44j8L9J38m23q8N36j77k94
4075a81L81J8l98K37K1l08J32L4l56M78J89j35m07J92J78l07N62m89J68n0K39
4096A98j96l02L51Q5P7j22j00m9n5Pj61N95m09L42L9j16k20K95j04j98J18j81
$$ y = [239, -93, 29, 172, 99, 11, -26, 389, -50, -86, 151, -103, 38, -185, 142, 150, 159, 17, 39, 36, -140, -58, -213, -166, 7, -41, 84, -254, -163, 137, -354, 153, -184, -311, -216, -265, 183, -51, -38, -59, -433, -26, -93, 21, 186, -39, -186, -105, 13, -114, 156, 4, 565, 140, 133, -42, -38, 225, 181, 418, 299, 194, 139, 81, 170, 171, 143, 138, 122, 5, -97, 305, -54, -255, -52, -159, 301, -135, 220, -19, -49, 22, -320, -249, -12, 158, -270, -118, 117, -205, -336, 54, -6, 91, -70, -424, -119, -22, -43, 137, 23, -152, -31, -95, -37, 160, -153, -174, 69, 67, 169, 75, -57, -100, -170, 144, -21, 94, -17, 147, 7, 187, 328, 153, -34, -31, 337, -168, 64, 242, 413, -138, 106, 88, 127, 265, -158, -246, 290, 113, -181, 200, 218, -180, 57, 78, -230, -98, -64, -420, 58, 247, 112, -295, -103, 75, -232, 330, -159, 9, -41, 198, 2, -300, 51, 136, 213, 91, -9, -58, -113, -106, -267, 328, -81, 261, 300, 184, -36, 259, 155, -43, 75, -106]
4118a06n2K49jJ8j01j98J3J14K89j87m12L38k9R5J11J48k80O8l41N7MJ15j40J60
4142f8P0n49L91L07Q7p91P81m50L48m0P6k54Q8q0j34K36m8J33K12k36k17O44p73
4165b67L40o4L5k91N78k17J24j22k39J13K4%%n4nl7j54L28k06J96n15L71l72M53
4189A9j2j43p1K07J36n55M17K4j60k00L45K43k06p2oJ9M5j1l3OL6k79J78K56j42
4214D1K8j06j36J36J83k57O2L02k76K12j54j31K65J97l67K31k01m8J67R7m52J88
4236a9qK57M2l29j41K94k04K6Jq3J68K5n1r9mn0K20J2K4j17p6J53j63j23M33j4
4262A74j81J6J29k26K9q7K75j34L46o27Q1L79k22j12J88O3K20k07k5j73J15K15
4284B36o0o6l14L32j86j13J64o5K43l03j05L02k2q1nJ6r0j36M2M49l23P7o7R4
$$ y = [-106, -158, 91, 90, 108, 7, -191, -178, -64, 225, 38, -374, -36, -65, 30, 141, 289, 9, 77, -264, -207, -203, -88, -228, -68, 2, -547, -156, 151, 238, -553, 228, -222, 126, 86, 162, -92, -4, -84, -218, 18, -30, 103, 315, 79, -138, 506, -267, 73, 9, 44, -247, 331, 114, 238, 116, -123, -10, 14, 14, 14, -40, -45, -82, -236, 92, -114, 82, -433, -62, -434, 19, 7, -136, -207, 0, 136, -419, -2, 22, -138, -338, 7, 250, 44, -28, -34, -15, 30, 19, -14, -8, 28, -251, -73, 183, 41, 69, -37, -173, -37, 146, -111, -49, 253, -23, 189, 35, -96, 169, 366, -1, 230, 29, -19, 148, 245, -207, -19, -27, 230, 272, -57, -198, 96, -108, -82, -81, -164, 4, 29, -22, -121, -125, -175, 45, 57, 81, -36, -112, 41, -122, -245, 188, 174, -7, 9, 138, -88, -59, -146, 129, -5, 341, -286, -205, 174, -48, -160, 28, 91, 311, 104, 79, -94, 21, 236, 176, 110, -204, 128, -58, -171, -7, -72, 171, -132, -237, 65, 43, -38, -43, -27, -117, -253, -211, 238, -85, -8, -75, 19]
4308A9O6j24O8l4J72j03l0o9j62J75J17k74K30q1M8L67m73J51J2r8Q9k58J52K83
4332B43m5j79j27J36K7K14l31L1J96p5L2j82J83L09o12M76j94j47K21n27K56j64
4354b59K94P0l25Q3O2J32k82pJ92J8l29L04m1j62J52qL75l59k27K45p6j9K60R0
4378A83j8M08n03J73k39L82l58K6N8j11N5J15j60J74l32K16K01k8k34O8M56p14
4400a82j23J64K58k7j6k90ml0J04L28k97J96j14J34m3l69j88K54L93j65N0j20
4422h7M5l78K69m5Q4k52K20J76l08K17m1r2K24N0K03Mj11j68J8J48j92Q2J12J36
4446C14n3l67K07J99m56M17k32p3l8j1R4n6j4L8L02j43j33Q3k89K82k8q2R0J3
4470F4QO7l50N7J27n5O3on7l4J11m55L04m1qM47j60O9k95R7M9K8l9j37M8K17n
$$ y = [19, 85, -39, 29, -5, 167, 64, 34, -35, -197, -22, 95, -179, 51, -30, 18, 385, -88, 63, 75, -23, 66, -192, -40, 243, 198, 19, -108, 28, 55, 269, -62, -31, 165, 90, 122, -60, 123, 432, -180, 296, 102, -45, 176, -351, -95, -259, 35, 105, -220, -137, -75, 57, -225, -232, -40, -22, -351, -47, -88, -250, -98, -106, 269, -90, -317, -72, -148, -167, 93, 183, 165, 573, 70, 243, 4, 386, 28, 54, 112, 1, 56, 171, 11, 185, -147, 69, 270, 242, 8, 76, 532, -182, -305, -141, 117, 90, 74, -216, -220, -250, -146, 182, -115, 81, -33, 101, 58, -311, -499, -245, 148, -17, 33, -87, -42, -420, -151, -196, -112, -364, -144, 32, -276, -59, -100, -192, 32, 82, 285, 289, 178, 10, 28, 176, -16, 66, 178, 314, 261, -106, 101, 300, -156, 261, 29, -44, -82, -93, 1, -55, -69, -31, 271, 128, -5, 78, -211, 71, 43, -39, 51, 64, 72, 139, -211, -154, -27, -82, -19, -25, -82, -116, -5, -460, -156, -197, -205, 242, 82, 151, -144, -47, 2, 30, -9, -146, -98, 119, 114]
4497A14j2N3K6j49rl7MK04j13J05O0j46L2K12j66mr6O3j56J13j39p6o5J65J17
4522A00l27o4J19K04K4j65k8K19j65R0j87j54K40L75l19K51k50r3K81j09p0P1
4544D3L1K0j19l14M07N7l86M67j61j49j09L99m6j56K09K32k91j58j21J36L8j15
4566h6L83n9n35M45J15k54o0L08k91K81j62jk75M61l99J03m8j3J72k75K69k69
4588a90J5j2L32R4j79K58n24r5J22J3P4lK19k22K81l1J5K26k46l01K7M40m26q8
4612b01K16l2O1k49O3q5L06j1J32lj30l49L48M1K0o6OO9L17l51j02p4L1j7k00
4637b60K45k49n5M43k70J49m0J23k1l37L83j64m9K41k54L28k74J53j1r1q5J69
4659G4j89J89j75J44j15J14L85n04J36L75j94R1j31j48Q5r4Q2o7K27l80J89j11
$$ y = [114, 102, 155, 181, 32, 23, -14, -10, 194, 81, 186, 246, 100, 132, 344, 178, 174, 78, 141, -15, 98, -41, -117, -182, -17, 100, -227, -291, -172, 32, 56, -109, -137, 82, -83, 7, -180, -334, -94, 281, -38, 213, -37, -130, 151, 42, -28, 43, 74, 94, -25, -339, 68, 125, -261, 206, 45, -104, -213, 186, 140, -16, 193, 425, 134, -24, -145, -9, 29, -86, 297, 238, -297, 148, 263, 9, -51, 257, -34, 247, 85, 84, -191, 270, -129, -26, -74, -87, 85, -190, 79, -190, -175, -187, 145, 239, 60, 318, -206, -301, -179, -166, -92, -95, 124, -98, 183, 152, 167, 393, 147, -154, -127, 313, -113, -201, 15, -17, 44, -205, -142, -227, 79, 68, 200, 197, 67, -282, 66, 107, 127, 61, 67, 136, 453, 102, 0, -74, -43, -60, -260, -15, -264, -319, 124, -146, 3, -37, 86, 65, -272, 111, -53, -102, 139, -115, 213, -61, 92, 81, -10, -95, 74, -115, 74, -101, 43, -72, 42, 427, -77, 59, 434, 240, 331, 200, 52, 137, 43, 125, 58, 285, -95, 94, -17]
4681a7jP5l27N74k56J21m98M55m1J57j51p5j01K17k47k4mK6J74j61K30l72K36
4704a0j22O7K24k60J77k1J57m31P0O6N6J32j40L03l14K37Oj75j46K52l35N22K
4727C17l27L79j16j80J43j5k13M10m75J74o1K35j05l36J52r1Q3J65l12K31J28
4748A86j12N6M8o2j79P3k62M42j46k44M2L31m11K94Mj26K01n01M62k8k46L10l04
4771a72N1Kj2q0N34n76K82Ok4K1n1K01k26j14K16k67L47j93J21q2lK29m82L36
4795F4j20J78k91J38k22J84Q7J01l93Q9K17K8j06j74J66K28j42r1M6j67mK20J86
4818B22j17j88j15l82P32O6k48J90k38L2O5J31J85j38k28N6p5J05L0j76K05j08
4840FQ5j11K20j42k45J10J84m9o8j94K8M77j24oj79P5k49P6J20l15K07k1l1J20
$$ y = [-17, -18, 57, -270, 304, 48, 169, -329, 126, 85, 242, 91, 16, -85, 132, -115, -139, -143, -117, 57, -104, 126, -246, -10, -132, -65, 159, -101, 76, 55, 212, -219, -149, -83, -27, 105, -35, 268, -46, 191, 197, 22, -124, 128, -207, 315, 317, -10, 369, 253, 73, 216, 201, -12, 398, -77, 97, 36, 271, 166, -170, -18, -109, -26, 139, -173, 58, 186, 74, 130, 178, 116, -63, 10, -252, 190, 44, -200, -158, 173, -238, 56, 60, -66, 135, -366, 96, 68, -178, 132, -172, -121, -119, -131, -211, 323, -253, 29, 35, 11, 32, -19, 182, -44, -158, 58, -209, 138, -55, 66, -16, -19, 210, -272, 64, -56, 122, -169, -31, -253, -69, 18, 119, -274, -185, 32, 60, -46, -220, -54, 174, 32, -59, -13, -180, -184, 36, 222, 105, -83, -198, -580, 152, 218, -30, 160, -78, -46, 19, 150, 335, 197, -31, 25, -50, 55, 85, -91, 114, 6, 91, -20, 200, 58, -187, -77, 107, 58, -10, -204, -176, 301, 177, 171, -8, 67, -182, -106, 14, -301, -94, -115, -146, -26]
4864b6J20k65k0Q0j11MJ73P2j9J99j10k20oJ47O1l00Q2J14n8L50k08n0O9M61n25
4889A4k98K36k5M10l42N11m08pk5J55N4m66J68J15j34Qm8k09P5J05M6K13l56J46
4913f2n2r8J52J2j64K19m01R2M06j08l5J51m99L74o3j07K87J7l16K97j11k29K99
4936F1j26mk05L65J21j99P0j32O0J2k41M06pk26R2K47m62J34K68J81l54l65J98
4959a06J83J77j79Q5j2q9L07k63k3j88K41q7j22j12Q9k21L10J42J9o53J62L35
4981eL0Nj40J56j88J77j57Q6J85k14Nq4J44M3Q3kq6K36j02j10j99N4J99QK21P4
5007D19n22j33K52J76J7l77Q2J80l26n5K71L1j46J18kL0P7k86J60L6p4J10nn2
5031a9q6L68j68r7J5k56K08k09J77K05k9j35J66m15K4M40m12J83Lj01Q4J83l07
$$ y = [-26, 94, -171, -191, -111, -222, -218, -45, 27, 8, 207, 97, -123, -129, 18, 79, -221, -139, -25, -83, 267, 59, 9, 78, 539, 14, -284, -48, -73, 337, -5, 506, 98, 91, 66, 221, 275, -191, -23, 92, -42, -34, -82, -291, -216, -111, -65, 148, -208, -62, -114, -212, -60, -48, -212, 7, -394, -302, 104, -4, -39, 112, -387, -13, -76, -183, 104, 121, -195, 102, -9, -238, 61, -65, -69, -274, 91, 212, 13, 83, -49, 11, 23, -218, 188, 181, -45, 47, 294, -168, -34, 234, 415, 61, -304, -106, 77, 254, 75, 160, 148, 59, 366, 103, 80, -108, 133, 46, -76, -188, -99, -320, -10, 132, 151, -502, -340, -5, 25, 30, -110, 46, -142, 35, -122, -36, 149, -65, -60, -144, 0, 43, 126, 124, 38, 274, 172, 62, -137, -83, 116, 124, 345, 419, -103, -236, 16, 192, 209, -168, -86, 94, -232, -287, -16, 15, -131, -13, -15, 15, 92, -194, -34, 2, -72, 38, 33, -19, -105, 263, 95, -2, 13, -243, -35, -244, -67, 138, 109, -26, 140, -275, -251, 189, -223, -40, -37, -138, -54, 129, -178]
5054a78K22n5l8J7Jk79N07k54K8k58J93L09j82J29Q9j16J99o0o3j11j25K80O8
5077C23l07k56L28m37M62j50p4Q0K5k76o6R3K97J01q3K2J1l92K16R7j66J90m22
5100c84L99K22l04m5K47k17M91q19M83m9j13L1J23j59L10J41l45J98q1l55Q7L42
5122B03k15J08K5j30R7M3k29R9j00J16K30k64j41K45k66J07j40L02p1j19j54K17
5144c7q6J0k0q1R3K2j37L17m2J22k00j54L65j81m6L10m1k65j8L4J25j24R8j84
5168a20K01O3Jj50l5j41J52K45j23J22K0p7j54j05R4J87r2K44k28k07N4Q2J31
5191A64k73J69qq2P8j07QJ11j75M3Q5J61l67J77J02q3j47J66l43m3M8J67P1J76
5215I8K1j06R3q3k1R6l11K06r9JM6q8M48l04J57J8j33j80L39k58L07Q5k03k68
$$ y = [-178, 44, -11, -49, -32, -31, -310, 197, -57, -29, -287, -94, 215, 33, 162, 251, 135, 334, 274, 211, 100, -25, 255, 323, 16, -240, 88, -349, 113, -37, -111, -31, -6, -282, -348, -255, 42, 143, 60, 82, 93, -299, -83, 14, -152, 38, -384, 15, 237, -67, -112, 135, -82, 409, -410, 73, 24, -89, -58, 65, -94, 216, 357, 12, 210, 129, -226, -139, 203, -12, 96, 121, -9, 88, 131, -98, 1, -99, 17, 247, -17, -158, 87, -179, -72, -212, 90, 19, -100, -254, -37, -123, -113, -133, -214, -121, -99, -236, 81, 39, 161, -39, -193, 172, -9, -55, 255, 214, -51, -69, -35, 90, -34, 64, -120, 81, 144, 145, -5, -40, -181, -29, 216, 93, 215, 235, 158, 4, -101, -7, 180, 88, 332, 104, -103, -49, 33, 164, -109, 60, 52, -30, 48, -59, -51, 60, -115, -72, 13, 174, -193, -16, 86, 3, -144, 22, -321, -364, -316, -149, -78, 98, 119, 13, 106, 23, 2, 98, -213, -7, -106, -105, -59, -147, 301, -3, 154, 172, 39, -141, 198, -60, 247, 332, 129, -139]
5239a39Q3M34k58j2j18K09l68K31R0k88L46k96P0R0j24L5O5p5K3P3jJ96j37n8
5263G1j75l90J81J36j25J79o9L78m68Q3Q2j78M80k38k25J15J20J28Q6k19J49j48
5285d7Jk59M81qrj62n9J92n9J69nj41J09k69L26k68J06j51J75l50L04k4m0R7J67
5310B76k68J1K48l35J18k09P3J5qO7oj58J77Q3n2k1k86L51j40p5M21k19o4J53
5334A52m33M28k99M49k38l02K11N0k33K58J61p3l4j59j25K25n3mN9k79J12M5n7
5357a39q5K1P18k51l71J76l7j79K75j79J8K41n87L37J18l11K10k65L05J03j70
5378e2Q9l80L4K93K43l22kJ55J31j94k33L7M99k89k09K9N38l74J69K9l82k8J94
5401b5R3J08j90mJ87RO4j16k7J1j19n2N8k23L64m5M2P3r5j26J80r1q5K51j28m48
$$ y = [-139, -56, 378, 120, 108, -10, 199, -169, 62, 152, -136, 210, -86, -16, 74, -50, -15, 50, -25, -2, 71, 70, 266, 129, 71, -104, -494, -313, -177, -302, -123, -192, 186, -282, -199, -117, -295, 185, -53, -278, -163, -43, 85, 171, -48, 101, -47, -46, -305, 176, 168, 159, -3, -62, 130, 71, 240, 235, 94, 203, -66, 260, -8, 98, -53, 122, -228, 76, 52, 12, 109, 276, 8, 19, 267, -68, 50, -159, -86, -71, -79, -12, -18, -176, 1, 84, 32, 11, -275, 76, -64, -139, 282, 63, -1, 152, -281, 147, -152, 297, 59, -243, -32, 18, -215, 43, 204, 131, 97, -62, -187, 38, -15, -19, 40, -239, -127, -82, -139, -224, -203, 515, 264, -107, 69, 32, -147, 128, -51, -33, 208, -379, -42, 76, -235, -25, -290, 15, 118, -52, 37, -343, -309, -16, 227, -95, -97, 58, 189, -5, -238, -201, 298, 9, -200, -171, 367, -7, 162, 191, -191, -219, -25, 68, 176, -14, -18, 169, 178, 242, 126, 99, 110, -9, -61, -3, -226, 138, 93, 135, 208, 113, -13, 167, 76, -9, 242, 114, -334]
5427c34L55k03L50k79O1j62M91m35J90J5r7j05J77J2l4J02j34R3k57M43j80QN8
5450A35j36L50n44l5J59L93m51q4K65J30p2k88R2K37K0m09Q3M17m79K01K2n6O4
5473A4O0l1l18K70P3M8l27J67K12m60J67J58r8J07j84j79L03j69J35J12j82J24
5495Bl1r5P7r8J52J5J24k64j09M44j11J8p3M1j51J20K3K63m53J08M10o08L75p5
5519A04j40K47l14J86J60j27m7j74M20j08r6l07L5K63m18K20K55q4oN2j09J94
5541B06k58J56m15J43R8J16k17Q4j13L04k94R8R2j9j0J52R1j07J24o09O91j68
5563A45k8k66K85j54L60l57r9K82j83J29k70J65r7M19m76L38k57j83J47J88j77
5584h9K28l36p4O60m82l13P36k8n12K89k37J01K80n32K25O9r3J70j29J95k81r4
$$ y = [-334, 21, -182, 168, -111, -50, -212, 279, -156, 34, 49, -48, -153, 24, 36, 2, 104, -30, 63, -194, 249, 69, 77, 135, -1, 349, -195, -230, -71, 322, -129, -213, 52, 182, 110, -178, -86, 151, 171, -238, -155, 262, -217, -16, 6, -50, 14, 74, 43, -275, -5, 68, 116, -211, -44, 168, -292, -125, 33, -65, 42, -142, -321, -18, -187, -52, 60, -122, 2, -29, -124, -47, -145, 7, 22, 146, -118, -227, 217, 106, 124, 51, 92, -59, 61, 84, 347, -106, 2, 412, -196, 179, 104, -36, 211, -103, 83, 243, 116, 69, -105, 315, 207, 111, -196, -161, 102, -316, -96, 159, 75, 69, 121, 12, 206, -52, 104, -311, -168, -70, 46, -171, -87, -200, 104, -190, -92, 0, -19, -29, 123, 214, 107, 231, -378, 313, 145, 117, -149, 136, -18, 342, -15, -114, 168, -15, 114, -156, 9, -88, 331, -145, 193, -64, -247, -100, 88, -89, 139, -197, -271, 389, -93, -406, 330, 302, -210, 79, -158, -57, 223, -309, -84, -15, -108, 62, -67, 128, -153, -247]
5606b47L06j6o4j39J20M6l0l86M57o0K06R4j91j7K6k13J44k82L25j3k0J0j55K45
5630A46m37L28R2k9M6j61Q3k04P6K71j72j24K32j29K09l12m0J77m28L53L28k36
5652F9l16K2K22q3K4K64nj17O1k30M95m36J6Q7n6o7K15l63K06O0r0N3L33k69l81
5677b86M07L4k15m7j75K26j41k10K52K27N1j63j04J4L27k18r0K50j31J30M8k25
5699c9j8o1J84k04Q0j19PJ92L4j62J59J90k74K1n0l2J51q5p6K05j93L10l02K10
5723A28j53J90L8j14M0l3M6k83J86n4N0k90L34j36K28N3m61J38L19l94K61k29
5745a36J82k55L77k29O9J28K28l29J6M1N8J01j17K1k14M9j45L69n01J95M17j87
5767A38n40N00k50K33m69O7N31m00r0M73J0l89j04K91M14l35j21P5M7J73l47K29
$$ y = [-247, 59, 43, -21, -160, -40, 6, -24, -410, 47, -13, 193, 287, 96, 79, 105, -108, 36, -246, 79, 66, 46, 56, -99, 146, -291, 37, 129, 100, 146, -15, 68, -136, -60, 211, 39, -85, 147, 18, 227, -85, -125, 52, -376, -23, 305, 69, -247, -225, -3, -86, -62, 202, 197, 80, 141, -89, 406, -30, -14, 73, 17, -50, 165, -198, 8, 68, -22, 31, 364, 95, -286, 121, 155, -60, -107, -282, -56, -197, -407, -155, 72, 123, -40, -144, -130, 197, -21, -111, 139, 8, 138, 186, -39, -57, -118, 66, -138, -58, -177, -170, 22, 56, -106, 53, 243, -31, -10, -60, -92, 59, -26, -102, 103, -90, 220, -82, 128, -25, 165, 203, 89, 129, 96, 142, -141, 45, -9, 41, -249, 85, -51, 177, 230, -231, -93, 226, -168, 93, -136, 46, -209, 168, -61, 8, 136, 364, 35, 51, 92, 150, 251, 134, 155, -59, -10, -155, 214, -287, -92, 325, 138, -402, 98, -152, 81, -388, -321, 210, -190, -280, 193, 203, -186, -290, 1, 415, 80, -41, 34, 81, 254, -93, 136]
5789A36J49po17L82p9L40k30j17K4N4M5J67n02L05J34Q2l9j51j17J35j28j03M48
5812C11m76N52n31K12r0jp6Q2k2R4N9k07r6L00L1m35K79j73K75R3Nj71k60lM29
5837A81k95O5j3K33l54L28K0j91M4L03N1l72j25K36k19j61O19k71k15J88j80J90
5859F2Q1j46j40M18k31l22M64n4j61L9Q4k65J1kM94k93k04j15J60L05n0M5j91
5882a1K87m30m0L66l64J59m9L37k26J35j74N3l02K27r6L48k16Mk02K15K9k51K55
5905E4Q8po9J53j04j29j77J87m6J20j63l5K21j18l0J71j89K2j0j90l3J42j6%K31
5930G3p0J55q0k87M07n02K01L27k39j18O3M1j7J5Jj17J76L80n63K56j46N1m2n1
5954h6j8J39R5N3j46kR5j19R8j54p9k2J85L40m11M0N7O2j15K7O1j45J02j66Q5
$$ y = [136, 285, 278, -339, 43, -36, 304, 74, -43, -19, 35, 80, 247, -255, 50, 184, 266, 227, 76, -41, 94, -34, -137, 311, -165, 387, -144, 68, -22, -23, -99, -17, -39, 55, 114, -93, -189, 111, 142, -293, -14, -187, 88, 181, 186, 15, -245, -248, 181, -114, -49, -62, 171, -183, 145, 165, -26, 18, 321, 372, 0, -125, 111, -108, -269, 350, 79, -136, 52, -128, 62, 143, -3, -143, 275, 44, -278, 186, 132, -29, 10, 94, -171, -160, -162, 332, 39, -165, -280, -120, 185, 135, 180, -11, 276, -154, -194, 172, -192, -33, -82, 255, 29, 164, -10, 43, -259, -32, -128, 220, 4, 8, -194, 21, 50, -201, 54, 142, 135, 66, 219, 115, -14, -191, -4, -50, 70, -93, -128, 93, -25, -55, 116, -73, -51, -61, -251, -284, -142, -158, -158, 73, 3, 158, 78, -209, 198, -304, -103, 224, -15, -133, -70, -29, -46, -31, -30, -147, 29, 409, -154, 102, -44, 7, -35, -86, -104, 35, 130, 183, 37, 35, 130, 11, 109, -45, -124, -146, 39, 379, -32, 8, 65, 127, 12, 39, 100, -45, 57, -109, -24]
5979b4J42q7j73R0n6j73J78r1N7K19j79r0L78m60O7L09l58J10J29j89K52k63K40
6002B8l58L12J20j37r8j01J77L5R3L02k32k44K00l2l4n5oK46j49o0Q5k49K94k07
6026g0Q1j07j25K29j61L9K60j65k77K35n6l7j16L84j85JK17j20n5J10l76J59L13
6049A78k55J71j72N7j58pO7J27K35k43j67J66o3j49K01K4j57J21r2Q0m2n2Q0J07
6073E7k33J53M9p6K71k72m3K02m36L15j00j75M73j39L1J14l14J52n8l4r3j1M06
6096B39j40j17o5M10k05k45J14J56k79L11l25M20n46M32J56l26l3j16N34o76K73
6117b8K00j73j67J13j06J27Q2r1J34M7O0k58j25J94J80j49J47j17l29K21K36m52
6139b54L06l07L42m27L78K86l55O4k78L06o1J87k30l1J16j76K43J84o42J70L48
$$ y = [-24, 118, 31, -142, -52, -108, -281, -103, -194, -137, 82, -97, -187, 191, -269, -202, 107, -251, -141, -12, -201, 51, -212, 28, -330, -18, 102, -35, -133, -234, -57, -22, 71, 373, 141, -103, 97, 65, 31, -24, -30, 216, 67, 7, 92, -157, 137, -70, 11, -96, -221, 8, -153, -114, 146, -19, -296, -61, -117, -154, -270, 114, -71, -70, 147, 27, -28, 82, -294, -135, 178, -77, 94, -78, -21, -179, -186, -119, 8, 243, 0, -167, -1, -64, -213, -12, 12, -145, -24, -116, -36, -78, -130, -50, 57, -176, -23, 26, -50, 221, -51, -94, 108, -328, -13, -113, -288, 185, 46, 77, 191, -123, 29, -29, -63, -156, -167, 239, 99, -18, -83, 327, 122, -123, -9, 147, -132, 179, -146, 274, -272, 160, 316, -10, -43, -159, 375, -301, -28, 172, -1, -168, -55, -161, -34, 48, -43, 91, 138, 198, -60, -185, 9, 189, 40, 187, 70, -259, -38, 198, -254, 52, -255, 87, -340, 38, 324, -31, 33, -245, 61, 0, 187, -43, -74, 42, -134, 109, 293, -349, -179, 169]
6160A69j35k05j34M74q8k10J10J97Nl8m90K99J56n6R5k4l3j46j03K82j32j58L39
6183A74q5K3j7j53j16K23K11p6k43Pl5J08j02O5J53j35L71n19mJ88l8K06q6R2
6207B12n8j64M7m71O07k15P1j03J28k28r9K79k22M4K56o3j09j1J99p2p8J17k45
6230a78K49j01K81j75n1j22K11J1N3j25%l4K54l08o8q0K74j5K13n06R4M37k75
6253C9q6J25j8R3p1m9K64l80R4P8j18O9l7j80K6j74K78OJ4J33l59N10j98K13n06
6278b34L2K30l26J70j04K11J23Q2j30J13j58K8p0J08o7m9K02j9j01j01J84k5k14
6301a15M9N8j48K1P8M6J12r2k22J97n4J22qk00L34J48Ql29L4k97ON0M66l52j9
6326a07K70j22j13N1M3P6p3J21J05n79N20n69M96J74j91l21K61k73K98j4j23J21
$$ y = [169, 34, -171, -305, 169, 81, -129, -19, 178, 183, 145, -345, -46, 110, 54, 149, 125, 92, -54, -157, 125, -7, -165, 174, 89, 112, 95, -58, -174, 49, 260, 184, -59, -52, -87, 21, -81, -16, 137, 2, 373, -146, -150, 38, 0, 206, 120, 212, 154, -10, 37, -434, 173, -42, 29, -74, 54, -174, -273, 6, -216, -172, 84, 21, -88, -99, 100, 28, -50, 67, -178, 71, -30, 251, 76, 25, -97, 114, 125, 178, 53, 53, 19, 273, -35, -103, -183, 91, 76, 289, -217, -123, 314, 39, -47, 78, 60, 153, 82, 33, 297, -83, 11, 89, -29, 40, 3, -177, -151, -325, -47, -41, -27, 106, -253, 257, 59, 272, -234, -202, 28, -298, -128, -232, -21, 102, 184, 54, 167, 9, 37, -33, 75, 8, -41, 161, 142, 41, -60, 124, 99, -115, -66, -8, -156, -135, -57, -11, 101, 9, -213, -16, -70, 52, 44, -156, 178, 326, 334, 5, 39, -258, -252, -202, 264, -88, -107, 163, 41, -72, -21, 22, 98, 25, 146, 251, -328, 192, -377, 119, 293, 102, -219, 42, -231, 67, 53, -70, 51]
6348E1j89L17m69J50n5L89J7o4j06J33j13k70M95n22P8L7N0r2J34J70P4j39k61
6371a85J97J35j11M7j88K52l32L22q9q3J77q5J19j87K04j31K1p8j68Q2J53p6j21
6394a25L47k30j11K01k02J6K3J27k1O4k71J03L5K00j52K18r6k74J98j70J35Lj78
6417a60P7lR2J08j11L33n19L86k79J77o58M39K07k92J36r1PJ00r8q6J33j27Q7
6440a42J07k16L68k01j7j33R2J33J48k17R4o3Q3k74J22n2K50K64m67J93J25j92
6462Ej87L41l48J12K58j60j55K48j99J05k8j9K75j94l6M0K12j94j37ql0M63m17
6485e3m7n5J48J43j45k1o1oL9O8q4J24p2k30K47j17J14n2L6R3j11O2q3K03j07
6510C3J19k06n5j6j15J33J85P2j99j1Q8K08m94J82J96J15l88J42J7j35Q5j01K68
$$ y = [51, -138, 179, -290, -140, -195, 194, 211, 147, 41, 174, 61, -209, 286, -236, -158, -121, -71, -163, -29, 141, 215, 76, -185, 12, 147, 36, 83, -105, 147, -185, 137, 48, -35, 142, 57, 176, -11, 193, 62, 83, 5, -163, -81, 72, -4, -125, 222, -8, -119, 82, -120, -104, -81, 46, 25, 89, -182, -79, -44, 156, 4, 222, 126, -148, 50, -120, 15, 18, -160, -83, -86, 6, 114, 3, 336, -183, 203, -76, 101, -557, -118, 89, -203, -67, -158, -151, -51, -149, -235, -102, -229, -142, -35, -251, 117, -84, -101, -234, -142, -9, 139, -78, 16, -47, 36, -238, -116, -168, 82, 346, -121, 72, 197, 5, -182, 159, -189, -77, 181, 21, -134, 114, -85, 20, -8, -27, 248, 54, 18, 58, 270, 76, -61, -69, -99, 364, -53, -100, -155, -7, 136, -9, -30, -91, -97, -58, 10, -74, 50, -22, -252, -5, -122, -8, -60, -24, 69, -42, 20, -63, 140, 33, 152, -54, -109, -125, -240, -107, 78, 150, -49, -60, 28, 236, -258, -76, 120, 235, -153, -11, 6, -129, -44, -145, 123]
6533A23j10n7r5J49J57j96j75J35K20j38L15k40l3l8Q8k05M8J17k2l4J02k1l26
6556b36M48k01N9k03j21J47L83l47l6K09j16p0K64k66j42J50K00R7j34mR9j62
6578A8k22P9J26J31pk18K61m36K89Kl0K15q4j4m8q5J02N3k50K47j62o6J31N2l4
6603E0J8k46P8M0j6K23n5J01k5Q3j05L2l54N8r7L99j49k31M21k38l02M34j97P
6627g1J76pK2j71j36M07o8m19K66q7K57j42r7L91l32J21K36k24O7j4J33k22L11
6650C97k3m08J72K16j04l89L02l13K80r7K8k36J20M6J78O6l98J94r7J01L7k07
6672a35K00J2lq7j39L5L06j19LJ7J06p9k26K55j60J09J5j47L46k91j52K59j33
6695hj87L33k12O6O1n5l17L58n9J98j83J93j3j01K10j16j44j15J16l10J23J04
$$ y = [123, 13, -44, -139, 10, 167, -29, -204, -69, 151, 13, 328, 88, 55, 17, 105, -100, -52, 65, 43, 9, 111, 90, -236, 212, 11, 70, -133, -254, -107, 276, -71, -107, 102, -14, -84, 180, -86, -228, -78, 122, 219, 85, 81, 180, 18, -204, -125, 1, 132, 125, -93, 168, -268, 21, 23, -7, 208, 124, 110, 62, -23, 79, 132, -118, 129, -33, -99, 32, 84, 50, 68, -178, -100, -60, -76, 147, 92, 193, 168, 251, 146, 178, -176, -118, -215, 184, 35, -196, 225, -13, -315, 119, -78, -71, 105, 98, 120, -51, -187, 220, 152, -267, -1, -88, 169, 27, -70, 321, -11, 110, 346, 122, 189, 175, 308, 86, 397, 374, -34, 138, 354, 250, -139, 163, -150, 130, 33, 61, -175, -55, -9, 169, 235, -163, 31, -66, 35, 72, -135, 65, 77, 74, -13, -152, -117, 189, 70, 73, 90, 196, 117, -109, 146, -14, 95, 110, -37, 309, 18, -134, 125, -8, -195, 138, -74, -8, 53, -2, -319, 39, -20, 178, -5, 188, 175, 74, 284, 168, 24, -91, 25, -285, -162, -58]
6717e8J93k11K3J73j86K17j54k4J00j69J4Q2Q8L0j45k3r7M8L4J47J61k69k29o2
6741c17K30l8Q7K3l7n4J08J17j59n2oJ90o4L28m85j69O74l04k43M4K25q5J38J66
6765C17j47r0K35J10n82J45m5J99k28L5K04k59J36n0K50l89k95M02K15j74j41
6786a52l5J56J13m5n9k40J90q4L8M20k32K4J51j49m93Q8M48l17M36j06l16J96
6808C2j31k61K43J45j81o9K97j05m9M6j9o9L0L34k72j93K08ql30K96k7L16k81
6831d8k81M51j89j26K95k05j8K9O0K15k10J09j29l4L68l75J75j56j16R1P9P5l3
6854B7l3Mp0n3K76Q5J8j73k49J05J09N8J4k93J57J67r6m8P8j23p1J1J29K15l06
6879f2j41J85n4o8J12r9K95p55N22J5K18Q2l53L6Q5N6j15J53j35J57j21J65l43
$$ y = [-58, 135, -76, -53, 120, -66, 151, -3, -27, 73, -96, -82, 0, 88, 118, -27, -50, -147, -99, -65, 82, 243, -26, -255, -317, -87, -125, -38, -15, -52, -106, 2, 119, -40, -92, -98, 92, 28, 356, -129, -298, 376, 72, -171, -127, 98, 13, 151, 317, 170, 80, 315, 425, -157, -12, -57, 142, -86, -51, 153, -106, 30, -20, 230, -159, -454, -52, 163, -11, -152, -187, -31, 82, 37, -22, -262, -72, -156, -118, 302, 70, 94, 245, 96, -397, -309, 139, -178, 258, 152, -164, 32, -99, -360, -117, 28, -153, -222, 75, -30, -79, -33, -52, -121, -91, 243, -29, -222, -14, -22, -352, -56, -83, 233, -48, -329, 122, -67, -193, 102, -103, -121, -92, -32, 183, -27, 82, -47, -81, 287, -88, 87, -69, -185, -94, -15, 60, 27, -6, -2, -72, -125, 151, 236, 254, 81, -168, -63, 46, 104, 118, -175, -18, 149, 53, 5, 83, -40, -111, -100, 29, 244, -62, -203, -18, -72, -140, -28, -127, 168, -587, -65, -50, 168, 250, -103, -67, 18, 74, -41, 112, -23, 134, 13, 178, -165]
6902a65j50K09J75l84K99l0N2j52K18j93K00l34O2J58J3j69K76J03l48k5K58n
6924F8j93K78J16K7j90k92L49k4j39J47m77J25L72J00j88m4K0k12K62j43Mj32
6946a66L63m10J68p8n9K46k9o8J77P2o4o9k8R3m65L99Q5J21l73L3J19l9N5Q3j91
6971b5j96K77m6%R1j93J21K06j37j05k29L30j83K81k77K76o2j94k94J94K34n7
6993A2j82L26q8l40K66K19j64j05J41Q6N7r4k08o4L24r3j46r2J43k09L90l39K00
7016D0k24J21P7J03mk32K71l12N7Q0l25N38O0m06J29J54n0L40m21p3j93L83mL
7040A12Rl14K02Pl2m2K9l15K75n5J01k8J33K2j28O8k49K05r0M0M45o53M48l14
7064a24j48J70j09L26j54j03K72qk9k38Q1J83J38l19J41m02J87L5J46jL1N0J10
$$ y = [-165, -315, -106, 69, -315, -16, -46, 6, -146, 72, -121, 79, -255, -193, -35, -22, -191, 85, 188, -160, -185, 73, 68, -125, 153, 269, 296, 106, -186, 163, 139, 0, 147, -330, -205, 167, 267, 79, 35, 55, -157, 105, -38, -34, -166, 197, -213, -45, -123, -182, 64, 35, -33, 144, 216, 152, 83, 55, 148, -317, 82, 167, 288, -85, -52, 67, 28, 83, 166, -25, -221, 56, 10, 10, 101, -92, 29, 235, 98, -7, -236, 94, -89, 192, -85, 191, 129, -65, -359, -165, 69, 12, -170, 156, 68, -272, -6, 213, 49, -56, 85, 171, 228, 134, -74, -138, 186, 93, -53, -145, -2, -211, 179, -160, 40, -184, -63, 14, 117, 113, -119, 152, -160, -103, -23, -348, 190, 250, -156, -27, 127, 77, 417, -4, -77, -270, 113, 109, 112, 121, -193, 9, 16, -16, -58, -29, -344, -69, -124, -23, -51, 82, 104, -24, 44, -205, 0, -90, -50, 395, -258, 190, -124, -272, -102, -211, 115, -39, -142, 130, 122, 93, -145, -64, 119, 257, -62, 79, -323, -136, -101, 45, 44, 75, 125, 235]
7087B35l99N4K48j43j42K46R1n00M66j22M0J98l52pP6J13k47J71j59M3K16k69
7109a43M42m38O0J00K4K18k63j27p7K87k7q6k27L07J26m4k73PjJ97k4K9k3j35
7133i1J48o0q3pJ94l61M16k21K20j70L4q2l2J17J97l69J54Q9Q7kj83%l44J73M0
7158a36q5L58l55K61Ml81L54m0R0l22L76k01R0M0J3P6o54Q04k47Q4K39j88l07
7181a27K27k36K44j83J07j39j1J95k56J38K21Rl51J23K20l58L62n8J04k96R6j09
7203g8J73k8n3MP0j19L5q2K80m55M22q6k61M64l82J98k53J24K52j6k29P7J45j34
7227F8N4j60K4m14L34P5J52j28p2K19m42J48J77M4l61M87J5k66J08P4j52p6J92
7250A00j90J6q5o2R2N9O7n4O2J69l48M13q9j53k16J67J45k78p9N36j76j6j02j07
$$ y = [235, -164, -110, 138, -5, -147, 99, 190, -310, 156, 34, 74, 272, -80, -87, -11, 102, -145, 26, -133, -90, 126, -143, 299, -139, -79, 21, 45, 263, 0, -127, -204, 83, 56, -30, -257, 50, 176, 132, -141, -134, -135, 62, 38, 67, 44, -91, 57, -3, -86, -93, 101, -260, 156, -65, 155, -15, 19, -63, -95, 22, 219, -150, 4, 93, 180, 178, -5, -5, -349, -176, -136, -221, 137, -218, 43, 47, -334, 20, -20, 70, -252, 124, -77, 13, 53, 66, 142, -512, 292, 45, 129, 368, 180, -127, 100, -136, 108, -75, 32, -107, -118, 77, -179, -41, 180, 189, -162, -39, 181, -177, 185, 127, 231, -65, 31, -78, 95, 67, 14, 18, 88, -31, 4, -78, 202, -253, 169, 83, -178, 286, -96, 102, -151, -27, 225, 209, -20, 57, 202, 68, 122, -38, -14, -428, -94, -19, 133, 5, -67, 152, -290, -142, 35, 79, -282, 205, 220, -46, 62, 136, -16, -92, 100, -90, -74, -159, -221, -129, -70, -3, -57, 5, 174, -174, 239, 150, -3, -219, -52, 93, -185, -264, 272, 96, 80, -22, -129]
7274a29o9K31oj59m5l9L67n1k0p3J26l32K94l81J5J14K41Lr5M1m0J27p3j91o2
7299b06J80j04Q3J19Lj03m11L59Q3k62MJ85l41L86Q3K19l51J74P3k29K27O0K8
7322B59n35K07j93N76l44k20K59l93L94J24m6j67j7L9n7L2j61M49m11L60j76o6
7344h7J60%Pm10P3Q2J77j33o9L04j4k29J53l98O15k85Q9r9L03k12l1kJ44k12M5
7369b9K3p5j89K44OK29m13O0L07p7r2J33r3k37J82m60M47Q6r4m5K52p3n3J7j5
7394D1K14j24j46R9o6J53j58J20P7k49J99j71r0K86j56J59n51pM36j99N5j02o9
7417b49P2J96Q3j65k4J75l6k03J31K7R6L4j30J06j86K75k76P7k38K4L72k95J85
7440E1j96L2J86J11j62N5l34L68l47J31J95j83l5J52j80J65J9J85l35L33l67K14
$$ y = [-129, -198, 33, 27, -132, -177, -216, 151, 100, 80, 7, 133, -199, 95, -286, -271, -157, 84, 87, -8, 33, -7, 120, 47, -144, -206, -26, -130, -47, 72, 75, -28, -439, -80, 3, -259, -255, -70, -411, -25, 58, 277, -74, 100, 173, -56, 171, 231, 259, -276, -69, -262, 314, -30, -250, 9, -384, 10, 134, 88, -79, -96, -57, -114, -82, -243, 206, -205, 155, -21, -87, 73, 73, 80, -330, -257, -175, 2, -131, -200, 104, 90, -139, 14, -384, 231, -54, 35, -64, 239, 27, -4, -6, 138, -74, -29, -6, -81, -270, -26, -20, 209, -204, -144, 163, 86, -6, 127, 34, -203, -21, -481, -34, 52, -42, -87, 165, 92, 39, 56, 41, 255, 131, -15, 84, 18, 171, 13, 133, 210, -39, 160, -11, -101, 185, 29, 188, -363, -370, 66, -133, -78, -180, -249, -177, 19, 102, -63, -87, 88, 52, -151, -20, 7, 103, 137, 7, 113, -73, 202, -74, 3, -235, -211, 161, -134, 51, -145, -113, 73, 184, 22, 77, -257, 111, -236, -105, 90, -93, -128, 24, -156, 9, 28, 213, -122, 211, -156, 58]
7462E8l44M12j06j98J26J86n25M00j7k55L18k3j58L6J57PJ22k87P2k57k48P16
7484A92k53K04l8j79L3K94J0k98lJ8k5K39j32L0R5o9j65J1K71m10J05K19j50k15
7508b16L21l81K2K69k16K96Pj76J80L18m69J24m8j0k42J99O3l75J78M14j71m9
7530C8n4n9p5L02j25M0j41J44j95N5J51O5m21M56J89l37k10L21j23o0l3j35L18
7553A11L3m00L10j18J43k32J59J07k01L36m6j42k6J19J58m13P2Q9L03l99n9M7
7575d9J60o8r1K1J40k34o8K21L7J63k08j48M6L2n7K05r0l3j5j09J61k5K37k30
7599bj81K07k11J02J3L25j98j32L48l84m3J77j84M31j33j23J36l41J97j53J42
7620gk54L60j79n2M12l69K8k26J9J93J53n0J62k56k09K73k35Q3M5K95m44J2K17
$$ y = [58, -286, 126, 20, -178, -52, 134, -391, 9, -8, -263, 55, 32, -126, -90, 67, 74, 196, -91, -19, -276, -524, 192, -61, 143, 105, -74, -41, 253, 263, -35, -38, -20, -45, 194, 62, 92, 187, 118, -47, -36, 235, -175, -70, 149, -1, -216, 105, -276, -254, 15, -201, 95, 102, -74, 106, 424, -45, 79, 31, 21, -221, -22, 41, -334, -156, 258, 87, 38, -16, -75, -150, 152, 27, 67, -74, 70, -125, -70, 81, 146, -275, 181, 370, 33, -177, 144, 21, -39, -72, -207, 111, 144, -256, 54, -64, 79, -153, 6, 113, -88, 248, 202, 60, 34, 153, 311, -102, -30, 59, 362, -37, -96, -49, 111, 43, -48, -27, 113, -121, -189, 32, 69, 232, 24, -124, -78, -46, -103, 102, 12, -21, -36, -145, 16, -9, 228, -2, -183, 24, -187, -85, -72, 253, 55, -77, 271, -113, -156, 21, -163, 268, 135, 12, 148, -193, 4, -149, -7, -261, 99, -80, -132, 280, -89, -61, -287, -268, -75, 78, 28, 190, -66, -275, -2, -237, -154, -109, 186, -258, -246, -29]
7643b9M7l0n4J86j28J45j18l95P84l31m8j4j67K41k09m8o0J90P6j91P9M9L16l76
7667h5k8J62l00J05L9K13l13K59J78k82R9nk3l04K48p8k2O5o9j07J36K98n10L04
7691b0o7K9J14Ok96L10K12m12L1n6K47j40J13j0m6J41m8m1K9n7j55J59r3j19M49
7716B80k65j2j3k69m9K13K03K2m8r5m4l5j17L09j8j07M2j80J63m2Q4L95n43L01
7740A75j30m44K78n1L75k77L59k92J58k53Q9K8r1j38M71L9k67r9k0j4r1L10j0
7763A05k02J10k2J06l79M89k43o1J53K0jp2p7j97J90K7J11J17n6N3l0l23K07p6
7787e1N3K11k72K08P1j06j25P4q7q2k0kj77K90Pn9K67m35K40L2Q6m11O23k18N2
7812A69j8k63J42j25r6K14J37j68N3J33Jm4m42L63J01J67m58J70j03oK54l56J92
$$ y = [-29, 18, -12, -66, 120, -8, 137, 19, -376, 408, 77, 29, 15, -152, 89, -120, -168, -228, -38, 38, -153, -74, -25, 291, -85, -113, 49, -251, -146, -107, 106, -207, 52, 230, -52, 47, 42, 19, -285, -37, -115, -137, -72, -141, -248, -112, 186, -324, -20, -87, -58, 56, 62, -234, 76, 288, -124, -93, -149, 98, -42, 71, 61, 15, 156, 108, 67, 96, 39, -116, 43, -50, -169, 280, 15, 3, -10, -279, -328, -115, 88, 110, 62, -33, -77, -112, -229, 80, 62, -45, -3, -183, -20, -62, 22, 417, -126, 175, 45, -399, -121, -172, 203, -74, 285, -7, 151, -102, -13, 15, -76, -214, 257, 296, 29, -70, -90, -104, -195, 115, 105, -97, 13, -9, 97, -282, 207, -36, -97, 56, 76, 75, 3, -74, -271, -81, -54, 57, 174, 118, 171, 141, -182, 25, -51, 2, 213, -59, 149, 220, 114, -11, 63, -24, -106, -126, -128, -305, -15, -8, -67, 200, -235, 5, 37, 123, -288, 335, 117, 169, 151, -112, 30, -95, -191, 23, 160, -8, 45, 178, 179, 135, -307, 56, 157, 324, -134, 36, -67, -73, 181, -175, 17]
7835A7L6J35k79O6K52j77L67n19r6O7j01K06K70k41J37k64L65L8k48K37k72j44
7857a48L92l92p0L00N0j11K14K2k8j96k61l9J87j37L55j36J1P5j68J16k7n3j50
7880a94J62k35PM26Q4k59J6O4k30L68l39j1k33L83n5K97k09O8q0j33J2J15j32
7903a08J3J14k63K54Q8L09o10J79J5j13J69j56L07j46Mj7J65l83J53k47N99l83
7925e7O8N1k65K16Q1Kj9K3Q8p2o2J5j13K3J0J64n13J91J07K45Q1k44j7Q3L05m63
7951g2J69%o0l11O94j96k40M5k45K53k09j3K53oj63J33p5m63O58j95k9K6Q8j82
7975a40K45j06j13J29q9M27k40m8j45L40k38j23L49k52Q4M8n7j62J64k47n9L28
7997I5k02K18j71P8K70k30k17J27O1J61k35M76l77j07K23k80L17P3j13j42J72
$$ y = [17, 53, 188, -91, -25, 227, 50, 417, -102, -198, -131, -232, -26, 244, 3, 140, -124, 241, 279, 31, 268, -4, -148, 244, -148, -218, 82, 132, 21, 235, 257, 229, 33, -228, -267, -80, -217, 138, 2, 13, 88, -80, 36, 9, -44, -194, -32, -267, -260, 166, 250, -9, 7, 71, -159, 209, -130, -141, -374, 9, -46, 251, 42, 110, 30, -103, -91, 24, -108, -95, 19, -244, 10, 98, 407, -203, -24, -9, -122, 47, -109, 198, 52, 56, 39, 204, -179, -26, -273, 326, -57, 11, 62, -203, 13, 94, 96, 77, 100, 188, 116, 54, 69, -44, -21, -11, 153, -360, -169, -62, 183, 264, 20, 3, 86, 391, -72, 97, 97, 37, -274, 420, 224, -16, 29, -216, 37, -172, -185, 68, 62, -101, 32, -43, -506, 152, -43, -72, -46, 42, -140, 105, -1, -114, 15, -74, 353, 113, 65, -80, 260, 22, -101, 248, -4, 80, 128, 71, -91, 73, -174, -233, 95, -107, 111, -60, 18, 288, 58, -159, -32, 29, 190, -45, 431, 54, -53, 170, -110, 207, 280, 167, 25, 197]
8018A97k20K08j60P8k53K38j98J33j19p5K37j03j24p5M32j82L1O2k04l04L89M05
8040C93l10q4l5M8j97L6L30j91j11J3P0P8R6Q5m36K57p7j29J95j80J01L18J57
8063D27l66l85L99k88Q6R7Q5R4p7m1N6n1o8M08l53L1k22l8K34R1l0l25K16NJ13
8088I8j39J4j2Q1K24j81k21J34J63j84J02l1J05k71n0L02k33J16m30M48J51k71
8110h5K44nn5k29K79k90M01k05l18J92K84k08k65l3M40j04r5l47K64J63K57k89
8132dJ30j2j39J56j93J81j07l7k13J56J28kj50M23k44J91m10J16N2j04K61Lk13
8155c1J69l39K07N1J64j50j98J23L35l55j98L10j48J55m07J43k3L04j56O3k66
8176b47N60k95n7J73q2K48p6j58j12J11J1L0L8n8k2
$$ y = [197, -23, 185, 25, 103, -150, 88, -110, 23, -96, -171, 66, -37, -161, -236, 196, 14, 45, 107, -97, -401, -12, 393, 83, -1, -36, 12, -185, -149, 181, -10, -121, -108, -38, 40, 136, 221, -215, 42, -35, -164, 31, -149, -48, 270, 427, 61, -324, 75, -213, -127, -30, 55, 149, 72, 31, 87, 36, -32, 376, 23, 54, -168, -206, 28, 119, 89, -236, -20, -15, 98, -41, -27, -39, 42, 266, 85, -136, -2, 161, -23, 79, 48, 153, -118, -168, 134, -99, 17, -413, 35, 186, -85, 159, 154, 99, -130, 149, -141, 260, 55, -263, -71, 213, 5, -260, -293, 147, 43, -52, -399, -135, 28, 285, -4, 126, 114, -25, 131, -62, 119, 12, -25, -238, -82, 46, 44, -106, 317, 73, 264, -146, -30, 22, -82, 179, 182, -31, 138, -201, 6, 57, 221, 71, -127, -4, 331, -24, -222, 88, -60, 95, -312, -169, -192, 112, -44, 19, -247, 313, 18, -39, 134, 52, 300, 224, 66, -46, 65, 76, 106, 144, 86, 64]
8191F4
$$ Imaginary data points
##PAGE= N=2
##DATA TABLE= (X++(I..I)), XYDATA
0@%%%%%%%%%%qJ6j6J6k4L2l2M0m8N6o6P4q8J03j18J34j52J72j94K22k50K78l14
33a67L52l92M38m87N38n96O61p32Q10q97R95j102J222j359J515j692J897k145
51a141K445k809L271l881M719n948P933j1650K0904q2069j45092K22679J11088
64A20449j74009j03613J62764Q6096j26862q4708Q5587N4569m9333l6323K6006
75c9377K4488J1889k518k3018r319K8527j28l9542M189N5232J2061k9215k677
88i408J0129j3768P968K6957k2321k9268N5972N2622o7395o2197P8346O9392q4374
101A2655p7823P8023Q0358n5303o0750M5697M5739l7348m4672P374K9377K0367
113D3694r459l8279j266N4379k43q5560j6170R5069J6350j08290j7410J15248
$$ y = [0, 0, 0, 0, 0, 0, 0, 0, 0, 0, 0, -8, 8, -8, 8, -16, 16, -16, 24, -24, 32, -34, 40, -48, 55, -63, 71, -81, 91, -103, 119, -131, 147, -167, 185, -207, 231, -256, 282, -314, 347, -385, 425, -472, 523, -579, 643, -716, 799, -893, 1004, -1141, 1304, -1505, 1766, -2115, 2604, -3344, 4589, -7061, 13843, -68226, -213318, 9361, 120449, -53560, -157173, 5591, 91687, -35175, -119883, -34296, 20273, -29060, -65383, -39377, -14889, -3000, -5518, -28536, -37855, -9328, -9456, -48998, -44809, 10423, 22484, -6731, -9408, 721, -13047, -5079, 21878, -443, -29711, 26261, 78883, 11488, -50709, 27637, 97029, 12655, -65168, 12855, 93213, 37910, -22840, 22857, 68596, 31248, -13424, -6050, 23327, 43694, 34235, -4044, -5310, 49069, 48826, -36734, -52904, 42165, 58515, -49775, -67185, 48063]
125D8063K0409j14652k5643R3344R150q5066j30P3877k381n1941J2528L1390k7905
138a8957k6144K8933J6352k7270n277K9957O688k2821o857J3816O852p431j1162
151b3321N323K8261J0394l2622j5237M2993J9369n5477k3519O7213L3277o7173
163a0519l0224P2570L0481p2849l1861O6646K7933n7935j9321N4949J8023m5491
175B402j6939L0456J0541k3615j1599J5066J5497k839j6756q013J6286R812k3666
188c367j8458K5566K2688k4713k0312K6783J6696l2523j8926K8317J1324k8108
200a5033m421K8894O90k6909K175K1171j0200k1713J2068K0863j1332j6085J5162
213d670J6414j5089j9559Q290J9851l859j9306N21K5533Q232k6717j7520K6082
$$ y = [48063, 68472, -46180, -71823, 21521, 30671, -54395, -54525, 19352, 16971, -34970, -22442, 8948, -18957, -45101, -16168, 184, -27086, -32363, -2406, 4282, -18539, -25396, -11580, -4728, -12159, -23321, -17998, 10263, 20657, -11965, -27202, 15791, 35160, -20317, -43836, 23377, 56654, -10519, -40743, 31827, 62308, -10541, -42402, 24244, 52177, -5758, -25079, 29870, 47893, 2402, -14537, 15919, 26460, 2845, -8754, 6312, 21809, 18970, 2214, -5799, 10487, 20299, -3367, -21825, 3741, 26429, 1716, -18596, 8187, 24883, -7640, -26566, 1751, 13075, -15033, -19454, 9440, 10130, -16779, -14604, 6567, -3633, -25346, -13278, 7585, -3747, -19832, -4670, 11744, -3345, -22904, -14614, 5237, 1378, -17928, -17407, 8126, 16358, -10359, -27879, -1797]
226a797K2947k7135k8335K9310L7520k3104l9295K0580L9614j8336m1847J3425
238a6453M2802m252l5123J365L1253K799k7749q946K0235J3477j1091j1754Q106
251D669J4358l729j5319k574R576L408o669r14N613J546k332n55m330p694L175
266a771J1151l293j4769M480K0803l432k7839l931K6428O135k9611j0668L1227
279D910J7800k8777k4710K2289K5843k1388l1152J5831L5968p186l4403K340L2126
292I491J572l2474p580K9417J3149k1275j1543J9229J3159j4981j3419R348J1436
305E529m160n232N870N815k437j580J899l312l839N721P670l943p359P362J1470
320A9474q051j5872L617J7039j624j8159R92K0682L130k1417r069J6666R073j7427
$$ y = [-1797, 21150, -5985, -34320, -5010, 32510, 9406, -29889, -9309, 30305, 11969, -29878, -16453, 26349, 22097, -13026, -11661, 19592, 22391, -5358, -14304, 5931, 19408, 8317, -3437, 4669, 19027, 15298, -21, -2595, 6981, 10389, 3720, 2806, 8419, 9965, 7633, 7078, 2748, -4946, -1771, 9380, 6087, -8682, -4202, 16601, 13169, -14670, -18601, 7827, 13962, -15649, -26317, 4910, 22710, -6067, -30777, -8488, 17355, -4033, -35185, -19354, 16614, 9428, -24975, -22635, 9491, 11063, -21411, -28991, 426, 13575, -7700, -19243, -14, 13145, -1836, -15255, -5907, 5529, 1369, -3863, 2007, 7822, 5385, 3805, 5704, 2392, -1447, 4274, 11944, 8001, 642, 8004, 19474, 11423, -4449, -832, 16207, 14583, -3576, -2584, 18098, 21228, -189, -9258, 7408, 16481, -946]
334i46j2563J4621J6529j0483j8281N039J5552n207j8537q11J7476M030j4202
347g783n265J2327N121j2871q705Q228Q085n727n649P228O062n461n610L344K315
362d361m141J26P111K456m772J99O965j064q771n77J0029K822p919n94J1456L723
378A2688j1505o146R783O283r286o084J1263R137q123j0397O259Q871q133j0636
392f026O316J1783l448j0805K949R909l749j2873J25J1182k73r128N11R629J76
407F278j0747l279P232J347p848r33Q217L283p064l766N282J808o912k879O667
422c314N148m498k895N495L238o875n287N453N608l939m031O254N826n258o520
437e595L965N006l901n408N664P473l495o497L696M767m178o399L760O475k274
$$ y = [-946, -13509, 1112, 17641, 7158, -11123, -6084, 9468, 4261, -14276, -15087, 2389, 6419, -7783, -13048, -721, 4400, -8471, -17176, -8948, -863, -6590, -12239, -5011, 1051, -4410, -10020, -6676, -4361, -8502, -8376, -1265, 1191, -3581, -3382, 3583, 2519, -6252, -6829, 3200, 6022, -1897, -2491, 8965, 12688, 1183, -4963, 4820, 11103, 1817, -4267, 6996, 16133, 8010, -2387, 3872, 12743, 4610, -6026, 290, 12073, 8625, -2180, 769, 10678, 6929, -5944, -5819, 5363, 5090, -4038, -3527, 6102, 6278, -4469, -7748, -516, 831, -7017, -7950, 267, 3550, -3514, -7280, -1998, -190, -7102, -9981, -3314, 1834, -2664, -5559, -64, 3174, -3701, -8988, -3535, 2073, -1866, -5897, 357, 6183, 925, -5595, -1630, 3376, -525, -5933, -269, 7204, 3709, -2788, 908, 5675, 1497, -4902, -1142, 5333, 3059]
452C059n048K860N978l155o876J224O620j329n706J583P017K74p168j926N472
467B879Q79o255j520O693K760m975l265M287K880n560l375M422M402l029l353
482b130K875L839l329m815J877M353j313m278J753M393j527m989K46L547j80m521
498d199N85M099M73l765o53L550J45m105n79M197M89l706n12L773O35l878p30
515d181L802J117m067n97N128J181m241j327M203K193m369j723M533K590m006
530B36k320M199K529l061k582L087L210k197k848J605L535j016k889N07K756j63
546D588l201l38K383O06l104j333K716O21k803j492K065K31k177r49J803K30j978
563b132J9J417p69k266M89J132q81j447J400J396j202j647N07J143j54j425M98
$$ y = [3059, -1989, 871, 6849, 3694, -3182, -1958, 4662, 3333, -2373, -790, 6227, 6501, -667, -2593, 2879, 3758, -2497, -4017, 2676, 5436, 461, -2804, 1483, 4363, -1197, -4572, -150, 4252, 1223, -2130, 745, 4584, 1255, -3560, -1683, 2670, 1357, -2921, -1168, 3225, 1698, -3291, -3045, 502, 322, -4199, -3614, 485, 958, -2807, -3460, 90, 235, -3870, -4449, -252, 237, -3469, -3981, -208, 427, -3451, -4181, -379, 738, -3329, -3926, 1202, 2383, -1858, -3185, 1018, 3211, -1158, -2881, 1652, 4242, 236, -2084, 2115, 4644, 1583, -999, 2088, 5298, 3101, 253, 1858, 5393, 4377, 1488, 1995, 4751, 4588, 1387, 1049, 3432, 4038, 934, -399, 2317, 2938, 135, -1357, 708, 939, -1238, -2187, -384, -154, -2132, -2113, -696, -1465, -3731, -3242, -2110, -2991, -4438, -3038, -1642, -2844, -4491, -3984, -2841, -2995, -4420, -3922]
580c922K197J201k241r81K540J592k150j884L297L078k267k252K785L303k761
595A535k631K096L399j029j797J278J493m81n42m73J00O45N18p58j552J590J333
612D724k127k218J117K046k224j878J645J376j641j200N54n32q22L50K01j348
628a977k42J538j66k344q82J859J62k008l67J819J188r53j020J46J284J68j693
645c488j33K638K057k944j170L246K161l997j842M928K414m029j602M619J780
660D638m416r13L278O21k704M65K690p57j637J251N05k582j3K180j27k174K21
677E26K091j26k813j87J439M00k077l01R23J291j024j936K61J560m2k725m5K907
695A22K02k930O48K366j035k211P98J926j078m30K177K19k333K95K441j132k393
$$ y = [-3922, -1725, -524, -2765, -3746, -1206, 386, -1764, -3648, -351, 2727, 460, -1792, 993, 4296, 1535, -1096, 1000, 4399, 3370, 1573, 2851, 4344, 3863, 3321, 2848, 2948, 3593, 4111, 3353, 1801, 3391, 4724, 2597, 379, 1496, 3542, 1318, -560, 1085, 2461, 820, -380, 174, -358, -1180, -830, -629, -1977, -2219, -681, -847, -3191, -4073, -2214, -2052, -4060, -4427, -2608, -1420, -2373, -3393, -3247, -1963, -1795, -3488, -3621, -983, 1074, -1870, -3040, 206, 2367, -1630, -3472, 1456, 3870, -159, -1761, 2858, 4638, 222, -691, 2587, 3208, 504, 969, 3659, 2902, 1265, 2516, 3021, 439, 426, 2606, 2479, 305, 526, 2617, 2491, -322, -509, 930, 1330, -747, -1048, -125, 1166, 142, -1794, -1533, 27, -15, -2740, -2785, 122, 324, -2606, -1958, 408, -627, -2838, -2040, -114, -1192, -1622, 555, 774, -1559, -1264, 1177, 45, -2348]
712b348J986L054k388k724L413K513l418k578L391K131l318j465L653J212k924
727A90j249J530P36j849k35J116M57n31l05L92k62n78r9M93Q9r23k6J656K26k110
747a282j13K101j81k608L3L569J60l423J58L708n77l751R64L827j286k916J891
764B74K985j799k472K083J940k393j741L079M78j863r04K452J20k671Q6J783k71
781A166k090K75J792l11j920J39J433j88k250k82J988K64k182m28K220N76k446
798b244o92K285J59k104K5K409j48j873Q19J508r35j202J431J201j211m71K084
815A041O96j993l55K446L1j898J99K376k82j291L65J249k81j398J10J121k98l79
833A459n3P02P3j424j3P01k52j252R9J116l35j351LJ321j353j923J411J367j575
$$ y = [-2348, -362, 2692, 304, -2420, 993, 3506, 88, -2490, 901, 3032, -286, -1751, 1902, 3114, 190, -1059, 471, 1207, -642, -877, 239, 696, 165, -140, 252, -10, -588, -687, -194, -105, -1028, -1054, 602, 828, -1282, -1395, 706, 525, -2083, -2050, 1519, 1679, -1744, -1586, 2122, 1545, -2206, -1242, 2585, 1299, -1617, 274, 3259, 1460, -1012, 1071, 3011, 618, -1123, 1956, 2434, 571, -333, 2119, 2239, -432, -346, 1437, 1166, -924, -649, 1143, 832, -1088, -949, 484, 296, -1954, -2236, -248, 16, -2166, -2594, -374, 202, -2244, -2936, -651, -492, -2596, -2571, -162, -310, -2183, -1364, 144, -791, -1993, -562, 639, -572, -1043, 1041, 1737, -256, -611, 1835, 1866, -32, 167, 2543, 2261, 970, 1335, 2584, 2303, 905, 1015, 2136, 1838, 1459, 1406, 2108, 2181, 757, 744, 1445, 1193, -59, 40, 1156, 821, -530, -527, 794, -559, -2482, -1071, 296, -1279]
852a279j539J508J337j841j341J821N30j853n24K319J45j442K43J279m98j072
868b207P70J194m36k83J288j48n98L11Q12m17l12J078M50l83oJ066o30q26M57
887A180O29l68j6J037k24j104N56P71j311r69J097K45j160j7P95k78j025n9O76
906D55j133l83J043n31j081P07P49r59j014J188N04j717l5J773j24j369L68J011
924e48n52j374J760O88r56k69J738j15j738N62K145j177j111J773Q48j225p06
941b57J637k0j475N59J231m91r79Q77Q47j302n24Q49J92r12O0M15K08p45j78K36
961B28p04J03K99q8m23L18Rl52k81P22n88o86N75Q16p67m02J256O3j533K68J401
982B34m32j143R79J358j138j147J581Q10j330n55J581M55j303K29J368q7j295
$$ y = [-1279, -2818, -1310, 27, -1814, -3155, -1334, -804, -2657, -3181, -862, -717, -2159, -1916, -637, -1135, -2207, -1437, -243, -679, -962, 326, 178, -420, -109, 703, 286, -26, 1052, 1502, 1119, 1113, 2179, 1549, 723, 1180, 1809, 1441, 1425, 2462, 2238, 1134, 1690, 2461, 1150, 181, 1278, 1523, 363, 346, 1141, 863, -162, -221, 455, -678, -1061, -18, -549, -1630, -923, -174, -1133, -2147, -959, -455, -2172, -2207, -434, -558, -1927, -1559, -548, -1100, -2474, -714, -26, -982, -1251, 487, 372, -1366, -804, 1341, 164, -947, 826, 1674, 449, -257, 1380, 1360, -115, 444, 1675, 1184, 205, 1082, 1929, 627, 103, 952, 1144, 232, 292, 707, 915, 170, -8, 228, -476, -373, -74, -162, -585, -267, -258, -610, -891, -169, -757, -1443, -868, -52, -819, -1221, 35, 98, -1435, -1167, 234, -198, -1341, -362, 996, -142, -1289, 292, 1102, -228, -783, 798, 1253, -50, 179, 1547, 1460, 165]
999A65J01Q47l62q14P72M16l51q47O10K04p39l39M88J10m53P0K08j85m07k44l19
1020a069K84K82l94J33O4qo20L25K64r3k80K52O05l51m0J34Q34q92K18N57r9J32
1042B38j75M57L49m65R8M53p0j69j59O36k05j13j14O22K8q32J52M73p3l59m36
1063C36N53j29m90j06J50j95n04J65J54m12j72J75j4o30o1K90j81n19L96M06j10
1084h98p65M24L18p1l31K75J12J49QM91k28j9L03J84n2J2P96p3q59Q28P40p18
1106F26j01O22K58l99j97N51M0m41M05L37o71p2K20j13n31M55K32o48n41L16L42
1127F90p87l87P66j9p85j44M14P1n81J77k29p6J80r0n12j31N58M50q87k28J145
1148d05o4n71l7N82j0k90J63P16k34l83M87N93o88Q6R35l35l68N06O53q04o05
$$ y = [165, 266, 1113, 751, -63, 709, 1125, 774, -73, 537, 741, 2, -337, 151, 261, -192, -122, 86, -99, -506, -750, -1069, -785, -503, -897, -764, -700, -708, -1328, -1003, -739, -832, -1112, -860, -255, -606, -646, -512, 322, -570, -352, 205, 106, 238, 63, 520, 869, 404, 502, 955, 885, 716, 557, 1193, 988, 875, 761, 1383, 1411, 579, 731, 1204, 1131, 772, 336, 889, 760, 270, 164, 314, 119, -385, -220, -66, -478, -650, -475, -489, -1119, -1180, -890, -1071, -1590, -1194, -788, -898, -1663, -1239, -921, -992, -1323, -1048, -936, -787, -779, -288, -516, -535, -232, -48, -100, -88, 708, 635, -224, 604, 1344, 626, 525, 1147, 1405, 1006, 809, 1360, 1400, 959, 1364, 1701, 1030, 958, 1178, 1065, 534, 989, 1221, 573, 32, 348, 690, -97, -484, 282, 263, -522, -666, -252, -181, -762, -585, -814, -890, -710, -800, -1312, -1443, -885, -435, -1322, -1550, -405, -469, -1040, -1077, -495, -505, -795, -632, 84, -150, -533, -46, 547, -141, -55, 880, 545, 177, 683, 1336, 532, -73]
1169g3N22R23n59q79P58N94l89o46L75oj92p6l24p4N05k64m90K68M25l01p41l0
1191f74N64p2o67L73M47k14n69L07K04l86J32P3M32l11K22M71m42o48N96P28n09
1212E7k96N67M53l84o64K83Q28l58l9j88L02J77o2l72j20O16p4n89l58Q05K40
1233H24r69j22J93P61j076l56P86k47m35Q3p7K88j35m50J83M03n05K28q4k05N04
1254d08l6J1q7o3M65j23l67L63K22L19k14j92L31N71j19m52k16R46L16r98J02
1275C71O06m7k63O7j48K62k3J5j06lL26p90R7P1L70n06p91M22M98Kj026J00L20
1298a76k32j027J45P57O7p74j06O79j0r70M23K32n0m47K40P09j27k46j44R11m90
1319f36q4M14R20o50j68L58R35o26n42N12J473p59p56O53J162q44r25N15J159
$$ y = [-73, 449, 1372, 813, -66, 692, 1286, 897, 251, 626, 620, 428, 352, 28, -46, 459, 195, -295, -27, 398, 97, -644, -674, -110, -182, -849, -476, -29, -243, -812, -505, -301, -687, -555, -482, -50, -361, -139, 332, -110, -758, -162, 566, 57, -239, 328, 781, 397, -267, 16, 844, 486, 447, 259, 561, 738, 676, 304, 184, 800, 726, 137, -221, 584, 824, -145, -267, -74, 687, -389, -745, 41, -206, -641, -558, -635, -347, -482, -932, -749, -346, -851, -623, -707, -912, -408, -444, -433, -520, -583, -118, -241, -608, -245, -23, 296, 82, -110, 221, 792, 673, 221, 5, 951, 1267, 269, 371, 977, 930, 667, 734, 586, 848, 825, 840, 734, 731, 1057, 267, 364, 435, 805, 299, -492, -70, 428, 430, -596, -496, -176, -408, -1435, -1290, -533, -466, -1240, -1346, -667, -677, -1647, -1224, -992, -1042, -1489, -1249, -540, -667, -913, -1057, -146, -636, -720, -306, 614, -36, -204, 154, 1089, 463, -79, 433, 1906, 1147, 391, 1044, 2206, 1362, 437, 952, 2111]
1338B111m08j102L42M70L4j200M67O15o49Q6j67K48j48q25J21J6k21j10N1k26
1358d95k76K17k87Q2j28m04K36k31j16n1q6L19Lj85N73O7l87M6M43j63J39L99
1380b85J34n8j11J97K04k60M84J57K41l51j06J300m37r63O15R08m42r45N14J075
1400A871q23r87N74J035o67r28J171N8r35m10P52K1o45j67L83k65j67k79J96l57
1420e69j7Nj92P11m41j75p9N69n46p09N42Q89q56q16J169R76j247l73P77O19m67
1441b30r44P52J111r35k95N29P31l87m02L80J01q4j43L63k22L9J56l57k72K20
1461A11N94l52n47R85l40n41J1N71l61n12K33J068p20r32R76N9q35l28P73Q9o42
1482f40N04K96J43n56J0lL54J78l19k81M64N89m71j113J185O83j135p66J084J067
$$ y = [2111, 1703, 601, 943, 1413, 1447, 247, 714, 1329, 680, 766, 599, 847, 699, -126, -5, 11, -210, -320, -269, -495, -771, -554, -841, -759, -887, -1291, -1055, -1286, -1402, -1453, -1539, -1220, -1217, -1402, -829, -762, -1149, -1103, -660, -823, -684, -285, -151, -209, -320, -123, 81, -179, 305, 462, 703, 352, 246, 1546, 1109, 146, 761, 1669, 1227, 282, 796, 1871, 1048, 61, 635, 1670, 1003, 75, 1246, 1304, 369, -41, 711, 732, 87, -80, 303, 38, -129, -408, -212, -569, -586, -581, -773, -62, -503, -678, -757, -188, -734, -1443, -901, -12, -868, -1684, -515, 461, -786, -1159, -382, 237, -230, -1174, -422, 689, -246, -541, -12, 719, 332, -70, 310, 411, 327, 184, 547, 325, 364, 520, 163, -109, 111, 705, 353, -194, 791, 451, -90, -79, 492, 131, -381, -148, 920, 200, -732, 244, 303, -532, -860, -87, 2, -640, -136, 160, 303, -253, -243, -246, 108, 286, -33, -314, 150, 739, 268, -845, 340, 1023, -112, -878, 206, 1273]
1502A273j082r20J350N01j207n67J256M37j163n39J104k8r59M26J76n34l87P11
1520a52r0l90M06L04m89m26M26n8l05K25N36l92n27Q06j34o03j45J048L39r54
1540e75K76R21l22j147P75J051n29o98N83P07m03k46J02M99k90J31k77m76P77
1559H59L38o02j72O89P2j035j87J032r7j064L7R08L7j300M81M2j79m34K72L10
1579Gr25K46J17j69m71q1J173p55l53O60m27L90l62k27K10pM64m19j25M74N08
1600g2k28n55N00M21k93l35J041O79r73n45J103M57o48m75J135J21n59J01R7o3
1620I09Q1K04l40k96P50l94j98K31q6l59l36L06j91k58J01L78k53j033J95P00
1640A11l51j184O72Q88o93n12J15Q70p68q92P30J039q58k79J93P89l17o06M08
$$ y = [1273, 191, -729, 621, 1122, -85, -652, 604, 1041, -122, -661, 443, 415, -544, -118, 58, -476, -863, -152, -242, -632, -226, 78, -411, -837, -411, -469, -774, -549, -13, -405, -932, -126, -260, -863, -1008, 40, 379, -575, -299, 622, 300, -847, -72, 979, 450, -248, 335, 1042, 639, 393, 495, 994, 704, 835, 558, 82, 859, 1197, 595, 423, 1112, 1184, 149, -38, 994, 897, -167, -130, 778, 815, -485, -4, 38, -141, -575, -303, 7, -918, -672, -555, -724, -1195, -1276, -103, -858, -1211, -551, -978, -588, -950, -1177, -967, -974, -510, -929, -1054, -580, -72, -300, -855, -355, 66, -227, -562, 479, 1158, 185, -360, 743, 1200, 552, 77, 1212, 1333, 774, 875, 972, 909, 990, 1194, 854, 558, 1308, 914, 716, 947, 861, 502, 166, 472, 281, 23, 124, 502, 249, -784, -589, 111, -240, -1424, -752, 136, -557, -1069, -954, -84, -852, -1744, -1014, 25, -833, -1112, -919, -130, -447, -1053, -645]
1659f45Q9L66l36pM71M19j82j86O1K84J00j54pO55o96Q6J18L25l57L82J52m3l10
1682E85j83K35k41j74K69k05q8J83J0o0j06o34L44M55k66n23J46q8K86n6k38m0
1704c89K87J2n25j21M79N14j017k89J236j5o59j83M62M46o13m87L32P32J95n62
1724a65k42P16J41k21l48L60p2L9o3J90M57o24K76k57L38n04J61J01J03l07j0
1745F9K36n41m73M24M45j35o78N33L29n36k35K59M59k40p92N18P10j55n69p0L96
1766d6K21l15k72M93L05k35k67J83M51j79q47L71O35K66o81K72K95j4m13K34K36
1787F93k75k19k7J65j10K65k91k67j05N4K32l71K6L36j30n8o89J96K62k80r4%
1809f87K95K17n13k95J88M8m6l5J18L02J55j71l01L28O7k6j48M89L60j46l19J66
$$ y = [-645, -556, -190, -526, -533, -62, 357, 175, -11, 50, 334, 434, 280, 273, 928, 232, 318, 436, 761, 404, 786, 938, 895, 585, 402, 637, 396, 222, 491, 286, 198, 381, 391, 331, 225, -409, -65, 390, 124, -399, -253, -341, -55, -111, -349, -389, -102, -90, -615, -736, -257, 257, -760, -1049, 187, 172, -487, -670, -208, 238, -375, -862, -530, 202, 397, -165, -407, 309, 450, 229, -119, 241, 169, 208, 145, 335, 792, 168, 444, 187, 525, 21, 182, 283, 386, 79, 69, 305, -236, -709, -285, 160, 25, -653, -120, 209, -327, -562, -303, 156, -84, -876, -358, 352, 197, -372, -442, -46, 175, -140, -412, 81, 386, 151, -116, 67, 518, 339, -508, -137, 498, 764, 83, 355, 650, 636, 223, 457, 693, 418, 199, 172, 337, 227, 492, 201, -66, -171, -117, 115, -256, -230, 106, -24, -82, -771, -575, -313, -593, -687, -687, -392, -175, -688, -983, -795, -747, -793, -828, -710, -408, -253, -424, -725, -397, -330, -356, -504, -15, 345, 199, -120, 46]
1831D6L62J00m90K99K55l8q3K95K59o0l86J29r6R0l7j95L43l10L15o34L46O9l37
1854B42J62l92p2j39J02n5kk04j75Q9l59K62k29L43p1k42M9nj2o24R4L45L53q5
1878f25k38J71K83r3l99M13O11m29l14O34M92l34l73M70j2M08j05m2P7l0N8J86
1900H09l9J41k18k7J37J99j69k7k55J20k54O7j91J35L6o79N28K79p22j2n1J91
1922bm63Q4M04k26k15r9j8Q8m52O4M38J0j94N6K06j73N5k54Q8J12L31j66o3L15
1946g4K95m61O5L18M9l52J75M67j77O5k51L94j01n7p7J79L6m5K85l17O8j10L34
1969G08k31o42M80J95k92J27k00L22l53k25l3k3K22Jk72k14J48L59j75k41j56
1990d95L23N4k79K7J56R4qj95K4K02O3j7L1P2P6l90J80K08j32P0N2N28o27J0J94
$$ y = [46, 408, 508, 18, 317, 572, 534, 451, 746, 1005, 945, 559, 688, 592, 682, 645, 450, 793, 483, 798, 164, 510, 579, 242, 404, 12, -60, -199, -97, -152, -154, -358, -533, -444, -803, -541, -770, -427, -498, -740, -691, -696, -708, -1332, -1238, -893, -540, -625, -863, -692, -409, -502, -901, -488, 123, -306, -620, 14, 506, 172, -201, 269, 257, 665, 560, 518, 595, 565, 623, 809, 770, 911, 693, 666, 803, 1002, 833, 806, 551, 671, 417, 484, 293, 428, 464, -215, 313, 592, -130, -142, -193, -2, -465, -381, 23, -203, -418, -517, -535, -447, -899, -835, -397, -387, -581, -525, -319, -492, -437, -691, -603, -491, -160, -326, -389, -74, 221, -240, -175, 143, 192, -160, 15, 482, 305, 370, 119, 513, 412, 355, 278, 457, 493, 448, 733, 416, 484, 374, 708, 477, -165, 315, 510, 218, 345, 145, 467, 114, -111, -144, -167, 55, 56, -216, -430, -282, 77, -98, -339, -495, -172, -118, -397, -370, -214, -120, -128, -323, -299, -97, -34, -51, -20, 52, 128, -262, -82, 126, -6, 64, 116, 644, 17, 27, 221]
2015B21J33k77k88P04l59K1J47j1n8p13M09Q2O6l52j12N61P6o17L90J55k52j33
2037b07j88M38k63l19K58l5J46j46P9J92J78l98P6Q0N9j06O4K26k57J71L45m4
2059C49Rk5J27K5l00LK05J72m90J58L48j34k56j73J52j7j86K88j58K72k95n43
2081d69N86k98j64K00j87pk14K52nj1k41r2N47k74k97J36K41n61L76J53j6Q4m42
2104g03N47J18l83J95L50l7K7k03J60j18K44n2J52m2J95l58P44j28j94l83K35
2125C66J98q5K4K37k71k17L04J16J49q04J93K30j92j14k46J69K37n84L11n78L68
2146a89m29J22L49j47l85J50K08l50p5J41k0J2J30P7j94K92k75L47l52L86k2J68
2168e6J52m09K23J82j21j67N23O6R4j81J69L9KJ72m80L08O6l5r9R4Q3j61k64K74
$$ y = [221, 354, 77, -211, 493, 134, 155, 302, 291, 233, -480, -71, 11, 77, -275, -387, 174, 250, -367, 23, 178, -74, -207, -395, 43, -220, -539, -281, -316, -170, -316, -237, -45, 133, -265, -189, -109, -50, -156, -92, 134, -123, 48, 393, 349, 358, 333, 460, 485, 185, 188, 393, 565, 75, 233, 581, 447, 191, 18, 170, 153, -33, 255, 97, 369, 74, -469, 117, -181, -345, -145, -332, -339, -553, -301, -306, -317, -558, -650, -103, -377, -674, -538, -297, -858, -482, -329, -345, -261, -703, -156, -38, -421, -226, 124, 87, 114, -89, 71, -47, 197, 145, 297, 255, 450, 92, 836, 708, 514, 131, 366, 564, 479, 503, 740, 469, 252, 556, 672, 821, 17, 210, 440, 248, 134, -112, 57, 294, -290, 21, -557, -189, -618, -496, -147, -294, -679, -529, -321, -671, -746, -605, -625, -613, -483, -406, -600, -308, -583, -236, -588, -202, -224, -56, 96, -313, -90, 92, -29, -196, 327, 393, 487, 306, 475, 514, 516, 688, 208, 516, 582, 547, 448, 542, 625, 464, 200, 474]
2192D74o7L9Oj58K3k73P1p7j88J16K07l0k86O3K2k69j74L48l73J85J3J19k80O2
2216d27Q4r6O1K17k1k89%j04M54j64J16L27k49j4M03n25L04K0M7J94j94r7K13
2239B60J82m1j16PK9k44%L62k50jN6j89J48l81L51j75J17j41k07P6J80o9L3o9
2263h2M8j62q7J29Mj70Q9j02L6K3J65M0q6M5n3L2k38K7L43N6J28j66M3O4K99L7
2289D62k71O5k18L70k74J34o4l0o1P9j92M3j18J76K08m60O5K09l2n4o4j44K37
2312F6l82l9K83o8r6J04j92j32O0L58k3j34j57K41k03k30M61J49l13K52l0K83
2334B58n46L97o8k80L69j66L97n3J18q4j3J17k2j92N6K94l90J86j55j6O9k52J28
2357A52J23N8m11J08K30k07k6k19J48q7k86J96J38J68m57j8O6J15m9j30J28j8
$$ y = [474, 407, 446, 452, 294, 317, 44, 115, 38, -150, -34, 173, 143, -143, -80, -58, -327, -501, -153, -526, -341, -328, -209, -489, -427, -343, -439, -378, -161, -182, -471, -471, -575, -121, -285, -169, 158, -91, -105, 298, -227, 77, 97, 144, 338, 144, 47, 260, 442, 401, 285, 292, 321, 77, 77, 439, 189, 188, 244, 55, 203, -178, 173, -2, 115, -26, -233, -157, 23, -46, -13, -82, -34, -196, -283, -154, -150, -320, -231, -333, -297, -274, -109, -69, -155, -110, -163, -131, -369, -342, 1, 57, 185, 19, 62, 126, 425, 462, 191, 256, 38, 408, 134, 268, 204, 174, 113, 192, 0, 43, -75, 101, 309, -151, -86, 123, 91, 37, -27, -171, 66, -316, -355, -72, -140, -236, -132, -324, -456, -396, -38, -61, -195, -352, -111, -314, -544, -83, 66, -247, 5, -25, 258, -288, 109, 41, -239, 130, -36, 361, 308, 426, 342, 329, 446, 424, 232, 288, 582, 192, 378, 223, 207, 276, 24, 152, 275, 333, -78, 30, 260, 53, 27, -192, -44, -131, -417, -221, -83, 85, -372, -390, -324, -209, -258, -388, -260, -278]
2379b78Q2l03K9l2J99r8k65N59Q1j99k66L92M0j32L12j28L1J89K7J32M4J36m0
2402E12l21J58QJ22k32K35m6o7j3Q8j66J91m51J17P7o0j64L51J34o00J68K4Rl26
2426b52K74m9l13l4o6m1J47k00j00J67K8j08k44L20J42o5l61P43k33j27K79l0
2448a23R1j8M9m3k6M48k00k13n2L05Q7J28j75r9J75j54O6j50L87j32Q8N1m38L51
2472D03j09k53R1J0l0M6j21j17L74k82J22k02L4n4N5j9l88J80j93%K92k86l38
2495g85O50J18j03l13O5L38l55QK00J55R8k30Q2J32R5j38J81l52m9L03j06K35
2517B29j09L16k12L08j70j95K43k96J48p2J97j14j07j41q3O6q5L50j56l44J08
2538a19K19k81n9q3O8L35j22l9j55L1l4K7q1J37k33N6J04k1J32r0QrM82j53j76
$$ y = [-278, -196, -499, -470, -502, -303, -401, -666, -107, -26, -225, -491, -99, -59, -191, 121, -7, 24, 213, 240, 372, 416, 552, 512, 191, 349, 357, 479, 247, 482, 436, 369, 356, 444, 278, 469, 18, 135, 212, 152, -12, 339, 473, -127, 41, 65, 74, -252, 22, -27, -340, -374, -440, -481, -334, -534, -634, -467, -439, -547, -791, -471, -329, -394, -755, -12, -245, -372, -93, -123, -32, -50, -1, -44, -70, 378, 178, -35, -87, 218, 305, 433, 258, 159, 334, 180, 246, 96, 483, 351, 439, 490, 52, 403, 294, 41, 132, 142, 112, 158, 37, -80, 294, 12, 134, -68, -34, -88, -33, -52, -440, -260, -453, -453, -161, -447, -785, -135, -17, -120, -433, -368, -30, -385, -377, -177, -22, 76, -154, -72, 60, 155, 17, 198, -154, -203, 100, -6, 229, 120, 436, 224, 532, 362, 167, 410, 114, 262, 190, 387, 273, 166, 25, -58, 8, -77, 273, 117, -227, -119, 100, -181, -240, -323, -255, 80, -42, -81, -236, -205, -239, -212, -293, -156, -389, -333, -229, -250, -118, -208, -200, -209, 273, 120, -56]
2563e6j24l3L48pN2N3Q3M7o7l7r8j74K01o9l1K90p2k67Q5LL25j0o45M93l75k50
2589c35L4J67K06J97m86N41n34P8R7k63P3J07Q4m25L39k87J35l9o0j82N23k79
2611c09J60R3j9J38L8j96J63J36k7J4j57QN3o9K47j43N8L74j38Q8m70L49j73J68
2635C86M1k11q5K4L72m68K21K4o37K09M91l66L38n57J45k27L08n8j51J95m94K96
2657b04k5k99R4J91k93M00J24m18K00p2K15k16J46r9P0j23Q0J55k4J47L9M7l03
2680a68N08p1n5k66L60J78j10k89K67j22k79K48K05j06qJ34j0j71J3l88J82n8
2702fj60L26o5j31j85J85k05J47l8k43J08K57k97N6k36J44N9K4o8L31o51M55r5
2725b88j07M06l9k49J17J20L58l24q3J24J12N7k71Q6K58N1m06J71J24j67K02j48
$$ y = [-56, -180, -213, 135, 128, 180, 233, 316, 363, 296, 259, 161, -13, 188, 119, 88, 378, 306, 39, 124, 127, 452, 442, -203, 290, -85, -335, -301, -134, 72, 269, -217, 324, -210, -132, -35, -298, -225, -118, -34, -459, -120, -407, -272, -311, -371, -553, -30, -309, -149, -56, -75, 63, 101, -95, 68, 204, 177, 191, 34, 42, 95, 26, 273, 130, 188, 562, 424, 512, 42, 391, 218, 386, 427, 216, 131, 155, 527, 59, 280, 304, -333, -124, 367, 1, 339, -218, -73, -300, 8, -50, -201, -6, -500, -204, -229, -528, -434, -243, -536, -136, -12, -430, -230, -302, -87, -303, -157, -256, -186, -309, -229, -74, -98, 49, 88, 135, -168, 340, 269, 214, -52, 308, 486, 376, 87, 354, 232, -47, 201, 406, 300, 292, 426, 416, 245, 258, -130, 52, -6, -166, 160, 95, -36, -221, -36, -241, -94, -132, -375, -267, -10, -307, -251, -487, -343, -284, -260, -328, 3, -648, -193, -288, -395, 11, -28, -277, -160, -40, 318, -6, -89, 35, 147, 204, -67, 19, 277, 328, -78, 93, 217, 50, 252, 104]
2747A04J04K1k47ON7J67j72p0r9K08p0J91m9l37M45l81J20j70p7R1k24L58k3j7
2771f4k12J71ln4N8q8j70J90J07j24n5L0K12k68L30k48J49K42r9j42J81l6j98
2794i1K92K3j67K23l82K44pJ00N9k56l2J82Pp6j03J29K14l07j02J06k33J87l6
2817b6N9j28j15L5K02k57k5o7O0J0j04l9J94K8r5K41k61j41J62J32r1K22m50M81
2841B7j79K57K60m13J34k53L30p2J80k09Q2J55j35l63K26J05J43J14j48k61L26
2862C06j52k03K97j23Q4j19j78n1L80k32jj13j84rJ17J06m8J37j91l80K31o6m4
2885d36o9L70k99N5J60K57k14j91M02N1J38l60L00j45j8L19k85j06k5K45j21j51
2907a23j47M69J31p5J18K8k18j2m6m7J2K63k73J81n2P0j28k74K91J51q2R9l13
$$ y = [104, 208, 229, -18, -12, 45, 212, 40, -30, -129, 79, 9, 200, 151, -186, 259, -122, -2, -172, -249, -158, -382, -24, -47, -64, -276, -105, -108, -162, -104, -192, -362, -172, -65, -189, -244, -214, -2, -270, 60, -188, -39, 203, 104, -38, 143, 107, -91, 201, 224, 57, 280, -102, 142, 135, 235, 294, 38, 6, 188, 195, 119, 16, 145, 359, 52, -50, 56, -177, 10, -26, 33, -95, -210, -175, 27, -230, -255, -322, -262, -252, -356, -395, -201, -173, -268, -27, -288, -429, -267, -135, -226, -4, -454, 27, -152, 105, 365, -48, 86, -167, 163, 91, 271, 62, 144, 299, 164, -199, 27, 132, 275, 389, 241, -20, 306, 154, -49, 248, 125, 209, 90, -88, -139, 241, 9, 8, -105, -289, -298, -181, -75, -123, 14, -177, -557, -326, -392, -436, -505, -135, -434, -379, -219, 38, -176, -367, 35, 86, 224, -136, 164, 19, 1, 320, 35, -71, -96, 149, 28, -123, -270, 199, 330, 255, 373, 401, 183, 171, 125, 78, 90, 353, 80, 261, 209, 279, 151, -123, 168, 319, 237, 336, 23]
2930B3L18m63j99L47L2m9k1k13J1k1J49k47J98J60m64p4K07j2L30l75K60J27j24
2953a00p6M46l11j12K71n5L1p4J66J15J26m23L03j20jj41L58k91j74Q8J22k06
2975e8k8J33J79j5L1m0j91J54j91q3J0r6JJ26o6j03K68J34p2r2k34k7L84k29L8
3000f7j76P4J88R3p6k97K16j90L49j11j49j48M05J21p3m15K83J16p5mK6l87M14
3023A17J93k37O0j82P3P0J43m84K99j7m6J52j23K81K0j59o1k11J19j00K67j09
3045F5L2l31R9J0j4K33m28q6M80J48j45J01j88J51k88j51N26Jk97l75M97N4OO6
3069A66n4k78K62k3j15L70j27j68K41Q4k53J27j56J25o0M5J3q2M1K1n9o4K06J32
3093C94j84m51M4J90o3M3q6J52n9k85K33j90O4o0J3O3M7M3k43K26j44R0p1N2j26
$$ y = [23, 341, -122, -321, 26, 58, 9, -12, -225, -214, -235, -86, -333, -135, 25, -439, -513, -306, -318, 12, -363, -103, 24, -100, -176, 270, -41, -153, 118, 63, 94, 20, 186, 301, 427, 4, 307, 187, 186, 45, 403, 112, -62, 26, 148, -58, -86, 47, 226, 211, 242, 202, 11, 165, -26, -109, -99, -195, -194, -68, -134, -237, 31, 165, 93, 1, -233, -260, 124, -105, -67, -243, -169, 19, 112, 36, -261, -45, -235, 114, 3, -146, -294, 111, 232, 159, -256, 27, 143, 68, 64, 90, -297, 117, 310, 73, 133, -49, 24, 94, 237, -247, 52, 35, -11, 141, 18, 299, 319, 160, 99, -112, 7, -93, 174, 65, 97, -234, -135, -125, -139, 94, -334, -420, 60, 208, 63, 164, -24, 127, -161, -312, 214, 215, -82, -457, 40, 94, 100, 166, 112, -166, 96, 73, -42, 328, 201, 33, 274, 358, 105, 232, 76, 201, 141, 186, 199, 117, 158, 179, 120, 56, 262, 394, 210, -241, -197, -7, -70, -27, -113, 39, -20, -305, -72, -262, -198, -258, -245, -182, -135, -92, -335, -109, -253, -163, -234, -182, -308]
3118c08L26j91j52J34K76k0K02k25K60k21j07K35j80J53o6L9J28j64L28n6k99
3139I2J22J86j91J54j12K4q0O7K15m36j43N77l20k74K34l3m4O3l57N6K24l06N8
3162b24K7m9K0k22J06J16J74l64K25M6J81k84P3m5O9j97l1J48L06J11k35or9%
3186a54K82l89L18m9j1K35p8K76j1j74J79k11j8l3J57j81j1J70nj68NR2k84Q6
3210B3M7j9mm2q0J22K6k10L8j90K62J7m72K48J09l58P8K95J02PN2N7l47K76k4
3235A3k21K19J17Pk13J7K23k72L71n9k30J46k21L1K59J20j4j16j93J30J7J72M2
3258C45k40m1p9J30n2j02P5J2rLm08K57J71J04j98Q6k11M4p1o4J0M7j80L79p3
3283f5l18N42k18M9Q3m13J68N04n82J08k00K52o9L03J8k80J45l6J43j34j10n9
$$ y = [-308, 18, -173, -325, -191, 85, 65, 267, 42, 302, 81, -26, 209, 29, 182, 116, 155, 283, 119, 447, 391, 92, 214, 400, 209, 363, 251, 275, 195, 262, 477, 41, -102, 475, 155, -119, 115, 82, 38, 101, -256, -200, 24, -282, -224, -197, -246, -226, -448, -342, -226, -52, -416, -191, -145, 36, -248, -175, -220, -151, -348, -379, -231, 75, 186, -49, -55, -154, -154, 128, -261, 57, 8, -3, 232, 154, 430, 419, 245, 424, 213, 195, 162, 319, 138, 127, 297, 292, 124, 129, 221, -63, 23, 70, 51, 47, 5, -75, 47, 73, -137, -99, -289, -27, -10, -482, -234, -125, -483, -405, -110, -8, -1, 51, 108, -239, 37, 13, -208, 11, 128, 135, -78, -61, 162, -110, 261, 202, -28, 118, -103, -72, 187, 307, 293, 177, -16, 114, 131, 303, 345, 105, 64, -15, 115, 63, -39, 36, 48, 39, 42, -366, -109, 62, 166, -32, 54, -157, -113, -184, -248, -238, -191, -371, 8, -65, -383, 159, -59, -10, 73, -340, -172, 332, -250, -142, -342, -90, -159, 144, 162, -118, 27, -9, 134, 0, -110, -169]
3305a69K02k93N34KJ00l48R2J34k50Qj08J88k08J07K60m44K32j93J08J41l1P5
3327A39k70K3J59l11L81k77k5M17n54K59J98m9n31M39J4n6k36J77j13J14N38p42
3349c06K20J33J72j83L03j0j81k9nJ9q8L6j25K9K48k77k54O15j86j92J83l93L50
3372G9%l42L88k39J08J59k75j94J51K00m13J74j34L16k07k50K11K61j44L6Q6J8
3394a1Ok17P1j69K8L49l52J02K15q3J12l13L37O4J33R5m43M40k37J90j16M1j5
3417B27r1p1J11Lj41K11J17k3j42L2k82K96p9J1Pl45J18L02k29kl1j9j85m5K69
3442A9k33K62j83k08rJ49j00q4N79m88J12q0m4K05L3Kn9j69Q4K23k52L88j24J93
3466B16k73k6K17M43n56J29n3J80m8j6j31o1J59J4k8l6J4J31k39l7j28J63J15
$$ y = [-169, 33, -260, 274, 276, 376, 28, 120, 254, 4, 12, -96, 92, -116, -9, 251, -193, 39, -154, -46, 95, 64, 139, -131, -108, 51, -260, 121, -156, -181, 236, -318, -59, 139, 90, -441, -2, 12, -44, -280, -103, -216, -102, 436, -306, -86, 47, 219, 36, 339, 329, 148, 119, 114, 133, 45, 81, -44, -15, 233, -44, -298, 317, 131, -61, 122, -271, 79, 79, -263, 125, -114, -6, 153, -122, -316, -165, 35, -378, -204, -338, -22, -229, -479, -268, -7, -151, -115, -29, -11, -5, -222, -151, -320, -292, 57, -295, -193, 22, -61, 51, -262, 75, 139, 272, 367, -76, 364, 127, 317, 201, 242, 227, 136, 65, 176, 179, 38, 249, 366, 343, 201, 233, -49, 247, 168, 179, 186, -159, -41, 261, 32, 30, -1, -20, -205, -250, 19, -214, 48, -135, -343, -352, -203, -303, -387, 192, -296, -184, -264, -308, -103, -70, -68, -127, -296, -212, 11, -241, 147, 23, 216, -57, -83, 134, 577, 21, 150, 97, 277, 229, 213, 82, 21, 180, 194, 166, 130, 144, 275, 36, -1, -129, 34, 149]
3489A49j38P5k21J71J36n7J06j54l95J33K92q4r4Q4j78O0J17J49l16j52N3M7K74
3512E7K35n50k7K24J06o9ON0j03j9J13J26j63n0J70O6k83J18J1J63k62J88J48
3535B55j08n9J36l12L72j95j13Q8j96K33j83Q2J48j30m4J75m0k94K33o7M8k12
3557a83k19O20l80J16k1J66j69J7j68P3j57N2K62n1k6k04L09l26M62q5j86J84
3579H6j71k35L27Q5m1p7L47K4p10N24n09J28L72j65K70l41j08O6R4R0n6l0J04
3602G4n8l3J30j17L09l60L5R7J7j90r1K32L4j30K74K3m53L10m15L10j06K3L59
3625B74m86J32l89L73Q6L9j55J66j85J57J77mk67K56M9k8j07J19J72k47j10L62
3647C84l68k27N73j86j49J9r5j0k24L15K4r7j52K72k81J62l24L93j69j48J39l3
$$ y = [149, 11, 86, -135, 36, 172, 115, 221, 67, -328, -195, 97, 13, -81, 3, -175, -115, 2, 151, -165, -317, -264, -217, 57, 292, -258, -285, -61, 45, -24, -18, 32, -71, -90, 23, 149, -14, -64, 106, 172, -111, 7, 18, 181, -81, 107, 255, 147, 88, 224, -88, 284, 89, -24, 64, -132, 101, -82, 0, 148, 18, -26, 149, 109, -185, 48, -19, 29, -183, -402, 218, -162, -46, -67, 99, -70, -53, -221, -148, -305, -253, 9, -42, -68, -272, 37, -289, 173, 88, -98, 86, -85, -320, 7, 92, 51, -26, 321, 345, -365, 159, -350, -222, 150, -15, 255, -86, -194, -128, -34, 56, 0, -30, 74, 16, -17, 113, -4, 305, -55, -20, 77, 94, -96, -187, 45, 79, -51, 223, 246, -207, 103, -312, -2, -108, -85, 274, -212, -80, -469, -96, -10, 29, -126, 40, -145, 12, 189, 185, -82, 174, 223, 195, 88, 207, 379, 132, 22, 384, 16, -211, 362, 176, 27, 46, -49, -59, -283, 32, 56, -41, -193, 79, -202, -40, -364, 29, -140, -288, -149, -182]
3669a82l0K94m21O1j90L64n9J05PJ58mm41K02k70J38j08M50L2Q5k79L9j1J88j22
3693FM1L5J36L02n60J99j13k39M86p4m2M5j73Q0M3O8j33%j64Nj6K64Mj85o6r5
3719a46L24m49L72j51P0k48L79r2l94J79J43o2n44M20J88k2o4j36r3K04J15k05
3741b12K47K7J58m05M26j14n0o0n0J25j16J77m9j67J48K3j13P4J64p6l9k63R9
3764d6K78k22J49J00k82K8M98o30J30j03O1m27L33nJ6o0j49K64j6k36K80J21k07
3787a25q7J7L22j79l0K53k56L6j64j20J70J82K2L2n9o1K64k32l77O04O5k34M34
3810D77l65R4j86J57n6n3K8J12l33J24J56k80N3K72n9J49m31J69LJ40o2k63K70
3833A16j64j15J15K46m90M51l09q3j0O2J71j26Q1r1k19J29L10k5l63J3J86p7M3
$$ y = [-182, -212, 82, -339, -278, -468, -104, -163, -58, -51, 107, 103, -338, -136, -406, -268, -376, 74, 106, 191, -88, -49, -60, 128, 6, 47, 82, 218, 520, -40, 159, 46, -193, 293, 219, 177, 222, 49, 129, 172, 240, 107, 107, -57, -52, -68, 196, 200, 15, -51, -146, 178, -271, 101, -50, 20, -228, 151, 59, -335, -156, -13, -75, -619, -199, -11, -33, -97, -233, -326, -122, -7, -212, 35, 62, 220, -185, 241, 127, 77, 17, -33, 92, -24, 153, 104, -63, 85, 108, -5, 69, 233, 157, 118, -145, -46, 232, 10, 159, 259, -23, 5, 503, -127, 3, -100, -39, -466, -133, -138, -122, -182, -331, -67, -83, -319, -39, 82, -125, -212, -195, 127, -52, -82, 171, -85, -49, -213, -333, -163, 19, 41, 73, 14, -47, 217, -15, -392, 212, 277, 43, 477, 112, 206, 20, 177, 121, 68, 96, 208, -125, -1, 155, -125, -72, 200, 141, 290, -141, 28, 31, 171, 109, -154, 116, -48, -163, -48, 198, -292, 159, -150, -233, -243, -181, -10, -136, -55, -146, -365, -236, 74, 49, -314, -301, -115, -192, -149]
3856a49J56J43k54J77q9N5J45r1n2k27M15m58L71k63K75N5J4k8k26j63J98J51
3878A55j42k2R9p0k40J44j11N6L30l68J31j37L41l26j09J14n8O4K94l69J63Np9
3901a35K40j22k49K30L6k29L34l12J58L22j64J14kq8k05n8J69J32l72O72O1n25
3923GJ22Pj89K7L72l35K08j35P7j41J36l7j11J88l89N07k85J28O3m74K96j30j36
3946b24K9k0K82m67P8J29J12j14J63Ql77L06r2L77l17p9J61j76J98p9k1L81m37
3969a79J6L1K46k69K97l11K21j29L35k80p2M02l12Q6Q5J53l28k9M4J39l10M55
3991B91Ml32Q9l2J47kl98J80J04n1k71J27K97m01J53n4J8K25j01j41r6K44p6K86
4015B10l28K06k34J85l03J38J12q6J67j0j8J9J12k6j69J56l11L72j39J68j45M6
$$ y = [-149, 7, 150, -104, 73, -16, 39, 184, 93, 41, -186, 229, -229, 142, -121, 154, 209, 223, 195, -31, -194, 4, 155, 13, -9, 90, 20, -220, -76, -187, -131, 199, -169, -38, -175, 166, -160, -269, -155, -213, -149, 145, -224, -61, -56, -135, 105, -17, -266, -36, 0, -229, 105, -207, -49, 273, 109, 223, 221, 133, -72, -130, 39, 171, -201, 471, 532, 7, 129, 136, -53, -26, 346, 11, 219, 84, 161, 20, 156, 119, 8, 196, -193, 314, 29, 157, 220, -254, 42, -88, -224, -195, -215, 67, -400, -322, -193, -81, -195, -32, -24, -401, -95, -187, 190, -127, -206, -45, -221, -23, -102, -123, 258, -179, -163, -132, 114, -155, 142, -169, 52, -77, 258, -22, -94, 308, -4, 82, 167, 320, -8, -37, 7, 146, -164, 291, 295, -37, 52, 20, 167, 165, -233, -53, 51, 0, -271, -144, 153, -248, -95, -149, -131, 94, -7, -148, -244, 0, -76, 210, -118, 88, -146, 39, -264, -126, -14, -100, 67, 57, 39, 58, 170, 144, -25, 131, -180, 192, 53, 221, 76, 122]
4037A22p4J12j32m4P4P0o8j1M1J60k71J8k6j34L54q7L21m99K08k61M07k61j23
4060a04j69J56K63K0l23j00J35l9lK89n73L87K00k34n4J73q0j09KJ63k25j48L94
4083B1k70Q5J43j89O8J97q0J36P7K1Lj28J15k04J39j66J42P4k87J24J7J8k0K69
4107C05k88Q0L3j35jq6J54k46l2K19rj9k15K51J61j15k69K05k74K81Mk82L58k32
4131a52R8O2J64r1k88k16M44J42k03K31j30L35n15J98n7K63k49n2p9N47m7l58
4153D7q7L2J32J50m01j44R8L37n03K52O2N1j24J82o0j94m5K17R8o3j91M9K74k71
4177a02J45q2j29O7K64m13Q3j33L6Q4J62R0J09l91O11o73L38J60k43J44j17N1
4199F1m81O02j35N4J82j4j86J15P0k23K15J62j15k64J81l55r2Q1Q6J20j9J05j83
$$ y = [122, 48, 160, 28, -16, 58, 128, 60, 49, 90, 250, -21, -3, -29, -163, 191, 104, 425, -74, 134, -127, 280, 19, -104, -273, -117, 146, 166, -157, -257, -122, -161, -164, 125, -448, -61, 139, -95, -149, 24, -56, -165, -163, 0, -225, -373, 21, -249, -164, -21, -210, -142, 55, -25, 111, 188, 209, 212, 84, 199, -5, 134, -32, 110, 184, -103, 21, 38, 56, 36, 305, 17, 97, 130, -5, -6, -92, 62, -184, -216, 3, -6, -25, -240, 11, 172, 57, -212, -7, -281, 0, 4, -278, 80, -152, -54, 8, 172, 81, -207, -423, 21, 163, -40, 191, 61, 396, -119, 79, 22, 285, 36, -16, -95, 452, 405, 47, -40, -8, 124, 274, -127, -271, -173, 164, -339, -87, -25, 26, -98, 84, 24, -170, -215, 2, 100, 37, -154, -105, 169, -102, 43, -39, -168, -101, 163, -250, -167, -300, -264, -180, -18, 72, 181, -210, 401, -272, 66, 226, -17, 127, 10, 61, -420, 182, 47, 101, 283, 269, 83, 198, 268, 45, 260, 422, 307, 43, 224, -131, -223, -142, -56, 64, 45, 150, -33]
4222c3Q0j1l32N90k53o9k63J2K69k76R3j71N6J00J3J72J10j61m8R7K33j80k72
4245b44L03m7p7J9j83R2K53n5J97k75l5J91m28J82J84n7j06L36m31M63l02J41
4267A21R0K6j90J82Q5l29J74j12n4o9l7j2J46j1k2k7q0K30l90K81L4P7m45L05
4291b7l42K93Q9j10J97k54J89l1Jm30K15K39k7J32J04m25J44Q3j40L12k94K6J70
4314A14j83J83k76O00m28o1m8k9K96rk08J38l24L32K86k53k10M0P5k93M48l33
4336a43J15j54M1K00J90k98j62J17K63k73q4O2R5j28k10L49K0N8n7j33M39o6k42
4359ak76P9q3N20k56J47q3m5J78K62m38j59K95p8m5p9J30l5l0J58j13P2j21K7
4383B6J80l76K84J80j45k21N3Qj0k3J06J33j93L9j99J80J22n10N84l45j05j34
$$ y = [-33, 47, 36, -296, 294, 41, -28, -291, -279, -10, -286, -193, -364, -308, -208, -195, -23, 87, -74, -122, -25, 208, 28, -244, 59, 12, -65, -46, -229, -137, 116, 61, 258, -17, -52, 139, -289, -107, 77, 20, -86, 250, -181, 282, -20, 121, 211, 237, 47, 229, 314, -15, 159, 47, -7, -76, -113, -125, 21, 10, -12, -39, -119, 111, -279, 2, 36, 113, -332, -27, -369, -76, 13, -97, 100, -154, 35, 4, 5, -425, -210, 29, 2, 134, 238, -187, -43, 40, -100, 212, -82, -56, 114, -69, 114, -162, 438, 10, -51, -99, -128, 168, 159, -49, 89, -235, 97, 383, 130, -80, -40, 35, -258, 190, -143, -28, -182, -141, 59, 249, -49, -211, -94, 169, -104, -188, -126, -31, -159, -369, -20, 0, 58, 1, -132, 307, 241, -1, -277, -198, -281, 239, -17, 130, 47, 2, 180, 442, 4, -155, 140, 62, 17, -62, 68, 33, 3, 161, 48, 120, -1, 26, 206, -170, 114, 294, 149, -72, -19, -11, -21, -44, 62, 195, 2, 41, -158, 22, 144, -366, 218, -127, -232, -366]
4405c66K39K16l40P8K67J48k41j45J2J87j32J35K5J87k77p3K5L19j94K9k5M7o8
4428E3Q8r7J68m05L50k13q5L37n59N05M5Q8k65k4j34K23k45K32R0j77L3j1m6j15
4452a64J27r1j91K62l2j72L72k04n9K29l25j31L36n0n3J44P6L1l3j76r8J89k11
4475b24k4K60m0J79j23r7n3K23J13j54k19L41N0k0j37j44J11Q7j20M8p2J83n4
4498A14J23l20L32j16k24J40L3q3J28l27K9lK11L4l70J25q4L43k62L11k27K2N6
4521a5j27R6M5j12K28l43L89O1m01lK3O2K49j56r3%j42M64j82k53M25R8m20M5
4545f2J01N4K20o3l58R8K04j23J94l07J99Q4l71M52l39k32K66J64l08j35L33J03
4567A74l13L7om2J84j11J20l33L60R0k89Q9j35J33j7K02r9j00n2J96j92QL32k56
$$ y = [-366, -127, 89, -251, -173, 94, 242, 1, -144, -132, 55, -77, 58, 83, 270, -7, -80, -55, 264, 70, 99, 74, 121, 53, 141, 44, 212, -193, 157, -56, -141, 196, -363, 142, 187, 275, 10, -14, -148, 75, -170, 62, 152, -25, 8, -3, -49, -164, -37, -128, -319, -57, -89, -261, 111, -93, -152, 77, -248, -379, -43, -93, -146, -2, 74, 105, 72, -104, -202, -13, -224, -248, 12, -28, 151, 28, -69, -122, 101, 214, 60, -159, 182, 232, 212, 75, -69, 42, 129, 9, 57, -15, 168, 114, 237, -83, 249, 133, -91, 49, 82, -1, 127, -200, -171, -174, 37, 71, -299, -174, -258, 85, -177, 134, -93, -71, -15, -142, -46, -1, -113, 115, -228, 161, 222, -179, -182, -159, -97, 152, -4, -97, -97, -239, 225, 43, -210, 215, 313, -107, -62, 39, 93, 313, 250, -108, -10, 194, 71, 265, -42, 157, 241, -130, 322, -17, -249, 17, 181, -127, -262, 71, 174, -139, -102, -108, -150, 34, -77, 43, -290, 70, 160, -129, -40, -175, -42, -59, 143, 44, -56, -108, 88, -104, -96, 236, -20]
4591b0m0k24M54k4J84k90L50k54p5k30L44qN6o6j00j74K87k23J63J22o0m52J56
4614a24J52L5k9j9m7k03P2K82n46N28J85k32K04k52K05o4l98M6K39q6R6j99J99
4637D4k52L42m29q8K71j51J03K27k76M4N3K79l00J12M3k31N01m54K41k3J17k49
4659g6L34O1k13Q1k42J49j27J90M3q1k32Q6Jk38K86l72L00J86m34J19q6N08k96
4682e3M9pK01q9n1j47Q3NJ04k86k06M22O3j96K20o2M1q1L1r0J67j19l8J84k81
4707a36K03K8j55L15j39N4J59J0k05p7k9J77l0K08r5l20M69k81J63j84n0J26l71
4730a60r8L00k6M5j65Q5R7m5j32J34m7L37n60M26l08K62k37k72M51k72o2K73P4
4753A00j98l8o1J29k7J43r7L1p1K50j62L62m83o0L85k77K26m27L61L2JR7j69J63
$$ y = [-20, -60, -284, 170, 146, 330, 40, 390, 136, 61, -169, 175, 167, 223, 157, 57, -117, 170, -53, 110, 232, 172, -280, -124, 28, 63, 34, 15, -32, -235, -163, 119, -427, 101, 286, 54, 258, 6, 211, 147, -251, -205, 34, -52, 44, -155, 44, -208, 134, -295, -383, -112, -263, -160, 67, -209, -165, -112, 167, -133, -21, 22, -209, 292, -162, 79, 56, 173, -76, 258, 319, 106, 187, -55, 94, -33, 157, 200, 119, -113, -27, -26, -264, 22, -350, -50, 136, -298, -179, -265, 243, -53, -4, -11, 190, 101, 50, -97, -14, -9, 95, -191, -397, 25, 88, -108, 112, 50, 91, 10, 41, -49, 118, -1, -39, 145, -136, 67, 95, -60, 255, 116, 170, 329, 339, 134, 57, 28, 205, 175, 383, 288, -32, 437, 156, 319, 135, 85, 211, -160, -258, 42, 16, 61, -104, -19, 78, 33, -99, 35, -12, 325, -235, 191, -117, 145, -92, -364, 87, -185, -247, 26, 100, -98, -136, -197, -68, -95, 48, -49, -18, -89, 161, -1, 361, -122, -182, 203, -74, 152, -275, 86, 118, 119, 216, 47, 210]
4777B10o17O71q9k5k26P7mK91l13rk92K20o6K74j56k32K05Q8J88k98O7Q9j25k7
4801i9%MJ2j31K67j11O7j17J87J23l76Q1J1r5J78P4J3J65L0l08K70j85j01L9l22
4826c24N98j24j18k8K51K0k74r4J94j40pO3J21k07K27l29K37k22K78R0k73J74
4848A13k51P9m5N1r7k9L46j30K8Mk10Q7l25M05l25L81l0j94L00k74J39K23j91
4871E5P3J1p6k88K28l40J43K87j69J51L8J46k90j0k08M49j75kmj57J92j37J45
4894F2L0k11M1N87o20M03n77K80Q1oO5p0j07J55O3k38qJ4kM8j18k75j0N73J25
4919B85j74p0l5l4P6K7o2l07L83j68L27j47k31L68j67r0J43J32j18j97j57L19
4941A03J4j25P8L4L3k9K00m24K39j05m6p9j18M18q8L2n8o9j57Q0L66l10l6k4J79
$$ y = [210, -407, 264, 175, 150, -76, 1, -3, 288, -25, -34, -326, -106, -172, 102, -54, -286, -81, 7, 195, -103, -36, 53, -72, -99, -99, -95, -83, -214, 53, -58, 9, -108, 79, 202, -174, -93, -82, -177, 1, 75, 88, 253, 283, -25, 245, 60, -41, -2, -324, 274, 150, 32, 4, 255, 275, 1, -93, 101, -39, -46, 17, 138, -69, 158, -171, 66, -156, 122, 212, -61, 113, -138, -59, -104, -53, -150, -179, 167, 37, 65, 69, -141, -54, -379, 26, -299, 82, 52, -142, 158, -116, 23, 246, 55, 128, 139, 63, -225, 3, -337, -194, 93, -76, 75, 113, 259, -31, -41, -249, 200, 25, 23, 19, -138, 54, -83, 62, 92, -119, -78, 509, -111, 292, -285, -5, 76, 70, 135, 65, -42, 113, 176, -62, -70, -56, -58, -10, -128, -403, -413, 160, 285, 111, 41, 6, -28, 48, 75, 13, -294, 89, -79, 248, 101, -130, 238, 71, -19, 124, 256, 138, -59, -216, 103, 117, -8, 70, 104, 137, 108, 308, -116, 123, 18, -28, -107, -225, 193, 105, 137, 79, 10, -147, -67, 299, -11, -47, -71, 108]
4966A08k76M7J84j56j40K83j51N2L21l99J10J15P0j46ON1j35k8J09q7K82l04k30
4989c14L39K77l24k1J71J25l93M0K44L43n57J20Q5Q9m01K25L7J8j78q6K93j18
5011A4J68m40N38j49m69L41k02K96l22J32J8O6j03o0J49j43R4k7r5J87p2l68O91
5034B44m94L31k09M34l33OJ19m3j6M2J01k49K51j39j86J23K92k35K8N8K4J44J89
5057D82k02l68J82J00k28O3j79N04m47L5PP7l23K66M0m6j3L2k5j28m4K77l55L10
5081A7Rr4jj21L07M5L9n31K77K17j23r5K63k39Q4N5k12L26m81M18k21J77q1m09
5105c74L37l1K43l18J17J57k68M20j06j81M13n44K06P2l73J81j50J29L34o5L1
5126B30l03K15j14O9P7ok45J62m13K90L5j78j04L33n1k6L8j01j10Q8J65j3j17
$$ y = [108, -168, -121, 63, -93, -233, 50, -101, -49, 272, -127, -17, 98, 168, 22, 28, 79, -56, -84, 25, -62, 220, -84, -314, 25, 302, -22, -43, 128, 253, -140, -100, 144, 487, -70, 50, 135, 224, -177, 48, 85, 103, -75, -161, 132, 14, 182, -258, 280, 131, -338, 3, -199, 97, -225, -93, -75, -9, -112, -172, -23, -166, -72, -99, -194, -7, -79, -447, 244, -250, 81, -128, 306, -27, -21, 98, 55, 39, 81, 182, -67, 184, 45, -141, -18, 274, 39, 67, 125, 149, 293, 482, 280, -88, 94, 194, -34, 29, -150, 354, -93, -58, -51, 26, -297, -31, 9, -37, -50, -18, -43, -171, -215, 62, -293, 17, 26, -68, -69, -190, 117, 162, 201, -330, -53, 164, 41, -54, 209, -30, 54, 109, -103, 223, -258, 160, -61, 116, 35, -374, -37, -68, 175, -143, -26, 131, -137, 283, 177, -4, 409, -135, 71, 143, -230, -49, -199, -70, 264, 199, 230, -73, 142, 28, 97, 174, 168, -77, 85, -328, -38, -3, -181, -285, 48, -3, -29, 9, -92, -202, -114, 51, 38, -79]
5149g9J44J19l29K64P1j99L4N2o5N2K24l9m08R0M5r3Q0L51k76j62K72j29n5j6
5173e2J34qJ51j33l40Q3j99L33J32k97J44M7o0j23j76J89j4L65j78J29j30M3k32
5196a92j0J56L9n2l5P8M5n0k2L7k60L71j33J69k57J50J08j93j76J92j29L61j85
5219A2j84J88p6J61k38Q9L33l34J62m0k83L44r3K02k74Q7j84k67K28N8J93P8k85
5242a23L11k04k14kJ93k44K48J52kl08p4K90N5l90K99j14k13L85o8j3J52j97M2
5265c9K18j47k48K72l76M09L39m07N3n7J8j01J64j59K55j07p1j45J31K14l35N4
5287f5M5rJ00l25M32n52L07K92l05p4J08jL67l4k74M8j23M2Mj36K54k30j8J91
5311D4l06J41r7L01pk03J41j7J09l66Q2K16M3j68k1K03M8j16p9J45o7Ok71K62
$$ y = [-79, 65, 184, -145, 119, 190, -9, 25, 77, 12, 64, 288, 249, -159, -69, -24, -117, -37, 314, 38, -124, 148, 19, -36, -52, 82, 74, 225, 92, -248, -165, -364, -31, 101, -196, -52, -5, -65, -188, -364, -175, -189, 176, -2, 127, -3, 40, -192, -202, -46, -7, -59, -94, -16, 29, -21, -43, -6, -266, 105, -28, 141, -116, 34, 142, -51, -227, -35, -164, 197, 12, -172, 16, -60, 101, -137, -48, 285, -49, 113, 73, -210, 134, 41, 243, -31, 56, -128, -395, -167, -109, 84, 162, -123, 188, -16, -230, -232, -39, -283, -35, 117, 115, -193, -267, 23, 78, -312, -13, -127, -340, 45, -23, -36, 116, -81, -39, 179, 32, -216, 56, -320, 89, 428, 21, 74, 17, 35, -66, 98, -61, 194, 87, 16, -129, 2, 216, -119, -65, -20, -29, 71, -254, 178, -374, -67, 225, -80, -154, -46, -47, 320, 286, 12, 60, -63, -21, -17, -153, 101, -129, -147, 44, -262, -121, -218, 83, 76, -127, 14, -3, 106, -260, -178, 38, 81, -87, -108, 95, 143, 27, -52, 93, 26, 32, -239, 23]
5335B3K3m03L37L25k91J3j50K32k13Q0r8M88k13k84R8k30J84j51J28J40j9J47
5357A66kj74j22Q8j26R8O4O5k89l2P51l94l08R6J09o4j71K92k79K07J65P2l84
5380a72j3L15k96J34K05j87j58N01o04K38k37K40J50j50K16l08M28j56j51J35
5400A30Mj95P6P0k08K21o3M5o3j20K50l39L76j45k37K6J00L7pJ30j90J28p9K18
5424A65j41k04K29j7J00q1l6m3J26J02l00O6K91m25k9M68m62N7l2J19k8L24l90
5447a41N7L91m10M3N0J78lN6j69L1k3j95J67M2j79j04J59K00k37n0n6J4J51k0
5471d8l54M25k8o3J50j28m5N7l56K76K0N6K7j72K47J2p1J22j27p5J27n7Ol27N39
5496B13J67m85j47L01J35q2K15k08j41K48j28j28Q1j09J97j3j46j4Q5K38J03l62
$$ y = [23, 46, -357, -20, 305, 14, 27, -123, 109, -104, -24, -122, 366, 153, -131, -33, -263, -79, -230, -102, 38, 19, 166, 164, -10, -132, -44, -170, -72, -8, 57, -232, -264, 487, 93, -215, -119, -10, -74, -245, 47, -232, -25, 140, 212, -172, -185, 130, -166, -32, 173, -14, -172, 329, -275, -37, -274, -34, 116, -34, 182, -126, 302, 146, -5, 130, 134, -61, 15, 85, -123, 98, 35, 80, 17, -103, 147, -192, 184, 39, -198, -172, -72, -35, -42, 88, -102, 26, -53, 165, 24, -180, 49, 32, 132, 51, 15, -28, 98, 200, -100, -34, 257, -168, -197, 271, -191, -134, -166, -47, -75, 249, -141, -84, 307, -103, -60, -10, 168, 165, 221, 52, 83, 60, -135, 32, 74, -105, -209, -50, 150, -87, -137, -193, -179, -28, -48, -402, 23, -5, -68, 82, -46, -91, -34, -390, -114, -94, -38, -11, -183, 64, 76, 5, 127, 0, -75, 52, -5, 1, -326, 213, 380, -105, -252, 49, 184, 102, 317, 109, -32, 216, 88, -40, 41, -68, 129, 116, -30, -44, 41, 279, 382, 20]
5518B0J83l54M7j0j47J25qj94j70O14k54K78j43n0O7J03j10j39N8r9K53J70p8
5541A62k26L78n12R1L58m92K39o6J71L7N8N2j09n4Jk74L87L4l72K65j57k03L06
5564G4o6M7j65j46M75k81j38M73l56K64j76K27j71l39K22K76l64m9J40J1k05K18
5586b9R8l26K28N3K3q3L10k02q6L5j71M7J01j20L68l15L34l48L9K11prj40Q7N5
5611A53j73J51j36k4j08J89Ol2M5j49P1j14J56J56k36q5J65j65n2J44J99k13L0
5634b2Q3k74O6K23j62k67O37m39L49j39l02K46j94J65P7k07K25J8l88M71r5J60
5656B31L6q7K45o57M87r4j22r1j42J64J6R5m2%J22m61j84L52K36N3k76R9o0M8
5680c2J36l03K09j90K18j21P6J52j74l6Q8J71m03L10o9pL0k79K14J43r6n5j9k80
$$ y = [20, 203, -151, -104, -114, -261, -136, -144, -338, -508, 106, -148, 130, -13, -63, 4, 107, -3, -142, -84, -183, 70, 240, 162, -64, 314, -198, -107, 251, -241, -2, -68, 103, 140, 198, 250, 141, 87, 88, -186, 201, 235, -137, 128, -29, -232, 74, 8, 55, -110, -256, 219, -62, -200, 273, -83, 181, 5, 232, 61, -278, -56, 220, -144, -193, -53, -42, -247, -29, 69, -257, -29, 24, 47, -36, 274, 72, -14, 21, -150, -103, -2, -122, 246, -69, 265, -83, -44, 167, 160, 151, 11, 98, 153, -20, 131, -5, -29, -137, 52, 58, 26, 71, -78, -7, -121, 35, 191, -45, -130, 35, -130, -182, -38, 161, -52, -22, 61, -213, -147, 76, -86, -353, 284, -155, 194, 55, -247, -1, -195, -30, 47, -160, 65, 83, -305, 166, 71, 231, 267, 180, 425, -232, 255, 161, 39, -52, -194, -30, -14, 81, 39, 39, 161, -300, -484, -132, 104, 157, -119, -20, -80, -32, 104, -199, 10, -180, 38, -83, -7, 145, -29, -65, 23, 194, -209, 101, 32, 25, 55, -224, -10, 133, 37, -18, -37, -317]
5704c17L65MJ7l18K35RJ08j4k29L8K14k01N6J22m36P08k49q7J57j87Q3j23J3K53
5728B21l19q5L1j2R0mN31k73j25j38k76M14L46p04L52j71J8k11L56k84K83lO3
5751A00j35r7J05r9L19k66L08k92r9k2K14k44j94K42L35k86N7J36k27J27J19k08
5773a07J98j48R3K02k60K33k30l1J75k10J07N7k6K08j76q0j7j76K57J61j65j29
5795f4N6J90k98nj2K40j48J90k43K37J97j11k39j44K10j73K60n45J74J62J6m2
5817i2j04L40k21K04j89n0J75K46m64K10j34L5L25n5o8k2P9n1l82K09K8j96p1
5840b48J8K25j4j37M15k30j0n9Kj04J31j60l6K73K2L3j3k7k29K62k33N28k40l40
5864a71p7J09r0J36O3l2M2J08l7j82K77j64k81L92Q9r6J53m77L04k32K92j91L82
$$ y = [-317, 48, 52, 69, -249, -14, -5, 103, 89, -140, -102, 112, -89, -33, 89, -347, 361, 112, 25, 182, -5, 78, -45, -32, 221, -98, -183, -152, -164, -74, -78, 453, 180, 55, -83, -359, 55, 401, -303, 49, -122, -104, -315, 41, -243, 40, 37, 100, -35, -132, -27, -126, 193, -73, 235, -57, -156, -178, 36, -208, -402, -160, 175, -111, -54, 82, -145, -18, 101, -107, 91, -57, 36, 238, -22, 211, -19, -50, 125, -85, 22, 79, 53, 261, 85, 5, -12, -188, 69, 230, 65, -64, -8, 182, -116, -121, -133, 107, -41, 149, -94, 143, 340, 229, -10, -154, 56, -117, 143, -402, -228, -66, -50, -92, -196, 144, -77, 127, -62, -112, 63, 309, -155, 55, -79, -44, 281, 226, 158, 136, 215, 164, -218, -9, 19, -177, -248, -230, -5, -19, -156, 259, 29, 19, -40, -38, -142, -11, -171, -207, 66, 88, 121, 108, 81, -148, 114, -119, 409, 169, -171, -248, -139, -229, -93, -30, -62, -20, 88, 51, -131, 146, -18, -299, 93, 182, 86, 239, -238, 66, -166, 126, -65, 317]
5887C17j01k29l68Q33j53J45m31k48K53n6k6K33l53K73j99O1L11j27j08J35j46
5908A6l8L6o0j34L4JJ19k4Q0k96J71K4r9R2k8O7mk62M93m6p7j57K09j41M6j49
5934a27j13J53Q2Q8l13P1L19n7k28j35J39J54K1j33J48K8k0k71O3J59j64L57j33
$$ y = [317, 216, -13, -381, 452, 299, 444, 13, -235, 18, -38, -64, 169, -184, 89, -110, -49, 262, 135, 27, 162, 16, -22, 14, -46, -180, -146, -145, -26, -50, 30, -266, -95, -71, -170, -78, -106, -39, -43, -305, 188, 142, 65, -92, 117, -24, 22, -127, -240, -87, -5, 83, -230, -159, 160, 103, -125, -260, -121, 33, 54, -79, 69, 97, 77, -194, -131, 28, -136, 221, 88]
$$ [...]
8191A5
##END NTUPLES=NMR FID
##END=
