##TITLE=1H_PR162_K
 CDCl3, 8 sc, 
 27.5.2019
##JCAMPDX= 6.0         $$ Bruker NMR JCAMP-DX V2.0
##DATA TYPE= NMR FID
##DATA CLASS= NTUPLES
##ORIGIN= UXNMR, Bruker Analytische Messtechnik GmbH
##OWNER= root
$$ XWIN-NMR		Version 3.5
$$ Mon May 27 14:16:35 2019 Russian Standard Time (UT+4h)  she@DPX200
##.OBSERVE FREQUENCY= 200.1315
##.OBSERVE NUCLEUS= ^1H
##.DELAY= (6, 6)
##.ACQUISITION MODE= SIMULTANEOUS
##.ACQUISITION SCHEME= undefined
##.AVERAGES= 8
##.DIGITISER RES= 18
##SPECTROMETER/DATA SYSTEM= spect
##.PULSE SEQUENCE= zg30
##.SOLVENT NAME= CDCl3
##.SHIFT REFERENCE= (INTERNAL, CDCl3, 0, 15.7039)
##AUDIT TRAIL= $$ (NUMBER, WHEN, WHO, WHERE, WHAT)
$$ ##TITLE= Audit trail, XWIN-NMR		Version 3.5
$$ ##JCAMPDX= 5.01
$$ ##ORIGIN= Bruker BioSpin GmbH
$$ ##OWNER= she
$$ F:/spectra/data/she/nmr/H-F/1/audita.txt
$$ ##AUDIT TRAIL=  $$ (NUMBER, WHEN, WHO, WHERE, WHAT)
(   1,<2019-05-27 14:15:34.07 +0400>,<she>,<DPX200>,
      <created by zg, POWCHK disabled, PULCHK disabled
       configuration hash MD5:
       00 E9 B6 7A A2 85 ED C7 34 08 36 98 17 FE 4E 26
       data hash MD5: 16K
       61 F5 8B C3 4F 89 88 BD 93 39 A0 74 8F B8 8C 17>)
$$ ##END=
$$ 
$$ hash MD5
$$ 3B EE 48 55 58 2B 20 96 53 11 5D EA AF 5E 21 11
##$RELAX= 
##$RELAX= 
##$RELAX= 
##$RELAX= 
##$RELAX= 
##$RELAX= 
$$ Bruker specific parameters
$$ --------------------------
##$DU= <F:/spectra>
##$EXPNO= 1
##$NAME= <H-F>
##$PROCNO= 1
##$TYPE= <nmr>
##$USER= <she>
##$AMP= (0..31)
100 100 100 100 100 100 100 100 100 100 100 100 100 100 100 100 100 100 
100 100 100 100 100 100 100 100 100 100 100 100 100 100 
##$AQSEQ= 0
##$AQ_mod= 1
##$AUNM= <au_zg>
##$AUTOPOS= <>
##$BF1= 200.13
##$BF2= 200.13
##$BF3= 200.13
##$BF4= 200.13
##$BF5= 200.13
##$BF6= 200.13
##$BF7= 200.13
##$BF8= 200.13
##$BYTORDA= 1
##$CFDGTYP= 0
##$CFRGTYP= 5
##$CHEMSTR= <none>
##$CNST= (0..31)
1 1 145 1 1 1 1 1 1 1 1 1 1 1 1 1 1 1 1 1 1 1 1 1 1 1 1 1 1 1 1 1 
##$CPDPRG= <>
##$CPDPRG1= <>
##$CPDPRG2= <>
##$CPDPRG3= <>
##$CPDPRG4= <mlev>
##$CPDPRG5= <mlev>
##$CPDPRG6= <mlev>
##$CPDPRG7= <mlev>
##$CPDPRG8= <mlev>
##$CPDPRGB= <>
##$CPDPRGT= <>
##$D= (0..31)
0 1.2 0 0 0 0 0 0 0 0 0 0.03 0 0 0 0 0 0 0 0 0 0 0 0 0 0 0 0 0 0 0 0 
##$DATE= 1558952133
##$DBL= (0..7)
120 120 120 120 120 120 120 120 
##$DBP= (0..7)
150 150 150 150 150 150 150 150 
##$DBP07= 0
##$DBPNAM0= <>
##$DBPNAM1= <>
##$DBPNAM2= <>
##$DBPNAM3= <>
##$DBPNAM4= <>
##$DBPNAM5= <>
##$DBPNAM6= <>
##$DBPNAM7= <>
##$DBPOAL= (0..7)
0.5 0.5 0.5 0.5 0.5 0.5 0.5 0.5 
##$DBPOFFS= (0..7)
0 0 0 0 0 0 0 0 
##$DE= 6
##$DECBNUC= <off>
##$DECIM= 24
##$DECNUC= <off>
##$DECSTAT= 4
##$DIGMOD= 1
##$DIGTYP= 9
##$DL= (0..7)
0 120 120 120 120 120 120 120 
##$DP= (0..7)
150 150 150 150 150 150 150 150 
##$DP07= 0
##$DPNAME0= <>
##$DPNAME1= <>
##$DPNAME2= <>
##$DPNAME3= <>
##$DPNAME4= <>
##$DPNAME5= <>
##$DPNAME6= <>
##$DPNAME7= <>
##$DPOAL= (0..7)
0.5 0.5 0.5 0.5 0.5 0.5 0.5 0.5 
##$DPOFFS= (0..7)
0 0 0 0 0 0 0 0 
##$DQDMODE= 0
##$DR= 18
##$DS= 0
##$DSLIST= <SSSSSSSSSSSSSSS>
##$DSPFIRM= 0
$$ [...]
##$SUBNAM2= <"">
##$SUBNAM3= <"">
##$SUBNAM4= <"">
##$SUBNAM5= <"">
##$SUBNAM6= <"">
##$SUBNAM7= <"">
##$SUBNAM8= <"">
##$SUBNAM9= <"">
##$SW= 24.9337058887773
##$SWIBOX= (0..15)
0 0 2 0 0 0 0 0 0 0 0 0 0 0 0 0 
##$SW_h= 4990.01996007984
##$TD= 16384
##$TD0= 1
##$TE= 0
##$TE2= 300
##$TE3= 300
##$TEG= 300
##$TL= (0..7)
0 120 120 120 120 120 120 120 
##$TP= (0..7)
150 150 150 150 150 150 150 150 
##$TP07= 0
##$TPNAME0= <>
##$TPNAME1= <>
##$TPNAME2= <>
##$TPNAME3= <>
##$TPNAME4= <>
##$TPNAME5= <>
##$TPNAME6= <>
##$TPNAME7= <>
##$TPOAL= (0..7)
0.5 0.5 0.5 0.5 0.5 0.5 0.5 0.5 
##$TPOFFS= (0..7)
0 0 0 0 0 0 0 0 
##$TUNHIN= 0
##$TUNHOUT= 0
##$TUNXOUT= 0
##$USERA1= <user>
##$USERA2= <user>
##$USERA3= <user>
##$USERA4= <user>
##$USERA5= <user>
##$V9= 5
##$VALIST= <valist>
##$VCLIST= <CCCCCCCCCCCCCCC>
##$VD= 0
##$VDLIST= <DDDDDDDDDDDDDDD>
##$VPLIST= <PPPPPPPPPPPPPPP>
##$VTLIST= <TTTTTTTTTTTTTTT>
##$WBST= 1024
##$WBSW= 4
##$XGAIN= (0..3)
0 0 0 0 
##$XL= 0
##$YL= 0
##$YMAX_a= 181421
##$YMIN_a= -238943
##$ZGOPTNS= <>
##$ZL1= 120
##$ZL2= 120
##$ZL3= 120
##$ZL4= 120
##$ABSF1= 10
##$ABSF2= 0
##$ABSG= 5
##$ABSL= 3
##$ALPHA= 0
##$AQORDER= 0
##$ASSFAC= 0
##$ASSFACI= 0
##$ASSFACX= 0
##$ASSWID= 0
##$AUNMP= <proc_1d>
##$AZFE= 0.1
##$AZFW= 0.1
##$BCFW= 1
##$BC_mod= 2
##$BYTORDP= 1
##$COROFFS= 0
##$CY= 11.3945322036743
##$DATMOD= 1
##$DC= 2
##$DFILT= <>
##$DTYPP= 0
##$F1P= 18.9103706918063
##$F2P= -1.10871071338519
##$FCOR= 0.5
##$FTSIZE= 0
##$FT_mod= 4
##$GAMMA= 1
##$GB= 0.15
##$INTBC= 1
##$INTSCL= 1
##$ISEN= 128
##$LB= 0.24
##$LEV0= 0
##$LPBIN= 0
##$MAXI= 10000
##$MC2= 0
##$MEAN= 0
##$ME_mod= 0
##$MI= 1.114404
##$NCOEF= 0
##$NC_proc= 0
##$NLEV= 6
##$NOISF1= 3.799351
##$NOISF2= 2.8
##$NSP= 1
##$NTH_PI= 0
##$NZP= 0
##$OFFSET= 15.70392
##$PC= 1
##$PHC0= -8860.456
##$PHC1= 18.00026
##$PH_mod= 1
##$PKNL= yes
##$PPARMOD= 0
##$PSCAL= 0
##$PSIGN= 0
##$REVERSE= no
##$SF= 200.130013532006
##$SI= 16384
##$SIGF1= 3
##$SIGF2= 2
##$SINO= 400
##$SIOLD= 16384
##$SREGLST= <1H.CDCl3>
##$SSB= 0
##$STSI= 0
##$STSR= 0
##$SW_p= 3612.71676300578
##$SYMM= 0
##$S_DEV= 0
##$TDeff= 0
##$TDoff= 0
##$TI= <>
##$TILT= no
##$TM1= 0
##$TM2= 0
##$TOPLEV= 0
##$USERP1= <user>
##$USERP2= <user>
##$USERP3= <user>
##$USERP4= <user>
##$USERP5= <user>
##$WDW= 1
##$XDIM= 8192
##$YMAX_p= 0
##$YMIN_p= 0
$$ End of Bruker specific parameters
$$ ---------------------------------
##NTUPLES= NMR FID
##VAR_NAME=  TIME,          FID/REAL,        FID/IMAG
##SYMBOL=    X,             R,               I
##VAR_TYPE=  INDEPENDENT,   DEPENDENT,       DEPENDENT
##VAR_FORM=  AFFN,          ASDF,            ASDF
##VAR_DIM=   8192,          8192,            8192
##UNITS=     SECONDS,       ARBITRARY UNITS, ARBITRARY UNITS
##FACTOR=    0.0002004,     1,               1
##FIRST=     0,             0,               0
##LAST=      1.6414764,     0,               0
##MIN=       0,             -238943,         0
##MAX=       1.6414764,     181421,          0
$$ Real data points
##PAGE= N=1
##DATA TABLE= (X++(R..R)), XYDATA
0 0 0 0 0 0 0 0 0 -8 8 -8 10 -16 21 -24 31 -34 40 -49 61 -72 82 -96 112 -130 149 -170 193 -221 251 -285
30 -285 319 -359 405 -451 504 -562 623 -693 771 -854 946 -1047 1160 -1284 1421 -1577 1752
47 1752 -1952 2178 -2443 2754 -3127 3582 -4155 4898 -5908 7366 -9671 13874 -24049 102504
61 102504 27523 -169179 47685 181421 41202 -121247 1314 135965 78973 -40040
71 -40040 -10237 53347 47522 3758 -5005 -10630 2703 28798 29915 -4276 7750 51051 39335
84 39335 -22022 -27563 8715 12809 -566 18215 19445 -13612 -2303 49664 19426 -67116 -44296
97 -44296 61663 46623 -73064 -73237 54305 79387 -30356 -71897 5489 38216 -23751 -60801
109 -60801 -26531 11865 17652 1071 -32127 -40422 6807 26784 -46539 -94200 -10480 62925
121 62925 -19420 -107444 -24683 82007 11349 -104418 -58529 41845 4494 -81797 -47245
132 -47245 31214 9960 -44318 -22583 10550 -21739 -50997 -20318 1380 -27170 -41284 -11709
144 -11709 5175 -14430 -29770 -21903 -12700 -13397 -25644 -40630 -28208 7791 7000 -39098 -42774
157 -42774 17238 26966 -47653 -72810 6508 44849 -31581 -74934 707 55449 -9560 -67991
169 -67991 -16999 35503 -7292 -57074 -23988 23169 7318 -26663 -17153 8326 7085 -12379
181 -12379 -24089 -17715 304 7227 -12152 -23764 2449 25040 -1280 -32546 -11621 18771
193 18771 -3976 -35282 -11974 22982 5191 -23829 -4910 20775 244 -25560 -7033 13878
205 13878 -4113 -20682 1153 19970 2212 -14652 1416 17189 850 -19425 -10740 11483
217 11483 12721 -6622 -14013 5279 23996 7629 -23660 -17389 19980 22100 -19353 -30473 16241
230 16241 41411 -3 -34674 -869 37767 10216 -34289 -18665 27495 26888 -10908 -17273 13555
243 13555 26867 3048 -18236 -8054 13040 13592 -2524 -7589 8296 20166 10911 -3599 -1950
256 -1950 8043 7707 -401 712 6937 7922 8581 14094 11253 -1656 -2246 13260 15515 -4873 -11926
271 -11926 12861 30654 10232 -14077 1184 30545 21098 -15032 -17616 19190 34387 3932
283 3932 -18567 7335 39487 22680 -16523 -14128 23696 30625 -3943 -17861 13030 37150 15626
296 15626 -11340 -510 23573 17498 -5712 -6861 12682 19472 8721 3378 10044 13081 7449
309 7449 4233 5543 3687 1679 6842 13519 10543 1520 3885 15037 12839 -3863 -9394 7319
323 7319 18245 4009 -9980 2399 22255 15012 -9183 -10621 10482 15824 -4608 -16186 1610
336 1610 19709 9825 -9744 -6984 11029 11722 -7427 -16276 -1576 11457 3151 -9773 -4407 9675
350 9675 8000 -7550 -12027 -1493 2660 -5702 -9776 -1337 4428 -1034 -5316 -1942 -716 -7792 -10967
365 -10967 -4774 -911 -6715 -8935 -883 4568 -4206 -12770 -7449 779 -4733 -15347 -11564 1817
379 1817 3336 -8647 -12207 -1268 4016 -8127 -17919 -9370 2176 -2329 -13591 -9151 4190 3732
393 3732 -10369 -13560 -2505 1648 -9306 -15601 -4621 5282 -1235 -10475 -5644 3028 -1138 -12179
407 -12179 -11788 -2035 -268 -7408 -8174 364 3898 -3060 -8786 -4544 -122 -4345 -9606 -5494 2931
422 2931 2211 -4281 -3821 3053 2418 -6131 -8685 -1258 3398 -2919 -6245 409 6759 585 -6610 -3561
438 -3561 3222 278 -6912 -4911 3931 3696 -2920 -3228 3510 4368 -3068 -6116 -461 3813 -947 -4913
454 -4913 449 6189 2527 -3921 -2483 3255 2245 -4779 -5186 2226 5511 -599 -3924 1653 5989
469 5989 818 -5729 -2626 3824 2254 -3624 -1971 4751 5384 -1159 -3716 669 3284 -1097 -4916
484 -4916 -1514 3622 2393 -2185 -2010 2440 2583 -2900 -4379 334 2997 -488 -3543 434 4199 1610
500 1610 -2439 -1107 3157 1563 -2482 -1450 3048 3017 -832 -1493 2893 3999 -741 -2351 2009 3496
516 3496 342 -2589 1340 5111 2521 -1835 267 4995 3244 -1712 -1025 4298 5225 748 -1081 3888
532 3888 6180 1783 -1779 1665 5186 3255 -244 1066 4901 5253 2211 914 3553 5574 3256
547 3256 822 2408 5557 5135 2498 2633 5283 5821 2685 1964 4167 5240 2655 2183 4069 4562 2707
564 2707 2631 4262 4206 2356 2139 3992 3764 2010 1601 3709 4777 2883 1812 3040 4123 3261 1210
581 1210 1198 3264 4383 1631 68 2471 4944 2225 -1679 -213 3804 2745 -1619 -1426 2952 3766
597 3766 -217 -1585 415 1329 -167 -1127 -551 -500 162 472 -1459 -2626 -1671 800 -843 -3710 -3064
614 -3064 -236 -1056 -3816 -3147 -715 -858 -3365 -3413 -1978 -2481 -3155 -2100 -2015 -3391 -3102 -1274 -1349 -4057
632 -4057 -4374 -1816 -1555 -4184 -5472 -3185 -1414 -2118 -3971 -4407 -2799 -1750 -3788 -5974 -3849 -906
648 -906 -1496 -5345 -4663 67 -42 -5393 -6186 -415 351 -4495 -5775 -579 1010 -2841 -4582 -1104 91
665 91 -2980 -3586 -776 -410 -3009 -2013 883 -519 -3044 -1646 1219 -133 -3370 -2161 1327 1412 -1639
682 -1639 -1364 881 1551 112 -1925 -1037 1071 615 -1000 -1530 1152 2706 808 -1183 785 2218
698 2218 152 -1217 727 2177 631 505 2485 2427 -384 -346 2416 1289 -1687 144 3843 2457
714 2457 -1797 41 4055 1988 -2837 -1638 3176 1915 -2013 -820 3512 2846 -1226 -1507 1214 1500
730 1500 -1262 -1095 953 667 -129 -11 462 194 -422 -663 110 -343 -1378 -1343 -18 1099 -393 -1653
748 -1653 -435 2005 -311 -3662 -1556 1643 606 -3134 -1819 2466 1261 -3294 -2381 1673 644
763 644 -3202 -2313 1372 732 -2487 -1249 1719 380 -2578 -1613 1350 -70 -2535 -1072 1811 668
779 668 -1935 -619 1800 108 -1695 -848 1591 1645 -744 -1136 1198 1995 199 -974 1017 2349 817
796 817 -935 215 2477 1559 -236 543 2643 2117 486 902 2373 1395 296 1376 2889 1954 466
813 466 2161 3383 1647 -321 1588 3203 1716 424 1817 3801 2427 830 1591 3459 1948 370
829 370 1283 3030 2401 1301 1634 2826 2387 877 1190 2199 1965 964 481 1735 2305 687 622 2611
847 2611 2239 275 -348 1399 1930 -573 -801 1229 2301 -169 -660 1174 1318 -1155 -1523 125 762
864 762 -703 -706 446 487 -1059 -1311 -481 -841 -1623 -1141 -591 -899 -1160 -657 -488 -1612 -2078 -1653 -1294 -2134
884 -2134 -1641 -802 -1269 -1581 -1252 -1274 -1756 -2280 -1462 -1245 -1996 -1785 -568 -834 -2352 -1901 -1503 -1501 -2391 -1818
904 -1818 -1510 -1691 -2163 -1295 -1478 -1928 -1632 -549 -1261 -2443 -1761 -199 -871 -1838 -1017 -44 -826 -1776 -632
923 -632 -247 -1470 -1825 -163 121 -1129 -515 740 316 -1227 -898 366 195 -1149 -233 1530 341
940 341 -546 367 1090 -163 -818 763 1122 191 -223 1083 1555 173 -197 910 738 -186 24 1107
958 1107 1218 761 735 873 878 342 574 734 540 783 1002 717 521 1048 905 -14 251 1042 706 -506 194
979 194 1349 507 -783 116 1407 314 -1017 -180 1249 311 -1004 -94 1475 269 -835 -8 805
996 805 -7 -1553 -652 203 19 -1112 143 529 -667 -1122 -930 -327 -624 -945 -740 -151 -505 -1055 -587
1015 -587 -264 -956 -1235 -1027 -377 -603 -788 -907 -575 -300 -1073 -1176 -737 -620 -786 -961 -382 -272 -321 -1073
1035 -1073 -661 -200 -616 -580 -492 -160 -526 -459 -318 219 -254 -304 1 429 -9 -169 58 637 137 -335 14
1056 14 516 799 -22 49 512 857 190 -16 871 1204 777 509 1196 1119 678 686 793 1151 952 804 1479 1315
1078 1315 836 1182 1295 1271 698 1015 1477 1195 764 717 1508 1296 1026 1402 1176 1003 1056 1798 1154 481 1423
1099 1423 1639 722 310 1248 1602 580 121 950 1265 922 428 775 1393 574 629 426 695 164 549 632
1119 632 5 -22 526 589 -132 -87 371 719 -279 -359 489 445 -300 -836 -225 162 -520 -445 -397 -430 -405 -230 -338
1142 -338 -1246 -895 -198 -420 -903 -907 123 -478 -1126 -960 -221 -647 -1275 -817 -346 -897 -759 -536 -636 -1111
1162 -1111 -1117 -393 -437 -1290 -1115 -159 156 -771 -1271 -309 -16 -1102 -1289 -408 -152 -732 -749 -890 -422 134 -240
1183 -240 -684 -477 -18 -1 -212 -706 -232 252 -302 -326 29 321 -364 -234 91 213 -208 331 397 311 -17
1204 -17 168 755 -42 -262 237 927 360 107 -4 955 507 -99 18 386 468 401 -32 322 666 744 432
1225 432 -504 370 479 562 -470 -118 597 848 -281 -197 412 302 122 -412 250 663 121 -394 -431 -23
1245 -23 -224 -246 -281 -407 -145 -259 -358 -665 -853 -285 -242 -161 -818 -796 -435 -189 -689 -777 -800 -639 -70 -1096 -980
1268 -980 -541 -436 -788 -1146 -866 -226 -633 -1096 -1003 -707 -413 -698 -1137 -1065 -496 -628 -764 -1182 -1336 -478 -885
1289 -885 -1058 -443 -461 -106 -753 -870 -242 -95 -478 -1446 -317 291 -111 -724 -413 408 7 -885 -387 215
1309 215 213 37 -179 579 624 -317 -144 538 707 297 113 1020 1137 472 311 880 1299 267 148 742 1537
1330 1537 1192 316 536 1633 1274 264 702 1692 1538 943 631 1573 1806 1210 1083 1445 1441 858 899 1145
1350 1145 1286 912 1327 1258 1710 1112 1294 1350 1125 769 1080 1249 1246 1014 1142 894 1113 1046 707 755 1031 937
1372 937 803 725 958 817 315 436 706 209 354 569 354 29 236 479 161 -307 -318 428 571 -123 -514
1393 -514 348 494 -640 -977 30 308 -939 -1205 -243 166 -695 -1335 -635 -129 -943 -1465 -573 -234 -439
1412 -439 -855 -388 -379 -739 -951 -734 -592 -926 -1034 -1207 -520 -732 -431 -971 -795 -377 -933 -1338 -921 3 -661
1433 -661 -1456 -947 -66 -355 -1574 -1047 48 59 -1174 -1226 -30 62 -792 -647 -46 -71 -330 -795 -291 -484
1453 -484 -733 -76 -291 -441 4 154 103 -816 -322 286 -43 -451 218 496 57 -526 188 582 -147 -636
1473 -636 507 952 -801 -671 403 522 -171 -374 201 187 -143 -70 505 556 247 191 5 328 538 219
1493 219 -382 -336 456 646 -509 -900 274 871 -380 -886 336 811 -359 -1064 -153 668 -206 -775 207
1512 207 566 -227 -497 116 -108 -620 -434 -73 -167 -767 -566 -204 -373 -701 -217 -135 -511 -423 6 -319 -445
1533 -445 -127 24 -882 -1502 277 93 -774 -941 27 423 -852 -948 -89 483 -535 -859 -68 176 102 -373
1553 -373 -258 -137 -62 -358 -262 -447 81 -5 -7 -576 -149 803 283 -313 284 603 -251 -258 145 865 73 149 719
1576 719 941 181 -40 755 661 155 416 1019 1067 153 609 1109 1050 262 529 622 1058 1104 1360 643 1199 1109
1598 1109 979 917 116 1103 1568 797 207 1175 1198 813 8 714 1401 1110 413 578 955 923 690 1041 731
1619 731 414 571 570 461 547 646 435 207 674 1122 542 403 401 389 37 -76 448 478 -15 -5 467 383 -264
1642 -264 -636 453 529 -399 -968 268 653 -474 -832 -395 500 -345 -970 -629 370 -72 -773 -696 -409 -432
1662 -432 -287 -947 -671 -462 -271 -805 -1047 -374 -381 -594 -1022 -663 -391 -439 -972 -444 5 -708 -643 -261 -258 -874
1684 -874 -831 -723 -696 -925 -842 -233 -148 -623 -426 -238 -300 -714 -654 -699 -515 -305 -290 -422 -656 -198 262 -309 -541
1707 -541 -373 182 -121 -569 -203 615 353 -559 -103 5 239 -517 -678 314 176 -133 -68 -71 217 111 -180
1728 -180 -23 229 588 270 371 210 385 446 411 168 33 218 199 431 131 215 313 205 421 -162 -314 309
1750 309 234 14 -514 73 822 73 -209 324 279 111 -229 -268 389 127 -153 -165 -1 165 -354 -303 -365 -223
1772 -223 -44 -173 -586 -207 182 -6 -607 -470 -105 -152 -442 -464 -247 -222 -243 -502 117 -81 -381 -580 -206
1793 -206 -378 -352 -421 -156 -457 -667 -204 -96 -391 -416 -352 -331 -184 -415 -505 -194 69 64 -286 -564 35 -165 -181
1816 -181 -464 76 402 115 -531 -17 -107 196 -297 -110 191 222 18 -3 -71 238 337 -57 127 -131 188 383
1838 383 88 228 485 708 701 155 827 741 369 444 300 718 790 735 745 951 530 747 895 620 160 737
1860 737 968 608 873 387 750 241 630 579 641 709 328 704 829 751 695 299 287 482 747 441 361 649
1882 649 911 784 417 464 391 680 234 245 363 662 378 233 412 266 112 175 315 -116 -80 127 117 -140
1904 -140 -58 -51 78 -339 -12 -56 -361 -135 -117 -481 -197 -262 -96 -175 -826 -485 -208 -475 -639 -848 -53 -188
1926 -188 -836 -692 -373 -551 -772 -810 -482 -538 -736 -592 -896 -564 -660 -460 -780 -598 -614 -709 -625 -328 -408 -444 -672
1949 -672 -627 -707 -160 -504 -666 -384 -642 -369 -260 -235 -417 -303 -358 -167 -11 -359 -237 -130 -461 -202 -121 -209
1971 -209 -622 -481 -52 349 -48 38 11 -103 83 299 396 193 -154 35 -50 54 -189 128 435 -73 218
1992 218 13 230 63 -374 161 162 217 7 327 409 314 300 -12 129 147 135 58 22 268 226 198 163 151 124 111
2017 111 -59 221 188 -195 -46 436 -100 -45 173 444 162 -349 -142 -41 170 -157 -52 -24 92 -241 -54
2038 -54 324 26 -129 -236 56 371 -124 -222 47 219 -128 -206 -381 -196 24 -407 -26 18 -467 40 -416
2059 -416 -184 -222 -105 -184 -29 -167 44 -264 45 -211 -563 -381 -311 23 -239 -313 -289 115 -83 -309 46 165
2081 165 102 54 334 -56 -71 327 -5 488 2 5 575 209 278 -17 350 273 339 367 530 -42 -45 562 566 291
2105 291 -13 360 411 285 255 417 440 133 332 230 344 495 485 341 263 264 325 217 354 441 87 107 291
2128 291 72 647 328 223 296 238 130 610 349 237 302 -75 89 -13 -247 -46 115 396 267 45 174
2149 174 220 65 59 271 60 -59 237 173 -207 108 -101 303 -93 -230 -8 194 -175 56 -275 79 -143
2170 -143 -447 -374 -151 -421 -84 -217 -156 -226 -395 -323 -276 -180 -274 -308 -396 -524 -296 -536 -491 -111 -217 -400 -527
2193 -527 -246 -371 -524 -487 -229 -516 -426 -351 18 -348 -295 -228 -457 -255 -69 -360 -366 -123 -416 -112 240 -61
2215 -61 -256 -298 -149 -410 -133 -192 -99 -137 -133 130 150 279 113 44 -186 13 -87 -72 -22 138 146 -96 -65 -14 1
2240 1 176 81 244 181 120 207 239 389 229 44 428 81 -269 128 413 239 97 29 -144 -44 203 185 54
2263 54 461 229 296 95 276 61 248 -148 201 601 267 130 -228 90 365 79 7 214 203 -174 -130 -62
2285 -62 -292 -240 -292 -106 -192 -70 135 500 -246 -107 -369 -9 -488 72 -195 -95 -312 -259 -279 -86 -136 -200 202
2308 202 -263 -245 51 21 -508 256 -97 -32 -113 -209 -25 -266 -198 -47 -211 -164 17 201 -177 -330 -178 -523
2330 -523 -235 -496 -318 -259 -12 -411 82 398 -211 -175 -154 -283 -60 108 16 -196 -82 -23 -165 -150 -200 -108 225
2353 225 -63 231 159 461 176 149 151 186 8 96 396 -11 100 100 210 -63 43 407 283 -128 165 365 436
2376 436 209 47 59 -50 173 172 464 182 165 56 80 94 450 253 361 37 47 355 606 348 228 126
2398 126 -99 318 438 -206 281 217 225 266 -48 88 243 213 -254 -64 -100 29 247 -288 245 -389 19 -2
2420 -2 270 -31 -79 -173 111 -412 -311 254 -33 -21 62 -66 -237 -232 122 182 -293 -191 217 51 -151 -113 -210 -318
2444 -318 -434 -131 -204 -2 -184 -357 -287 -175 -222 -105 -6 -419 -132 -203 -118 -565 -252 -300 -159 -11 -467 -54
2466 -54 -225 -94 -378 56 -135 -196 -254 64 -314 -273 -138 259 256 62 -432 -59 -36 237 -146 -146 205 121 -234
2489 -234 -141 164 -107 10 -368 -8 93 103 -198 -80 165 243 -56 72 128 118 201 31 -199 -12 335 -86
2511 -86 -95 140 -9 -154 -14 -17 144 571 -127 -56 87 17 -10 172 2 111 -216 -63 321 249 120 -72 66
2534 66 85 58 269 92 -3 129 315 65 -41 193 -39 55 51 212 -92 100 -7 105 -12 110 -175 -176 -56
2557 -56 -7 -48 -307 161 -209 147 -170 -106 109 -72 -5 -42 -25 -82 -178 -86 -346 -91 -221 -405 283 78 -106
2580 -106 -262 -144 -3 -266 -181 30 104 -285 -177 -66 -161 131 37 -22 206 -329 -238 186 105 178 -65 40 -135
2603 -135 129 -112 -91 166 -228 523 -207 129 -112 -125 388 117 92 180 -151 -23 292 -42 -99 -67 216 91
2625 91 55 298 299 -29 262 78 233 426 83 216 451 149 -4 272 69 274 -173 93 46 -209 98 -68
2647 -68 64 398 429 191 49 231 74 269 63 261 42 165 536 14 238 125 176 145 298 4 -216
2668 -216 145 -40 267 252 151 136 189 40 -169 -203 -184 -54 -90 81 251 220 -267 61 84 15 54 -316 25
2691 25 100 -211 51 -53 -39 45 106 -153 85 -79 -35 -267 -242 184 -228 227 -20 -241 -214 -2 71 -116 -168
2714 -168 -255 -155 -296 -188 134 -247 -274 -102 -191 41 141 140 -161 173 -231 140 -34 169 112 -393 -23 44
2736 44 137 -183 -208 17 -228 -244 55 21 53 153 -7 43 -171 -147 -93 -1 73 -95 28 -187 234 203 52 178
2760 178 158 -74 -252 -225 263 140 -232 -204 172 49 177 136 -130 -30 6 208 59 -1 -28 -335 98 -281
2782 -281 357 83 141 40 9 506 51 155 -185 25 330 5 26 81 -156 -325 34 -187 -58 -83 153 -74
2804 -74 -178 6 -177 11 69 -178 -96 -118 11 307 -290 -201 55 524 -301 -130 -69 92 -14 -314 -384 -298 -7
2827 -7 -69 156 -147 -37 -167 -461 5 -41 -258 -34 87 -334 -2 -169 -36 -78 -59 148 -168 224 89 -434
2849 -434 -217 -15 420 249 -215 78 -76 -212 476 157 185 -10 -37 94 -34 98 93 336 344 -202 16 -101
2871 -101 1 -22 150 207 86 -75 -237 69 129 20 -114 -20 -20 -20 178 55 -118 87 184 -28 152 108 205 129
2895 129 -177 363 395 79 27 -44 3 42 -61 -64 142 59 377 349 -24 276 314 -137 -152 -33 29 -129 70 207
2919 207 -28 141 262 -161 188 189 -6 35 -28 184 191 -97 232 202 94 22 -359 -128 396 -160 -35 -65 0
2942 0 61 -82 192 222 -92 -37 37 -77 -21 -82 -4 133 10 -91 -77 -2 -145 -99 342 257 -516 -184 8 -36 201
2967 201 -217 -1 260 -45 94 161 -166 36 129 22 -85 58 185 -105 -397 -131 -77 -129 -127 -69 -23 -139 -91
2990 -91 -96 -84 2 26 -68 82 -71 -235 164 156 52 -124 106 252 93 -22 -38 116 146 155 158 21 -11 226 59
3015 59 -8 138 53 229 -160 58 234 41 -306 -6 260 149 105 161 235 -40 -61 -223 -142 188 149 53 185
3038 185 114 104 -42 -116 -65 -4 -202 22 135 -20 134 153 12 -156 -79 48 79 -129 -163 -220 -101 -29 -274 -101
3062 -101 -50 -56 -151 177 145 206 -62 26 71 39 181 253 -21 -117 200 -334 91 14 -176 -38 -101 122 33 -163 258
3087 258 284 21 -269 49 2 -83 -93 70 303 84 259 -107 107 -277 -93 255 -20 244 -66 65 -131
3108 -131 177 -175 -14 3 -16 -14 149 -10 -99 265 -183 -32 50 19 54 -102 0 -67 120 289 295 22 146 -73
3132 -73 -33 -212 -184 -14 141 -8 -82 26 -47 124 -167 143 135 -38 331 112 -59 34 -336 -30 -36 9 160 -198
3156 -198 -81 454 176 178 141 -67 -16 272 -11 39 199 -79 31 -23 -168 -84 -57 -226 41 -166 370 104 141
3179 141 113 186 138 211 146 -182 146 -15 342 -134 -108 30 120 -90 -311 -355 184 110 20 -96 -197 122 -216
3202 -216 50 -337 148 -50 61 72 82 -76 -13 22 173 -176 -120 -70 -76 -3 -29 241 190 -274 55 -334 -79 13
3226 13 -150 -363 11 -5 46 242 -53 -49 -362 18 89 207 40 7 -48 171 -73 78 -54 74 -4 -64 8 165
3250 165 -90 -151 -50 -202 196 -135 -358 73 -53 84 158 -225 -342 -21 -132 -109 -29 -3 -132 -35 -95 -416
3272 -416 -40 -12 97 2 156 -79 144 128 -47 -26 117 -63 193 260 185 163 351 -6 15 119 -91 277 -332
3295 -332 -50 211 -71 55 -74 36 -130 57 -108 140 189 328 -122 -8 -57 159 25 -89 -66 49 -146
3316 -146 -24 7 -150 98 -269 69 -54 -81 -66 70 -53 206 38 66 -104 -192 135 516 80 -114 75 -117
3338 -117 -98 42 -164 -334 27 248 -86 15 -213 -65 -15 18 202 189 -68 216 -170 -148 -159 -262 29 52
3360 52 77 158 -106 -33 -83 44 -234 8 62 96 -157 67 -68 -81 -262 -12 -58 73 43 74 130 192 141 -87 -126
3385 -126 8 -149 -142 -10 251 96 -8 53 -47 71 60 246 10 171 -270 120 120 -229 -172 88 141 -10 138
3408 138 -39 -112 72 -211 67 -301 72 115 -155 37 -105 45 -12 419 114 208 -37 -102 136 83 -67 279
3430 279 -60 129 290 -66 130 24 132 12 27 93 56 -2 27 205 -37 -140 29 -127 -165 -139 15 2 -227
3453 -227 -95 -171 -44 19 -66 172 -115 -81 190 -75 -145 199 20 -43 157 -278 -173 160 78 48 160 -20 -15
3476 -15 -300 20 -146 -295 -98 57 -380 -293 -127 146 211 32 -473 -135 190 -92 26 -59 181 -179 -132 -43
3498 -43 212 79 75 299 71 34 -96 214 -66 -213 -292 -65 -76 162 -49 -23 -119 314 -181 -95 74 -1 -86 63
3522 63 313 -98 -191 109 -164 104 29 -76 76 -62 -133 -5 -81 -138 72 114 -60 -75 231 -99 68 96 -52
3545 -52 2 30 16 64 100 -198 276 223 51 80 123 175 -129 -160 -99 145 -29 250 194 -29 -9 91 -148 -98 44
3570 44 152 171 148 -29 -122 274 -4 -128 -419 -160 -11 30 1 -69 -143 -478 29 186 -194 44 -93 240 198
3593 198 362 -143 10 79 -449 39 -241 39 63 -154 -92 -31 72 83 54 -105 244 343 -128 250 -94 -56 -236
3616 -236 -186 -92 201 119 301 38 186 75 32 88 -72 173 28 -319 -176 -70 -75 -15 339 86 -161 -281 81
3639 81 -219 -93 342 329 0 -391 191 24 173 122 213 202 350 -128 152 214 14 217 301 16 12 29 173
3662 173 304 -147 51 120 -185 -23 -162 8 183 -135 50 24 -50 -132 388 -65 -320 91 163 -121 -38 -175
3684 -175 107 -98 -5 -109 -75 -70 -232 -68 153 -229 -143 -11 179 44 -137 62 155 -13 -177 -101 82 -34
3706 -34 341 268 117 -37 -250 -125 -187 152 102 -27 -368 59 74 -49 -135 -267 -128 -56 136 6 -415 8
3728 8 -142 78 -26 -290 -221 -133 89 -17 -141 45 -10 7 -54 72 381 28 -90 -35 92 169 -326 -104 23
3751 23 42 265 172 372 -199 185 360 -73 227 -151 50 64 144 -30 136 96 -40 -170 -179 161 305 11 135
3774 135 -4 -81 170 107 323 -61 258 155 37 207 -142 -169 -189 -231 183 414 -120 38 215 30 -14 -145
3796 -145 174 -174 114 -48 -67 36 -162 50 477 119 181 -199 319 -133 -186 209 43 78 -448 -28 -126 -89
3818 -89 148 66 -30 78 -7 -26 -43 90 -112 -15 154 125 -2 224 -71 -192 -19 -68 -174 185 -179 -419 7
3841 7 -138 155 195 -11 -106 -162 -169 -111 -106 25 39 161 -53 -150 -98 19 -40 156 -236 -96 -182 -253 -239 -135 47 -106
3867 -106 -88 -181 25 89 -28 98 -200 -118 -40 10 79 304 -168 47 -81 -55 -32 204 26 241 26 -254 69
3890 69 97 30 -76 -151 -265 170 144 -229 89 113 32 119 -14 240 -371 -4 -183 -215 -110 49 283 -68 -29
3913 -29 5 64 -69 62 -177 59 14 70 163 83 -112 -117 184 -195 -68 19 48 229 -235 266 80 122 -70 13
3937 13 184 66 -122 -214 25 -50 157 2 58 193 52 -43 3 157 -340 -50 -18 -51 -100 -63 184 95 -91 -88
3961 -88 -6 -106 154 -5 -247 87 -172 -443 -315 -88 -51 2 -209 27 -13 -113 -171 263 -73 -255 -99 -152
3983 -152 -301 -57 182 -79 -129 157 55 -113 55 -159 -29 -116 -215 -74 -230 146 -52 13 -53 59 493 -120
4005 -120 -198 -64 487 -129 91 87 -292 -100 -3 -1 -58 -123 22 137 271 88 -114 3 -219 195 -13 254 55
4028 55 182 -47 142 100 75 139 -91 57 80 148 247 -12 282 53 121 -63 -91 346 -196 28 -36 94 -12
4051 -12 -102 -95 -108 174 -162 -79 -52 83 -127 -84 -170 139 180 -38 19 -115 7 -19 -46 34 189 249 -54 -6 -48 38
4077 38 107 -30 -242 -106 -62 120 20 -187 59 -156 -10 -139 -26 -215 135 -12 -204 113 -407 -19 -288
4098 -288 -221 -35 159 -96 96 -91 -159 -143 -243 456 -71 48 -193 -140 -18 51 180 -39 -237 47 38 86 60
4121 60 -223 163 -89 105 -158 -14 -139 242 -32 -9 286 117 192 206 -91 -34 45 196 -173 -54 143 90
4143 90 -174 44 -76 -22 -37 -132 -47 -17 59 189 177 142 188 269 53 60 178 4 -71 37 -54 218 378 5 -30
4168 -30 -45 187 -189 -136 55 365 113 24 -152 -26 -15 240 55 -322 281 -106 -260 -186 -174 -238 218 139 172
4191 172 21 263 233 236 92 -152 -58 -10 -12 -187 53 -130 -188 -187 -86 155 416 61 179 -77 32 -146 -240 -77
4215 -77 -43 148 83 147 -212 121 -106 -413 -12 -13 55 8 36 -51 116 -124 13 256 -143 -217 -143 142 32 -250
4239 -250 73 -39 -179 -303 -38 84 -12 189 158 -163 -21 -168 -11 167 176 60 -19 -163 271 11 224 -30
4261 -30 46 153 -48 -36 -30 -107 -27 -236 -160 279 231 13 112 -46 -14 160 -112 -15 92 -1 -70 83 -81 60 -164
4286 -164 60 -89 89 81 -2 -5 289 -41 222 37 166 -51 -87 -262 35 108 -78 40 233 342 -39 -2 -84
4309 -84 154 261 -9 96 189 -56 -243 97 139 59 107 123 98 99 -252 51 -51 137 -163 48 95 -273 122
4332 122 -262 181 115 18 86 -239 -214 130 97 -274 -8 -80 -47 -87 -147 -15 -87 127 16 -108 155 -11 -176
4355 -176 35 172 -221 292 -152 -58 149 -20 240 -160 -133 -52 54 34 -167 -318 73 -62 299 -14 2 -57
4377 -57 -128 178 37 36 -66 -45 -10 169 -24 -169 341 -77 146 -35 69 144 -374 -155 -204 -3 -5 10 196 -50
4401 -50 26 -36 78 62 -14 -293 24 -7 298 227 91 96 153 -110 24 -132 44 42 -1 88 160 249 247 189 84 -195
4427 -195 57 -20 -21 91 64 -36 174 107 156 64 -65 124 -43 75 190 -70 341 55 73 17 108 100 65 -141
4451 -141 -221 146 100 -70 -67 144 249 -429 -236 127 -146 -23 -43 204 -70 -213 155 286 283 -20 109 -66
4473 -66 -168 -113 4 236 175 -191 -157 -42 -351 -173 227 48 -129 27 -234 -288 -278 -40 -292 -57 54 -44
4495 -44 25 152 -328 176 -75 -79 -92 203 138 -86 310 -67 24 -255 -256 3 164 108 158 -28 92 127 107 -240
4519 -240 205 -102 -115 159 -201 15 298 -55 -95 274 198 210 -216 -99 65 -122 185 -317 -141 207 -281
4540 -281 79 75 167 -164 -107 -19 -34 254 -53 166 -201 -56 -181 -114 150 53 53 182 98 106 25 -194 274 65 -81
4565 -81 328 135 -412 -136 -62 -237 -26 -256 358 115 -14 121 -41 -64 290 23 -18 152 -140 241 -78
4586 -78 223 -66 33 -88 -257 6 -166 21 -133 48 -75 -168 -187 -200 198 -289 187 -19 177 -77 -44 -242
4608 -242 169 35 74 -417 -252 -260 -1 5 84 213 -6 -24 -87 -281 134 37 252 18 -50 -162 -138 -23 -91 142
4632 142 3 -106 106 -210 -56 -183 -369 190 168 19 -93 -76 171 50 79 2 -232 -89 139 160 108 -66
4654 -66 156 -29 -179 -173 -37 -245 148 -44 -186 -27 3 -11 -41 -147 151 -90 -7 -171 -47 61 27 13 51
4677 51 177 53 -60 254 78 92 139 -172 27 105 427 249 -6 177 101 315 -92 199 -33 147 56 68
4699 68 249 -182 -85 51 252 -161 -192 -61 10 -173 50 135 -159 55 185 205 91 -230 -284 168 -147 -30
4721 -30 14 246 -21 -46 209 79 -252 -311 109 178 102 23 64 -179 -11 158 -199 94 180 -85 -35 18 140 -120
4745 -120 56 -21 101 -47 -48 -129 -332 -74 214 -27 -264 245 -207 -285 -187 70 -292 107 147 36 182 -33
4767 -33 -25 -22 -48 -203 48 62 166 -25 -19 -22 162 -77 11 -287 -268 168 121 -110 -57 -278 152 -261 -271 -117 46
4792 46 30 106 116 23 -101 264 98 86 354 -288 -235 31 -15 263 20 -315 -69 43 119 66 164 -88 230 148
4816 148 -32 84 207 345 100 115 343 -290 -131 364 45 73 455 -198 56 94 -50 110 131 241 -28
4837 -28 -247 183 29 -44 -55 46 -29 -31 -23 115 37 51 300 295 5 -362 -259 -63 -47 -345 46 67 -250 96 96
4862 96 41 -131 -226 69 207 -41 -156 63 -60 90 165 -24 -199 8 -21 72 111 271 96 -32 -286 -91
4884 -91 -233 -74 -66 231 -4 -93 -69 -26 83 -299 -402 -302 17 135 13 174 -255 106 -222 67 -247 98
4906 98 -274 -9 -329 -26 57 -70 -279 122 -311 30 50 -327 -138 157 260 2 26 -370 317 396 256 -164
4928 -164 239 79 70 147 223 172 182 -300 -15 -50 253 -21 146 58 -43 348 173 123 126 -78 -24 201 -55 189
4952 189 156 67 219 52 -132 313 -102 194 -10 -175 249 12 444 -126 126 -10 -124 84 26 -5 16 -42
4974 -42 -246 -123 59 -54 -217 78 -70 -64 -12 -182 -121 161 78 77 -55 31 -254 145 -112 -27 -198 -45 -278
4997 -278 -42 -132 180 -140 100 -24 -239 -143 -64 -8 -127 39 -168 -254 108 -270 -164 -189 -183 -2 -4 -37 -236 170
5021 170 -81 342 -94 -152 -24 185 -152 -204 165 181 -116 40 134 -89 0 -19 -7 229 104 33 -24 -101 114
5044 114 -45 80 317 318 -224 196 197 26 60 184 -170 301 262 206 263 285 115 -8 41 -7 27 435 118 -62
5068 -62 122 29 121 1 -18 318 32 -36 130 -39 -77 358 82 -251 -87 18 360 175 178 117 219 -247 -132
5091 -132 167 -131 -9 69 -34 341 -38 114 -216 -114 -139 -40 -52 -100 297 112 391 -1 -20 -103 -304 -130
5113 -130 250 251 -105 33 -39 119 88 -322 131 212 30 218 88 69 -340 -84 8 126 12 -282 -414 -16
5135 -16 -18 -140 64 -108 147 -272 -124 -201 -61 130 133 94 -247 59 15 32 280 89 -236 -162 38 -8 -109 -44
5159 -44 319 20 395 -33 -199 -82 170 -86 99 110 56 5 261 -32 -27 83 82 -43 136 275 -152 -10 -237
5182 -237 -288 41 -54 -290 52 -28 -68 204 139 -167 257 35 1 44 -89 -58 -30 334 -219 113 -126 77 130
5205 130 -187 137 266 99 8 132 -170 -114 314 -63 -166 107 195 -15 68 -6 -139 138 37 83 -166 57
5227 57 96 271 173 155 -74 75 -64 317 -140 -18 -141 78 220 -195 273 -32 -111 84 49 -214 -115 -162 109
5250 109 -126 340 -131 -106 -32 -181 -35 71 -236 -94 -25 77 166 -138 1 73 -36 -148 -239 -41 -37 -427 -50
5273 -50 -242 -112 -251 -331 -99 -178 -132 60 -15 -367 -80 -65 178 -386 127 -159 23 -1 -93 239 113 -383 3
5296 3 -43 180 214 192 -314 -163 140 -12 10 111 -193 133 -183 89 -187 -85 262 8 -228 24 -235 89
5318 89 48 31 19 -157 14 -120 273 77 1 117 48 -162 -7 79 -44 62 29 -317 67 123 72 220 44
5341 44 -234 78 82 83 181 -42 418 192 116 252 130 4 -74 -24 83 298 -264 30 -88 -30 -59 79 63 11
5365 11 12 336 -66 135 -91 98 73 25 -30 60 20 122 -102 -163 288 82 -136 58 41 71 -30 94 -277 -20
5389 -20 22 -366 -159 -37 -219 -320 76 -21 -187 -81 -5 -13 -28 -315 141 54 -120 80 195 -106 25 -212 54
5412 54 -135 -255 -220 -317 -65 5 -198 55 179 -201 78 151 -8 -49 196 -66 269 36 146 -194 109 -76
5434 -76 146 -123 35 84 -173 465 -33 88 194 133 12 -107 -148 -99 114 282 -110 52 -97 120 169 -79
5456 -79 401 -207 131 274 340 156 194 166 -44 -223 -49 -194 -7 322 -181 93 39 329 152 -211 108 -137
5478 -137 66 58 52 -69 -201 299 -141 85 -240 233 -43 -116 85 194 39 -47 -264 -162 -267 24 24 -1 -9 229
5502 229 145 -48 -87 68 9 -13 109 -233 -71 53 -31 -224 15 -64 -369 -305 -132 -160 239 70 -100 64 171
5525 171 -75 -151 87 41 -39 -48 -286 -86 -301 51 -157 34 -65 -173 -155 124 -85 119 2 110 -29 -87 -70
5548 -70 111 -166 318 20 -97 372 50 -163 -212 43 117 -9 128 -113 113 -39 -115 -114 -155 9 -154 -166 -27
5571 -27 -117 99 -138 -407 397 -142 98 216 -25 119 -129 91 63 -61 -32 122 -78 -14 158 -2 -117 -39
5593 -39 -45 68 334 12 200 -321 162 303 54 165 -125 33 -69 219 189 113 -211 1 13 139 295 62
5615 62 167 102 -159 181 134 -41 159 35 -27 99 34 -168 77 182 113 67 -21 -61 -31 32 64 7 -140 90
5639 90 114 3 19 58 -308 26 -45 -88 123 -145 -12 -310 -57 164 32 31 75 177 -352 -360 -88 -369 -375 149
5663 149 -21 50 2 -385 14 -8 -90 -19 206 274 51 36 45 49 -17 -255 81 -95 -8 127 -117 -203 128 -87 65
5688 65 -54 -52 112 -313 51 -217 -199 -92 130 -242 -108 144 258 75 -184 317 353 -83 -51 -86 -41 47 283
5711 283 273 84 -29 -176 20 -89 -81 -116 369 17 -176 132 -75 -93 275 -49 252 149 112 242 -249 -70
5733 -70 33 230 235 149 -54 -107 175 62 -42 44 -102 81 146 -175 44 -256 -115 135 7 -49 249 283 12
5756 12 -60 21 -155 -201 299 12 -106 -68 107 172 -122 86 259 -105 -249 142 -18 167 -171 -68 101 235
5778 235 -40 25 567 61 -153 -31 -328 121 205 76 -212 121 24 -196 -237 -147 42 -52 -28 -210 25 -47 -106
5801 -106 85 -151 -47 -12 -34 103 14 -85 -111 -66 -91 -109 -190 -20 -122 -67 276 -57 -42 230 49 93 -62 -81
5825 -81 -219 -245 179 -243 -209 211 37 200 -302 112 82 243 75 131 -118 23 47 -82 129 -163 45 147
5847 147 27 -55 -255 238 133 -141 23 -59 -129 79 315 55 46 20 160 -206 -84 -136 53 -156 -289 -14
5869 -14 132 111 -152 -137 6 354 204 88 132 131 -43 -146 179 276 0 -127 224 -270 -136 -48 -172 -78 222
5892 222 -299 150 -56 43 148 -61 262 -66 43 78 146 84 -141 129 152 222 -37 -97 -35 -63 220 -58 -50 -197
5916 -197 -191 59 45 117 -10 60 57 103 25 -170 -134 265 -100 30 -64 -67 -180 -185 -73 -164 34 -14 78 116 41 27 194
5943 194 -72 17 -71 25 -222 160 -81 101 -30 -85 -284 -212 -54 -156 54 64 177 -2 -113 33 -120 -298
5965 -298 -87 104 252 3 -289 -34 280 35 132 -65 131 -1 -166 80 -28 167 -117 110 173 310 47
5986 47 157 221 -286 87 299 -281 93 -96 296 -209 126 107 41 33 -76 -85 -34 -80 -55 237 193 -20 145 273
6010 273 24 28 -85 375 117 380 -31 -160 6 446 -88 2 -32 -19 54 364 -52 -14 95 -197 88 99 -290
6033 -290 -235 -140 55 -22 -25 13 -24 344 -28 48 118 388 -20 31 129 140 7 107 131 -48 -91 199 -107 221 -51
6058 -51 -91 -72 -140 -126 -29 -227 -326 50 -107 319 -96 -210 24 -4 189 -30 195 261 100 -44 -108 -71 64 -37
6082 -37 -3 45 67 -69 97 -89 -46 -116 37 22 379 -222 79 156 286 93 -24 53 136 -288 22 80 72 200
6106 200 184 197 184 25 104 -29 -150 -93 227 230 44 -20 44 -26 -292 121 -81 420 79 213 147 -52 -207 119
6130 119 335 128 116 71 102 145 19 -112 -31 243 -55 -159 25 226 88 86 216 162 -72 -45 -282 104 -3
6153 -3 447 302 12 -58 -13 -2 311 220 -129 -25 38 -289 -111 -26 35 116 -169 102 -26 29 -20 -3 97 97 153
6178 153 -213 137 132 -9 -130 220 -65 97 -84 -216 126 -277 -180 -455 -114 319 -108 165 -74 -274 -94
6199 -94 -350 113 -110 176 59 -325 -126 -86 -327 -55 -217 -26 59 42 75 -105 162 -38 -24 -186 93 84 -76
6222 -76 60 181 231 -116 9 75 -71 -244 -93 146 -38 -133 -32 -258 46 -29 -84 -103 -129 -52 326 4 47
6245 47 -40 -23 109 -261 256 322 230 76 -122 24 115 306 119 137 39 121 283 532 -51 -76 -13 -12 156 -79
6269 -79 -68 -23 -82 25 50 -75 -107 194 134 -219 224 188 -194 154 59 5 202 334 -243 143 97 -452 79 -106
6293 -106 -414 60 -53 18 -370 90 -110 64 -72 -117 -304 78 -151 -37 129 -285 -33 257 142 -74 62
6314 62 -47 -26 -33 -211 -66 20 222 -424 0 31 -98 -246 48 -202 -117 70 -91 19 103 -36 -297 186 -2
6337 -2 118 180 35 -180 -77 -205 36 -129 -268 -66 375 -155 86 334 -226 -146 70 -110 575 -46 -42 132
6359 132 -137 148 1 116 80 219 -73 -131 59 34 -241 -34 132 -18 122 -216 77 -102 265 -253 -29
6380 -29 -12 -66 -176 -23 -30 234 168 14 -72 -252 -11 81 -41 80 239 418 239 89 116 -11 210 181 16
6403 16 -20 13 214 -131 8 165 198 236 127 -202 -171 -137 63 -121 -107 207 -104 20 132 126 -161 182 -10
6426 -10 -69 -123 216 -8 156 -38 -72 -246 -132 -29 -25 -58 -204 164 -101 233 -30 150 13 -190 -72 62
6448 62 251 94 -65 -397 10 170 -28 55 -103 44 -12 -204 52 71 -43 17 -13 51 -19 -32 291 -186 -70
6471 -70 -37 -19 88 -119 10 280 -164 184 -409 13 262 -80 90 3 149 98 -125 286 -8 297 -406 22
6493 22 -148 192 -19 -115 181 91 -22 182 -272 -431 26 -225 -107 121 106 58 194 99 267 259 -137 297 -100
6516 -100 -97 -41 -119 388 127 156 7 -285 -197 13 -19 24 15 69 6 179 -87 19 184 -403 -90 -378 -1 -58
6540 -58 -17 -48 -16 114 -63 212 237 285 38 -265 97 78 136 -26 -113 156 -28 -410 175 -12 114 69 -122
6563 -122 -61 -43 -169 -127 336 -192 -430 -190 -195 -156 -294 107 21 -148 173 13 94 -40 -39 40 -12 -66 -59 86 -11
6588 -11 -80 -61 -88 -73 106 -93 -85 -192 -42 20 -45 -53 -80 27 -202 76 -16 -42 -282 -79 -23 -227 115 -94 79
6613 79 276 -198 29 161 139 254 14 82 -33 190 31 235 -77 5 30 -10 -124 41 -238 -86 263 89
6635 89 89 41 18 -28 269 -250 247 256 -66 90 207 302 -11 2 -61 140 -22 364 284 238 163 3 89 40 258
6660 258 256 204 -3 19 -44 -74 424 -102 -26 -113 -107 -100 -175 93 -202 56 -180 99 -58 149 -88 -229 231 139 134
6685 134 52 374 33 -69 -75 -96 174 -45 -20 160 -112 150 259 -47 -191 -43 -111 -100 -71 37 -10 -421 -111
6708 -111 234 61 -85 -336 -187 -82 74 144 44 28 -231 -17 23 -55 -381 38 83 -99 -7 -6 76 -176 96
6731 96 11 -119 -81 -158 -137 -239 -37 -279 -16 212 -27 311 166 1 -240 115 -76 -53 78 -172 176 231
6753 231 -225 172 -318 -218 246 75 -228 -41 56 86 40 -9 -189 586 100 139 202 23 130 -47 -7 154
6775 154 10 304 172 -174 242 -61 -56 241 270 125 -254 -105 145 199 107 -20 -62 23 -183 -130 -200 167 127
6798 127 240 -91 188 1 158 -95 125 16 132 54 61 32 -52 151 192 56 -264 88 -21 -289 -162 209
6820 209 -222 -145 -33 -18 -189 244 165 18 -124 -16 -132 -160 -131 -36 -108 72 -96 74 -257 -265 -87 -65 -103 -15
6844 -15 110 -309 63 39 -184 -126 195 -181 271 -327 -171 -98 119 166 87 -98 35 -143 -30 325 52 267
6866 267 -408 326 -138 -228 115 65 72 -315 96 39 -61 -56 84 112 40 -221 -84 -19 -136 -190 51 141 -39 72
6890 72 117 -17 223 -238 40 92 -6 -68 201 14 -24 101 -66 208 303 -206 98 172 5 47 118 256 -150
6913 -150 -85 66 256 4 -203 -116 366 14 -9 40 -37 -76 377 132 75 262 43 194 20 134 -58 84
6935 84 203 -157 -15 332 -270 89 -238 -264 -17 -15 -103 194 -47 236 92 -324 57 56 -82 -244 159 -141
6957 -141 233 46 -48 -142 -199 102 6 95 -22 -124 -107 178 -52 -60 127 210 135 -13 58 -186 -152 -110 -13 -211 -167
6982 -167 31 -193 -226 -121 99 232 -103 -215 -115 -48 62 87 89 -24 173 134 137 -39 98 33 -119 -169 65
7005 65 138 -30 -329 176 -7 57 16 430 -81 -14 -147 129 -170 171 47 11 328 -58 312 -169 145 -190
7027 -190 -76 -4 79 241 4 65 -201 111 8 250 206 62 -149 232 -7 120 102 145 -43 52 -3 86 49
7050 49 -372 48 -113 209 262 221 -84 -131 -11 -167 116 67 -233 -109 -96 7 -108 -156 227 150 -49 183 -332
7073 -332 37 -43 -4 -133 174 185 92 115 137 -127 -510 245 37 -324 155 -214 -372 66 -19 45 -35 -91 86
7096 86 -456 -113 185 -123 -239 36 -84 -298 24 -63 -57 54 -3 14 -159 -27 -64 -240 -7 -101 -245 -217 -56
7119 -56 159 0 -220 -134 -44 -55 -96 -144 172 -64 126 124 -21 93 -1 -287 -96 -81 191 -95 -121 -79 -406 -61
7143 -61 33 310 95 -70 78 -209 -28 269 -175 -81 -172 -189 296 183 181 3 -261 171 26 -113 -111 48 51 199
7167 199 72 13 -14 60 -144 -43 52 -113 8 -10 69 31 239 -160 -96 109 -62 313 63 150 215 114 212 218
7191 218 376 -100 275 -35 -145 332 98 -149 1 -148 101 202 148 -123 116 120 211 -93 -248 85 50 239
7213 239 -2 217 30 -124 167 73 28 -160 -59 96 -37 -265 60 -27 31 31 244 -6 -42 157 -105 -216
7235 -216 217 -90 161 -224 73 -49 -104 -69 -210 -118 46 57 -194 -45 205 65 14 -116 -204 -44 -204 -194
7257 -194 238 85 -169 -12 110 -435 -72 -73 -260 299 -290 -18 20 52 -109 29 146 -121 -252 -93 -187 45
7279 45 -86 -70 94 84 -189 144 -128 -281 -98 46 -80 278 109 111 469 -72 -38 -57 69 156 150 -186 156
7302 156 377 100 185 103 -32 -25 -20 -75 106 206 169 76 184 -33 260 -41 34 109 234 -40 376 251 -53 -59
7326 -59 10 -19 -146 -127 251 49 -6 170 230 102 230 -76 -254 -229 295 -235 58 -163 -16 151 154 134 -164
7349 -164 247 -11 110 -116 6 -68 107 -145 -21 64 -118 -62 -178 -158 176 -253 115 -301 -361 -124 -185 -212
7371 -212 -10 65 110 -131 -251 -71 72 -114 -82 214 -10 -87 66 163 -197 -296 -1 142 -266 33 82 -13 54
7394 54 37 148 80 -273 -277 124 -215 -98 -15 77 13 284 -140 -75 37 -19 -277 -112 -19 124 34 -43 -55 57 -332
7419 -332 129 -3 -27 -171 59 76 -167 177 158 45 -4 -53 -100 197 53 85 -116 120 309 392 79 146 18
7442 18 178 -187 -56 -63 85 -26 -120 357 -137 118 253 -45 197 -77 274 96 33 20 -109 -162 -112 75 246
7465 246 96 4 -72 137 21 261 -61 -14 258 -266 -46 -230 51 246 279 135 159 -90 74 45 -18 -165
7487 -165 5 51 39 75 -228 -24 68 1 -239 144 -6 -342 70 -232 -41 231 170 -108 73 380 77 -261
7509 -261 -225 184 159 89 8 43 -148 -336 -147 -102 161 22 -115 140 4 371 188 -118 -8 20 -257 131
7531 131 18 -109 9 125 -29 -124 55 -403 145 63 65 -451 -12 -98 -98 -8 -97 -84 -12 46 39 274 5 -300 -125
7556 -125 114 379 448 -214 -169 -223 22 -39 -92 185 394 -125 -268 -39 160 205 229 -168 390 -21 -231 -86
7578 -86 54 -93 -38 131 -64 -34 32 77 90 72 44 191 153 25 270 246 -99 -343 -38 31 147 -115 32 -159
7602 -159 -318 97 179 41 393 278 106 -184 -41 173 -153 -112 61 127 267 -109 -117 -162 27 -16 -63 -125 35
7625 35 -294 72 -3 -29 -136 180 -16 -50 27 170 -268 -228 -176 -218 -3 -47 144 119 -3 223 70 -112 173
7648 173 -25 -49 86 -265 85 -11 126 -113 18 -51 20 193 110 -261 28 132 -29 -64 39 -54 -218 -176 72
7671 72 61 -144 153 45 -121 -282 77 128 17 20 -116 -91 168 -79 32 -144 153 -44 106 72 -47 -94 39
7694 39 408 -184 -293 -79 207 30 -46 193 26 -114 -228 123 179 232 253 -29 122 162 -176 113 200 5
7716 5 279 209 -156 -388 -72 102 -383 45 -216 136 203 4 -190 90 -52 -178 51 146 -5 27 192 39
7738 39 -299 -106 10 127 67 313 -203 -7 -200 121 -133 -85 97 0 0 -136 17 -91 -30 34 -121 119 54
7761 54 -98 -50 -96 -153 -139 27 92 108 -151 -5 -70 184 -24 -120 -339 135 -56 -227 -69 185 57 -184 343
7784 343 43 52 110 -67 -66 86 -44 71 134 -102 -36 211 -309 -10 -123 -26 -53 4 7 -107 -45 161 93 -411 -128
7809 -128 225 25 144 -238 -157 51 -38 94 73 21 -27 41 27 -5 150 -79 54 -76 -54 77 -182 -162 117
7832 117 -44 64 364 232 -257 -207 140 -83 -271 -19 -97 -44 116 -17 5 -135 -176 -42 -291 -73 -110 20
7854 20 412 -53 191 -215 120 55 12 253 -267 90 -384 23 -141 -413 -110 -22 -58 119 -118 -16 -147 160
7876 160 6 221 94 -39 -81 -93 1 -143 101 -115 165 19 -51 -188 103 61 258 -127 9 -95 83 108
7898 108 168 -207 99 74 -8 -78 133 72 6 -41 -128 -9 95 -68 22 -33 -3 106 -111 -79 200 -63 31 -62 -192
7923 -192 178 268 98 -115 77 -14 58 97 186 -136 115 105 -195 12 90 -344 -92 63 -107 40 -158 111
7945 111 -171 -198 316 -293 17 151 102 -154 -7 -108 -105 16 -262 -121 -322 110 -491 311 128 -57 -49 100
7967 100 195 223 167 -48 126 -149 -81 -63 24 -144 27 36 101 -8 55 -106 36 322 -87 -78 101 -211 12 -212
7991 -212 -98 -76 -11 -1 -9 -13 -217 -246 -103 81 -124 11 -117 -155 -181 -66 -9 163 81 179 -246 -261 170 -411 133
8016 133 187 -280 -137 124 184 -85 251 56 43 -159 59 123 -265 -124 5 -71 52 -26 -259 -76 225 -107
8038 -107 63 205 -316 -1 -94 170 50 -252 78 -55 247 6 -112 -77 -23 -176 124 -18 13 36 63 213
8060 213 79 305 50 96 111 -161 138 -151 0 22 6 -147 121 -184 304 83 24 338 150 41 -169 -144
8082 -144 91 -297 209 76 84 103 171 245 -214 -118 204 378 -26 -107 -28 -13 -24 63 336 99 19 -112 83 -94
8106 -94 242 56 -9 415 -302 141 12 120 -77 139 -50 -114 -161 133 36 -432 299 40 -288 116 115 -65
8128 -65 -4 20 -167 159 -34 211 134 226 -28 -96 -106 173 -193 -269 -276 263 219 377 62 -39 23 110 -167 -131 -51
8153 -51 -118 -223 -6 -118 -233 179 -109 -170 399 93 -97 15 -36 -218 103 35 52 78 89 -66 -60 -260 -220 -73
8177 -73 204 29 -69 318 49 -59 32 -87 117 228 57 357 -33 -72
8191g2
$$ Imaginary data points
##PAGE= N=2
##DATA TABLE= (X++(I..I)), XYDATA
0 0 0 0 0 0 0 0 0 0 -6 6 -8 8 -8 9 -16 16 -22 24 -31 32 -40 47 -54 62 -71 80 -92 103 -118 133 -150 166
32 166 -188 209 -234 259 -290 321 -355 393 -434 482 -534 591 -654 728 -811 903 -1010 1137
50 1137 -1290 1472 -1700 1992 -2381 2927 -3754 5139 -7888 15427 -77942 -238943 -2847 147499
64 147499 -14566 -169344 -28955 116936 30391 -104208 -61754 24240 8508 -48644 -49663
75 -49663 -32300 -16507 1181 -3018 -36622 -32587 1841 -13747 -70351 -67241 -15637 -5596 -28960
88 -28960 -21794 -15823 -42598 -39463 802 -22203 -90797 -62209 36867 19020 -93349 -83957 42120
101 42120 53996 -67757 -104515 -11918 26605 -41860 -74405 -22462 17892 4092 -25079 -47574
113 -47574 -44944 -5264 9243 -49981 -81179 1257 64697 -17787 -98232 -14625 82419 3890
125 3890 -109843 -51353 59873 21429 -69858 -31490 52199 24653 -42979 -24060 18325 -9756
137 -9756 -39467 -5523 21258 -6842 -22977 7315 22799 -2749 -19337 -6317 6185 2380
149 2380 -6952 -11245 2964 29840 23365 -18417 -19669 32526 38290 -29549 -46469 32818 66492
162 66492 -10850 -51438 24964 74193 2324 -55742 1777 57654 12081 -37944 839 50941
174 50941 27460 -13887 -2671 26133 20518 -3127 -8009 5126 21560 23107 4644 -4604 17829
187 17829 33960 6238 -22448 1388 33246 12105 -18198 5866 40198 19879 -12766 4385
199 4385 30824 10556 -15010 4847 28646 10865 -7122 13330 30877 10378 -8678 7711
211 7711 22738 6019 -11649 1677 23687 20282 -247 -4489 14293 26310 7204 -18379 -6312
224 -6312 28839 27466 -11822 -17914 27134 45229 -266 -31369 5731 42257 11821 -29635 -7408
237 -7408 39520 31936 -10610 -14128 19381 28323 672 -17504 -125 22248 18714 310 -2294
250 -2294 12850 21232 8333 -6539 -1856 10852 10348 1982 3092 10532 10463 7548 9026 5539 -4156
265 -4156 -3287 11227 12384 -4748 -8522 14586 26902 3262 -18895 -917 25151 11884 -21284
278 -21284 -16951 20355 29950 -3742 -23293 4160 31210 8412 -28385 -18970 20411 23006 -13040
291 -13040 -23505 9646 28861 1230 -25904 -10499 14779 6505 -16937 -14185 8170 12127 -3153
304 -3153 -10114 -2385 782 -6027 -9579 -6177 -5115 -5764 -2000 2795 -2165 -10867 -8619 959 -2464
319 -2464 -16868 -17982 -692 8022 -7289 -19550 -6180 10012 -1103 -23850 -21302 1919 5635
332 5635 -14770 -23150 -3158 11842 -2326 -22053 -16094 2458 981 -17610 -21697 -4327 7481
345 7481 -3695 -16893 -10517 2761 -1531 -16451 -18247 -5130 -137 -8313 -11931 -3280 1813 -5687
359 -5687 -11361 -7453 -4710 -9622 -11078 -3973 153 -4977 -7546 -426 2893 -6248 -13659 -6438 2109
374 2109 -3056 -11471 -5882 6529 5448 -7017 -9790 1129 4911 -5974 -13202 -2613 8996 3275
388 3275 -7871 -3107 9371 6348 -8044 -9580 3185 7407 -3212 -7883 3703 12132 3403 -6429
402 -6429 -1157 7173 2246 -7459 -4724 6700 7841 28 -1172 6166 8621 510 -5067 1053 6568
417 6568 2304 -1877 2835 9908 7460 -266 -220 5992 5077 -2426 -3508 5002 8970 2689 -1101 5007
433 5007 9474 2619 -4743 -322 6623 3683 -3084 150 8725 6952 -327 -599 5496 5584 -1738 -3784
449 -3784 3366 7346 1890 -1706 3220 7721 3083 -3713 -1459 4721 3699 -2616 -1744 5968 8043
464 8043 1134 -2294 2961 6469 793 -4938 -387 6482 4464 -1671 -188 6009 5404 -1553 -3496
479 -3496 1653 4185 -42 -2982 1345 6031 3393 -1454 -341 3508 3331 -1589 -2020 3225 5615 1918
495 1918 -1075 2853 6207 2465 -1445 543 4528 3333 -963 593 5134 4655 211 123 3915 4433
511 4433 96 -1566 3012 5006 1355 -1062 2685 6381 2889 -1321 770 5136 3696 -1774 -353
526 -353 5145 5536 144 -1247 3575 5276 656 -2213 1343 4886 2558 -901 581 4337 3742 -226
542 -226 -978 1882 3293 1083 -1204 574 3136 2197 -1024 -967 1890 1736 -990 -2313 405 729 -1241
559 -1241 -2068 -590 184 -1778 -2014 -173 -511 -2746 -2644 -943 -970 -2955 -2857 -572 -304 -2768 -3678 -2496
577 -2496 -1413 -2673 -4251 -3794 -1730 -1290 -3931 -5039 -2892 -944 -3510 -6826 -4696 -1002 -1945 -6121
593 -6121 -5745 -1076 -1244 -5331 -6580 -3442 -2036 -3925 -4799 -3933 -3487 -3418 -3393 -4313 -5275 -3923 -2135 -3576
611 -3576 -5813 -4851 -1382 -2271 -4641 -4110 -1588 -1357 -4141 -4010 -2001 -1863 -3148 -2236 -1487 -2611 -2345
628 -2345 -866 -1006 -3176 -3168 -909 -298 -2741 -2816 -220 1084 -292 -2024 -1334 -20 277 -922 -2310
645 -2310 -7 2834 1934 -1847 -1009 3288 2716 -2331 -2239 3140 4588 -683 -2040 3461 5073 336
661 336 -1417 2045 3711 417 -172 2802 3161 878 1407 4138 2291 74 1264 3956 2384 -710
677 -710 951 4141 3316 664 662 2840 3432 1078 -344 1237 2773 2614 663 334 2883 3737 872
694 872 -665 1109 2667 1059 -710 1237 3527 1488 349 1804 1635 -976 -820 1941 1274 -1471
710 -1471 359 3579 1792 -2820 -1190 2912 756 -3561 -1813 2807 2042 -2830 -1438 2519 1687 -2292
726 -2292 -2427 1208 820 -1778 -1541 879 912 -865 -912 257 14 -1121 -714 -198 -111 -986 -928 543 1129
745 1129 216 -1574 -154 1769 -273 -2771 -671 2746 1693 -1982 -974 3274 1915 -2575 -1822 2525
761 2525 2063 -2053 -874 3234 2386 -1424 -268 2850 1898 -1255 -41 2898 2061 -593 739 3382
777 3382 1703 -984 384 2901 2058 -616 329 3015 2460 -183 -10 2642 3042 867 -269 1806
793 1806 3232 1468 -212 1015 2973 1997 406 824 2757 1955 -129 114 2087 1321 -179 649 2363
810 2363 1349 -425 952 1899 163 -1393 258 1670 237 -1447 401 1978 120 -1833 -462
825 -462 1048 -392 -2073 -592 686 -267 -1647 -1132 45 -323 -1700 -2001 -560 -900 -1943 -1919 -620
842 -620 -367 -2071 -1938 -722 -859 -2926 -3140 -1262 -782 -2618 -3021 -955 -224 -2591 -3510 -1247 -1022 -3032
860 -3032 -3582 -1457 -567 -2221 -2706 -1300 -1221 -2739 -3089 -1719 -1669 -2193 -1635 -892 -1516 -1886 -1210 -1236 -1705
879 -1705 -1931 -1563 -1201 -1555 -1229 -522 -617 -1264 -933 -668 -1043 -1065 -551 -313 -651 -475 321 -328 -1060 -628 708
900 708 -118 -547 30 557 274 -62 966 1235 181 174 1211 691 -114 589 1909 1379 248 937 2194
919 2194 853 -138 957 1742 584 383 1802 2257 843 815 1666 1551 -129 171 2198 1499 138 870
937 870 2837 1308 159 862 1753 635 -85 1410 1937 844 180 1251 1824 81 -492 1057 1021 261
955 261 138 1241 1123 286 -10 585 161 200 12 246 191 20 719 -95 -313 -29 -368 -787 -805 649 81
976 81 -1001 -670 388 -231 -1398 -603 415 -635 -1665 -717 409 -273 -1395 -641 557 -205 -1826
993 -1826 -590 367 -472 -1370 -443 213 -487 -1160 -241 404 -466 -1357 -561 -24 -373 -762 -268 485 -17 -314
1013 -314 -210 371 56 -399 -106 443 748 581 -113 475 478 -5 -43 403 470 474 341 543 563 520 458 655 1090
1036 1090 840 702 837 1189 929 980 1078 1753 1052 746 821 1339 1011 706 873 1349 1323 862 792 1532 1500 913
1058 913 640 1017 1352 802 529 1283 1400 1105 652 796 1048 603 444 966 923 652 633 940 698 301 340
1079 340 546 290 104 133 539 35 -232 60 323 -18 -134 -353 -42 -414 -253 -35 -305 -1220 -643 -191
1099 -191 -934 -833 -565 19 -757 -1250 -593 -365 -773 -1087 -855 -306 -862 -1420 -882 -979 -1056 -982 -684 -1096 -1164
1120 -1164 -786 -507 -1397 -1332 -676 -1077 -1417 -1427 -973 -516 -1607 -1475 -938 -849 -1189 -697 -695 -975 -971 -641 -866 -1261
1142 -1261 -984 -258 -557 -978 -886 222 -448 -1119 -742 -25 -631 -818 -104 39 -308 -768 -13 58 -452 -654
1162 -654 152 331 -182 -370 523 583 -88 -417 471 846 -463 -389 504 651 6 -94 203 618 753 331
1182 331 143 175 750 832 -32 -19 596 1025 462 87 639 872 -11 46 286 662 426 358 418 577 -63 60
1204 60 797 432 -191 273 957 585 -576 9 509 261 -520 -718 262 459 -227 -247 23 71 -24 -394 -634
1225 -634 -467 377 -14 -759 -568 172 91 -620 -859 -27 239 -274 -862 -322 -250 -331 -856 -433 -208 -272 -446
1246 -446 -595 -354 -675 -261 -479 -634 -435 -311 -71 -216 -627 -391 -253 -429 -481 -861 -288 263 41 -110
1266 -110 -337 23 21 -151 -261 89 269 181 -318 -236 381 462 432 14 242 701 615 172 115 836 975 801 644
1289 644 369 996 953 434 336 1041 1467 570 360 1196 1727 987 556 1167 1500 1220 401 650 1388 1434 796
1310 796 936 1501 1351 854 784 1486 1240 892 917 1552 1620 566 450 991 1537 320 585 1264 1837 744
1330 744 120 604 1515 1080 -459 -17 1164 1393 -48 32 928 891 -39 -209 160 590 -148 -170 183 212
1350 212 5 -232 -155 -65 -237 -331 -15 -696 -722 -473 34 -578 -779 -867 -538 -923 -992 -568 -886 -965 -1165 -769
1372 -769 -941 -466 -1143 -1137 -1060 -1269 -1139 -1217 -1087 -815 -983 -1304 -1053 -1069 -1307 -1373 -690 -772 -1352 -1612 -444 -479
1394 -479 -1661 -1923 -718 -568 -1297 -1623 -567 -213 -1022 -1813 -688 -145 -883 -1257 -412 -165 -641 -954 -649
1413 -649 -272 -781 -1182 -591 -340 -156 -736 -170 -150 -107 -475 -359 -267 -122 -139 -626 -261 261 -86 -532 199
1434 199 1182 274 -946 -279 719 759 -592 -182 841 902 -61 10 886 646 -67 110 342 812 688 908
1454 908 646 521 202 785 335 53 66 927 169 -54 601 714 610 -109 661 1026 -96 -499 519 853
1474 853 -92 -336 478 721 19 -339 697 549 -59 -279 230 403 40 -410 -225 399 -40 402 -553 -321
1494 -321 507 156 -350 -670 700 726 -427 -933 457 874 -302 -1140 189 786 -291 -869 170 652
1512 652 -752 -515 66 458 -202 -382 486 6 -167 73 390 158 -502 243 149 172 121 616 141 -272 645
1533 645 385 -206 -461 1080 972 -195 -127 1090 1179 335 -478 641 1258 252 -333 652 1166 485 217
1552 217 452 741 565 451 489 333 682 1187 285 349 968 1168 652 268 462 913 442 491 658 912 783
1573 783 757 628 882 356 378 805 875 69 253 876 798 122 102 825 689 175 -65 536 612 547 290 84
1595 84 -102 162 288 -149 -316 196 678 -261 -688 137 272 12 -1193 -397 691 112 -816 -498 -134 -70
1615 -70 -766 -695 -245 -488 -295 -644 -544 -394 -821 -604 -728 -843 -601 -651 -1066 -788 -549 -657 -878 -490 -519
1636 -519 -1120 -952 -449 -651 -1264 -1074 -530 -59 -1223 -1338 -501 -1 -734 -1868 -751 6 -913 -1172 -907
1655 -907 -237 -89 -913 -914 -327 -192 -482 -681 -449 -325 -392 -461 -401 -430 -58 -497 -529 -441 248 208 -446 -230 49
1678 49 -376 -793 -8 6 -215 -219 -107 217 -22 90 233 400 -30 -212 306 425 -84 64 499 394 265
1699 265 -71 366 352 403 423 -54 102 644 982 453 -271 516 917 587 -581 -146 770 625 -201 -305 619
1720 619 508 371 158 224 194 15 49 143 536 319 212 190 -279 487 396 143 95 -7 101 70 92 256 65
1743 65 -192 44 102 -147 -281 106 82 -77 -226 143 574 270 -601 -246 287 -47 -571 -209 51 382 -229
1764 -229 -58 -95 97 -168 -261 -465 -221 246 -116 -529 239 234 -96 -455 -132 87 125 -395 -181 447 61 -134
1786 -134 -249 81 -56 -190 -8 237 212 -91 -195 156 -95 21 373 317 211 117 364 573 199 404 15
1807 15 639 451 201 165 144 520 564 244 140 623 935 809 319 150 847 633 123 363 833 584 655 440
1829 440 755 686 172 338 434 464 729 794 427 412 668 663 222 293 313 560 522 87 381 829 421 319 299 86
1853 86 257 186 141 115 -224 115 242 49 65 64 316 -80 -507 -536 -432 -35 -318 -206 24 -129 -253 -472 -640
1876 -640 -159 26 -542 -549 -408 -356 -142 -1025 -341 -42 -547 -737 -641 -387 -206 -606 -844 -768 -893 -703 -657 -531
1898 -531 -596 -683 -418 -765 -633 -527 -646 -482 -980 -790 -580 -537 -804 -591 -616 -456 -653 -498 -182 -1122 -604
1919 -604 -326 -229 -849 -408 -487 -88 -601 -728 -189 -101 -536 -606 -481 -541 -354 -192 -358 -79 -262 -392 -156 -353
1941 -353 235 64 -265 -46 82 154 -43 33 139 -242 64 126 553 202 333 221 231 337 36 292 549
1962 549 205 411 721 230 491 593 529 546 98 -252 453 291 115 152 383 172 408 365 354 272 109 188
1984 188 223 389 -106 507 389 141 296 424 321 417 112 -46 675 273 358 304 196 468 48 -85 17
2005 17 96 149 -82 -112 44 80 -94 -139 28 -57 -31 -56 170 -56 39 -205 -273 -316 -90 -266 280 39 -196 -225
2029 -225 92 96 -330 39 284 222 -177 -110 -10 -11 -472 -254 136 -17 -45 49 316 421 -442 17 -190 189 141
2052 141 261 -160 45 156 -150 126 -179 81 213 243 42 -119 200 105 267 226 131 -71 219 460 259
2073 259 169 273 542 106 207 241 215 252 557 601 289 212 156 576 479 169 370 266 572 193 94 117 24 236
2097 236 248 428 712 -309 221 288 525 269 168 498 637 346 438 326 -60 45 22 43 -87 177 -18
2118 -18 110 47 436 47 201 143 -104 -200 -144 -31 -93 -332 -93 -35 -243 -320 -291 -263 -227 -186 -433 64 -172 -232
2142 -232 -670 -314 -13 -384 -384 16 -88 -375 -484 -331 -612 -270 -568 -573 -26 -392 -554 -298 -109 -367 -223
2163 -223 -346 -158 -304 -447 -202 -380 -582 -420 -27 -459 -543 -359 -269 -317 -304 -306 -384 81 -245 -480 -393 -164 -325
2186 -325 -269 13 -13 203 -13 147 -27 -81 -242 -272 255 225 -19 195 21 115 128 -3 83 -63 218 269 241
2209 241 94 125 2 319 -150 -138 508 241 115 59 134 415 235 556 176 21 104 276 577 295 147 413
2231 413 202 167 290 54 177 293 -88 327 33 47 251 137 321 103 133 123 134 -76 208 227 -32 -30 279
2254 279 247 -43 24 118 -101 168 -88 333 42 71 47 -57 -90 74 -347 346 -180 107 -44 -249 -229 -211 221
2277 221 -138 -157 25 6 -28 -73 -200 -152 -227 -68 -358 -381 0 -267 -62 -72 -123 102 -5 117 -62 -457 47
2300 47 -298 4 -162 -447 -237 -215 128 -119 -19 77 17 -241 -219 162 -12 74 138 236 -147 113 146 -47 -130
2323 -130 -233 424 246 -122 71 50 57 -315 -43 -69 133 -47 92 153 -186 -85 250 466 154 167 199 304
2345 304 461 241 142 200 34 537 -56 347 367 391 272 91 -107 502 110 231 270 440 21 -318 249 282
2367 282 139 347 198 268 -92 208 83 -50 -353 -124 246 196 -136 45 14 74 -194 -180 45 55 37 -147
2389 -147 10 -281 -226 -211 -144 -15 -157 12 -22 -208 -488 -315 -160 -410 -133 -82 -76 -190 -166 -59 -77 -132 -238
2412 -238 -129 -225 -121 -170 -394 -295 -178 -171 -446 -20 -370 -76 -77 -391 -169 -276 -218 -445 -233 139 -244 117 -44
2435 -44 -198 -421 -344 -207 -63 -273 -260 129 128 140 3 -192 -304 -92 184 53 203 -120 -3 -142 -113 96
2457 96 -148 7 -13 -62 -57 252 -173 -186 -239 175 122 6 -36 -162 263 312 49 20 -257 148 3 133 282 28
2481 28 148 13 127 12 242 440 254 71 305 269 99 -102 274 418 -54 286 127 -101 38 368 -5
2502 -5 345 523 -30 302 139 217 -178 103 114 142 -112 -309 86 -12 -86 -349 -66 82 -218 185 68 25 -21
2525 -21 80 -87 168 -18 -127 -234 129 -223 -18 48 -218 105 -463 -224 110 -269 99 119 24 -280 -476
2546 -476 250 -212 -166 -106 -226 37 -135 -47 -67 163 35 -155 3 38 -164 -177 99 -118 -190 45 -86 47
2568 47 74 10 -102 -190 -206 -241 -364 136 96 -68 -77 -389 86 27 -246 1 167 -1 2 297 112 367 194 254
2592 254 28 272 -156 150 19 -14 -3 249 153 303 98 96 139 -106 325 122 373 126 159 132 201 195 262 153
2616 153 70 121 23 163 410 63 77 233 105 -79 162 124 -140 197 93 -170 42 -69 292 298 5 -102
2638 -102 67 -128 -20 113 -326 -69 60 -7 1 -59 -306 38 -239 -140 78 36 -182 -203 -171 -13 -72 -158 -14
2661 -14 0 -208 -320 -245 -322 -194 -167 -375 -85 -86 -154 -63 -165 -76 -214 148 156 59 -359 -232 -47 -345 -93 -300
2685 -300 -193 -230 73 -107 -30 -161 -38 -126 -196 -116 -14 -77 -274 -142 104 42 -49 -314 6 15 -24 19 52 59 -336
2710 -336 -211 -163 -151 88 193 -35 48 159 59 72 171 63 -148 363 -270 15 -121 3 268 -10 104 56
2732 56 95 -120 92 332 234 205 -95 232 151 29 -86 364 314 79 74 272 62 -74 142 42 169 -17 126
2755 126 46 99 78 314 -5 -36 -211 319 413 -62 264 -213 334 143 70 138 216 -4 250 -8 180 -9 211
2778 211 77 -6 -3 -197 41 77 -111 3 91 63 -267 -151 224 46 52 -79 -56 139 -213 12 -12 -311 51
2801 51 -274 -279 -32 -24 -95 6 -136 104 -105 -227 -284 -104 69 -148 12 -223 -68 -21 20 -294 108 37 -284
2824 -284 -66 -309 -77 143 61 -20 67 71 187 128 -11 235 -216 -87 -179 5 63 120 -128 -93 139 216 -120 -148
2848 -148 12 68 18 98 121 102 -61 -360 109 -41 78 179 -28 231 126 -56 223 309 321 -2 155 153 92
2871 92 276 -21 -194 96 27 63 283 106 -81 -124 170 251 233 -105 38 242 80 -4 -42 42 271 59 19
2894 19 -236 46 460 90 206 223 -41 49 86 191 181 -50 -67 -172 -182 -94 -255 -115 56 112 -75 -212 -49
2917 -49 -100 -62 -53 126 -42 -290 -17 -124 179 -6 -23 -103 -52 102 40 21 -82 200 14 114 -201 -161 -354 127
2941 127 8 -54 82 190 -196 -72 -131 117 101 -118 58 -22 -134 -16 65 -343 -132 -233 -237 -145 -18 -226 -264
2964 -264 -209 234 -43 -6 -222 -29 -81 -343 -231 59 -60 -250 215 -158 111 -77 127 9 340 -241 61
2985 61 108 64 186 -25 36 335 334 275 88 -142 215 -22 -27 29 -167 21 131 80 156 74 78 266 -212 -25 -41
3010 -41 117 -92 -46 133 -186 21 -445 86 -151 222 157 122 92 -82 283 242 -183 504 59 46 247 -12
3032 -12 80 -242 -248 -52 2 -183 -162 -11 -369 56 2 -10 48 -56 49 161 -52 199 -4 -170 -139 -139 -145 -348 -92
3057 -92 -26 97 -32 -177 -347 -285 -110 59 -77 -196 -194 -134 -8 -121 -273 94 81 -42 -28 -147 129 175 224
3080 224 179 35 -185 181 -215 -250 64 277 -132 -237 -136 59 162 -196 359 198 25 135 -219 -53 13
3101 13 183 -38 13 54 -101 163 -54 35 150 54 -32 -112 157 -70 13 259 -130 -29 -90 144 -38 116 11
3124 11 -202 71 -167 -236 125 -14 10 326 67 65 -173 395 211 56 409 -143 2 -147 43 67 45 -58
3146 -58 -52 -15 138 -114 96 -174 -41 -383 -346 -71 -8 14 244 164 -112 317 33 85 119 -3 43 -219 245 81
3170 81 25 -87 -271 111 55 -103 187 -120 -89 -100 -101 -49 168 -436 158 -41 -314 67 -19 234 -119 134 187
3193 187 -211 38 13 -84 -133 -100 -103 -282 53 -255 -392 -158 71 -232 52 122 -27 52 -87 124 -130 -41 -92
3216 -92 226 -96 248 -174 -125 -14 -377 57 -272 105 -61 33 -60 -165 104 157 -17 -109 165 33 -44 -79 20
3239 20 302 311 180 77 -70 -35 186 -45 163 -34 239 -338 -135 120 -142 3 -94 77 8 112 -38 13
3261 13 260 -70 30 70 -69 130 -45 -114 66 62 47 190 -48 346 -12 -63 -2 -92 68 -215 147 -197 0
3284 0 127 40 2 160 -98 -72 323 141 -50 79 -64 -466 -8 -231 205 -58 -35 25 -34 91 94 -98 -176 124
3308 124 82 -29 -31 123 13 94 106 -147 -43 -81 24 209 -91 -88 58 102 72 -169 -63 149 23 -185 24
3331 24 -6 170 -204 -253 49 -115 348 25 -313 250 -136 -159 4 152 -29 59 218 -23 -291 31 41 142
3353 142 110 -160 179 -270 74 -116 223 -4 278 -82 201 98 60 193 -156 63 -149 204 172 114 -135
3374 -135 32 384 -279 20 -22 -100 171 197 132 82 61 -46 -32 -60 8 -10 342 273 40 -146 -295 -37 164 193
3398 193 -451 3 138 187 -122 36 -41 -360 -197 -105 68 115 38 17 58 149 20 -223 -53 -29 94 -207 -100
3421 -100 123 55 -90 -12 -20 -62 -102 163 52 140 21 19 -24 -140 -313 -188 -28 -69 48 12 -24 335 156 244 227
3446 227 40 84 -209 110 108 123 29 -69 291 68 -60 30 219 -94 -117 313 -90 -134 -78 -147 -198 -239 26 -168
3470 -168 17 -55 58 -32 -77 168 158 -79 -94 -26 171 -36 -51 81 -152 137 -268 74 228 122 76 413 -328
3493 -328 -146 -123 308 -162 -49 216 499 115 164 113 35 -88 120 -105 50 -2 190 120 160 -79 -285 -103
3515 -103 -85 -79 242 -56 -152 273 95 44 106 272 249 -357 -101 -58 -48 0 -110 -109 119 -96 -151 3 95 4 -258
3540 -258 -174 49 -21 -24 109 -156 17 131 -212 107 -90 -164 -10 -25 252 -176 -158 -63 -152 -22 -10 10 51 -22
3564 -22 133 36 372 -105 123 49 -21 -35 -173 -236 153 86 118 154 -251 158 42 -213 81 -168 33 -3 -4 -47
3588 -47 -10 210 -145 14 -6 97 226 61 265 90 284 -42 -122 -34 15 127 276 -181 -119 1 -187 -316
3610 -316 -16 -28 -14 385 88 43 -44 86 -237 -88 285 -88 -168 -100 -16 -121 -268 40 81 -187 298 -27 -23
3633 -23 182 -48 -53 -48 -69 57 91 132 144 -87 -214 -297 -178 -137 -97 102 -72 -278 -180 195 -15 -236 -152 28 -8
3658 -8 -88 -13 -97 146 -226 -77 -29 -80 12 -33 -23 18 -61 -97 289 -75 -168 -151 237 -360 98 -57 -215 143 -249
3683 -249 -144 26 164 52 -82 -190 -61 240 69 -148 -24 -89 -114 -168 -186 41 -45 81 -44 142 111 -141
3705 -141 -51 105 -193 -37 14 -16 371 119 194 183 6 273 152 -122 140 -65 -82 -81 137 -432 58 29 -271
3728 -271 -159 243 -37 93 -133 -107 -34 95 -74 14 37 273 148 -54 384 -33 7 213 232 69 5 195
3750 195 39 -191 213 210 -44 -61 -40 0 196 155 -176 -35 294 26 -32 -178 -57 118 -63 -184 55 -47
3772 -47 54 299 -38 -197 111 31 119 110 180 120 26 113 237 88 57 61 265 198 -138 126 -162 194 -99 -304
3796 -304 25 99 211 16 -38 56 0 201 -254 219 -43 -13 154 96 -207 227 131 -105 -103 -58 13 -36 -56 -30 -95
3821 -95 -189 -279 -267 28 -173 227 -263 226 -10 40 -485 -72 19 -86 151 49 -73 376 -33 4 97 -3 -149
3844 -149 70 57 -23 170 -276 136 127 -384 8 538 129 -2 -112 -234 94 40 11 192 -30 -64 -201 -375
3866 -375 232 9 -168 -81 -41 86 -125 243 -37 -74 -32 105 161 75 -7 -32 106 -5 -32 193 45 88 -17
3889 -17 -48 343 -95 102 39 83 33 -267 -223 -132 -266 -103 119 43 -64 76 -63 348 -152 -131 -46 15 122 -37
3913 -37 132 -275 102 -36 -219 303 179 -261 52 -112 216 -150 -41 -48 -73 -16 11 119 209 -90 169 -98
3935 -98 -84 74 283 179 -223 26 -174 -182 -274 -92 -113 17 79 127 -245 -366 100 -179 4 -66 -115 100 -102
3958 -102 -52 -34 241 -117 -67 80 -189 -280 -96 -144 145 264 142 198 54 -113 59 204 138 -89 -95 91 -170
3981 -170 66 -195 45 335 313 224 249 -83 -39 -135 197 -215 -17 111 294 15 77 111 63 -50 -69 75 121
4004 121 -59 -236 127 94 -196 -12 71 -113 -124 -10 182 98 126 -150 148 251 65 188 104 285 305 -69
4026 -69 121 -236 117 -46 -115 25 -26 336 -39 -49 4 -104 330 49 106 -122 -62 231 186 -217 -105 193 -240
4049 -240 21 126 -17 -72 -170 151 -70 236 390 -44 -215 -212 -356 -154 11 -40 347 72 28 20 173 223 106
4072 106 -163 229 285 -367 -253 -384 -165 -172 -111 -249 -93 47 -87 -361 177 146 -230 -266 113 -283 -111 98
4094 98 -15 -312 -216 67 -204 -160 25 -210 -60 -13 -75 -116 1 124 47 120 -395 117 -13 257 -41 1 126
4117 126 -76 106 -156 -57 84 218 -8 88 270 262 60 60 119 -117 139 256 150 189 -84 -8 39 -136 241
4140 241 130 -55 152 -196 73 -23 -20 -94 165 271 186 -314 129 6 -170 135 -92 -197 -28 -16 -74 -154 -4
4163 -4 -55 -41 -84 -104 -114 -146 -36 -310 -190 6 -125 87 274 52 125 -258 -160 54 -133 72 -243 101 -272
4186 -272 15 -42 -130 400 144 125 73 -100 41 -10 113 -142 9 353 138 43 -137 -112 -83 -13 -202 -91 139
4209 139 32 49 -233 -33 -21 -114 102 36 -126 157 -102 17 -239 -59 179 608 -165 25 -254 -85 -107 183
4231 183 -204 -103 -174 -4 71 13 161 -153 151 130 84 76 -92 182 -201 66 117 121 29 -59 -150 79 30 93 -245
4256 -245 -1 -130 261 -177 39 -60 146 390 -123 63 16 66 -117 36 163 -28 -336 -267 167 104 -42 16
4278 16 -248 129 -143 95 -47 -15 -77 108 338 76 230 -65 -261 261 22 89 -373 67 -112 210 304 3
4300 3 -246 63 -174 -96 172 -137 -269 -239 -6 -42 -79 -221 84 -279 -150 -114 102 55 -212 -77 6 -47 82
4323 82 8 -387 301 -145 137 8 17 -31 -45 -84 119 51 -133 -19 -73 118 -170 -64 152 -315 1 -245 -68
4346 -68 -314 -81 -154 73 -103 -264 177 -125 208 201 -132 -362 362 -48 -279 -197 237 -132 195 109 45 350
4368 350 -199 195 16 -190 127 187 -76 118 262 247 -109 52 -108 110 -293 -84 79 -163 -26 384 328
4389 328 -20 83 283 4 49 -91 -120 241 183 86 -250 21 -211 -240 -95 -91 -45 -270 90 -27 -116 133 -15
4412 -15 -330 -190 51 -76 54 -150 -170 73 2 53 -70 -357 -135 -127 -201 -63 -96 29 119 -315 17 -291 42
4435 42 -200 -57 81 -75 -273 73 -28 -53 79 64 11 95 -248 -180 -232 -225 -272 -57 -14 -306 -109 -88 39 -217
4459 -217 -146 7 -143 -42 -86 -176 -24 54 129 -61 196 -188 -198 -91 -179 -134 -155 -188 -64 107 45 102 99 45 -106
4484 -106 149 -99 -111 161 208 -225 150 -235 130 87 -72 -21 -120 -55 -51 251 -186 -3 -226 30 -134 148 295
4507 295 19 -182 -153 55 -103 -109 26 209 -26 -176 63 -201 -13 233 -124 -92 101 -226 -52 185 157 222
4529 222 115 -105 10 162 349 -148 253 -31 -126 68 -54 -76 -198 -394 -34 30 -205 46 -68 68 -108
4550 -108 28 6 -44 -56 143 41 177 6 31 -6 208 197 255 299 90 77 -21 160 46 -59 -112 -350 43 -86
4574 -86 -198 173 29 -257 -158 16 -103 45 110 36 -152 -113 77 -64 153 254 -364 271 32 4 96 190 -230
4597 -230 125 -73 -156 44 -165 -402 -69 -247 53 -74 263 -171 -15 -151 -36 67 31 19 -43 -163 -67 -49
4619 -49 58 -141 25 -52 120 22 -6 28 -100 -109 169 291 178 -137 7 115 193 -32 -91 141 -80 -178 107
4642 107 217 150 -422 21 -91 -74 31 -60 12 -350 49 117 -4 -307 -7 -78 124 273 -280 -84 35 -32
4664 -32 153 54 -61 172 -138 -247 -64 -132 280 53 86 -156 93 -164 266 -23 -194 -29 -22 69 -173 54
4686 54 49 176 176 -165 329 -8 -49 -66 6 114 -126 155 -124 -6 17 -170 5 201 113 27 -1 -140 -177 174
4710 174 0 69 -235 -158 65 -297 -105 -57 -348 -63 -189 7 194 -79 -257 -299 -100 -204 151 75 -111 106
4732 106 54 145 196 -98 -78 259 113 42 -142 -34 37 -41 -150 -101 -110 52 136 -117 -61 24 146 -254 -32 -33 114
4757 114 -72 152 -51 -57 -138 36 315 391 286 47 47 12 54 -28 -87 -91 -328 -84 80 161 -89 177 310 162
4781 162 -9 -139 25 98 125 -172 -35 110 36 -418 -192 -25 -65 292 -11 115 176 -35 -16 285 84 -96
4803 -96 14 37 -73 -103 25 190 -14 10 -51 210 -43 92 92 47 62 152 -114 -75 -27 -30 -38 -230 133 -85 99
4828 99 -85 18 110 -156 -20 -108 147 77 35 -198 -143 -171 55 -21 225 -186 -158 -356 -474 16 -298 72 -137
4851 -137 29 7 195 -283 114 -77 202 11 8 -9 -42 -10 196 -147 -245 -212 46 -208 146 214 108 -124 208
4874 208 -106 -300 27 -5 132 -149 16 -142 -187 -191 91 311 132 -116 -222 5 394 -111 37 -41 57 -105
4896 -105 -197 173 33 227 -72 28 74 0 -34 88 70 -309 -214 56 -99 66 215 118 -330 68 70 276 31
4919 31 -49 -55 -254 180 -13 360 30 -182 478 88 197 248 -133 61 251 130 301 -70 362 73 275 87
4941 87 -27 -48 41 151 -302 -9 -119 -84 -177 -194 -203 37 -194 70 -18 -53 -138 -62 38 -21 33 -111 22 77 13
4966 13 -155 -297 -348 81 38 28 16 139 -1 10 171 -6 122 89 47 -314 -70 306 -25 -5 -29 -299 -98
4989 -98 -58 -247 142 54 -112 -152 -246 245 60 96 65 62 -107 -54 -166 -25 -149 -229 188 -87 331 96 -37 13
5013 13 -298 -108 -141 -98 -124 -181 130 398 161 18 -69 121 23 -405 -55 17 -138 -226 203 -140 -169 -139 160 -17
5037 -17 209 142 -99 76 32 256 87 -104 -15 -66 -27 156 20 98 31 -53 131 -377 56 176 231 90 -4 48
5061 48 106 455 -79 192 324 222 93 69 71 -173 147 -18 -25 -39 152 279 -26 -181 -169 249 62 -215 -38
5084 -38 -41 201 271 1 76 140 -16 -112 -92 348 -29 1 -30 -78 65 23 -259 -416 -49 42 -297 -236 86 -69 22
5109 22 -106 64 -29 140 3 -18 13 1 -102 -11 -110 -183 79 174 -40 232 243 66 -182 266 31 -123 60
5132 60 193 -5 -343 158 55 29 -243 -57 76 118 -14 -183 -81 38 -2 69 -216 -36 -33 99 -190 -319
5154 -319 176 261 -146 262 -270 -89 30 154 64 75 -120 56 266 214 488 58 -35 45 60 29 -15 -234 57
5177 57 -223 251 -15 108 -142 -194 -30 3 94 68 -49 209 -129 -44 300 -144 67 31 -172 250 -8 -51 -120
5200 -120 -153 -112 -212 -243 -44 14 222 -149 -241 97 176 233 -135 -176 -93 12 64 263 -2 44 -111 130 -174 102
5224 102 58 -181 -26 -204 -34 168 -230 -131 -192 -87 -10 -349 -128 150 -31 -3 -39 -222 -334 241 -66 -34
5246 -34 68 -58 -80 -112 -133 -95 -311 -108 135 -70 -97 7 -97 -394 -449 -236 -117 -77 -6 195 -26 -49 135
5269 135 84 -74 51 145 44 132 -167 27 -187 -98 174 254 10 -9 203 -135 -2 -133 222 -50 26 123 228
5292 228 -2 131 117 43 -140 100 -106 -176 102 74 92 -201 273 -44 171 146 103 10 333 255 19 272 -84
5315 -84 319 -78 346 197 86 168 248 -98 -49 -20 167 83 -5 -22 1 240 -40 169 174 255 -68 -153 -171 -64 19
5340 19 -123 80 251 23 0 128 4 -87 -20 195 -108 -181 -241 1 42 -58 -108 -260 -133 -19 101 160 -162
5363 -162 -125 -131 -368 -216 -33 -66 -97 -264 -36 -104 -19 -118 -92 -164 36 185 -65 321 316 15 -126 -55 -305 -100
5387 -100 86 87 -297 34 -58 117 131 -25 152 98 -326 -110 -47 -70 -261 -5 21 -35 208 72 28 266 -171
5410 -171 57 -81 -80 -225 2 178 69 -135 167 295 -146 -203 276 3 9 -8 127 270 93 44 235 163 -123
5433 -123 59 191 145 272 193 97 62 68 42 63 208 150 228 -23 11 -30 -20 326 -225 -23 -184 -214 211 205 45
5458 45 -28 222 -210 -54 -112 -54 -32 118 73 44 112 -132 -329 -121 -301 231 108 -274 -59 343 25 12 120
5481 120 11 10 -3 -115 -4 184 -69 -126 125 35 -185 49 -219 59 -116 -211 29 -144 187 -290 -62 -105
5503 -105 -81 150 -193 -91 64 -51 -231 40 -423 68 -41 269 51 -6 -213 -147 326 -170 -65 -142 -100 49
5525 49 253 58 -10 -80 12 -388 45 19 -10 96 -23 120 -70 3 -125 181 175 281 -79 29 -83 170 226
5548 226 141 252 -24 37 128 -335 -105 256 -387 -35 -26 -93 -8 87 3 13 297 68 194 84 -106 -10 -312 -313
5572 -313 26 204 -13 466 -64 102 192 144 109 -74 143 -170 7 248 1 366 178 -112 42 -140 223
5593 223 -254 246 81 -26 -281 173 -7 119 -31 65 -80 -3 17 -24 -57 -45 27 -86 123 59 11 230 -170
5616 -170 -104 3 102 -3 -399 432 -177 100 -207 -42 -52 20 10 52 132 34 -44 -207 260 -257 30 -116 -217
5639 -217 43 -122 44 98 136 -100 19 -219 46 173 -53 -133 -25 50 212 130 193 -157 25 89 111 1 -262
5662 -262 -276 -97 -165 120 52 -244 -342 -6 -39 325 141 -10 255 54 103 -15 -242 68 86 -111 -161 102 -186
5685 -186 56 62 -162 60 112 92 146 164 -28 112 192 124 153 -57 -99 -219 -48 -76 275 -42 90 132 271 -59
5709 -59 -33 -6 59 -220 115 -99 -14 -74 238 146 17 159 86 331 -81 213 -85 -165 -51 -1 150 -256 -36
5732 -36 247 -176 -49 177 -267 -56 42 -108 173 189 -121 279 -9 76 151 -2 186 80 -311 -26 -123 183
5754 183 169 104 346 -204 3 -435 -47 -258 -271 -244 -147 -103 -307 39 -436 202 82 -70 -52 -112 10 243 -165
5777 -165 -279 15 -158 -80 78 -324 -8 -17 16 -66 -212 252 -198 -47 -30 -42 241 221 -67 -34 -124 278 259 245
5801 245 213 95 17 268 98 139 224 -342 -73 172 35 227 -22 342 13 20 245 -19 139 85 20 -103 95
5824 95 128 -52 -90 -167 -146 281 109 12 -382 -85 -47 118 200 -227 203 266 49 -46 -33 193 126 26 85 -96
5848 -96 -112 -107 -119 178 25 101 289 -203 228 73 21 264 35 -81 -18 -19 -100 -34 159 15 136 -24 41 -85
5872 -85 -179 -44 31 14 -75 86 22 66 -32 -148 -277 -2 -8 65 -138 -143 -7 9 -440 383 -65 188 -403 -31 -19
5897 -19 19 13 -17 -83 16 -310 101 145 -103 28 317 36 226 63 -26 165 93 215 37 108 39 94 -192 -212 29
5922 29 45 -225 -34 -163 93 3 202 -38 308 34 -36 -280 -176 -197 15 20 202 -95 30 -13 -41 -111 238
5945 238 75 30 117 -146 211 -143 -150 70 179 -105 65 28 66 60 -69 -210 -128 49 117 -42 21 -22 172 -206
5969 -206 -124 148 83 -56 6 423 4 -206 189 -141 322 57 24 -25 85 -186 65 -92 167 -90 -56 49
5991 49 18 0 131 -78 -36 135 -290 152 249 -54 149 -45 -87 231 65 197 -30 137 -108 153 -119 294
6013 294 23 -10 225 -288 -121 -176 -106 -68 -391 -51 0 -411 -215 -274 -3 -74 -184 45 86 17 -179 -74 242
6036 242 -144 -280 -30 4 -205 -2 -78 274 252 -330 -27 -92 12 27 170 -155 14 372 14 294 -196 -360
6058 -360 -69 -85 160 212 23 41 312 147 147 312 88 14 9 42 207 -34 177 84 -131 -78 216 -34 -43 334
6082 334 -19 229 150 14 178 -83 67 -80 127 153 76 119 -100 4 84 -89 -35 -41 216 -137 93 161 96
6105 96 118 39 593 52 -202 24 132 236 93 118 -3 415 89 286 -31 71 241 36 497 203 -120
6126 -120 -287 180 43 -178 -117 -152 -125 -109 100 -429 -21 84 109 -117 -96 266 -235 -245 79 -272 65 -114
6148 -114 -247 -267 144 154 -428 -13 70 -31 21 -15 -195 -117 -94 37 -176 -159 52 -221 8 -141 -62 -223 -449
6171 -449 -473 29 -47 28 111 -47 -221 87 133 238 -13 -20 -108 -399 7 -67 -163 16 -67 -222 -21 -90 171 2
6195 2 -201 -62 -16 -6 256 142 -54 -70 -179 -195 140 107 -98 -253 -130 57 234 322 32 -176 -122 3 205
6218 205 331 143 -13 15 25 137 -84 55 -181 121 -192 373 -355 19 145 -118 66 -23 127 150 337
6239 337 151 157 78 258 398 49 192 -111 -48 1 214 -196 -185 203 -46 93 -251 -65 82 -10 -213 -81
6261 -81 20 69 117 167 -212 17 59 193 -9 -121 68 -218 113 -52 -192 -125 -188 41 -220 -126 138 35 -122
6284 -122 164 149 295 -336 -43 -107 -212 50 -286 -39 73 165 -165 175 -15 -122 121 -94 -135 5 -157
6305 -157 4 284 245 -98 -323 -56 64 -130 200 -8 -117 -351 86 82 -113 0 -327 -96 68 63 -14 -20 49
6328 49 272 45 -49 134 29 -45 -169 39 -31 -197 -53 55 120 96 248 150 62 53 261 130 59 107 200 232 76
6353 76 194 329 66 -41 43 194 98 -13 13 -130 346 -60 193 279 18 118 71 381 66 -9 76 -70 -426
6376 -426 -237 193 111 -335 -154 194 57 27 -12 95 213 183 350 213 46 -454 230 29 -76 -129 116 139
6398 139 88 12 -187 -206 195 -157 -513 102 -232 -159 -82 -19 -115 -191 -204 -116 199 92 -197 -105 -165 -255 -85 35
6422 35 -26 -49 -220 -32 -32 224 -202 -175 -51 26 64 187 99 107 4 0 -51 -32 -52 -228 92 -94 -40 -202 -412 28
6448 28 -192 67 152 -49 -17 -3 27 -152 234 337 -51 184 -128 141 101 12 21 -81 -205 -140 10 -11 22 269
6472 269 40 -60 302 39 161 -196 -52 146 152 -13 39 -108 -20 190 -167 177 72 122 181 106 58 28 89
6495 89 -130 260 150 88 -124 196 -230 195 -28 -157 -185 -3 -145 131 49 -178 340 165 -60 78 148 274
6517 274 -61 9 420 258 161 205 -21 134 -130 15 206 40 -112 -215 64 114 16 -287 -488 -243 66 185
6539 185 -34 55 -65 196 -163 -156 -123 -15 -4 -86 255 -282 25 -18 17 -39 46 -137 79 -327 48 60 -27 -70
6563 -70 130 -12 -283 -303 -58 -306 -74 56 -108 -106 -105 94 44 225 74 150 138 -3 -184 -343 73 51 105 -119
6587 -119 -181 30 -67 -49 -194 251 -48 57 69 -66 -77 69 -98 -237 41 13 0 3 -184 -11 -53 -42 256 126
6611 126 185 91 292 137 419 233 123 79 -33 175 390 5 -207 -134 191 -221 -83 -275 -189 110 -90 -68
6633 -68 55 -53 11 181 16 -345 -37 158 140 -20 -21 -7 -301 -110 -9 77 241 296 33 169 89 113 -99
6656 -99 27 -204 40 -45 -82 177 7 -316 -83 -191 40 2 231 -298 32 94 46 -67 15 41 -83 -111 7
6679 7 -56 -74 253 297 -78 189 -86 106 72 -115 -157 -255 -104 53 138 133 -7 -183 25 -152 176 -136 -43 -184
6703 -184 -272 28 -63 -55 34 -16 -7 191 131 -230 -262 12 47 237 -123 -131 119 -130 320 -248 -324 74 27 -300 40
6728 40 138 158 -77 25 -33 432 -10 -123 117 -119 214 54 -205 157 215 -53 -96 200 393 123 119 -93 -3
6751 -3 63 202 338 43 -161 254 114 -20 1 -316 96 188 110 -61 114 -75 146 55 -39 -222 98 -172 -79
6774 -79 -239 -153 170 70 -29 -6 -75 281 -62 147 -328 -246 -141 -23 135 -3 35 -32 247 99 318 -255 -88
6797 -88 129 -35 -25 -66 66 48 -69 122 -206 -47 47 -97 -69 -113 -566 -76 -164 -251 -25 -170 -28 -202 176
6820 176 -303 -96 -65 -12 -84 171 219 19 -296 78 -214 -41 -122 44 31 -56 121 110 101 -143 151 -167 153
6843 153 6 -129 110 -177 -26 79 -131 169 -50 291 313 -100 79 125 95 -200 301 43 234 93 -56
6864 -56 27 141 2 87 174 -85 117 -187 202 226 -173 272 38 92 -58 -43 133 140 -112 163 30 112 98 64
6888 64 91 139 -6 208 35 162 -130 -42 -180 18 122 -9 86 -139 242 -303 13 -47 -77 -17 0 285 281 -155
6912 -155 25 72 37 191 -108 -30 25 115 -245 10 -361 -151 -150 -66 -243 20 45 3 -112 127 -149 -258 -280 90
6936 90 198 235 -293 -117 15 -183 -85 -187 14 64 -122 -19 53 264 -94 -129 -123 -292 61 -1 -77 204 -256
6959 -256 -148 -10 -17 -178 121 -94 -88 77 59 28 80 165 119 46 -114 255 -190 -109 -159 -240 162 -252 217 89
6983 89 34 -7 51 -105 -99 -102 42 148 -20 -58 215 368 -119 19 127 289 -119 193 -130 74 -252 -49 524
7006 524 36 -128 213 -214 123 -89 340 -57 -180 -30 -77 124 -170 -36 -30 -157 174 225 -265 -308 205 153
7028 153 -99 25 -187 210 183 186 123 -50 -217 -177 25 -117 -64 -154 81 80 55 125 -3 52 -198 -48 -301 20
7052 20 -305 159 410 -66 -563 -167 -7 -52 -68 -21 39 -471 -217 -522 147 -262 69 -190 42 -219 -212 99
7074 99 -76 18 61 -88 -301 22 -108 181 224 -174 -25 -220 -145 16 32 11 -69 361 -167 33 -388 91 107
7097 107 -195 -257 -223 30 198 -159 21 117 -166 34 28 54 143 48 79 -23 -46 20 248 12 301 146 300 -161
7121 -161 119 -124 150 295 -131 116 205 57 -35 150 76 -32 138 -6 -110 63 88 195 -14 71 3 -70
7143 -70 -240 204 165 54 -141 -176 -36 63 43 321 23 -205 106 165 65 -47 17 110 199 103 150 166 -100 152
7167 152 -360 231 -148 152 81 -79 -62 159 100 -359 117 -114 -80 -139 99 -77 -189 -163 136 104 -28 -310
7189 -310 -27 -31 38 258 79 254 -32 -386 -95 -249 -101 -70 -81 41 -169 81 -234 163 -16 -152 -86 94
7211 94 5 -120 133 -180 35 -113 90 -23 -205 49 36 125 -134 -112 -7 115 -14 -125 -46 142 271 159
7233 159 -60 290 -15 252 -105 -126 196 -121 -62 24 270 222 -34 347 75 6 371 -36 114 296 94 56
7255 56 -122 -156 163 -89 -91 105 287 178 -42 -58 80 36 30 144 88 77 -130 71 19 300 307 224 -171 -26 -19
7280 -19 164 162 6 47 -263 335 38 25 46 130 193 -78 119 66 226 65 190 138 157 78 239 81 62 -187
7304 -187 -121 -4 -88 71 252 102 54 -113 -63 55 -294 75 45 229 -121 116 -47 -80 -280 -101 94 -116
7326 -116 129 -169 -362 -83 -125 -11 -113 -156 -37 -54 87 89 30 308 163 154 -149 98 -330 104 124 242 141
7349 141 174 -117 -4 133 12 168 -110 139 -12 64 4 392 -238 -195 51 140 126 -195 411 58 189 399
7371 399 29 250 144 48 29 -463 -27 -77 194 -193 -167 -4 307 -172 -123 25 28 -57 123 -7 1 -207 -204 49
7395 49 -353 247 149 399 264 10 85 279 -8 17 30 -127 117 28 194 87 -9 329 -192 -170 177 -115 -117
7418 -117 -225 194 193 -71 19 169 269 4 -239 -271 154 -116 26 128 -149 42 -213 308 5 125 -13
7439 -13 24 150 -299 192 339 -60 -32 -99 -7 25 14 -52 58 -67 30 -127 13 -156 -43 192 -327 46 -316
7462 -316 302 -62 -303 -56 -201 139 25 144 -77 220 -170 66 -373 156 106 68 -96 -50 -22 67 143 288
7484 288 180 25 160 -175 -261 48 55 -95 -71 50 -183 109 -264 146 -360 175 5 200 159 -169 -10 -60
7506 -60 -137 -29 -81 -212 91 128 -108 124 267 194 51 -163 56 47 177 -2 193 27 103 -182 37 -53 238
7529 238 190 -81 70 118 151 -56 206 -39 -101 -10 -204 -134 233 90 145 -168 108 -68 153 -97 215 -181
7551 -181 -145 28 73 -150 -223 81 314 88 91 28 83 43 -204 -279 -165 -134 -345 -181 17 46 -6 44 -125 -75 -142
7576 -142 -157 -102 -125 -403 159 58 199 -92 -91 75 -166 84 -40 7 45 -373 -30 -89 221 -84 -113 -139 -235 168
7600 168 -49 -190 341 -62 -52 -69 9 65 -78 136 82 172 -138 -156 108 121 217 -20 -362 -12 106 114 271 43
7624 43 51 102 125 72 -141 -32 -199 -38 -189 130 50 103 112 -43 30 146 54 142 81 41 2 240 31 -241 -368
7649 -368 -70 3 117 -36 174 171 374 161 84 -163 97 158 108 -13 -53 -131 -74 138 -12 -196 14 158 -15
7672 -15 155 71 -25 29 -344 23 116 -56 127 -75 -158 140 137 -90 -51 -379 321 74 221 -96 -54 19 -132 123
7696 123 19 104 -274 217 -71 214 66 264 192 -88 2 -36 347 266 29 217 -72 -4 -105 -121 64 79 -94
7719 -94 125 112 -182 -263 -235 69 61 307 -285 -328 42 -176 -93 -113 -26 12 292 13 -193 -228 -126 -113 -221 -45
7743 -45 -44 -142 -70 -11 15 196 174 -181 -102 -74 107 -156 -101 3 -228 -121 177 -217 67 -74 -136 218 139 147 -16
7768 -16 -22 236 134 50 -52 214 -177 8 176 195 266 -38 432 1 314 -32 88 133 -61 280 146 -127
7790 -127 86 -30 137 328 -115 80 9 -299 98 11 -235 71 89 -165 -40 -137 14 -71 71 248 -112 25
7812 25 93 -156 64 64 83 42 118 -260 15 169 -115 -192 88 7 -2 145 -95 13 -125 85 -3 -42 1 -177 -208
7837 -208 357 -39 416 267 -111 140 233 -73 79 226 -9 131 -17 56 135 209 -30 -99 115 113 197 -96 86
7860 86 -28 145 80 -119 -204 232 43 -250 232 -73 -124 -159 -137 60 -17 -3 176 64 -166 43 -236 -73 157
7883 157 -134 6 -187 97 -98 -16 -197 -86 95 39 179 174 137 -131 -26 -24 98 378 180 244 -108 20 43
7906 43 222 31 23 -49 -88 -47 -25 144 -77 406 -24 116 44 -78 234 -25 79 362 -67 73 -10 284 219
7929 219 142 -70 -227 85 120 307 -70 88 -151 -204 -467 -230 207 105 5 -173 -169 50 36 169 121 146 -137
7952 -137 4 -167 -32 -228 135 52 -103 -62 -234 -63 -122 -168 90 160 22 -44 150 39 71 -191 313 -16
7974 -16 -106 223 233 -136 -230 247 -133 89 -209 82 156 -115 17 -28 43 136 -196 181 -190 -156 -83 154 -61
7997 -61 238 323 64 -74 103 -68 46 167 -239 83 -345 -138 -41 35 42 -9 28 -19 133 -31 -118 15 -48 -76
8021 -76 -70 -53 89 -72 -77 214 -85 172 107 36 100 64 72 -88 -202 -81 -180 14 -48 154 229 157 179 40 -124 -130
8047 -130 -112 12 227 21 116 -103 51 -10 86 133 238 -1 -16 -19 92 -127 42 342 259 426 -154 318 129
8070 129 -43 -214 -37 77 -155 72 33 176 123 42 -166 -232 -19 -118 -242 -181 -78 102 54 -377 130 47 121
8093 121 -194 -94 164 -157 21 -110 -95 43 -171 227 -408 77 -179 142 69 115 139 172 -4 -79 87 -116
8115 -116 41 197 235 -268 -216 -21 48 -102 10 -108 -6 88 -151 31 -25 -61 -293 -204 -213 73 -236 -60 258
8138 258 -79 -25 -76 -415 172 -39 -79 210 -133 59 181 64 114 314 120 -129 -184 -182 -126 -21 162 -32 -214
8161 -214 79 -50 69 -152 -28 -55 -53 117 211 -19 41 106 -97 -182 -233 -14 220 182 -15 122 75 107 43 116
8185 116 19 -171 159 160 73 -20
8191b0
##END NTUPLES=NMR FID
##END=
