##TITLE=1H_PR159_oil
 D2O, 8 sc, 
 30.4.2019
##JCAMPDX= 6.0         $$ Bruker NMR JCAMP-DX V2.0
##DATA TYPE= NMR FID
##DATA CLASS= NTUPLES
##ORIGIN= UXNMR, Bruker Analytische Messtechnik GmbH
##OWNER= root
$$ XWIN-NMR		Version 3.5
$$ Tue Apr 30 14:18:26 2019 Russian Standard Time (UT+4h)  she@DPX200
##.OBSERVE FREQUENCY= 200.1315
##.OBSERVE NUCLEUS= ^1H
##.DELAY= (6, 6)
##.ACQUISITION MODE= SIMULTANEOUS
##.ACQUISITION SCHEME= undefined
##.AVERAGES= 8
##.DIGITISER RES= 18
##SPECTROMETER/DATA SYSTEM= spect
##.PULSE SEQUENCE= zg30
##.SOLVENT NAME= D2O
##.SHIFT REFERENCE= (INTERNAL, D2O, 0, 15.7039)
##AUDIT TRAIL= $$ (NUMBER, WHEN, WHO, WHERE, WHAT)
$$ ##TITLE= Audit trail, XWIN-NMR		Version 3.5
$$ ##JCAMPDX= 5.01
$$ ##ORIGIN= Bruker BioSpin GmbH
$$ ##OWNER= she
$$ F:/spectra/data/she/nmr/H-F/1/audita.txt
$$ ##AUDIT TRAIL=  $$ (NUMBER, WHEN, WHO, WHERE, WHAT)
(   1,<2019-04-30 14:17:17.89 +0400>,<she>,<DPX200>,
      <created by zg, POWCHK disabled, PULCHK disabled
       configuration hash MD5:
       00 E9 B6 7A A2 85 ED C7 34 08 36 98 17 FE 4E 26
       data hash MD5: 16K
       FB 0B 99 0D 50 B2 93 BC 55 9D 0F 8D 9E BC 0E A9>)
$$ ##END=
$$ 
$$ hash MD5
$$ 75 6D 38 BF 3D 45 26 60 99 7C B2 C3 90 8A 91 47
##$RELAX= 
##$RELAX= 
##$RELAX= 
##$RELAX= 
##$RELAX= 
##$RELAX= 
$$ Bruker specific parameters
$$ --------------------------
##$DU= <F:/spectra>
##$EXPNO= 1
##$NAME= <H-F>
##$PROCNO= 1
##$TYPE= <nmr>
##$USER= <she>
##$AMP= (0..31)
100 100 100 100 100 100 100 100 100 100 100 100 100 100 100 100 100 100 
100 100 100 100 100 100 100 100 100 100 100 100 100 100 
##$AQSEQ= 0
##$AQ_mod= 1
##$AUNM= <au_zg>
##$AUTOPOS= <>
##$BF1= 200.13
##$BF2= 200.13
##$BF3= 200.13
##$BF4= 200.13
##$BF5= 200.13
##$BF6= 200.13
##$BF7= 200.13
##$BF8= 200.13
##$BYTORDA= 1
##$CFDGTYP= 0
##$CFRGTYP= 5
##$CHEMSTR= <none>
##$CNST= (0..31)
1 1 145 1 1 1 1 1 1 1 1 1 1 1 1 1 1 1 1 1 1 1 1 1 1 1 1 1 1 1 1 1 
##$CPDPRG= <>
##$CPDPRG1= <>
##$CPDPRG2= <>
##$CPDPRG3= <>
##$CPDPRG4= <mlev>
##$CPDPRG5= <mlev>
##$CPDPRG6= <mlev>
##$CPDPRG7= <mlev>
##$CPDPRG8= <mlev>
##$CPDPRGB= <>
##$CPDPRGT= <>
##$D= (0..31)
0 1.2 0 0 0 0 0 0 0 0 0 0.03 0 0 0 0 0 0 0 0 0 0 0 0 0 0 0 0 0 0 0 0 
##$DATE= 1556619437
##$DBL= (0..7)
120 120 120 120 120 120 120 120 
##$DBP= (0..7)
150 150 150 150 150 150 150 150 
##$DBP07= 0
##$DBPNAM0= <>
##$DBPNAM1= <>
##$DBPNAM2= <>
##$DBPNAM3= <>
##$DBPNAM4= <>
##$DBPNAM5= <>
##$DBPNAM6= <>
##$DBPNAM7= <>
##$DBPOAL= (0..7)
0.5 0.5 0.5 0.5 0.5 0.5 0.5 0.5 
##$DBPOFFS= (0..7)
0 0 0 0 0 0 0 0 
##$DE= 6
##$DECBNUC= <off>
##$DECIM= 24
##$DECNUC= <off>
##$DECSTAT= 4
##$DIGMOD= 1
##$DIGTYP= 9
##$DL= (0..7)
0 120 120 120 120 120 120 120 
##$DP= (0..7)
150 150 150 150 150 150 150 150 
##$DP07= 0
##$DPNAME0= <>
##$DPNAME1= <>
##$DPNAME2= <>
##$DPNAME3= <>
##$DPNAME4= <>
##$DPNAME5= <>
##$DPNAME6= <>
##$DPNAME7= <>
##$DPOAL= (0..7)
0.5 0.5 0.5 0.5 0.5 0.5 0.5 0.5 
##$DPOFFS= (0..7)
0 0 0 0 0 0 0 0 
##$DQDMODE= 0
##$DR= 18
##$DS= 0
##$DSLIST= <SSSSSSSSSSSSSSS>
##$DSPFIRM= 0
$$ [...]
##$SUBNAM2= <"">
##$SUBNAM3= <"">
##$SUBNAM4= <"">
##$SUBNAM5= <"">
##$SUBNAM6= <"">
##$SUBNAM7= <"">
##$SUBNAM8= <"">
##$SUBNAM9= <"">
##$SW= 24.9337058887773
##$SWIBOX= (0..15)
0 0 2 0 0 0 0 0 0 0 0 0 0 0 0 0 
##$SW_h= 4990.01996007984
##$TD= 16384
##$TD0= 1
##$TE= 0
##$TE2= 300
##$TE3= 300
##$TEG= 300
##$TL= (0..7)
0 120 120 120 120 120 120 120 
##$TP= (0..7)
150 150 150 150 150 150 150 150 
##$TP07= 0
##$TPNAME0= <>
##$TPNAME1= <>
##$TPNAME2= <>
##$TPNAME3= <>
##$TPNAME4= <>
##$TPNAME5= <>
##$TPNAME6= <>
##$TPNAME7= <>
##$TPOAL= (0..7)
0.5 0.5 0.5 0.5 0.5 0.5 0.5 0.5 
##$TPOFFS= (0..7)
0 0 0 0 0 0 0 0 
##$TUNHIN= 0
##$TUNHOUT= 0
##$TUNXOUT= 0
##$USERA1= <user>
##$USERA2= <user>
##$USERA3= <user>
##$USERA4= <user>
##$USERA5= <user>
##$V9= 5
##$VALIST= <valist>
##$VCLIST= <CCCCCCCCCCCCCCC>
##$VD= 0
##$VDLIST= <DDDDDDDDDDDDDDD>
##$VPLIST= <PPPPPPPPPPPPPPP>
##$VTLIST= <TTTTTTTTTTTTTTT>
##$WBST= 1024
##$WBSW= 4
##$XGAIN= (0..3)
0 0 0 0 
##$XL= 0
##$YL= 0
##$YMAX_a= 427845
##$YMIN_a= -497193
##$ZGOPTNS= <>
##$ZL1= 120
##$ZL2= 120
##$ZL3= 120
##$ZL4= 120
##$ABSF1= 10
##$ABSF2= 0
##$ABSG= 5
##$ABSL= 3
##$ALPHA= 0
##$AQORDER= 0
##$ASSFAC= 0
##$ASSFACI= 0
##$ASSFACX= 0
##$ASSWID= 0
##$AUNMP= <proc_1d>
##$AZFE= 0.1
##$AZFW= 0.1
##$BCFW= 1
##$BC_mod= 2
##$BYTORDP= 1
##$COROFFS= 0
##$CY= 11.3945322036743
##$DATMOD= 1
##$DC= 2
##$DFILT= <>
##$DTYPP= 0
##$F1P= 18.9103706918063
##$F2P= -1.10871071338519
##$FCOR= 0.5
##$FTSIZE= 0
##$FT_mod= 4
##$GAMMA= 1
##$GB= 0.15
##$INTBC= 1
##$INTSCL= 1
##$ISEN= 128
##$LB= 0.24
##$LEV0= 0
##$LPBIN= 0
##$MAXI= 10000
##$MC2= 0
##$MEAN= 0
##$ME_mod= 0
##$MI= 1.114404
##$NCOEF= 0
##$NC_proc= 0
##$NLEV= 6
##$NOISF1= 3.799351
##$NOISF2= 2.8
##$NSP= 1
##$NTH_PI= 0
##$NZP= 0
##$OFFSET= 15.70392
##$PC= 1
##$PHC0= -8864.93
##$PHC1= 25.00026
##$PH_mod= 1
##$PKNL= yes
##$PPARMOD= 0
##$PSCAL= 0
##$PSIGN= 0
##$REVERSE= no
##$SF= 200.130013532006
##$SI= 16384
##$SIGF1= 3
##$SIGF2= 2
##$SINO= 400
##$SIOLD= 16384
##$SREGLST= <1H.CDCl3>
##$SSB= 0
##$STSI= 0
##$STSR= 0
##$SW_p= 3612.71676300578
##$SYMM= 0
##$S_DEV= 0
##$TDeff= 0
##$TDoff= 0
##$TI= <>
##$TILT= no
##$TM1= 0
##$TM2= 0
##$TOPLEV= 0
##$USERP1= <user>
##$USERP2= <user>
##$USERP3= <user>
##$USERP4= <user>
##$USERP5= <user>
##$WDW= 1
##$XDIM= 8192
##$YMAX_p= 0
##$YMIN_p= 0
$$ End of Bruker specific parameters
$$ ---------------------------------
##NTUPLES= NMR FID
##VAR_NAME=  TIME,          FID/REAL,        FID/IMAG
##SYMBOL=    X,             R,               I
##VAR_TYPE=  INDEPENDENT,   DEPENDENT,       DEPENDENT
##VAR_FORM=  AFFN,          ASDF,            ASDF
##VAR_DIM=   8192,          8192,            8192
##UNITS=     SECONDS,       ARBITRARY UNITS, ARBITRARY UNITS
##FACTOR=    0.0002004,     1,               1
##FIRST=     0,             0,               0
##LAST=      1.6414764,     0,               0
##MIN=       0,             -497193,         0
##MAX=       1.6414764,     427845,          0
$$ Real data points
##PAGE= N=1
##DATA TABLE= (X++(R..R)), XYDATA
$$ [...]
$$ plain form
3071 -10135 -14776 -12118 -3704 6882 13809 14884 8842 -1314 -11075 -15962 -13371 -4845 6048 13241
3085 13241 14996 8930 -1833 -11590 -16283 -14021 -5514 4886 13122 14853 9239 -344 -10442 -15478
3099 -15478 -13759 -5275 5038 12735 14738 9770 540 -9247 -14074 -12047 -4159 5507 13099 14590
3113 14590 9917 633 -8748 -13115 -11239 -3604 6010 13027 14218 8696 -322 -8843 -13967 -11687 -3866
3128 -3866 5902 12727 13499 8173 -1555 -10876 -15211 -12688 -4310 5424 12817 13776 8039 -2091 -10919
3143 -10919 -15587 -13451 -5064 5127 12728 14483 8890 -339 -9945 -14976 -13137 -5219 5194 13191
3157 13191 14740 9993 684 -8631 -13713 -12045 -4695 5008 12738 14576 10057 1200 -7768 -12903 -10946
3172 -10946 -4010 4974 12072 13316 8789 282 -8419 -13078 -11741 -4297 4942 11799 12715 7579 -959
$$ packed form
3071a0135m641K658Q414J0586O927J075o042j0156r761m887K591Q526J0893P193
3085A3241J755o066j0763r757m693K262Q507J0400Q236J731n614r583j0098n036
3099a5478J719Q484J0313P697K003m968r230r787m827K027P888R666P592J491
3113A4590m673r284r381m367J876P635R614P017J191n522r018q521n124K280P821
3128c866R768O825P72n326r728r321m335K523Q378R734P393R59n737j0130q828
3143a0919m668K136Q387J0191P601J755n593r229r606n031J839P918J0413P997
3157A3191J549m747r309r315n082J668P350R703P730J838m519q857q968n135J957
3172a0946O936Q984P098J244m527q507q701m659J337P444R239O857R16n136q538
$$ plain form
3187 -959 -9429 -14141 -11813 -4418 5010 11622 12736 7331 -1416 -10132 -14462 -12561 -4770 4964 12258
3202 12258 13727 8776 -55 -9588 -13894 -12246 -4640 5281 12770 14205 9750 888 -8213 -12830 -11110
3217 -11110 -4567 4909 12043 14219 9719 1080 -7627 -12583 -11287 -4410 4223 11139 13037 8763 397
3232 397 -8114 -12831 -11554 -4860 3869 10604 11972 7781 -696 -8778 -13163 -11539 -4826 3568 10606
3247 10606 11891 7265 -1252 -9257 -13339 -11425 -4150 4959 11236 12923 8228 -325 -8786 -13011 -11193
3262 -11193 -3688 5269 12221 14029 9293 532 -7974 -12320 -11254 -4500 4464 12065 14004 9364 1379
3277 1379 -7236 -12576 -11286 -5305 3819 10791 12242 8698 677 -7543 -12054 -11384 -5377 2955 9790
3292 9790 11419 7414 -199 -7914 -12298 -11200 -5115 3194 9585 11222 7018 -418 -8205 -12199 -10351
$$ packed form
3187i59q470m712K328P395R428O612J114n405q747q716m330J901P791R734P294
3202A2258J469m951q831r533m306J648P606R921P489J435m455q862r101m617J720
3217a1110O543R476P134K176m500q639q707m956J296O877Q633O916J898m274q366
3232C97q511m717J277O694Q729O735J368m191q477q082m385J624O713Q394P038
3247A0606J285m626q517q005m082J914P275R109O277J687m695q553q461m225J818
3262a1193P505Q957O952J808m736q761q506m346J066O754Q964P601J939m640p985
3277A379q615n340J290N981R124O972J451l544q021q220m511O70O007Q332O835
3292I790J629m005p613p715m384J098O085Q309O391J637m204p436p787l994J848
$$ plain form
3307 -10351 -4345 3983 11017 12128 7690 -256 -7941 -12017 -10349 -3860 4815 11610 13042 8774 554
3322 554 -7478 -12127 -11016 -4219 4676 11450 13315 9092 810 -7594 -12093 -11282 -5243 3387 10241
3337 10241 11919 8498 573 -7279 -12321 -11347 -5734 2209 9202 11234 7831 571 -7497 -11892 -10797
3352 -10797 -4953 2532 8765 11059 7571 160 -7410 -11214 -9999 -4155 3947 9773 11310 7643 303
3367 303 -7253 -11157 -9617 -3490 4467 11126 12269 7797 296 -7352 -11504 -10010 -3667 4427 10951
3382 10951 12651 8365 825 -7373 -11783 -10852 -4746 3399 10110 11807 8088 415 -7430 -11862 -11343
3397 -11343 -5408 2048 8695 11022 7666 162 -6879 -11118 -10920 -5522 2433 8628 10615 7219 454
3412 454 -6051 -10361 -9789 -4390 3529 9293 10822 7604 1126 -6039 -10120 -8760 -3065 4299 10198
$$ packed form
3307a0351O006Q328P034J111m438p946p685m076J668O489Q675O795J432m268q220
3322E54q032m649J111O797Q895O774J865m223q282q404m499Q11O039Q630O854
3337A0241J678l421p925p852n042R74N613P943O993K032l403p260q068m395J095
3352a0797N844P485O233K294l488p411p570l804J215N844Q102N826J537l667p340
3367C03p556l904J540O127P957O659J143m472p501p648m152J494O343Q094O524
3382A0951J700m286p540q198m410R31O106Q145O711J697l719p673p845m432N19
3397a1343N935P456O647K327l356p504p041m239J98N398P955O195J987l396o765
3412D54o505m310N72N399P919N764J529l218o478p165m081J360N695P364N899
$$ plain form
3427 10198 11613 7682 573 -6629 -10459 -9124 -3515 4324 10125 11204 7570 302 -6917 -11454 -10583
3442 -10583 -4644 3140 9115 11119 7713 729 -7327 -11867 -10804 -5015 2510 8632 10830 7876 512
3457 512 -6734 -10554 -10377 -5396 2045 8457 10525 7851 1516 -5305 -9942 -9864 -4544 2799 8857 10478
3473 10478 8241 1332 -5873 -9710 -8436 -2958 3469 8888 10739 7335 627 -6081 -9606 -8929 -4055
3488 -4055 3052 9133 10592 6954 364 -6932 -11145 -10319 -4849 3098 8637 10461 7078 172 -7135
3503 -7135 -11351 -10046 -4763 2555 8331 10508 7230 688 -6155 -10370 -9847 -5032 1961 8403 10604
3518 10604 7866 1070 -4990 -9652 -9331 -4315 3013 8649 10237 7790 1764 -4968 -8833 -8420 -3764
3533 -3764 2761 8283 9956 7214 1030 -5668 -9272 -8415 -3776 2708 8363 9832 6403 -7 -6428
$$ packed form
3427A0198J415l931p109p202l830J335N609P839N801J079l634p268p219m537Q71
3442a0583N939P784N975K004l406o984q056m540J063N789P525O122K198k954p364
3457E12p246l820J77M981P441O412K068k674o335o821m637P8N320P343O058J621
3473A0478k237o909p205l837J274N478O427N419J851l404o708o708l525O77M874
3488d055P107O081J459l638o590p296m213Q26N470P947N539J824l383o906p307
3503g135m216J305N283P318N776K177l278o542o843m215N23M815O993O442K201
3518A0604k738o796o060m662L21N016P328N636J588k447o026o732l865M13M656
3533c764O525N522J673k742o184o698l604Q57M639O484N655J469l429o410o421
$$ plain form
3548 -6428 -10138 -9243 -4101 2926 8363 9524 6228 -125 -6977 -10593 -9535 -4543 2435 8411 9765
3563 9765 7027 697 -5914 -9875 -9837 -4724 2718 8748 10606 7795 1503 -5109 -9330 -8687 -3829 2815
3579 2815 8378 9910 7745 1779 -4738 -8659 -8423 -3829 2408 7723 9511 6877 1279 -5104 -8770
3594 -8770 -8312 -3817 2002 7547 8893 5634 -90 -5694 -9256 -8790 -3976 2052 7196 8841 6124
3609 6124 -28 -6237 -9713 -8995 -3873 2530 8212 9621 6704 155 -5556 -9546 -9144 -4012 2352
3624 2352 8444 10180 7642 1712 -4634 -9015 -8429 -3936 2530 7999 10088 7765 1572 -4816 -8334
3639 -8334 -8142 -3995 1977 7575 9000 6857 1123 -4382 -8664 -8683 -4476 1429 6762 8247 5900 256
3655 256 -5598 -9065 -8254 -3766 2092 6562 8331 5697 17 -5715 -8941 -8112 -3910 2220 7446 8842
$$ packed form
3548f428l710Q95N142P027N437J161l296o353o852l616J058M992O978N976J354
3563I765k738o330o611l961L8N113P442O030J858k811o292o612m221O43M858O644
3579B815N563J532k165n966o517l921K36M594O237N315J788k634n598o383l666
3594h770M58M495N819N545J346l259n724n604l562M66M814O028N144J645k717
3609F124o152o209l476P18N122O403N682J409k917o549n711l990M02N132O364
3624B352O092J736k538n930o346m381N86M493O466N469K089k323o193o388l518
3639h334J92M147N972N598J425k143n734n505m282j9M207N905N333J485k347n644
3655B56n854l467Q11M488N858M470J769k634n680n732l226Q29M202O130N226J396
$$ plain form
3671 8842 5950 744 -5201 -8855 -8492 -3561 3224 8080 9767 7282 1472 -4818 -8595 -8373 -3446
3686 -3446 2469 7583 9793 7572 1688 -4552 -8121 -8113 -4408 1582 7208 8934 6549 1439 -4579 -8136
3702 -8136 -8388 -4382 1094 6407 7742 5725 849 -5031 -8528 -8157 -4272 1289 5868 7909 5855
3717 5855 514 -5040 -8170 -7247 -3792 2214 6965 8505 5833 872 -4806 -7999 -7667 -3380 2832
3732 2832 7608 9296 6603 1455 -4772 -8171 -7442 -3347 2480 7473 9474 7146 1295 -4688 -8238
3747 -8238 -8327 -4234 1735 6946 8680 6507 1313 -4666 -8017 -8579 -4951 1195 5707 7423 5722 1130
3763 1130 -4460 -8118 -7926 -4333 1158 5642 7522 5680 885 -4504 -7489 -7117 -3307 1638 6560
3778 6560 8071 5584 1009 -4388 -7357 -6744 -2772 2720 7178 8422 5841 1290 -4425 -7826 -7190
$$ packed form
3671H842k892n206n945l654L63M931O785M856J687k485n810o290l777K22M927
3686c446N915N114K210k221n884o240l569QL705N990N626J726k385n110o018l557
3702h136k52M006N476N313J335k017m876n880l497L71L885N561M579K041k054
3717E855n341n554l130R23L455O006M751J540k672m961n678l193L32M287O212
3732B832M776J688k693n148o227l399P29M095N827M993K001k328n851n983l550
3747h238q9M093N969N211J734k173n194n979l351n62L628O146M512J716j701m592
3763A130n590l658J92L593N491M484J880j842m795n389k985L72L810M945M922
3778F560J511k487m575n397k969O13L972N492M458J244k581m551n715l401O36
$$ plain form
3793 -7190 -3119 2276 7116 8470 5997 984 -4858 -8047 -7651 -4040 1467 6542 8259 6287 938
3808 938 -4350 -7816 -8407 -4703 1116 5877 7529 6008 1255 -4037 -7695 -7981 -4297 1016 5218 7432
3824 7432 5685 1586 -3682 -6985 -6207 -3507 1619 6006 7802 5656 692 -3654 -6571 -6224 -2773
3839 -2773 2239 6219 7918 5657 1056 -3675 -7072 -6539 -2619 2396 6455 8295 5707 931 -4471
3854 -4471 -7297 -7343 -3644 1659 6273 7615 5541 853 -4604 -7994 -8022 -4298 1073 5605 7633 5830
3870 5830 1039 -3883 -7582 -7332 -4093 1007 5440 7432 5803 1534 -3031 -6375 -6627 -3554 1328
3885 1328 5769 7605 5299 1595 -3097 -6293 -6121 -3130 2167 5955 7258 5392 1050 -3733 -6691
3900 -6691 -6267 -3116 1934 5891 6964 5016 606 -4211 -7336 -6958 -3656 1489 5662 6955 5079
$$ packed form
3793g190M071N395M840J354k473n013n842l189L96L611N507N075J717j972n349
3808I38n288l466n91L704N819M761J652j521m753n292l658k86L684N313M202K214
3824G432j747m099n268l303P78K700N126M387J796k146m964m346k917L47L451
3839b773N012L980J699k261m601m731l397N33L920N015M059J840k588m776n402
3854d471k826m6L699N303M614J342k074m688n457l390k8L724N371M532K028j803
3870E830m791m922l699K50L239N100M433J992j629m269m565l344k52L073M882
3885A328M441J836k306l704m692l196J72K991N297L788J303j866m342m783k958
3900f691M24L151N050L957J073j948m410m817l125L78L302N145M173J293j876
$$ plain form
3915 5079 607 -4572 -7702 -7166 -3997 1176 5493 7343 5332 997 -4043 -7221 -7119 -3696 627
3930 627 5608 7472 5710 1854 -3023 -6389 -6511 -3384 1373 5363 7227 5935 1814 -2726 -5938
3945 -5938 -6022 -2843 1275 5395 7014 5046 1320 -3570 -6110 -6332 -2940 1460 5231 6592 4818 728
3961 728 -4016 -6703 -6453 -3542 1430 5467 6488 4432 726 -4169 -7228 -6852 -3610 1324 5230 6684
3977 6684 4998 763 -3912 -6779 -6655 -3503 1031 5978 7363 5778 1491 -2992 -5742 -6101 -3349
3992 -3349 1047 5138 7190 5906 1979 -2629 -5528 -5736 -3102 1004 5006 6787 5214 1364 -2966
4007 -2966 -6011 -6044 -3095 1039 4436 6460 4535 607 -3279 -6221 -6074 -3480 930 4792 6190 4094
4023 4094 144 -4041 -6802 -6369 -3182 1156 5496 6434 5127 733 -3591 -6288 -6236 -2930 1591 5268
$$ packed form
3915E079m472n179l130N36L169N173M317J850k011m335n040l178J02L423M323
3930F27M981J864j762l856m877l366j22L127M757L990J864j292m121m540l212
3945e938q4L179M118M120J619j968l726m890k540k22L392M400L771J361j774m090
3961G28m744k687K50K911M972M037J021k056l706m895l059L76L242M934L906J454
3977F684j686m235m675k867J24L152M534M947J385j585m287m483k750l59K752
3992c349M396M091K052j284l927m608k899k08K634M106M002J781j573l850m330
4007b966l045l3K949M134L397K024j925l928l886k942J47K594M410L862J398k096
4023D094l950m185k761M33L187M338M340R38j307m394m324k697N2L306M521L677
$$ plain form
4039 5268 6983 5386 1483 -2759 -5968 -6234 -3026 1484 5633 7191 5494 1508 -2428 -5798 -5936
4054 -5936 -3038 1008 4899 6174 5081 1495 -2843 -5717 -5700 -3156 510 4208 5552 4548 963
4069 963 -3492 -5985 -6010 -3019 870 4302 5328 3842 341 -3345 -6053 -5825 -2797 1082 4699 6082
4085 6082 4492 902 -3328 -6011 -5861 -2851 1606 5106 6841 5387 1320 -3018 -5841 -5884 -3262 1413
4101 1413 5086 6661 5195 1601 -2505 -5554 -5688 -3363 951 4491 5933 4933 1275 -2855 -5619
4116 -5619 -5740 -3351 254 3734 5309 4328 781 -3175 -5412 -5824 -3638 606 3668 4903 3872 682
4132 682 -2905 -5182 -5802 -2735 1211 4459 5814 4488 1225 -2886 -5621 -5329 -2258 1401 5034 6248
4148 6248 4835 1111 -2839 -4932 -4969 -3050 1546 4998 6330 5179 1541 -2779 -5642 -5783 -3295 799
$$ packed form
4039E268J715j597l903m242l209k66L208M510M149J558j697l986l936l370j38
4054e936K898M046L891J275j093l586m338k874J7K544L666L698J344j004l585
4069I63m455k493k5K991L889L432J026j486l501l686k708K28L028L879L617J383
4085F082j590l590m230k683J50L010M457L500J735j454m067m338k823m3K622M675
4101A413L673J575j466l594m106l049j34K325M314L540J442j000l658m130k764
4116e619j21K389L605L480J575r81l547l956k237m12K186M244L062J235j031l190
4132F82l587k277o20L067L946L248J355j326l263m111k735K92L071L659L633J214
4148F248j413l724l950k093l7J919M596L452J332j151l638m320k863j41K488M094
$$ plain form
4164 799 4212 6108 4585 1055 -2869 -6013 -6007 -3629 299 3812 5021 4163 1087 -2677 -5466 -5736
4180 -5736 -3754 303 3906 5255 3748 850 -2602 -4812 -5288 -2626 1034 4224 5733 4323 957
4195 957 -2757 -4584 -4826 -2447 1447 4682 5934 4756 1096 -2820 -5255 -4888 -2574 1411 4503 5963
4211 5963 4703 1331 -2738 -5740 -5360 -3149 634 4048 5693 4348 1086 -2868 -5561 -6081 -3701
4226 -3701 -98 3841 5292 3994 1072 -2589 -5161 -5143 -3270 363 3519 5014 4327 1424 -2421 -4584
4242 -4584 -4679 -2464 619 3817 5009 4003 1310 -2205 -4079 -4238 -2371 1201 4275 5310 4030 1379
4258 1379 -2429 -4776 -4601 -2102 1369 4471 5282 3962 768 -2772 -4982 -5038 -2909 934 3843 5424
4274 5424 4091 654 -3010 -5419 -5669 -3472 582 3900 5201 3817 1189 -2561 -4875 -5328 -3267
$$ packed form
4164G99L413J896j523l530l924l144OK378L928L513J209q58l076l764k789k70
4180e736J982M057L603J349j507k898l452k210m76K662L660L190J509j410l366
4195I57l714j827k42K379L894L235J252j178l660l916k435L67K314L985L092J460
4211E963j260l372m069l002L80K211L783L414J645j345l262l954k693n20K380
4226c701L603L939J451j298k922l661k572J8J873L633L156J495o87k903l845k163
4242d584r5K215L083L198J192j006k693l515j874j59J867L572L074J035j280k651
4258A379l808k347J75K499L471L102Q11j320l194l540k210n6K129L843K909J581
4274E424j333l437l664k409k50K197M054L318J301j384k628l750k314m53K061
$$ plain form
4289 -3267 480 3613 4864 4261 1448 -1920 -4571 -4715 -2688 604 3465 5495 4439 1310 -1999
4304 -1999 -4238 -4261 -2370 977 3848 5159 3532 1359 -1985 -3972 -4395 -2136 1130 3865 4584 3830
4320 3830 1024 -2566 -5242 -4807 -2689 756 3817 4951 3607 296 -2618 -5204 -5173 -2963 338 3572
4336 3572 4888 3791 929 -2188 -4800 -5063 -3182 369 3615 4585 4275 1790 -1894 -4552 -4543 -2497
4352 -2497 413 3468 5376 4047 1522 -1881 -3568 -4207 -2398 777 3746 4660 4060 1264 -1638 -4109
4368 -4109 -4192 -2285 670 3199 4177 3410 497 -2475 -4395 -4466 -2252 470 3535 4515 3231 372 -2779
4385 -2779 -4913 -4997 -2842 493 3617 4710 3781 1008 -2371 -4637 -4869 -2904 448 3627 4887 3936
4401 3936 1274 -1965 -3870 -4624 -2811 258 3441 4975 4094 1781 -1126 -3489 -4414 -2725 288 3223
$$ packed form
4289c267L747L133J251o03k813l368k651j44K027L292K861K030j056l129l309
4304a999k239k3J891L347K871J311j627k173l344j987m23K259L266K735P19p54
4320C830k806l590k676M35K118L445L061J134j344l311k914k586L1K210L301L234
4336C572J316j097k862l117k612k63J881L551L246R70l10k485l684k658RK046
4352b497K910L055J908j329k525l403j687o39J809L175K969R14o00k796k902k471
4368d109q3J907K955K529R78p67k913k972j920p1K214K722L065R80j284k859l151
4385b779k134q4K155L335L124J093r29k773l379k266k32J965L352L179J260r51
4401C936k662l239j905p54J813L069L183J534q81k313k907k363r25J689L013K935
$$ plain form
4417 3223 4746 3786 1255 -1755 -4094 -4394 -2634 605 2644 4214 3179 777 -2086 -4254 -4566 -2538
4433 -2538 167 3091 4017 3196 495 -2757 -4390 -4281 -2378 773 3649 4621 3273 868 -2283 -4387
4449 -4387 -4601 -2295 762 3657 5026 3843 1311 -2274 -4083 -4135 -2339 361 3469 4718 4011 1734
4465 1734 -1624 -3634 -3986 -2520 323 3433 4158 3437 1205 -1535 -3865 -4315 -2476 181 2625 3649
4481 3649 3358 1194 -2062 -4061 -4236 -2139 288 2584 3876 2987 451 -2335 -3874 -3880 -2377 269
4497 269 3035 4196 3290 746 -2152 -3732 -3705 -1953 711 3608 4545 3486 907 -1988 -3794 -4032
4513 -4032 -2528 833 3539 4669 3951 1271 -1538 -3700 -3989 -2713 244 2959 4162 3691 909 -1638
4529 -1638 -4018 -4212 -2656 -165 2521 3606 3219 1000 -1787 -3887 -4257 -2623 53 2244 3543 2549
$$ packed form
4417C223J523r60k531l010k339l00J760L239K039J570j035k402k863k168l12K028
4433b538K705K924R26q21k701l252j633J09J903L151K876R72j348k405l151k104
4449d387k14K306L057K895J369j183k532l585j809n2J796K700L108J249p07k277
4465A734l358k010l52J466K843L110P25p21k232k740k330m50J839K657K444J024
4481C649k91k164l256j999j75K097K427K296J292q89k536k786j539oJ503K646
4497B69K766J161r06k544k898j580K7J752K664K897R37j059k579k895j806k38
4513d032J504L361K706J130p18k680k809k162k89J276K957K715J203m71k782k547
4529a638k380j94J556K491K686J085l87k219k787k100l70J634K676K191J299r94
$$ plain form
4545 2549 842 -2019 -3807 -3697 -2228 463 3166 4294 3445 897 -1708 -3678 -3527 -2159 921 3541
4561 3541 4433 3516 973 -1553 -3599 -3556 -2068 969 3471 4355 3816 1673 -1829 -4194 -4134 -2256 609
4578 609 2860 4055 3593 980 -1812 -3864 -4082 -2480 -43 2435 4092 2972 1103 -1580 -3561 -3920
4594 -3920 -2476 -40 2472 3121 3149 1010 -1547 -3508 -3603 -1976 149 2610 3844 3202 1021 -1734
4610 -1734 -3054 -3294 -1937 750 3209 3951 3370 1288 -1664 -3514 -3297 -1736 848 3395 4088 3171
4626 3171 1116 -2011 -3555 -3913 -2178 272 3104 3903 3152 917 -1877 -3838 -4127 -2661 -65 2329
4642 2329 3591 3094 773 -1376 -3544 -3930 -2345 -71 2280 3405 2972 1149 -1241 -3229 -3311 -2261
4658 -2261 259 2352 3641 2815 1197 -1074 -2977 -3306 -1628 831 3139 4160 3440 942 -1642 -3345
$$ packed form
4545B549j707k861j788J10J469K691K703J128q49k548k605j970J51J368L080K620
4561C541Q92r17k543k526k046M3J488L037K502Q84n39k143l502k365O0J878K865
4578F09K251J195m62k613k792k052k18J602K437K478J657j120j869k683j981l59
4594c920J444K436K512O49K8k139k557j961r5J627K125K461J234o42k181k755
4610a734j320k40J357K687K459P42n81k082k952j850K17J561K584K547O93r17
4626C171k055l127j544l58J735K450K832P99p51k235k794j961k89J466K596K394
4642B329J262m97k321k149k168l86J585K274K351J125m33j823k390j988q2J050
4658b261K520K093J289q26j618k271j903l29J678K459K308J021p20k498k584j703
$$ plain form
4674 -3345 -3207 -1694 703 3214 3753 3028 581 -2015 -3760 -3724 -2009 310 2875 3758 2854 207 -1909
4691 -1909 -3759 -4090 -2364 323 2535 3571 3277 673 -1543 -3683 -3852 -2316 -194 1889 3924 3067
4707 3067 1128 -1214 -3187 -3217 -2158 193 2305 3460 3125 1261 -1136 -2637 -3314 -1474 250 2501
4723 2501 3478 2804 987 -1168 -2896 -2656 -1941 594 2721 3504 2783 618 -1727 -3244 -3222 -2126 557
4740 557 2541 3143 2600 312 -1978 -3594 -3968 -2048 202 2247 3554 2739 615 -1896 -3503 -3599 -2626
4757 -2626 311 2546 3608 3118 1159 -1126 -2853 -3258 -1977 454 2122 3939 3049 1034 -789 -2393
4773 -2393 -2959 -1718 389 2327 3546 2943 1112 -1453 -2600 -3213 -1888 535 2240 3105 2664 259
4789 259 -1734 -3181 -3227 -1734 431 2522 2910 2222 536 -1906 -3367 -3516 -2183 440 2340 3227 2457
$$ packed form
4674c345J38J513K397K511N39p25k447k596j745L6J715K319K565Q83r04k647k116
4691a909j850l31J726K687K212J036k94k604k216k140j69J536K122K083K035q57
4707C067j939k342j973l0J059K351K112J155l35j864k397j501o77J840J724K251
4723B501R77o74j817k155j728K40P15K535K127P83p21k165k345j517K2J096K683
4740E57J984O02n43k288k290j616l74J920K250K045J307q15k124k511j607r6R73
4757b626K937K235J062m90j959k285j727m05J281K431J668J817q90k015j823j604
4773b393n66J241K107J938J219o03j831k565j147o13J325K423J705Q65m41k405
4789B59j993j447m6J493K165K091L88o88j686k442j461j49J333K623J900Q87p70
$$ plain form
4806 2457 614 -1790 -3374 -3483 -2230 274 2577 3482 3098 1083 -1270 -3288 -2849 -1913 472 2515
4822 2515 3692 3240 1296 -903 -2549 -2910 -1739 296 2022 3321 2766 666 -1206 -2649 -3036 -1832
4838 -1832 4 2047 2515 2383 404 -1375 -3062 -2780 -1984 149 2206 2596 1916 336 -1855 -3211
4854 -3211 -3014 -1776 -113 2625 3009 2297 360 -1416 -2912 -3096 -1919 161 2531 3539 2868 1282
4870 1282 -941 -3237 -3268 -1725 389 2452 3459 3067 978 -1261 -2432 -2940 -1789 18 2195 3286
4886 3286 2459 725 -998 -2527 -3320 -2227 -68 1590 2583 2438 588 -1095 -2895 -3142 -1645 -138
4902 -138 1772 2673 2095 322 -1572 -2915 -2501 -1758 74 1718 3083 2079 495 -1171 -2803 -2934
4918 -2934 -1443 443 2471 3260 2459 877 -1221 -2886 -2802 -1568 778 2503 3233 2864 1078 -1183
$$ packed form
4806B457j843k404j584j09J253K504K303R05l84k015k353k018M39R36K385K043
4822B515J177m52j944k199j646l61J171K035J726J299n55k100j872j443l87J204
4838a832J836K043M68j32j979j779j687K82P96K133K057L90o80j580k191j356
4854c211J97J238J663K738L84p12j937j776j496j84J177K080K370J008o71j586
4870A282k223k296l1J543K114K063J007l92k089k239j171n08J151J807K177J091
4886C286q27j734j723j529p93J093K159J658R93j45j850j683j800k47J497J507
4902a38J910R01n78j773j894j343M14P43J832J644J365j004j584j666j632j31
4918b934J491J886K028P89q01j582k098j665Q4J234K346J725P30l69j786k261
$$ plain form
4934 -1183 -2462 -2584 -1633 -93 2019 3045 2430 938 -985 -2548 -3168 -2048 38 1650 2640 2272
4950 2272 1002 -1140 -2523 -2735 -2135 411 1555 2164 2368 610 -1113 -2446 -2945 -1518 317 1802
4966 1802 2792 2337 610 -1155 -2295 -2495 -1467 925 2579 2954 2231 654 -1136 -2759 -2577 -1333
4982 -1333 646 2207 3312 2648 747 -1174 -2719 -2925 -1710 330 2183 2928 2623 334 -1307 -2543
4998 -2543 -3255 -1866 190 1926 2424 1959 731 -1314 -2661 -3058 -1895 -290 1632 2542 1853 809
5014 809 -1112 -2484 -2778 -1306 263 1631 2801 2132 595 -1001 -1614 -2235 -1107 697 1681 2864
5030 2864 2152 739 -1210 -2215 -2316 -1302 482 2077 2889 2190 733 -1507 -2495 -2723 -1363 176
5046 176 2293 2681 2131 225 -1283 -2725 -2862 -1590 41 1629 2589 2188 863 -1084 -2437 -2792 -1931
$$ packed form
4934a183j279j22R51J540K112J026o15j492j923j563o20J120K086J612R90l68
4950B272j270k142j383k12O00K546J144O09K04j758j723j333m99J427J835J485
4966A802R90m55j727j765j140k00J028K392J654L75p23j577j790j623J82J244
4982a333J979J561J105o64j901j921j545k06J215K040J853P45l05k289j641j236
4998b543p12J389K056J736M98m65j228k045j347l97J163J605J922R10o89j044
5014H09j921j372k94J472J569J368J170o69j537j596o13o21J128J804R84J183
5030B864p12j413j949j005j01J014J784J595Q12o99j457k240r88k28J360J539
5046A76K117L88n50j906j508j442j37J272J631J588R60m01j325j947j353l55Q61
$$ plain form
5063 -1931 -330 1505 2618 2217 822 -902 -2145 -2613 -1639 -283 1722 2380 2235 752 -765 -1824
5079 -1824 -2176 -1078 408 1851 2251 2298 564 -962 -2101 -1926 -1338 343 1847 2564 2300 476 -1237
5096 -1237 -2181 -2335 -1349 212 1885 2503 1570 434 -1408 -2763 -2708 -1782 81 1452 2408 1919 599
5113 599 -1359 -2474 -2900 -1806 -192 1659 2476 2413 904 -610 -1998 -2556 -1632 91 2123 2698 2050
5130 2050 993 -494 -2010 -1962 -918 677 1841 2322 2273 869 -820 -1774 -2078 -842 238 2108 2249
5147 2249 1815 752 -1174 -2442 -2189 -1723 269 1869 2232 1923 612 -1721 -2662 -2568 -1768 127 1892
5164 1892 2535 2171 693 -1283 -2617 -2310 -1444 -110 1645 2474 1958 556 -791 -1962 -2413 -1481 177
5181 177 2008 2536 2117 976 -801 -1700 -2128 -1430 348 1412 2355 2211 604 -751 -1941 -2154 -1109
$$ packed form
5063a931J601J835J113m01j395j724j243m68R74J356K005O58j45j483j517j059
5079a824l52J098J486J443M00M7j734j526j139J75N88J681J504P17k64j824j713
5096a237r44j54R86J561J673O18r33j136j842j355N5R26J863J371R56m89j320
5113E99j958j115m26J094J614J851Q17o3j509j514j388n58R24J723K032N75o48
5130B050j057j487j516M8J044J595J164M81m9j404j689r54l04J236J080J870J41
5147B249m34j063j926j268K53M66J992J600L63l09j311k333r41R4Q00J895J765
5164A892O43l64j478j976j334L07Q66J334J755Q29n16j402j347j171m51R32J658
5181A77J831N28m19j141j777q99m28O98J778J064R43j44j607j355j190k13J045
$$ plain form
5198 -1109 -12 1609 1877 1848 350 -1164 -2231 -2500 -1209 235 1584 2087 1479 439 -1308 -2457
5214 -2457 -2333 -1364 283 1762 2144 1779 715 -1291 -2386 -2586 -1871 141 1682 2359 1889 734 -582
5231 -582 -1856 -2073 -1442 -19 1799 2636 1968 909 -830 -1763 -2208 -1112 -25 1554 2053 2207 825
5248 825 -918 -1968 -2043 -1238 9 1099 1826 1636 724 -824 -1977 -2032 -1512 193 1271 1878 1394 104
5266 104 -1170 -2310 -2208 -1218 316 1602 2079 1370 -104 -879 -2069 -2184 -1194 541 1903 2472 2130
5283 2130 879 -791 -2277 -2211 -1004 245 1513 2593 2343 908 -800 -1970 -2175 -1291 302 1356
5299 1356 2169 1771 678 -795 -1872 -2039 -1633 319 1380 1783 1707 379 -798 -2022 -2044 -1541 -24
5316 -24 1330 1721 1348 322 -1293 -1977 -1808 -1137 86 1337 1821 1500 281 -1024 -1769 -1763 -831 450
$$ packed form
5198a109J097J621K68k9j498j514j067k69J291J444J349N03o08j040j747j149
5214b457J24R69J647J479L82l65j064k006j095k00P15K012J541O77m70j155j316
5231e82j274k17O31J423J818Q37o68j059j739r33m45J096J087J579M99J54j382
5248H25j743j050p5Q05J247J090P27j90r12j548j153n5N20J705J078O07m84j290
5266A04j274j140J02R90J534J286M77p09j474p75j190j15R90J735J362N69l42
5283B130j251j670j486O6J207J249J268J080k50j435j708j170k05Q84J593J054
5299A356Q13l98j093j473j077j67M06J952J061M03p6j328j177j224k2N03J517
5316b4J354L91l73j026j615o84J69O71J223J251M84l21j219j305p45OR32J281
$$ plain form
5334 450 1864 2283 1650 592 -795 -2044 -1848 -1091 276 1719 2149 2130 724 -530 -1863 -2018 -1250
5351 -1250 185 1420 2178 1557 965 -690 -1582 -2022 -1302 -49 1144 1878 1413 398 -554 -1788 -2072
5368 -2072 -1343 -183 1139 1571 1697 132 -1166 -1796 -1734 -928 137 1251 1933 1493 338 -907 -1572
5385 -1572 -1895 -744 250 1602 2017 1569 247 -999 -1671 -1626 -797 293 1610 2238 1845 862 -781 -1943
5403 -1943 -1776 -1017 148 1740 1932 1597 902 -1040 -1822 -2181 -1361 35 1233 1740 1721 496 -736 -1682
5421 -1682 -1998 -1266 -74 1085 1580 1441 504 -331 -1538 -1527 -820 -27 1271 1542 1714 606 -431 -1412
5439 -1412 -1639 -601 398 1538 1884 1214 453 -400 -1557 -1530 -733 298 1520 1914 1516 594 -573 -1797
5457 -1797 -1720 -934 177 1333 1920 1636 435 -794 -1995 -1900 -1284 -18 886 2009 1539 318 -612 -2029
$$ packed form
5334D50J414M19o33j058j387j249J96P57J367J443M30j9j406j254j333j55P68
5351a250J435J235P58o21n92j655q92m40P20J253J193P34m65j015r52j234k84
5368b072P29J160J322M32J26j565j298o30O2Q06J065J114O82m40j155j245o65
5385a572l23J151R94J352M15m48j322j246o72M5Q29J090J317O28l93r83j643j162
5403a943J67P59J165J592J92l35o95j942p82l59Q20J396J198N07j9j225j232r46
5421a682l16P32J192J159M95j39r37q35j207J1P07P93J298K71J72j108j037r81
5439a412k27J038R99J140L46o70p61q53j157K7P97J031J222L94l98r22j167j224
5457a797P7P86J111J156N87k84j201j229j201R5O16J266R04J123m70j221r30j417
$$ plain form
5475 -2029 -2076 -1084 -192 900 1476 1429 714 -297 -1649 -1570 -843 -223 1213 1700 1894 308 -522 -1163 -1078
5494 -1078 -784 205 1194 2117 1463 197 -510 -1435 -1379 -591 522 1405 1918 1276 350 -763 -1458 -1353 -908
5513 -908 123 874 1795 1527 395 -1074 -1832 -1986 -1212 -135 1313 1702 1472 355 -762 -1893 -1862 -1165
5531 -1165 2 961 1725 1428 927 -736 -1560 -1461 -1096 6 1208 1856 1502 659 -529 -1504 -1201 -783
5549 -783 295 1238 1528 1515 525 -302 -1052 -1547 -1023 198 1081 1640 1552 352 -545 -1685 -1312 -638 500
5568 500 1039 1527 1307 521 -956 -1921 -1659 -1285 133 947 1790 1524 376 -929 -2012 -1737 -1171 103
5586 103 939 1699 1534 546 -388 -1560 -1944 -1001 -130 1014 1934 1405 952 -228 -1008 -1274 -778 79 1097
5605 1097 1441 1324 642 -322 -1066 -1108 -717 -53 1094 1517 1319 497 -527 -1566 -1437 -935 -293 966 1356
$$ packed form
5475b029m7R92Q92J092N76m7p15j011j352P9P27O20J436M87J94j586q30o41Q5
5494a078K94R89R89R23o54j266p07r25N6P88J113Q83N13o42r26j113o95J05M45
5513i08J031P51R21k68j132j469p58j54P74J077J448L89k30j117j117j131L1O97
5531a165J167R59P64k97n01j663q24R9L65J102J202O48l54q43j188r75L03M18
5549g83J078R43K90j3r90q27p50m95N24J221Q83N59q8j200q97j140L73O74J138
5568E00N39M88k20p86j477r65K62L74J418Q14Q43k66j148j305j083K75N66J274
5586A03Q36P60j65r88r34j172l84R43Q71J144R20n29m53j180p80k66M96Q57J018
5605A097L44j17o82r64p44m2L91O64J147M23j98q22j024j039J29N02O42J259L90
$$ plain form
5624 1356 1223 198 -875 -1482 -1594 -954 96 1024 1441 1078 448 -646 -1608 -1591 -860 187 1281 1818
5642 1818 1444 627 -547 -1117 -1536 -1183 -106 1233 1623 1556 835 -165 -1293 -1527 -774 -10 928 1910
5660 1910 1416 555 -375 -997 -1361 -754 37 885 1509 1136 334 -794 -1511 -1483 -1110 -195 784 1228 967 232
5680 232 -571 -1433 -1587 -885 -15 686 849 1137 471 -436 -1191 -1395 -462 369 996 1696 1645 711 -589 -1208
5700 -1208 -1379 -764 112 1124 1798 1584 321 -370 -1240 -1419 -984 42 1177 1284 1453 631 -315 -1160
5718 -1160 -1401 -975 -367 918 1289 1257 376 -578 -1279 -1343 -818 -90 926 1407 878 718 -575 -1375 -1658
5737 -1658 -699 100 621 1264 1277 242 -532 -1396 -1514 -723 320 1044 1426 1469 243 -557 -1059 -1210 -972
5756 -972 377 1324 1831 1330 659 -539 -1213 -1288 -1017 -87 996 1215 1441 574 -322 -1250 -1467 -942 11
$$ packed form
5624A356j33j025j073o07j12O40J050R28M17l63o30j094r62J7P31J047J094N37
5642A818l74q17j174n70m19L53J077J339L90o7p21j000j128k34P53P64R38R82
5660A910m94q61r30o22l64O07P91Q48O24l73q02j128p17K8L73R15R79M44k61p35
5680B32q03q62j54P02Q70P01J63K88o66r07p55k04R33Q31O27P00n1r34j300o19
5700a208j71O15Q76J012O74k14j263o91q70j79M35J026J135J07J69q22r46q45
5718a160k41M26O08J285L71l2q81r54p01o4N25P28J016M81n29j60j293q00k83
5737a658R59P99N21O43J3j035p74q64j18P91J043P24L82M3j226q00n02j51K38
5756i72J349R47N07n01o71j198o74p5K71R30J083K19K26q67q96r28k17N25R53
$$ plain form
5775 11 848 1444 1248 232 -590 -1298 -1553 -1050 -234 724 1412 811 389 -457 -1117 -1217 -817 374 934 1335
5795 1335 991 616 -746 -1026 -1108 -450 -24 953 1497 1278 305 -780 -1286 -823 -341 180 1211 1385 1205
5814 1205 177 -689 -1256 -1315 -749 108 961 1469 1138 314 -998 -1566 -1606 -1003 -54 588 1211 1260 346 -391
5834 -391 -1105 -1217 -936 -258 319 1339 928 397 -258 -1167 -1047 -753 287 898 1073 1023 287 -604 -1233 -945
5854 -945 -626 475 1074 1279 1060 267 -539 -1040 -905 -459 345 905 1599 976 901 -370 -1324 -1214 -707 423
5874 423 1088 1364 1202 125 -584 -1343 -1510 -707 215 1049 1451 1306 428 -575 -1177 -1238 -781 -95 621 1121
5894 1121 876 651 -645 -1134 -1309 -1008 -34 836 1224 1114 370 -456 -864 -1012 -923 423 688 1134 1169 115
5914 115 -561 -1199 -901 -614 379 768 1242 1185 613 -544 -1348 -1255 -665 -107 772 1418 1001 118 -641 -1325
$$ packed form
5775A1Q37N96j96j016q22p08k55N03Q16R58O88o01m22q46o60j00M00J191N60M01
5795A335l44l75j362k80q2O58M26R77N44k19r73j085n06M63M82N21J031J74j80
5814A205j028q66n67n9N66Q57Q53N08l31q24j312n68m0O03R49O42O23M9r14p37
5834c91p14j12K81O78N77J020m11n31o55r09J20K94J040O11J75n0p36q91o29K88
5854i45L19J101N99K05k19p93q06n01J35M46Q04N60O94o23p5j271r54J10N07J130
5874D23O65K76j62j077p09p59j67Q03R22Q34M02j45q78j003o02o1M57O86P16N00
5894A121k45k25j296m89j75L01R74Q70L88j10p44q26m08j48Q9J346K65M46L5j054
5914A15o76o38K98K87R93L89M74n7n72j157q04R3N90N58Q79O46m17q83p59o84
$$ plain form
5934 -1325 -1538 -952 68 709 1325 1100 387 -664 -1362 -1462 -895 -220 630 1358 1059 535 -412 -1135 -824
5953 -824 -601 28 681 1282 1140 449 -317 -807 -1130 -536 62 1177 1419 1041 455 -320 -784 -961 -619 181
5973 181 904 1362 798 232 -676 -1200 -1312 -737 242 601 1462 693 352 -637 -1219 -1395 -700 298 527 1443
5993 1443 783 163 -513 -1217 -1303 -788 89 815 1067 898 302 -558 -1154 -1114 -689 341 1117 1422 1119 467
6013 467 -78 -1063 -844 -500 248 779 1403 1168 216 117 -704 -1000 -590 12 678 1061 732 38 -373 -919
6033 -919 -784 -675 29 420 1326 749 -45 -686 -1359 -1102 -714 173 868 1166 486 289 -563 -1130 -1330 -475
6053 -475 -36 687 1209 1030 -9 -539 -1192 -1303 -572 301 1032 1272 1049 417 -569 -1270 -1116 -769 109 830
6073 830 1332 1053 519 -478 -833 -1080 -722 -263 565 838 964 -33 -304 -1110 -1042 -728 81 590 703 707 24
$$ packed form
5934a325k13N86J020O41O16k25p13j051o98j00N67O75Q50P28k99n24r47p23L11
5953h24K23O29O53O01j42o91p66m90l23N94N98J115K42l78n86p75m64j77L42Q00
5973A81P23M58n64n66r08n24j12N75R79L59Q61p69l41r89n82j76O95R98K29R16
5993A443o60o20o76p04q6N15Q77P26K52j69n96q60n96M0M25J030P76L05l03o52
6013D67n45r85K19L44P48N31O24k35r52r9q21k96M10O02O66L83l29o94m11n46
6033i19J35J09P04L91R06n77p94o41o73K57L88Q87O95K98o80j97q52n67k00Q55
6053d75M39P23N22j79j039n30o53j11P31Q73P31K40k23o32r86p01J54L47Q78P21
6073H30N02k79n34r97l55k47L58M59Q28K73J26r97k71q06O8L14Q09N09J13Mo83
$$ plain form
6094 24 -714 -976 -1105 -757 313 809 1181 837 -138 -394 -900 -975 -551 94 1020 1466 829 339 -624 -1110
6114 -1110 -796 -795 494 1013 1318 1217 301 -433 -1022 -691 -527 -4 572 1313 1196 530 -378 -987 -890 -701
6134 -701 170 497 692 767 58 -334 -1116 -861 -416 -82 637 445 715 82 -343 -1039 -1106 -521 189 986 1171
6155 1171 779 224 -250 -793 -955 -436 369 870 1058 727 242 -543 -1110 -818 -650 485 700 1110 1089 266
6175 266 -280 -1262 -1396 -394 20 680 1089 1061 381 -497 -923 -1119 -596 169 271 1019 1010 100 -460 -836 -1045
6196 -1045 -671 -310 513 827 393 -154 -403 -1053 -959 -705 18 1006 679 890 139 -437 -1156 -820 -566 209
6216 209 976 1322 871 103 -561 -732 -869 -257 162 964 1454 601 415 -704 -828 -1004 -854 134 976 934
6236 934 957 332 -371 -1158 -1243 -528 59 439 816 764 16 -517 -1205 -1409 -607 -97 683 957 749 456 -501
$$ packed form
6094B4p38k62j29L48J070M96L72l44r75k56n06p5M24O45R26M46o37m90r63m86
6114a110L14JJ289N19L05j01r16p34n89L31J64N23N76P41j17o66r08o09R7J89
6134g01Q71L27J95P5p09l92p82K55M45L34P19j92K70o33m25o96o7N85P10P97J85
6155A171l92n55m74n43j62N19Q05N01J88l31m85p85n67K92J68J135K15M10k1q23
6175B66n46r82j34J002M14O60M09k8o80q78m26j96N23P65J02P48rr10n60l76k09
6196a045L74L61Q23L14m34n47k49o50R4K54P23R88l27K11p51n76p19L36K54P75
6216B09P67L46m51p68o64j71j37O12M19Q02M90q53j86j119j24j76J50R88Q42m2
6236I34K3o25p03p87q5P15N87L80L77n2p48n33o88k04Q02N10P80K74k08k93r57
$$ plain form
6257 -501 -964 -841 -762 113 607 987 745 476 -324 -948 -632 -409 270 823 779 804 134 -462 -744 -455 -356
6278 -356 186 972 1077 652 179 -340 -934 -936 -405 -25 736 911 877 75 -208 -1145 -973 -278 -69 589 607
6299 607 625 66 -533 -1280 -1029 -810 -60 389 1120 886 97 -450 -647 -880 -411 72 418 906 734 323
6319 323 -151 -899 -931 -252 378 517 860 651 266 -224 -652 -705 -544 251 722 990 909 46 -328 -782 -929
6340 -929 -473 200 872 1008 505 33 -817 -891 -406 -437 32 859 1169 746 -36 -850 -1127 -1026 -563 135 544
6361 544 753 841 144 -228 -785 -641 -742 347 779 672 642 661 -195 -446 -718 -189 275 868 961 808 544
6382 544 -478 -619 -476 -142 270 840 835 423 -102 -221 -613 -795 -124 30 571 813 454 23 -598 -1173
6402 -1173 -928 -648 20 784 786 592 157 -622 -885 -485 -692 116 816 1079 933 538 -570 -453 -690 -489
$$ packed form
6257e01m63J23P9Q75M94L80k42k69q00o24L16K23O79N53m4K5o70n96k82K89R9
6278c56N42P86J05m25m73n19n94kN31L80P61J75l4q02k83r37J72O95K09O58J8
6299F07J8n59n99p47K51K19P50M49P31k34p89n47j97k33M69M83L46M88j72m11
6319C23m74p48l2O79O30J39L43k09l85m90m28n3J61P95M71K68q1q63l74m54j47
6340i29M56O73O72J36n03m72q50p4M85l1M69Q27L10m23p82q14k77J01M63O98M09
6361E44K09Q8o97l72n57J44j01J089M32j07l0J9q56k51k72N29M64N93R3j53k64
6382E44j022j41J43L34M12N70nm12n25j19l92j82O71J54N41K42l59m31o21n75
6402a173K45K80O68P64Kj94m35p79k63M00k07Q08P00K63j46l95j108J17k37K01
$$ plain form
6422 -489 308 597 969 661 490 -11 -790 -571 -649 188 690 817 934 232 -359 -639 -421 -678 331 860
6442 860 479 493 131 -529 -557 -852 -294 -105 484 724 561 -111 -640 -1077 -813 -544 217 715 796 477 133
6463 133 -704 -1127 -761 -436 508 799 986 796 201 -447 -854 -1063 -384 5 963 909 697 435 -279 -567
6483 -567 -732 -560 141 577 730 969 481 -148 -789 -733 -385 -122 775 854 566 126 -263 -821 -831 -479 -92
6504 -92 346 732 225 28 -829 -734 -556 -297 223 420 676 719 -119 -436 -864 -638 -397 357 692 779 470
6525 470 -75 -526 -685 -1022 -282 430 817 820 622 158 -529 -865 -581 -253 415 923 825 914 138 -459 -459 -803
6547 -803 -83 183 364 478 931 91 -354 -526 -709 -658 -121 801 405 342 133 -474 -723 -332 -514 -90 779
6568 779 500 596 115 -406 -499 -903 -155 245 720 948 617 -35 -430 -664 -528 -300 545 603 809 796 241
$$ packed form
6422d89P97K89L72l08j71n01p79K19p8Q37N02J27J17p02n91k80K18k57J009N29
6442H60l81J4l62o60k8k95N58J89N89K40j63o72n29m37K64K69P61M98Q1l19l44
6463A33q37m23L66L25R44K91J87j90n95o48m07k09O79L89R58n4k12k62p14k88
6483e67j65J72P01M36J53K39m88o29o41N6L48K63Q97P9k88m40l89n58j0L52L87
6504i2M38L86n07j97q57R5J78K59N20J97K56M3q38l17m28K26K41P54L35Q7l09
6525D70n45m51j59l37P40P12L87Lj98m64o87l36K84L28O68N08r8Q9p76n97%l44
6547h03P20K66J81J14M53q40m45j72j83N1N37R22l96o3k09o07k49L91j82M24Q69
6568G79k79R6m81n21r3m04P48M00M75K28l31o52l95k34J36K28Q45N8K06j3n55
$$ plain form
6589 241 -355 -522 -906 -445 327 333 1132 705 383 -225 -847 -853 -339 205 658 866 690 284 -410 -921 -560
6610 -560 -491 -39 619 683 678 -84 -306 -675 -696 -651 -54 523 385 429 115 -646 -624 -670 17 55 852 917 466 125
6634 125 -399 -748 -466 -207 297 842 774 653 235 -464 -709 -649 -262 402 833 1019 384 78 -482 -582 -702
6655 -702 -399 155 768 577 484 116 -565 -832 -941 -547 9 219 582 600 5 -408 -769 -463 -616 -48 693
6676 693 794 380 102 -169 -540 -519 -218 81 697 690 436 125 -178 -500 -389 -471 385 800 1017 267 -252
6697 -252 -541 -512 -838 -338 392 456 666 792 43 -406 -779 -675 -639 276 643 670 448 69 -295 -896 -610
6718 -610 -550 -164 214 579 717 53 -331 -376 -719 -149 33 413 743 706 -32 -271 -381 -607 -349 -25 418
6739 418 755 726 414 -231 -435 -642 -141 180 765 572 289 38 -165 -415 -589 -283 190 591 791 264
$$ packed form
6589B41n96j67l84M61P72OP99m27l22o08o22oN14N44M53K08j76m06o94n11L61
6610e60O9M52O58O4np62k22l69k1M5N97N77j38M4l14p61K2m6O87L8P97O5m51l41
6634A25n24l49K82K59N04N45o8j21m18o99k45O0L87O64M31J86o35l06n60j00j20
6655g02L03N54O13j91r3l68o81k67j09L94N56K10L63J8n95m13l61L06j53N68P41
6676F93J01m14k78k71l71K1L01K99O16pk54l11l03l22J11q2Q56M15K17p50n19
6697b52k89K9l26N00P30O4K10J26p49m49l73J04L6R15L67K7k22l79l64o01K86
6718f10O0L86L78L65J38o64l84m5l43N70J82L80L30l7p38k39j10k26K58L24M43
6739D18L37k9l12o45k04k07N01L21N85j93k83k51k03k50j74L06M73M01K00n27
$$ plain form
6759 264 -193 -401 -530 -638 -308 -6 285 965 314 -84 -740 -907 -894 -448 202 516 805 545 32 -167
6779 -167 -708 -859 -377 -249 551 801 435 -253 -15 -654 -642 -408 522 464 764 598 -33 -100 -361 -381 -376 365
6801 365 338 619 88 -71 -412 -818 -140 -42 148 542 794 159 160 -329 -885 -517 -77 139 643 794 576
6822 576 -1 -500 -631 -723 -443 121 389 391 506 -39 -174 -506 -392 -269 315 292 588 732 241 -233 -656
6843 -656 -763 -357 200 794 1207 409 189 -150 -460 -531 -198 286 291 364 234 180 -522 -424 -397 -337 183 572 542
6866 542 488 -238 -344 -584 -952 -88 149 552 608 543 -128 -563 -700 -585 -499 129 242 699 415 63 -626
6887 -626 -490 -277 -190 336 595 725 568 -68 -380 -444 -653 -185 165 776 708 695 169 -64 -468 -784 -516
6908 -516 -26 467 755 101 -282 -506 -653 -585 -94 38 447 235 475 133 -379 -479 -268 -259 -264 648 290 234
$$ packed form
6759B64m57k08j29j08L30L02K91O80o51l98o56j67J3M46O50L14K89k60n13j99
6779a67n41j51M82J28Q00K50l66o88K38o39J2K34R30n8L00j66o31o7k61k0NP41
6801C65k7K81n31j59l41m06O78R8J90L94K52o35Jm89n56L68M40K16N04J51k18
6822E76n77m99j31r2K80N64K68KJ15n45j35l32J14J23N84k3K96J44m91m74m23
6843f56j07M06N57N94M13p98k20l39l10p1L33M84NP3j30n4p02R8K7O0N20L89l0
6866E42n4p26j06k40l68Q64K37M03N6o5o71m35j37J15Q6O28J13M57k84l52o89
6887f26J36K13Q7N26K59J30j57o36l12o4k09M68L50O11o8j3n26k33m04l16K68
6908e16M90M93K88o54l83k24j47O8M91J32M09k12K40l42n12j00K11RnR12l58n6
$$ plain form
6930 234 -94 -487 -376 -717 -290 240 428 642 651 -41 -264 -907 -457 -172 331 686 843 666 310 -264 -271
6951 -271 -583 -317 149 427 577 448 -29 -277 -334 -647 -552 -258 428 537 9 111 -284 -268 -447 -295 205
6972 205 366 526 496 -34 -635 -606 -237 -180 211 417 394 243 -58 -317 -603 -130 -48 106 624 541 389 61
6994 61 -527 -452 -381 -17 257 564 986 359 291 -610 -598 -706 -32 282 789 866 633 -103 -259 -861 -627 -238
7016 -238 -185 483 367 569 206 -368 -607 -643 -367 10 90 471 290 -199 -351 -652 -650 -425 -255 551 376 491
7038 491 -95 -535 -480 -482 -21 61 300 418 363 426 -108 52 -461 11 436 300 571 311 178 -405 -542 -796
7060 -796 -33 -23 553 790 409 -270 -314 -591 -571 -457 151 402 326 381 -67 -300 -699 -696 -558 -79 189 727
7082 727 308 170 -141 -416 -582 -89 25 60 610 431 100 -442 -179 -943 -227 153 409 441 387 77 -349
$$ packed form
6930B34l28l93J11l41M27N30J88K14Ro92k23o43M50K85N03L55J57j77l56n74p
6951b71l12K66M66K78J50j29m77k48n7l13R5K94O86J09n28J02l95J6j79J52N00
6972B05J61J60l0n30o01K9L69N7L91K06k3j51l01k59k86M73Q2J54N18q3j52l28
6994F1n88P5P1L64K74L07M22o27o8r01J2j08O74L14N07P7k33p36j56o02K34L89
7016b38N3O68j16K02l63n74k39l6K76L77Q0L81j81m89j52l01KK25J70Q06j75J15
7038D91n86m40N5kM61Q2K39J18n5O3n34J60n13M72M25j36K71k60j33n83j37k54
7060g96P63J0N76K37l81o79m4k77K0J14O08K51p6N5m48k33l99LJ38M79K68N38
7082G27m19j38l11k75j66M93J14L5N50j79l31n42K63p64P16L80K56L2n4l10m26
$$ plain form
7103 -349 -405 -487 -121 433 559 665 328 273 -12 -446 -510 -58 307 355 667 386 41 -233 -598 -734 -463 18
7125 18 589 541 404 207 -628 -835 -636 -516 -275 251 536 388 233 -167 -554 -543 -190 -123 194 569 488 408
7147 408 -425 -227 -347 -212 281 340 434 340 150 -404 -460 -281 123 219 540 433 192 73 -122 -614 -833 -11
7169 -11 325 570 633 396 215 -461 -571 -585 -130 95 306 449 -87 -86 -509 -450 -464 -19 187 447 283 321 47
7192 47 -105 -726 -503 -203 348 345 548 553 273 -77 -385 -262 -116 -126 325 536 399 -55 -183 -456 -649 -346
7214 -346 -97 403 454 101 -149 -102 -524 -294 -173 70 511 310 607 -53 -763 -556 -656 -299 103 257 457
7235 457 157 -314 -435 -467 -643 -139 36 332 709 346 183 -313 -674 -546 -192 330 642 488 518 489 -327
7256 -327 -259 -606 -131 -14 735 786 176 109 -75 -643 -532 -72 169 227 552 20 185 -313 -329 -203 -232 238
$$ packed form
7103c49n6q2L66N54J26J06l37n5k85m34o4M52L65M8L12k81l45k74l65j36K71M81
7125A8N71m8j37j97q35k07J99J20K41N26K85j48j55m00l87J1L53O7L17L75q1q0
7147D08q33J98j20J35M93N9R4r4j90n54n6J79M04R6L21j07k41j19j95m92k19Q22
7169a1L36K45O3k37j81o76j10j4M55K25K11J43n36Jm23N9j4M45K06K60j64L8k74
7192D7j52o21K23L00N51lK03Nk80l50l08J23J46j0M51K11j37m54j28k73j93L03
7214c46K49N00N1l53k50M7m22K30J21K43M41k01K97o60p10K07j00L57M02J54K00
7235D57l00m71j21l2j76N04J75K96L77l63j63m96l61J28L54N22L12j54L0k9q16
7256c27O8l47M75J17P49N1o10o7j84n68J11M60K41N8L25n32J65m98j6J26k9M70
$$ plain form
7278 238 84 165 366 -136 -424 -541 -546 -261 222 638 536 216 -296 -323 -730 -573 -315 472 882 485 260
7299 260 14 -22 -576 -701 -161 194 561 667 736 -1 -311 -578 -481 -215 173 213 710 521 -216 -219 -463 -368
7321 -368 -13 190 595 622 280 99 -264 -319 -203 -351 127 10 342 84 269 -173 -492 -739 -52 120 241
7342 241 261 437 -14 -530 -535 -324 -327 64 377 632 196 -69 -478 -363 -234 -314 256 509 455 341 -119 -151 -566
7365 -566 -295 -480 -8 569 520 371 89 -150 -495 -333 -352 60 123 231 479 249 -30 -482 -211 -169 326
7386 326 418 299 670 -87 -242 -407 -625 -78 276 161 344 317 -99 34 -149 -321 -229 24 727 387 372
7407 372 -145 -210 -450 -264 -114 80 308 530 487 -34 -160 -221 -204 -27 234 309 537 575 287 -210 -488 -528
7429 -528 -82 234 402 420 301 -107 -146 -471 -485 -36 122 148 561 178 -104 -455 -485 -188 -308 -56 102 110
$$ packed form
7278B38j54Q1K01n02k88j17nK85M83M16j02l20n12k7m07J57K58P87M10l97k25
7299B60k46l6n54j25N40L55L67J06O9p37l10k67R7K66L88M0M97j89p37lk44R5
7321c68L55K03M05K7l42j81l63n5J16j48M78j17L32k58J85m42l19k47O87J72J21
7342B41K0J76m51n16nK11lL91L13K55m36k65m09J15J29q0N70K53n4j14m60l2m15
7365e66K71j85M72N77m9j49k82k39l45J62j9M12O3J08K48k30k79m52K71M2M95
7386C26R2j19L71p57j55j65k18N47L54j15J83k7m16J33j83j72R2K53P03l40j5
7407C72n17o5k40J86J50J94K28K22m3n21j26o1J7J77K61P5K28L8k88m97k78m0
7429e28M46L16J68J8j19m08l9l25j4M49J58K6M13l83k82l51l0K97j20K52J58Q
$$ plain form
7451 110 294 -139 -431 -389 -315 -129 -12 375 482 314 -16 -239 -195 -424 173 174 693 516 603 -70 -37 -293
7473 -293 -322 90 116 643 553 139 25 -166 -477 -401 -180 127 244 504 324 -6 -653 -497 -518 -267 -208 420
7495 420 466 355 -13 -433 -227 -74 -564 2 235 494 -119 267 80 -299 -194 -58 317 332 291 355 93
7516 93 -204 -159 -406 287 274 490 132 343 231 -442 -300 -270 198 277 752 123 226 32 -314 -136 -365 -586
7538 -586 145 450 454 495 191 -197 -615 -326 -190 34 387 318 480 184 -367 -370 -337 -377 -39 400 346 152 -95
7561 -95 -223 -469 -383 -253 380 620 624 170 284 -164 -530 -312 -130 227 357 452 69 200 -102 -554 -249 -171
7583 -171 107 416 419 98 -370 -321 -662 -226 -287 -90 401 602 120 -183 -515 -570 -257 -125 195 317 654 295
7605 295 -34 -461 -511 -551 -161 266 444 327 41 -174 -297 -261 -555 -371 103 327 264 177 -103 7 -169 -186
$$ packed form
7451A10J84m33k92M2P4J86J17L87J07j68l30k23M4k29N97JN19j77Q7o73L3k56
7473b93k9M12K6N27r0m14j14j91l11P6K21L07J17K60j80l30o47J56k1K51N9O28
7495D20M6j11l68m20K06J53m90N66K33K59o13L86j87l79J05J36L75J5m1O4k62
7516I3k97M5k47O93j3K16l58K11j12o73J42L0M68P9M75o29J03j94l46J78k29k21
7538e86P31L05MM1l04l88m18K89J36K24L53o9J62k96n51lL3m0L38M39n4j94k47
7561i5j28k46Q6J30O33K40Mm54J14m48l66K18J82L57J30R5l83J31l02m52L05P8
7583a71K78L09Ll21m68M9l41M36o1J97M91K01m82l03l32n5L13J32L20J22L37l59
7605B95l29m27n0m0L90M27J78j17k86k15j23L6k94J84M74K24o3q7k80J10j76j7
$$ plain form
7627 -186 -347 3 535 186 32 318 -341 -192 -400 113 364 128 337 16 -106 -200 -393 -728 -79 193
7647 193 199 445 -134 104 -325 -603 -411 49 391 422 574 148 -143 -273 -294 -253 86 -63 515 287 84 -215
7669 -215 -279 -430 -502 -271 225 65 294 603 83 -112 -183 -315 -116 31 213 362 149 102 -88 -575 -218
7690 -218 -10 -155 169 423 55 -91 -179 -678 -484 -38 66 415 495 43 -94 -230 -329 -325 217 329 556 414
7712 414 109 23 -374 -431 -415 56 274 253 248 273 -47 -101 -103 -528 -46 94 459 531 150 -258 -389 -470 -400 -96
7736 -96 101 767 123 265 295 -385 -461 -129 -234 31 206 65 101 72 -133 -314 -334 16 42 -99 228 258 -67
7759 -67 -282 -432 -356 -13 549 496 285 -58 9 -274 -335 -350 35 219 515 609 240 90 -356 -468 -369 117 598
7782 598 573 382 43 -67 117 -377 -145 -82 283 372 212 23 18 -391 -492 -658 -302 278 318 246 169 229 -213
$$ packed form
7627a86j61L50N32l49j54K86o59J49k08N13K51k36K09l21j22r4j93l35O49K72
7647A93OK46n79K38m29k78J92M60L42L1J52m26k91j30k1M1L39j49N78k28k03k99
7669b15o4j51p2K31M96j60K29L09n20j95p1j32J99J47J82J49k13m7j90m87L57
7690b18K08j45L24K54l68j46q8m99J94M46J04L49Q0m52j37j36r9MN42J12K27j42
7712D14l05q6l97n7J6M71K18k1nK5l20n4km25M82J40L65P2l81m08j31q1P0L04
7736i6J97O66o44J42L0o80p6L32j05K65J75j41L6k9k05j81k0L50K6j41L27L0l25
7759f7k15j50P6L43N62n3k11l43O7k83o1j5L85J84K96R4l69j50m46j12R9M86M81
7782E98k5j91l39j10J84m94K32O3L65Q9j60j89nm09j01j66L56N80M0p2p7O0m42
$$ plain form
7805 -213 -234 -162 -392 169 516 224 198 21 -84 -201 -248 -223 20 35 443 219 24 -476 -598 67 -262 -169
7827 -169 286 329 214 -46 -177 -296 -177 155 194 296 341 271 163 -33 -317 -368 -177 232 258 309 75 67 -51
7850 -51 -525 -651 -293 -85 218 596 137 -158 -221 -406 -209 -318 -45 326 163 380 114 -225 -347 -76 235
7871 235 209 333 406 -113 -45 55 -15 -140 -83 -34 239 567 249 -1 -470 -326 -392 59 252 415 289 580
7893 580 -142 -460 -417 -474 226 200 660 415 137 25 -471 -258 -255 -264 152 432 528 286 194 -370 -281 -347 -297 -130
7917 -130 3 367 164 147 -521 -73 -365 45 126 408 153 81 -123 -142 -247 -274 191 227 272 465 241 -173
7939 -173 -206 -118 -297 178 519 365 294 484 -37 -175 -145 -297 169 325 452 661 509 -117 -292 -435 -533 19
7961 19 -31 270 360 111 -68 -388 -368 -196 -27 -123 306 194 477 332 -268 -497 -235 -477 -128 403 391 -58
$$ packed form
7805b13k1P2k30N61L47k92k6j77j05j17m7K5K43J5M08k24j95n00j22O65l29R3
7827a69M55M3j15k60j31j19J19L32L9J02M5p0j08j96k84n1J91M09K6N1k34qj18
7850e1m74j26L58K08L03L78m59k95o3j85J97j09K73L71j63K17k66l39j22K71L11
7871B35k6J24P3n19O8J00p0j25N7M9K73L28l18k50m69J44o6M51J93J63j26K91
7893E80p22l18M3n7P00k6M60k45k78j12m96K13LrM16K80R6k42r2n64Q9o6N0J67
7917a30J33L64k03j7o68M48k92M10Q1K82k55p2k04j9j05k7M65L6M5J93k24m14
7939a73l3Q8j79M75L41j54p1J90n21j38L0j52M66J56J27K09j52o26j75j43r8N52
7961A9n0L01R0k49j79l20K0J72J69r6M29j12K83j45o00k29K62k42L49N31j2m49
$$ plain form
7983 -58 99 132 -60 -312 59 23 203 305 -45 155 7 -249 -186 -123 228 329 186 74 127 -328 -412 -618
8005 -618 40 305 430 437 77 -198 -209 -357 -175 -114 283 206 224 326 360 -198 -442 -145 -85 32 192 212 185
8028 185 -88 -79 -494 -519 -67 486 223 -9 251 0 108 -478 -300 -207 184 236 517 218 38 -205 -1 -105
8050 -105 -9 323 106 193 114 -132 -48 -383 -385 -217 169 459 -19 364 -259 -577 -240 -212 -124 -139 432 188 -53
8073 -53 -245 -314 -689 -360 -174 267 513 153 327 297 -290 -619 -206 -138 -278 490 541 341 307 144 -299 -78
8095 -78 75 311 235 231 102 -92 -481 -533 -261 -84 109 333 58 -166 78 -228 -291 -151 -263 274 -95 58
8117 58 -99 -156 -255 -677 -399 50 96 431 227 80 -160 -507 -389 -592 247 250 228 223 128 -267 -401 -670 -547
8140 -547 -186 148 352 435 330 -95 43 -376 129 -336 -175 -123 439 59 24 -242 -182 -95 -309 349 573 356
$$ packed form
7983e8J57L3j92k52L71l6J80J02l50K00j48k56O3O3L51J01j43j12N3m55q4k06
8005f18O58K65J25Pl60k75j1j48J82O1L97p7J8J02L4n58k44K97O0J17J60K0k7
8028A85k73Rm15k5M52N53k63k32K60k51J08n86J78R3L91N2K81k99j80k43K04j04
8050a05R6L32k17Q7p9k46Q4l35kJ68L86K90m78L83o23l18L37K8Q8j5N71k44k41
8073e3j92o9l75L29J86M41K46l60J74l0n87l29M13O8j40P68N1k00l4j63m43K21
8095g8J53K36p6mj29j94l89n2K72J77J93K24k75k24K44l06o3J40j12N37l69J53
8117E8j57n7r9m22K78M49M6L35k04j47k40l47J18k03Q39Lk2nr5l95j34k69J23
8140e47L61L34K04Q3j05m25J38m19N05m65J61N2N62l80l5k66O0Q7k14O58K24k17
$$ plain form
8162 356 621 -277 -78 -425 -86 -89 187 542 121 -104 135 -358 -277 -278 -449 295 125 -17 90 -208 -244 -29
8184 -29 -235 0 66 74 504 81 -204
$$ packed form
8162C56K65q98J99l47L39lK76L55m21k25K39m93Q1jj71P44j70j42J07k98l6K15
8184b9k06K35O6QM30m23k85
8191b04
$$ Imaginary data points
##PAGE= N=2
##DATA TABLE= (X++(I..I)), XYDATA
$$ plain form
0 0 0 0 0 0 0 0 -8 0 -8 8 -8 16 -16 24 -24 32 -40 43 -54 64 -72 86 -97 111 -131 147 -168 191 -215 247 -273
31 -273 309 -347 385 -432 480 -534 595 -656 729 -806 894 -992 1094 -1216 1349 -1499 1674
48 1674 -1867 2101 -2378 2707 -3123 3644 -4338 5308 -6750 9154 -13874 26801 -138087 -497193
62 -497193 -427058 -227782 29539 242107 387427 317055 72016 -204570 -359709 -392510 -273623
73 -273623 -18543 264398 387453 308816 94787 -154093 -360098 -403621 -246341 21346
83 21346 251044 365117 321262 113114 -174093 -366518 -369508 -215520 15819 252572 379962
94 379962 305104 72968 -169362 -322871 -356272 -239436 16893 278381 381337 290660 87565
105 87565 -145296 -333352 -376498 -222138 45939 275254 370754 311265 112473 -148946 -337789
$$ packed form
0@%%%%%%qQqJ6j6K4l2M0m8N6p2Q3r7J18j36J58j83K08k42K78l15L59m06M62n20
31b73N82o56P32q17R12j014J129j251J385j535J700j886K086k310K565k848L173
48A674l541L968m479N085n830O767p982R646j2058J5904k3028M0675j64888l59106
62d97193P0135J99276K57321K12568J45320p0372k45039k76586j55139l2801J18887
73b73623K55080K82941J23055p8637k14029k48880k06005m3523J57280K67687
83B1346K29698J14073m3855k08148k87207j92425k990J53988K31339K36753J27390
94C79962p4858k32136k42330j53509l3401J16836K56329K61488J02956r0677k03095
105H7565k32861j88056m3146J54360K68077K29315R5500n9489j98792k61419j88843
$$ plain form
116 -337789 -353594 -203693 31974 259504 380225 323287 113698 -136794 -312649 -348858
126 -348858 -223339 22878 264654 369820 298243 107410 -123135 -306943 -351972 -219141
136 -219141 18230 232778 335013 290916 106731 -144471 -326313 -339813 -199790 9360
146 9360 207238 318673 275965 83583 -153649 -310848 -328469 -209300 4864 222401 328756
157 328756 266376 74932 -148381 -306512 -326474 -192490 30686 232816 327225 276891 97544
168 97544 -133538 -299619 -314764 -181008 33752 238916 345340 293065 103987 -123229
178 -123229 -279487 -305848 -190225 26205 241257 339989 279056 103619 -106021 -270952
188 -270952 -313367 -198812 17170 217060 308536 263569 103477 -110629 -280626 -315146 -199116
$$ packed form
116c37789j5805J49901K35667K27530J20721n6938k09589k50492j75855l6209
126c48858J25519K46217K41776J05166p1577j90833k30545j83808m5029J32831
136b19141K37371K14548J02235m4097j84185k51202j81842j3500J40023K09150
146I360J97878J11435m2708j92382k37232j57199j7621J19169K14164K17537J06355
157C28756o2380j91444k23313j58131j9962J33984K23176K02130R4409n0334j79347
168I7544k31082j66081j5145J33756K14760K05164J06424n2275j89078k27216
178a23229j56258k6361J15623K16430K15052R8732o0933j75437k09640j64931
188b70952m2415J14555K15982J99890R1476m4967j60092k14106j69997l4520J16030
$$ plain form
199 -199116 4143 194949 290752 247263 82072 -126035 -277772 -303556 -192902 2980
209 2980 190476 280688 234657 77543 -121361 -271323 -296840 -181936 15861 200201 291544
220 291544 248005 84933 -122058 -266874 -279484 -163720 24501 207105 303590 259738 93127
231 93127 -111154 -252885 -274312 -169550 19765 209979 306505 259562 94232 -106168 -250139
242 -250139 -276308 -174427 9387 192175 287457 247426 90103 -106452 -249202 -277154 -180275
253 -180275 -2924 174608 267068 228520 80762 -103607 -242119 -273737 -180885 -3271 172396
264 172396 258395 218069 75821 -102982 -238207 -264136 -164276 12173 177912 256742 216921
275 216921 79075 -97420 -231413 -255880 -154549 22141 185907 262459 221365 82885
$$ packed form
199a99116K03259J90806R5803m3489j65191k08107j51737k5784J10654J95882
209B980J87496R0212m6031j57114j98904j49962k5517J14904J97797J84340R1343
220B91544m3539j63072k06991j44816j2610J15764J88221J82604R6485m3852j66611
231I3127k04281j41731k1427J04762J89315J90214R6526m6943j65330k00400j43971
242b50139k6169J01881J83814J82788R5282m0031j57323j96555j42750k7952R6879
253a80275J77351J77532R2460l8548j47758j84369j38512l1618R2852J77614J75667
264A72396Q5999m0326j42248j78803j35225k5929R9860J76449J65739P8830l9821
275B16921j37846j76495j33993k4467J01331J76690J63766P6552m1094j38480
$$ plain form
285 82885 -94288 -229888 -255025 -154227 21916 185134 263041 224146 85904 -94357 -231269
296 -231269 -256835 -158947 10348 171593 254996 223077 85968 -94768 -229166 -253824 -162579
307 -162579 -1579 157591 244361 215622 82571 -88978 -216708 -243952 -161328 -5462 153493
318 153493 239686 209468 78681 -85717 -205537 -228975 -147782 1648 154665 237866 207787
329 207787 79409 -82847 -201082 -222654 -140127 10716 161944 239144 203395 74376 -84369
340 -84369 -201190 -225087 -143947 8577 160800 237188 200699 72013 -88702 -208757 -232963
351 -232963 -150228 1640 151088 227530 197482 74648 -85771 -210127 -238716 -156262 -4208
362 -4208 143350 220323 193966 77028 -77909 -200160 -229877 -151625 -4792 139865 216609
$$ packed form
285H2885j77173j35600k5137J00798J76143J63218P7907l8895j38242j80261j36912
296b31269k5566R7888J69295J61245Q3403l1919j37109j80736j34398k4658R1245
307a62579J61000J59170Q6770k8739j33051j71549j27730k7244Q2624J55866J58955
318A53493Q6193l0218j30787j64398j19820k3438Q1193J49430J53017Q3201l0079
329B07787j28378j62256j18235k1572Q2527J50843J51228P7200l5749j29019j58745
340h4369j16821k3897Q1140J52524J52223P6388l6489j28686j60715j20055k4206
351b32963Q2735J51868J49448P6442l0048j22834j60419j24356k8589Q2454J52054
362d208J47558P6973k6357j16938j54937j22251k9717P8252J46833J44657P6744
$$ plain form
373 216609 193939 82178 -69067 -187342 -214798 -138938 2191 140984 214954 192077 81829
384 81829 -65708 -179204 -203807 -129449 7400 142410 213080 187127 74885 -71044 -181273
395 -181273 -204335 -130792 5695 141221 210311 180325 65298 -79407 -187280 -210476 -138569
406 -138569 -2374 135105 206889 177988 62992 -82125 -190986 -215307 -143116 -7057 130389
417 130389 203635 178616 69386 -72511 -182681 -209967 -141387 -7527 129313 203275 181561
428 181561 76452 -61411 -168895 -196613 -131214 -3866 127139 199912 181510 80514 -55937
439 -55937 -162623 -188211 -122670 1575 124797 192638 173699 74935 -59406 -163449 -187652
450 -187652 -121784 510 121551 187944 167559 66172 -68861 -171189 -192585 -125527 -2838
$$ packed form
373B16609k2670j11761j51245j18275k7456P5860J41129J38793P3970k2877j10248
384H1829j47537j13496k4603P4358J36849J35010P0670k5953j12242j45929j10229
395a81273k3062P3543J36487J35526O9090k9986j15027j44705j07873k3196P1907
406a38569J36195J37479P1784k8901j14996j45117j08861k4321P2191J36059J37446
417A30389P3246k5019j09230j41897j10170k7286O8580J33860J36840P3962k1714
428A81561j05109j37863j07484k7718O5399J27348J31005P2773j8402j00996j36451
439e5937j06686k5588O5541J24245J23222O7841j8939r8764j34341j04043k4203
450a87652O5868J22294J21041O6393k0385j01387j35033j02328k1396O7058J22689
$$ plain form
461 -2838 118329 185326 164679 63378 -71483 -174437 -196798 -130495 -7331 117564 187418
472 187418 168656 68054 -65649 -168007 -192807 -130289 -8992 117481 189630 172367 75058
483 75058 -53181 -154792 -184514 -128484 -8650 117023 187256 169752 77351 -46508 -146060
494 -146060 -177202 -123392 -8223 112279 179442 162337 71508 -49627 -146018 -175243 -122130
505 -122130 -9195 108238 171874 151328 60938 -56771 -150569 -179098 -123899 -8979 107726
516 107726 168541 147899 58661 -60272 -155883 -181109 -120919 -6697 107612 170580 154808
527 154808 66081 -56596 -152533 -177043 -118946 -6692 109270 176593 162435 73205 -48327
538 -48327 -143905 -171409 -117053 -7530 105876 172130 161721 78707 -40704 -140048 -169224
$$ packed form
461b838J21167O6997k0647j01301j34861j02954k2361O6303J23164J24895O9854
472A87418j8762j00602j33703j02358k4800O2518J21297J26473P2149j7263r7309
483G5058j28239j01611k9722N6030J19834J25673P0233j7504r2401j23859r9552
494a46060l1142N3810J15169J20502O7163j7105r0829j21135r6391k9225N3113
505a22130J12935J17433O3636k0546r0390j17709r3798k8529N5199J14920J16705
516A07726O0815k0642q9238j18933r5611k5226O0190J14222J14309O2968j5772
527A54808q8727j22677r5937k4510N8097J12254J15962O7323j4158q9230j21532
538d8327r5578k7504N4356J09523J13406O6254j0409q3014j19411r9344k9176
$$ plain form
549 -169224 -115942 -10215 97792 162252 154844 73237 -44943 -139592 -164847 -115070 -15923
560 -15923 89556 154926 145913 63528 -50091 -138591 -164897 -117371 -16446 92260 154631
571 154631 140442 59391 -49751 -138772 -164555 -113724 -9138 97570 157022 145051 65909
582 65909 -45753 -136205 -161467 -110290 -7930 100546 165115 153142 69818 -41111 -128719
593 -128719 -158114 -114447 -12109 100639 164319 150474 72645 -33294 -125943 -161441 -116568
604 -116568 -14522 90459 150430 144586 73630 -34820 -128526 -159381 -115785 -21840 80839
615 80839 145731 138698 61871 -42520 -124239 -150988 -112764 -22070 80562 141848 132089 60859
627 60859 -38176 -123174 -152585 -107890 -11236 87230 143739 136117 65039 -40139 -125142 -146927
$$ packed form
549a69224N3282J05727J08007O4460p408q1607j18180r4649k5255M9777R9147
560a5923J05479O5370r013q2385j13619q8500k6306M7526J00925J08706O2371
571A54631j4189q1051j09142q9021k5783N0831J04586J06708N9452j1971p9142
582F5909j11662r0452k5262N1177J02360J08476O4569j1973q3324j10929q7608
593a28719k9395M3667J02338J12748O3680j3845p7829j05939r2649l5498M4873
604a16568J02046J04981N9971n844p0956j08450r3706l0855M3596R3945J02679
615H0839O4892p033p6827j04391q1719k6749L8224R0694J02632O1286r759p1230
627F0859r9035q4998k9411M4695R6654R8466N6509p622p1078j05178q5003k1785
$$ plain form
639 -146927 -98966 -8386 88019 149949 143663 67563 -37816 -120533 -145665 -104804 -12075 90975
651 90975 151891 141639 68335 -33772 -120263 -151502 -109277 -14202 83381 139739 134691 68692
663 68692 -32463 -120794 -150916 -110861 -24228 70491 132944 131920 63803 -35755 -117840 -146163
675 -146163 -111118 -25217 72123 131958 125042 59261 -32063 -111663 -142073 -104209 -15138 77986
687 77986 130874 125223 64237 -29118 -110893 -137065 -95068 -9901 78555 134970 132405 66959
699 66959 -30019 -109494 -136077 -99340 -14940 80617 140137 132090 63806 -31196 -111498 -141851
711 -141851 -105595 -18665 74486 130946 126980 64251 -29769 -111683 -140828 -107315 -28985 62031
723 62031 126350 129139 65401 -29455 -106553 -135400 -106848 -28903 66061 127654 123421 61578
$$ packed form
639a46927M7961R0580R6405O1930o286p6100j05379q2717k5132M0861R2729J03050
651I0975O0916j0252p3304j02107q6491l1239M2225R5075R7583N6358n048o5999
663F8692j01155q8331l0122M0055Q6633R4719O2453j024o8117r9558q2085k8323
675a46163L5045Q5901R7340N9835o916o5781r1324p9600l0410L7864Q9071R3124
687G7986N2888n651o0986r3355q1775k6172M1997Q5167Q8456N6415k565o5446
699F6959r6978p9475k6583L6737Q4400R5557N9520q047o8284r5002q0302l0353
711a41851L6256Q6930R3151N6460l966o2729r4020q1914k9145L3513P8330R1016
723F2031O4319K789o3738r4856p7098k8847K8552P7945R4964O1593m233o1843
$$ plain form
735 61578 -23962 -97089 -127815 -97408 -18465 68097 122053 121968 68690 -17627 -96168 -125512 -92449
748 -92449 -14854 71104 128160 126992 64893 -25942 -100125 -125960 -93132 -14044 74222 126081
760 126081 118028 59264 -23961 -99887 -133187 -102228 -20718 66649 120709 121204 64903 -26394
772 -26394 -108417 -137837 -102614 -24590 61434 119557 119982 62024 -24727 -99390 -130031 -103335
784 -103335 -26999 61757 117719 117339 65786 -15829 -93280 -126559 -95422 -19490 61543 114709
796 114709 118656 67373 -18029 -92041 -117520 -87196 -18225 60806 115962 115946 60224 -20263 -88805
809 -88805 -117217 -92378 -20895 63466 115731 112328 57733 -24111 -97097 -125108 -93840 -20198
821 -20198 59123 110972 112186 57112 -27663 -99172 -123861 -96258 -28163 54805 113987 114507 58301
$$ packed form
735F1578q5540p3127l0726L0407P8943Q6562N3956q5n3278q6317p8541k9344L3063
748i2449P7595Q5958N7056j168o2099r0835p4183k5835L2828P9088Q8266N1859
760A26081q053n8764q3225p5926l3300L0959Q1510Q7367N4060M95n6301r1297
772b6394q2023k9420L5223P8024Q6024N8123M25n7958q6751p4663l0641K6696
784a03335P6336Q8756N5962l80n1553q1615p7451l3279L1137P5932Q1033N3166
796A14709L947n1283q5402p4012k5479L0324O8971P9031N5156j6n5722q0487o8542
809h8805k8412K4839P1483Q4361N2265l403n4595q1844p2986k8011L1268P3642
821b0198P9321N1849J214n5074q4775p1509k4689K7603O8095Q2968N9182N20n6206
$$ plain form
834 58301 -22362 -90979 -121736 -99474 -28350 56876 112064 113731 65945 -11994 -86726 -120019
846 -120019 -92028 -21138 56638 108167 114254 67265 -11697 -82325 -109777 -85721 -22344 53782
858 53782 107820 110598 61054 -14615 -80624 -110543 -89536 -22772 55895 104684 103515 56050
870 56050 -18204 -87897 -117617 -89607 -20691 52987 100743 103674 56655 -21862 -90862 -116192
882 -116192 -90879 -26581 51192 107057 109542 57831 -18856 -85383 -115515 -93350 -24336 56767
894 56767 107978 107700 62477 -9409 -78515 -111284 -88217 -22542 50987 102053 110557 68582 -7038
907 -7038 -77163 -106838 -85968 -26752 48112 102366 106720 59087 -12474 -75118 -104303 -86904
919 -86904 -26592 47584 96144 97023 54377 -13709 -79630 -109533 -86429 -23553 46354 93036
$$ packed form
834E8301q0663o8617l0757K2262P1124Q5226N5188J667m7786p7939p4732l3293
846a20019K7991P0890P7776N1529O087m6989p8962p0628k7452K4056O3377P6126
858E3782N4038K778m9544p5669o6009k9919K1007O6764P8667M8789j169m7465
870E6050p4254o9693k9720K8010O8916P3678M7756K931m7019p8517o9000k5330
882a16192K5313O4298P7773N5865K485n1711p6687o6527l0132K2165O9014Q1103
894E6767N1211k78m5223p1886o9106l2769K3067O5675P3529N1066Q504m1975p5620
907g038p0125k9675K0870N9216P4864N4254M354m7633p1561o2644k9185J7399
919h6904O0312P4176M8560Q79m2646o8086o5921k9903K3104O2876O9907M6682
$$ plain form
931 93036 98494 55314 -17863 -83659 -108518 -83935 -23871 47458 98584 103237 56525 -15617
943 -15617 -78749 -106129 -85442 -23798 50583 101126 105695 63088 -7359 -75316 -106350 -84529
955 -84529 -22880 48071 98581 106376 65714 -6640 -73138 -102685 -83733 -27380 42187 93726
967 93726 101241 59475 -8418 -70419 -100775 -85932 -30606 39781 89135 93728 54178 -10538
979 -10538 -72186 -102106 -84616 -27694 39937 87129 91761 52915 -12213 -73614 -101120 -81989
991 -81989 -24388 44582 92356 95513 54815 -10803 -70522 -98195 -80435 -22602 48016 96226
1003 96226 100209 59804 -6007 -68245 -98653 -80821 -23030 46374 94302 100474 62151 -4018
1015 -4018 -68308 -99120 -82443 -27323 39524 88055 96266 59224 -6304 -68578 -98600 -83258
$$ packed form
931I3036N458m3180p3177o5796k4859K4583O0064P1329N1126M653m6712p2142
943a5617o3132k7380K0687O1644P4381N0543M569m2607p0447o7957l1034K1821
955h4529O1649P0951N0510P795m0662p2354o6498k9547J8952N6353O9567N1539
967I3726P515m1766o7893o2001l0356J4843N5326P0387M9354M593l9550o4716
979a0538o1648k9920J7490N6922O7631M7192M632l8846o5128o1401k7506J9131
991h1989N7601O8970M7774L157m0698o5618n9719k7673J7760N7833P0618M8210
1003I6226L983m0405o5811o2238l0408J7832N7791O9404M7928O172l8323o6169
1015d018o4290l0812J6677N5120O6847M8531Q211l7042o5528o2274l0022J5342
$$ plain form
1027 -83258 -31324 33891 82191 90326 53896 -8661 -68477 -96566 -80963 -29838 33343 79745
1039 79745 88046 53195 -8971 -67794 -94239 -76696 -24665 38240 84061 91221 54335 -8172
1051 -8172 -66031 -91444 -74030 -21414 42881 89277 94864 56639 -6515 -65135 -91888 -75002
1063 -75002 -22313 41968 88942 94782 57876 -5181 -64997 -94426 -79535 -27536 37672 84379
1075 84379 91858 56009 -5124 -64062 -94817 -81935 -31694 32434 79817 87295 53761 -4819
1087 -4819 -62257 -92143 -80037 -30631 32280 77100 84694 52496 -4148 -59311 -87543 -74829
1099 -74829 -26060 34916 79168 85977 52964 -3975 -58663 -85188 -70786 -22191 38131 81833
1111 81833 88023 54063 -4415 -59484 -86605 -71970 -22802 38346 82682 88515 54201 -5127
$$ packed form
1027h3258N1934O5215M8300Q135l6430o2557n9816k8089J5603N1125O3181M6402
1039G9745Q301l4851o2166n8823k6445J7543N2031O2905M5821P160l6886o2507
1051h172n7859k5413J7414N2616O4295M6396N587l8225o3154n8620k6753J6886
1063g5002N2689O4281M6974N840l6906o3057n9816k9429J4891N1999O5208M6707
1075H4379P479l5849o1133n8938l0755J2882N0241O4128M7383P478l3534n8580
1087d819n7438k9886J2106M9406O2911M4820P594l2198n6644n5163k8232J2714
1099g4829M8769O0976M4252O809l3013n6939n4688k6525J4402M8595O0322M3702
1111H1833O190l3960n8478n5069k7121J4635M9168O1148M4336N833l4314n9328
$$ plain form
1123 -5127 -61442 -89304 -75865 -27388 33601 79208 86978 53628 -5076 -62009 -90428 -78206
1135 -78206 -31153 29659 75061 84200 53496 -3094 -58441 -87460 -76307 -30233 28748 73235
1147 73235 82856 54054 -599 -54447 -82420 -70937 -25670 31532 73682 82400 53590 100
1159 100 -52700 -79350 -66909 -21843 34059 74584 82179 52168 -2131 -55483 -81362 -67780
1171 -67780 -21811 34055 74660 81081 50470 -4845 -58631 -85673 -72418 -26341 30843 72937
1183 72937 80582 49910 -5549 -59920 -86772 -74827 -29811 27708 71243 80848 51760 -2466
1195 -2466 -56111 -83533 -73198 -29825 26714 70998 81150 53637 1122 -49907 -77462 -68342
1207 -68342 -27037 28037 70888 81190 53232 2072 -47830 -73603 -64483 -24385 28943 70266
$$ packed form
1123e127n6315k7862J3439M8477O0989M5607P770l3350n8704n6933k8419J2222
1135g8206M7053O0812M5402R139l0704n6590n5347k9019J1153M6074N8981M4487
1147G3235R621k8802n4653n3848k7973J1483M5267N7202M2150Q718k8810n3490
1159A00n2800k6650J2441M5066N5902M0525P595l0011n4299n3352k5879J3582
1171f7780M5969N5866M0605O421l0611n5315n3786k7042J3255M6077N7184M2094
1183G2937P645l0672n5459n4371k6852J1945M5016N7519M3535R605k9088n4226
1195b466n3645k7422J0335M3373N6539M4284J0152k7513n2515n1029k7555R120
1207f8342M1305N5074M2851J0302k7958n1160m9902k5773R120M0098N3328M1323
$$ plain form
1219 70266 78930 49985 -714 -49813 -75059 -65101 -24587 28984 68961 75932 46078 -4543
1231 -4543 -53701 -78833 -68745 -26920 27718 68310 75093 45820 -5177 -55464 -81772 -70952
1243 -70952 -27760 27165 68312 76208 48565 -2183 -52715 -79440 -69308 -27230 26596 67679
1255 67679 77974 52663 2940 -47621 -75213 -66175 -24956 27513 67367 77291 52564 4589
1267 4589 -44612 -71448 -62775 -23659 26973 65313 74021 49397 1824 -45942 -71500 -62079 -23451
1280 -23451 25953 63016 70900 45400 -2743 -50047 -74072 -63975 -24156 25787 62873 70639
1292 70639 43103 -4603 -51604 -75454 -65221 -26089 25616 64965 72932 46042 -2418 -50023
1304 -50023 -74865 -65430 -25471 26424 65962 75048 49835 1806 -45796 -71322 -62798 -25329
$$ packed form
1219G0266Q664k8945n0699m9099k5246R958M0514N3571L9977O971k9854n0621
1231d543m9158k5132J0088M1825N4638M0592O783k9273n0997n0287k6308J0820
1243g0952M3192N4925M1147P896k7643n0748n0532k6725J0132M2078N3826M1083
1255F7679J0295k5311m9723n0561k7592R038M1219N2469L9854R924k4727m7975
1267D589m9201k6836Q673L9116N0632L8340Q708k4624m7573m7766k5558R421L8628
1280b3451M9404L7063P884k5500m8143m7304k4025J0097L9819M9943L7086P766
1292G0639k7536m7706m7001k3850J0233L9132N1705L9349P967k6890m8460m7605
1304e0023k4842R435L9959N1895L9538R086k5213m8029m7602k5526Q524L7469
$$ plain form
1316 -25329 24713 64546 75100 51451 3871 -42759 -68228 -61742 -25787 22923 61912 70828
1328 70828 46614 2113 -42698 -67708 -61772 -25974 21602 57936 66235 43346 -530 -46446
1340 -46446 -70742 -60760 -24215 22022 57288 65711 41900 -3563 -47754 -69303 -60415 -24625
1352 -24625 23161 61416 69326 43331 -1717 -45155 -69571 -60908 -22612 27239 63444 70864
1364 70864 47932 3137 -43808 -68515 -58802 -21567 24704 61192 71586 49693 3783 -41713
1376 -41713 -65951 -59714 -26323 21221 59699 68518 44841 2183 -40437 -66111 -62068 -26692
1388 -26692 20850 54600 61275 41272 1449 -42386 -67306 -59661 -24327 19239 52966 62606
1400 62606 41049 -2296 -44715 -64790 -56015 -22906 22046 57459 65006 40408 -1587 -41507
$$ packed form
1316b5329N0042L9833J0554k3649m7580m6630k5469O486L5955M8710L8989Q916
1328G0828k4214m4501m4811k5010N936L5798M7576L6334Q299k2889m3876m5916
1340d6446k4296R982L6545M6237L5266Q423k3811m5463m4191k1549Q888L5790
1352b4625M7786L8255P910k5995m5048m3438k4416Q663L8296M9851L6205P420
1364G0864k2932m4795m6945k4707R713L7235M6271L6488J0394k1893m5910m5496
1376d1713k4238O237L3391M7544L8478Q819k3677m2658m2620k5674M043L5376
1388b6692M7542L3750O675k0003l9823m3835k4920P645L5334M3566L3727R640
1400F2606k1557m3345m2419k0075Q775L3109M4952L5413P547k4598m1995l9920
$$ plain form
1412 -41507 -63656 -57249 -21050 26076 60471 67001 44922 2761 -41914 -65851 -56238 -19426
1424 -19426 24614 58640 68386 47369 2671 -41796 -63648 -56316 -25182 18203 56089 66904
1436 66904 44091 1705 -39731 -63646 -59901 -27882 18455 53069 60161 39904 1788 -39403
1448 -39403 -63643 -56989 -23976 16783 47992 59064 41711 1259 -40470 -60837 -52828 -23174
1460 -23174 18253 54603 64094 39856 -1501 -38559 -58099 -52485 -20111 25263 57646 61638
1472 61638 39612 3757 -36150 -60938 -54233 -19286 23974 55047 64170 45657 2874 -41615
1484 -41615 -63499 -54361 -22918 18993 54292 63819 40685 -153 -38296 -60623 -58912 -28014
1496 -28014 17213 51475 57447 38777 3726 -36446 -62955 -57650 -24281 16615 47158 57177
$$ packed form
1412d1507k2149O407L6199M7126L4395O530k2079m2161m4675k3937R613L6812
1424a9426M4040L4026R746k1017m4698m4467k1852P332L1134M3385L7886J0815
1436F6904k2813m2386m1436k3915L745L2019M6337L4614P092k0257l8116m1191
1448c9403k4240O654L3013M0759L1209J1072j7353m0452m1729k0367Q009K9654
1460b3174M1427L6350R491k4238m1357l7058j9540N614L2374M5374L2383L992
1472F1638k2026l5855l9907k4788O705L4947M3260L1073R123j8513m2783m4489
1484d1615k1884R138L1443M1911L5299R527k3134m0838l8143k2327J711L0898
1496b8014M5227L4262N972j8670l5051m0172k6509N305L3369M0896L0543J0019
$$ plain form
1508 57177 40991 2261 -38433 -58454 -49615 -21591 16626 49953 60191 39194 466 -34679
1520 -34679 -53498 -49343 -20419 21469 53391 59172 38899 3200 -35019 -58019 -50966 -17847
1532 -17847 22027 51578 59678 41054 1455 -39995 -60205 -51481 -21643 17434 50358 59962
1544 59962 39028 -476 -38266 -59034 -55133 -26494 15428 48576 57504 39048 3580 -34927
1556 -34927 -59505 -54904 -24706 15565 46439 56409 40808 4254 -33964 -54383 -48779 -21371
1568 -21371 15496 47118 57140 39720 3930 -31164 -50880 -47881 -20925 18997 49878 56238
1580 56238 37581 3357 -32832 -54244 -48050 -17687 20087 47401 54427 37198 1373 -35679
1592 -35679 -56152 -49985 -21758 15390 47229 56339 37526 -265 -37334 -57454 -53388 -25091
$$ packed form
1508E7177j6186l8730m0694k0021Q839K8024L8217L3327J0238k0997l8728l5145
1520c4679j8819M155K8924M1888L1922N781k0273l5699l8219k3000P053L3119
1532a7847L9874K9551Q100j8624l9599m1450k0210Q724K9838L9077L2924R604
1544E9962k0934l9504l7790k0768L901K8639M1922L3148Q928j8456l5468l8507
1556c4927k4578M601L0198M0271L0874R970j5601l6554l8218k0419N604K7408
1568b1371L6867L1622J0022j7420l5790l5094j9716K999K6956L9922L0881O360
1580E6238j8657l4224l6189k1412O194L0363L7774K7314P026j7229l5825l7052
1592c5679k0473O167K8227L7148L1839R110j8813l7791l7069k0120M066K8297
$$ plain form
1604 -25091 15591 47671 54907 36769 2271 -33792 -55830 -52242 -23882 14407 45413 55320
1616 55320 40481 5911 -30613 -51933 -48122 -22366 14020 45666 56268 39556 6067 -28190
1628 -28190 -48829 -46003 -20299 16362 45473 53189 37330 5136 -29516 -50050 -46174 -19356
1640 -19356 15903 43788 51556 35233 1161 -34154 -53101 -47791 -21013 14619 43504 51240
1652 51240 33890 209 -34813 -54847 -50518 -22895 14301 43753 52314 36280 3418 -33034
1664 -33034 -54130 -49669 -22295 14119 43839 54330 39504 5938 -29369 -49500 -46398 -21332
1676 -21332 14009 44370 54166 39472 7574 -26586 -46815 -45078 -21070 13723 42133 50797
1688 50797 36902 5855 -27432 -47496 -44439 -20731 12673 40119 49270 33618 2177 -30643
$$ packed form
1604b5091M0682L2080P236j8138l4498l6063k2038L588K8360L8289L1006R907
1616E5320j4839l4570l6524k1320L811K5756L6386L1646J0602j6712l3489l4257
1628b8190k0639K826K5704L6661K9111P716j5859l2194l4652k0534L876K6818
1640a9356L5259K7885P768j6323l4072l5315j8947N310K6778L5632K8885P736
1652E1240j7350l3681l5022k0034M329K7623L7196K9452Q561j6034l2862l6452
1664c3034k1096M461K7374L6414K9720J0491j4826l3566l5307k0131L102K5066
1676b1332L5341L0361R796j4694l1898l4160k0229J737K4008L4793K8410Q664
1688E0797j3895l1047l3287k0064L057K3708L3404K7446R151j5652l1441l2820
$$ plain form
1700 -30643 -49014 -45920 -22059 12440 40378 48320 31999 603 -31846 -50786 -47498 -21960
1712 -21960 13117 41794 49993 34434 2964 -30279 -50003 -46563 -21632 13673 42814 52114
1724 52114 37340 6110 -27080 -47309 -45354 -21709 13177 42059 52026 38476 8043 -24897
1736 -24897 -45865 -44593 -21725 11652 39433 48735 36308 6991 -25526 -45910 -43863 -21496
1748 -21496 10312 36499 45795 32918 4086 -27487 -46541 -44050 -21212 10232 36201 44719
1760 44719 31587 2509 -29016 -47111 -43830 -20140 11954 38687 46594 32962 3752 -28098
1772 -28098 -46892 -43361 -19372 13222 40849 49359 35628 5871 -26401 -45305 -43147 -20045
1784 -20045 12469 40067 49605 36810 7419 -24833 -44645 -43298 -21373 10203 37406 47429
$$ packed form
1700c0643j8371L094K3861L4499K7938P942j6321l1396l2449j8940L288K5538
1712b1960L5077K8677Q199j5559l1470l3243j9724L440K4931L5305K9141R300
1724E2114j4774l1230l3190k0229J955K3645L4886K8882R967j3550l0433l2940
1736b4897k0968J272K2868L3377K7781R302j2427k9317l2517k0384K047K2367
1748b1496L1808K6187R296j2877k8832l1573j9054K491K2838L1444K5969Q518
1760D4719j3132k9078l1525j8095L281K3690L2094K6733P907j3632k9210l1850
1772b8098j8794L531K3989L2594K7627Q510j3731k9757l2272j8904K158K3102
1784b0045L2514K7598R538j2795k9391l2252j9812J347K1925L1576K7203J0023
$$ plain form
1796 47429 35146 6699 -24705 -44444 -43247 -22949 7747 34223 44113 32308 4895 -25554
1808 -25554 -44102 -42487 -22326 8270 34111 42837 30735 3780 -25819 -42870 -40884 -20154
1820 -20154 10559 36271 44773 32126 4448 -25093 -42299 -40055 -18124 12444 38259 47040
1832 47040 34562 6310 -23886 -42609 -40304 -19107 11939 38561 47486 34932 6917 -23816
1844 -23816 -42944 -42141 -21583 9000 35293 44788 33673 6364 -23560 -43388 -43462 -23397 6288
1857 6288 32050 41790 31523 5437 -23561 -42021 -41637 -22311 6502 31429 40973 30110 5432
1870 5432 -22493 -40393 -39323 -19526 9451 33895 41836 30631 5841 -21998 -39573 -37380 -16970
1883 -16970 11991 35932 43710 32262 6144 -22470 -40193 -38213 -17782 11659 36330 44257
$$ packed form
1796D7429j2283k8447l1404j9739J197K0298L0696K6476R890j1805k7413l0449
1808b5554j8548J615K0161L0596K5841Q726j2102k6955k9599j7051J986K0730
1820b0154L0713K5712Q502j2647k7678k9541j7206K244K1931L0568K5815Q781
1832D7040j2478k8252l0196j8723K305K1197L1046K6622Q925j2554k8015l0733
1844b3816j9128Q03K0558L0583K6293R495j1115k7309k9924j9828p4K0065K9685
1857F288K5762R740j0267k6086k8998j8460L84J9326K8813K4927R544j0863k4678
1870E432k7925j7900J070J9797K8977K4444P941j1205k4790k7839j7575K193K0410
1883a6970K8961K3941P778j1448k6118k8614j7723J980K0431K9441K4671P927
$$ plain form
1895 44257 32509 5996 -23002 -41473 -40474 -20339 8592 33613 42707 32252 6066 -23337
1907 -23337 -42261 -41770 -22593 5693 31135 41026 31189 6126 -22494 -40322 -40583 -22205 5149
1920 5149 29834 40041 30976 6708 -20598 -37692 -37358 -19683 7118 31313 40705 30864 6819
1933 6819 -19479 -36090 -35339 -17339 9876 32904 41428 31024 6354 -20316 -36931 -35804 -17177
1946 -17177 9559 33010 41376 31078 5669 -21695 -38968 -38023 -20037 8095 32155 41024 30040
1959 30040 5213 -21844 -39768 -40446 -22098 5807 30004 39456 30293 6497 -20647 -38934 -39606
1972 -39606 -21944 5032 29050 39111 30493 8242 -18247 -35757 -36448 -19992 6142 29492
1984 29492 39321 30333 8431 -16820 -33877 -34155 -17839 8240 30607 38797 29642 7141 -18123
$$ packed form
1895D4257j1748k6513k8998j8471R99K0135K8931K5021R094j0455k6186k9403
1907b3337j8924M91J9177K8286K5442R891r837k5063k8620j7828k61J8378K7354
1920E149K4685J0207r065k4268k7306j7094L34J7675K6801K4195R392r841k4045
1933F819k6298j6611P51J8000K7215K3028Q524j0404k4670k6670j6615J127J8627
1946a7177K6736K3451Q366j0298k5409k7364j7273R45J7986K8132K4060Q869j0984
1959C0040k4827k7057j7924o78J8348K7905K4197R452r163k3796k7144j8287o72
1972c9606J7662K6976K4018J0061q618k2251k6489j7510o91J6456K6134K3350
1984B9492R829q988k1902k5251j7057k78J6316K6079K2367Q190r155k2501k5264
$$ plain form
1997 -18123 -35044 -34549 -17223 8126 30070 37886 28718 5335 -21082 -37501 -36320 -18994 6804
2010 6804 29523 37929 28038 4032 -21866 -37966 -38431 -21484 5594 29029 38200 29164 6815
2023 6815 -19342 -37514 -38258 -20918 5408 28367 38564 31390 9051 -17549 -34639 -34705 -18810
2036 -18810 5432 27998 38582 31171 9104 -15319 -31858 -33164 -18615 5821 28374 36881
2048 36881 28964 8716 -16131 -33859 -34184 -17462 6266 26781 35391 27060 5629 -19638 -35023
2061 -35023 -34295 -18520 4886 26617 35838 26611 4224 -19954 -35887 -36688 -20604 5534 28290
2074 28290 36600 27591 5966 -18540 -35738 -36341 -19494 5439 27815 37276 30474 9342 -15902
2087 -15902 -33285 -34037 -19417 4686 27554 38262 30627 9436 -14228 -30239 -32816 -18949 5005
$$ packed form
1997a8123j6921M95J7326K5349K1944P816r168k3383k6417j6419J181J7326K5798
2010F804K2719Q406r891k4006k5898j6100m65J6947K7078K3435R171r036k2349
2023F815k6157j8172p44J7340K6326K2959J0197p174k2339k6600j7090o6J5895
2036a8810K4242K2566J0584p411k2067k4423j6539j306J4549K4436K2553Q507
2048C6881p917k0248k4847j7728l25J6722K3728K0515Q610q331k1431k5267j5385
2061c5023P28J5775K3406K1731R221r227k2387k4178j5933q01J6084K6138K2756
2074B8290Q310r009k1625k4506j7198o03J6847K4933K2376R461o802k1132k5244
2087a5902j7383p52J4620K4103K2868J0708p635k1191k3664j6011k577J3867K3954
$$ plain form
2100 5005 26554 35233 28384 9144 -14315 -31511 -32902 -18479 4365 24801 33490 26517 6251
2113 6251 -17487 -33412 -33283 -18515 4265 24660 33130 25208 4617 -18478 -33773 -34219 -19098
2126 -19098 4510 26238 34548 26878 6462 -17487 -33809 -34454 -18425 5875 26971 36130 29297
2139 29297 9135 -15501 -31895 -32533 -17850 4967 25925 36732 30432 10536 -13798 -30383
2151 -30383 -32318 -18863 3794 24779 34343 28095 9019 -13808 -30108 -32303 -18841 2417 21966
2164 21966 31315 25868 7179 -15654 -31099 -31879 -18893 2093 22482 31711 24549 5213 -16638
2177 -16638 -30648 -32178 -18148 4254 24488 32880 25490 6971 -15278 -31338 -31875 -17269 5486
2190 5486 25893 34953 28406 8540 -14949 -30190 -30857 -17712 4236 26078 35798 28294 8997
$$ packed form
2100E005K1549Q679o849j9240k3459j7196j391J4423K2844K0436Q689o973k0266
2113F251k3738j5925J29J4768K2780K0395Q470p922k0591k3095j5295m46J5121
2126a9098K3608K1728Q310p670k0416k3949j6322o45J6029K4300K1096R159o833
2139B9297k0162k4636j6394o38J4683K2817K0958J0807o300j9896k4334j6585
2151c0383j935J3455K2657K0985R564o248j9076k2827j6300k195J3462K1258J9549
2164B1966R349n447j8689k2833j5445p80J2986K0986K0389R229p162j9336k1851
2177a6638j4010j530J4030K2402K0234Q392p390j8519k2249j6060n37J4606K2755
2190E486K0407R060o547j9866k3489j5241o67J3145K1948K1842R720p504j9297
$$ plain form
2203 8997 -12906 -28673 -32207 -19736 2633 23836 33216 27399 9688 -12756 -30162 -32569 -19646
2216 -19646 1092 20860 30196 25523 7245 -14508 -29097 -31079 -19477 845 21244 30054 23883
2229 23883 6221 -13967 -28539 -30635 -17724 4042 23007 30448 24560 7863 -13639 -29233
2241 -29233 -29812 -15701 5133 23887 33114 27275 8188 -14336 -28780 -29434 -16706 4524 24986
2254 24986 34075 26634 8367 -12831 -28634 -31011 -18581 3058 22583 31153 26534 9586 -12750
2267 -12750 -30123 -32234 -19331 822 19496 29957 25240 7844 -13709 -28282 -29803 -19267
2279 -19267 282 19591 29107 23647 7249 -12025 -26334 -29169 -17849 2892 21621 29768 24313
2292 24313 8246 -12119 -26814 -27816 -14610 4728 22462 30983 25952 8340 -13014 -26457
$$ packed form
2203H997k1903j5767l534J2471K2369K1203R380n817j7711k2444j7406k407J2923
2216a9646K0738J9768R336m673j8278k1753j4589j982J1602K0322K0399Q810o171
2229B3883j7662k0188j4572k096J2911K1766J8965P441n888j6697k1502j5594
2241b9233n79J4111K0834J8754R227n839j9087k2524j4444o54J2728K1230K0462
2254B4986R089p441j8267k1198j5803k377J2430K1639J9525Q570m619j6948k2336
2267a2750j7373k111J2903K0153J8674J0461m717j7396k1553j4573j521J0536
2279a9267J9549J9309R516n460j6398j9274j4309k835J1320K0741J8729Q147n455
2292B4313j6067k0365j4695j002J3206J9338J7734Q521n031j7612k1354j3443
$$ plain form
2304 -26457 -27239 -16219 3391 22876 32243 25704 7702 -12708 -27467 -29782 -18776 2553 22008
2317 22008 30353 24750 7884 -13062 -28843 -31491 -19271 233 18506 28631 24920 8625 -12836
2330 -12836 -27537 -29787 -19289 -593 18755 28731 24375 7896 -10371 -24690 -28183 -17797 1913
2343 1913 20275 28506 23929 9304 -9918 -24814 -26641 -14604 3812 20614 28891 24738 8408
2356 8408 -11416 -25137 -26278 -14741 3273 21175 29631 23668 6542 -12523 -26161 -28881 -17421
2369 -17421 2469 20686 28619 23090 7605 -12672 -28258 -30280 -18528 763 18985 27929 24247
2382 24247 8240 -11983 -26534 -28733 -18537 -232 18486 28129 24305 8847 -9904 -24033
2394 -24033 -26900 -16852 1370 19129 27524 23823 9627 -8741 -22982 -25296 -14809 2405 19152
$$ packed form
2304b6457p82J1020J9610J9485R367o539j8002k0410j4759k315J1006K1329J9455
2317B2008Q345n603j6866k0946j5781k648J2220J9504J8273J0125l711j6295k1461
2330a2836j4701k250J0498J8696J9348R976m356j6479j8267j4319l493J0386J9710
2343A913J8362Q231m577j4625j9222j4896j827J2037J8416J6802Q277m153j6330
2356H408j9824j3721j141J1537J8014J7902Q456n963j7126j9065j3638k720J1460
2369a7421J9890J8217P933n529j5485k0277j5586k022J1752J9291J8222Q944l682
2382B4247j6007k0223j4551k199J0196J8305J8718R643l824j5458j8751j4129
2394b4033k867J0048J8222J7759Q395l701j4196j8368j4241k314J0487J7214J6747
$$ plain form
2407 19152 27485 23554 8642 -10522 -23323 -24998 -14562 2120 18947 27321 22183 6382 -11751
2420 -11751 -25128 -27178 -16689 1698 18772 26829 22328 6470 -12810 -26594 -28822 -17722 790
2433 790 18278 27084 22854 7561 -11520 -25374 -27844 -17336 157 18165 27487 24071 9765
2446 9765 -9130 -22904 -26313 -16854 881 18177 27554 24064 9894 -7875 -21455 -24678 -15351
2459 -15351 1467 17802 25946 22603 8908 -8450 -22183 -24316 -15160 956 17250 24925 20610
2472 20610 6817 -10605 -23726 -25734 -16253 877 16843 24827 20414 6014 -11452 -24858 -27134
2485 -27134 -16362 581 17574 25870 21792 7394 -10973 -24453 -26663 -16466 1053 18067
2497 18067 27239 23616 9486 -8711 -22467 -25199 -15766 894 17719 27018 24021 10184 -7393
$$ packed form
2407A9152Q333l931j4912j9164j2801j675J0436J6682J6827Q374n138j5801j8133
2420a1751j3377k050J0489J8387J7074Q057m501j5858j9280j3784k228J1100J8512
2433G90J7488Q806m230j5293j9081j3854k470J0508J7493J8008R322l416j4306
2446I765j8895j3774l409R459J7735J7296R377l490j4170j7769j3580l223R327
2459a5351J6818J6335Q144l343j3695j7358j3733k133R156J6116J6294P675m315
2472B0610j3793j7422j3121k008R481J7130J5966P984m413j4400j7466j3406k276
2485b7134J0772J6943J6993Q296m078j4398j8367j3480k210J0197J7519J7014
2497A8067R172l623j4130j8197j3756k732R433J6660J6825R299k997j3837j7577
$$ plain form
2510 -7393 -20810 -24298 -15775 210 16545 25061 22463 9094 -8282 -21298 -24182 -15450 236
2523 236 15443 23598 20433 6819 -9837 -22188 -24597 -15482 130 15503 23074 19451 5935
2536 5935 -10802 -23441 -24893 -15660 782 16763 24659 20779 7015 -10212 -22529 -24841 -15741
2549 -15741 1348 17360 26145 22477 9117 -8163 -21523 -24154 -15734 665 17329 26059 23014
2562 23014 9996 -7225 -20565 -23875 -15892 -255 15798 24391 21598 9058 -7397 -20326 -23993
2575 -23993 -16146 -1236 14063 21999 19783 7498 -8318 -20659 -23866 -15691 -964 14140 21711
2588 21711 18709 6500 -9234 -20933 -23440 -15065 450 15507 22872 19768 7189 -8876 -20498
2601 -20498 -23033 -14400 1508 16805 25078 21246 8468 -8176 -20353 -22761 -14655 1159 16944
$$ packed form
2510g393j3417l488Q523J5985J6335Q516k598j3369j7376j3016k884Q732J5686
2523B36J5207Q155l165j3614j6656j2351k409R115J5612J5373P571l623j3516
2536E935j6737j2639j452R233J6442J5981P896l880j3764j7227j2317k312R100
2549a5741J7089J6012Q785l668j3360j7280j3360k631Q420J6399J6664Q730l045
2562B3014j3018j7221j3340l310P983J5637J6053Q593k793j2540j6455j2929l667
2575b3993P847J4910J5299P936k216j2285j5816j2341l207Q175J4727J5104P571
2588B1711l002j2209j5734j1699k507Q375J5515J5057P365l104j2579j6065j1622
2601b0498k535Q633J5908J5297Q273l832j2778j6644j2177k408Q106J5814J5785
$$ plain form
2614 16944 24909 21736 9426 -6893 -20308 -23533 -15374 -488 15163 23501 21045 8916 -7322
2627 -7322 -20381 -23739 -16089 -1792 13186 21410 19159 7526 -7648 -20040 -22943 -15683 -1308
2640 -1308 12430 20443 18562 7452 -7904 -19665 -21838 -13700 267 13890 21699 19335 7391
2653 7391 -7548 -18978 -20832 -12940 1391 15677 23337 20411 8225 -6943 -18953 -21555 -13709
2666 -13709 999 15812 23641 20722 8639 -7310 -19585 -22309 -14749 -566 14361 22333 20111
2679 20111 8224 -7386 -19519 -23129 -16343 -2412 12547 20848 18728 7690 -6474 -18729 -22470
2692 -22470 -15765 -2230 12092 19813 18695 7808 -6525 -17756 -20767 -13967 -853 12888 20771
2705 20771 18750 7591 -6269 -16903 -19514 -12760 695 14819 21784 19042 7972 -6467 -17707
$$ packed form
2614A6944P965l173j2310j6319j3415l225Q159J4886J5651Q338k456j2129j6238
2627g322j3059l358P650J4297J4978Q224k251j1633j5174j2392k903P260J4375
2640a308J3738Q013j881j1110j5356j1761k173Q138J3967J3623P809k364j1944
2653G391j4939j1430j854P892J4331J4286P660k926j2186j5168j2010k602P846
2666a3709J4708J4813P829k919j2083j5949j2275k724P560J4183J4927P972k222
2679B0111j1887j5610j2133l610O786J3931J4959Q301k120j1038j4164j2255l741
2692b2470O705J3535J4322P721j118j0887j4333j1231l011O800J3114J3741P883
2705B0771k021j1159j3860j0634k611O754J3455J4124O965k742j1070j4439j1240
$$ plain form
2718 -17707 -20282 -12583 1078 14714 21857 19230 7472 -7079 -18912 -21359 -14192 -625 13455
2731 13455 20888 18922 7654 -7370 -19118 -22644 -15824 -2116 12230 20087 18668 7856 -7152
2744 -7152 -18439 -22089 -15403 -2222 11116 19334 17731 7848 -5129 -16960 -20096 -13884 -1089
2757 -1089 12057 19859 18380 8717 -5039 -15533 -18512 -12269 428 12869 19827 18239 7814
2770 7814 -5591 -15935 -18425 -12497 -19 12912 20532 17922 7288 -6669 -17356 -20499 -13929
2783 -13929 -476 12481 19871 17336 7018 -7367 -18327 -21120 -14264 -1799 10759 18984 18197
2796 18197 7770 -6201 -17057 -20464 -15303 -2944 11178 19645 18154 8341 -4561 -15466 -19122
2809 -19122 -13856 -1100 11785 18692 17771 8976 -3681 -14640 -17847 -12147 -834 10973 18548
$$ packed form
2718a7707k575P699J3661J3636P143k627j1758j4551j1833k447P167J3567J4080
2731A3455P433j966j1268j5024j1748l526O820J3708J4346P857j419j0812j5008
2744g152j1287l650O686J3181J3338Q218j603r883j2977j1831l136O212J2795
2757a089J3146P802j479r663j3756j0494k979O243J2697J2441O958j588j0425
2770G814j3405j0344k490N928J2478J2931P620k610j0634j3957j0687l143O570
2783a3929J3453J2957P390k535j0318j4385j0960k793O856J2465J2558Q225p87
2796A8197j0427j3971j0856l407N161J2359J4122Q467j491r813j2902j0905l656
2809a9122N266J2756J2885O907r21q795j2657j0959l207N700J1313J1807P575
$$ plain form
2822 18548 17684 8295 -4985 -14955 -17696 -12382 -810 11817 19114 16447 6122 -6078 -16114
2835 -16114 -19387 -13358 -879 11479 17829 15913 6385 -6470 -17651 -20332 -13412 -956 10915
2848 10915 18090 17314 7668 -6037 -17102 -19698 -14129 -2110 11161 19555 17820 8181 -4606 -14778
2862 -14778 -18910 -13280 -1140 11489 18386 17127 9124 -2776 -13703 -17643 -12422 -882 9802
2875 9802 17285 16989 8435 -4615 -14763 -17210 -12081 -1538 10194 17149 15355 5703 -6042 -14807
2889 -14807 -17684 -12406 -1355 10307 16110 14393 6017 -5685 -16227 -19394 -12912 -1156 10498
2902 10498 17336 16312 7208 -6010 -16342 -18219 -12540 -1751 10838 18873 17341 7719 -4337
2915 -4337 -13812 -17531 -13167 -1438 11225 18245 17291 9022 -2530 -13620 -17451 -11951 -1158 9949
$$ packed form
2822A8548q64r389j3280r970k741N314J1572J2627P297k667j0325j2200j0036
2835a6114l273O029J2479J2358O350j916r528j2855j1181k681O920J2456J1871
2848A0915P175p76r646j3705j1065k596N569J2019J3271Q394j735r639j2787j0172
2862a4778m132N630J2140J2629O897j259q003j1900j0927l940N221J1540J0684
2875I802P483k96q554j3050j0148k447N129J0543J1732O955j794r652j1745q765
2889a4807k877N278J1051J1662N803j717q376j1702j0542l167O482J1756J1654
2902A0498O838j024r104j3218j0332j877N679J0789J2589Q035j532r622j2056
2915d337r475l719M364J1729J2663P020r54q269j1552j1090l831N500J0793J1107
$$ plain form
2929 9949 16465 16402 8673 -4153 -14066 -16279 -12179 -2508 8532 16146 14898 6258 -4781 -14028 -16853
2944 -16853 -12599 -2088 9362 15294 13464 5661 -5043 -14822 -17816 -12440 -951 9569 16163
2957 16163 15090 6733 -5003 -14889 -17372 -11482 -948 10647 17855 16418 7679 -3834 -13249 -16376
2971 -16376 -12362 -1293 10404 17761 16379 8792 -2636 -12978 -17116 -12507 -1696 9397 16100
2984 16100 15892 8301 -3520 -13335 -16609 -12039 -2987 7976 14353 14301 6776 -4074 -13129 -16290 -12462
2999 -12462 -2451 8184 14328 13527 6274 -4582 -13342 -16263 -11201 -1212 8884 15071 14077 6714
3013 6714 -4428 -13557 -15614 -10857 -783 9561 16375 15648 7531 -3850 -12654 -15851 -11274 -991
3027 -991 9890 16809 15877 7989 -3120 -12767 -16509 -11965 -2142 8775 15579 15510 8264 -3369 -12917
$$ packed form
2929I949O516o3p729j2826r913k213M100R671J1040P614j248q640j1039r247k825
2944a6853M254J0511J1450N932j830p803j0704r779k994N376J1489J0520O594
2957A6163j073q357j1736r886k483N890J0534J1595P208j437q739j1513r415l127
2971a6376M014J1069J1697P357j382p587j1428j0342m138M609J0811J1093O703
2984A6100k08p591j1821r815l274M570R052J0963O377n2p525j0850r055l161L828
2999a2462J0011J0635O144q01p253j0856q760k921N062R989J0096O187r94p363
3013F714j1142r129k057M757J0074J0344O814p27q117j1381q804l197M577J0283
3027i91J0881O919r32p888j1109r647l742M544R823J0917O804o9p246j1633r548
$$ plain form
3042 -12917 -15993 -12615 -3181 7225 14189 13849 6873 -3439 -12360 -15863 -12282 -3363 6766 13675
3056 13675 13388 6377 -3525 -11702 -15143 -11127 -1826 8328 14512 13858 6664 -3497 -11938 -14511 -10159
3071 -10159 -755 9412 15938 14209 7245 -3300 -12017 -14620 -10436 -630 9972 15860 14690 7525
3085 7525 -3350 -12174 -15808 -11154 -2052 8230 14827 14487 7345 -3380 -12685 -16007 -12342 -3400
3099 -3400 7077 13556 13472 6916 -3258 -11918 -15507 -12462 -3416 6857 13059 13367 7146 -2613 -11111
3114 -11111 -14332 -10669 -1997 7386 13491 13268 7132 -2817 -10831 -13134 -9775 -883 8943 14398 13718
3129 13718 6639 -2734 -11200 -13940 -9905 -1117 8460 14606 14108 6914 -3379 -12099 -15039 -11075 -1847
3144 -1847 7871 13843 13657 6594 -3834 -12450 -15826 -11991 -3214 6542 12978 12953 6639 -3071 -11569
$$ packed form
3042a2917l076L378R434J0406O964l40o976j0312q921l503L581Q919J0129O909
3056A3675k87p011r902q177l441M016R301J0154O184o54p194j0161q441k573M352
3071a0159R404J0167O526j729o964j0545q717k603M184R806J0602N888j170p165
3085G525j0875q824l634M654R102J0282O597l40p142j0725r305l322L665Q942
3099c400J0477O479q4o556j0174q660l589L045R046J0273O202L08o221r759q498
3114a1111l221L663Q672R383O105k23o136r949q014k303L359Q892R826N455o80
3129A3718p079r373q466k740M035Q788R577O146m98p194j0293q720k940L964R228
3144a847R718N972j86p063j0428q616l376L835Q777R756O436k5o314r710q498
$$ plain form
3159 -11569 -15011 -11706 -3137 6638 13013 12979 7250 -1977 -10612 -13921 -10677 -2275 7108 12998 13134
3174 13134 7700 -1840 -9480 -12654 -9505 -1335 7879 13326 12891 6604 -2079 -10069 -12714 -9168 -1495
3189 -1495 7439 13266 12778 6285 -3006 -11093 -14062 -10529 -2127 7136 13180 12799 6184 -3728 -11610
3204 -11610 -15072 -11386 -3108 6737 12723 12888 6643 -2576 -11016 -14586 -11626 -3034 6523 12630 13263
3219 13263 7477 -1588 -10025 -13442 -10503 -2530 6673 12573 12879 7360 -967 -9251 -12363 -9565 -1693
3234 -1693 6325 12429 12880 7079 -1609 -9475 -12198 -9287 -1738 6616 12046 11972 6176 -2914 -10492 -13250
3250 -13250 -10042 -2311 6613 12131 11587 5765 -3307 -11052 -13693 -10181 -2626 6308 12220 12198 6281
3265 6281 -2596 -10504 -13604 -10550 -2665 6538 12426 12956 7311 -1450 -9388 -12581 -10101 -2618 6137
$$ packed form
3159a1569l442L305Q569R775O375l4n729r227q635l309L244Q402R383N890J36
3174A3134n434r540p640l174L149Q170R214N447m35o287q683p990k645L546P673
3189a495Q934N827m88o493r291q087k969L533Q402R263O044l81o615r912p882
3204a1610l462L686Q278R845N986J65o245r219q440l570K960Q592R557O107O33
3219A3263n786r065q437l417K939P973R203N900L06n519q327q284l112K798P872
3234a693Q018O104M51n801q688p866k723K911P549Q354N430p4n796r090p578k758
3250a3250L208P731Q924N518n44n822r072p745k641L512P555Q934N912k2n917
3265F281q877p908l100L054P885R203N888N30n645q761p938l193K480P483Q755
$$ plain form
3280 6137 12476 13321 7772 -675 -8514 -11740 -9409 -2709 6055 11887 12263 7056 -1347 -8774 -11753
3295 -11753 -9549 -2557 5675 10858 11306 5787 -2552 -9316 -12418 -9864 -2353 5220 10996 10715 5345
3310 5345 -2909 -10134 -12807 -9841 -2747 6081 11467 11423 5825 -2464 -9713 -13067 -9842 -2244 6348
3325 6348 12192 12682 7043 -1225 -8928 -12241 -9696 -2401 6146 12486 12852 7600 -864 -8387 -11843
3340 -11843 -9696 -2347 5550 11257 11530 7012 -812 -8468 -11994 -9814 -2856 4585 10044 10457 5880
3355 5880 -2022 -8999 -12070 -9752 -2656 4836 9934 10456 5191 -2383 -9275 -12147 -9211 -2251 5474
3370 5474 10765 10855 5682 -2131 -9227 -11806 -8781 -1815 6178 11710 11616 6625 -1386 -8681 -11581 -8999
3386 -8999 -2056 6062 11813 12618 7432 -836 -7835 -11456 -9302 -2767 5374 10844 11726 6746 -858
$$ packed form
3280F137O339Q45n549q447p839l226K331O700Q764N832L76n207q403p427k979
3295a1753K204O992Q232N183M48n519q339o764l102K554P511P573N776k81n370
3310E345q254p225k673K966P094Q828N386m4n598q289p249l354L225P598Q592
3325F348N844M90n639q268p703l313K545P295Q547O340L66n252q464p523l456
3340a1843K147P349P897N707K73m518p824p656l526K180O958P441N459M13m577
3355E880p902o977l071K318P096P492N098N22n265p574o892k872K936O960P725
3370E474N291R0n173p813p096k579L025O966P993N532r4m991q011p295k900K582
3386h999O943Q118N751Q05n186q268o999l621K154O535Q141N470Q82m980p604
$$ plain form
3401 -858 -8164 -11386 -9754 -3218 4341 9858 10733 5795 -1513 -8203 -11061 -9176 -3038 4123 9303
3416 9303 9565 5015 -1874 -8281 -10979 -8811 -2585 5066 10128 10292 5483 -1743 -8287 -10936 -8238
3431 -8238 -1580 5707 10907 11434 6354 -1560 -7972 -10586 -8272 -1862 5941 11183 11336 6791 -971
3446 -971 -7910 -11454 -9553 -2505 5488 10515 11144 6557 -932 -8092 -11607 -9454 -3409 3518 9231
3461 9231 10063 6132 -1142 -8050 -10915 -9975 -3826 3753 8962 9580 5716 -1222 -7515 -10697 -8564 -2115
3477 -2115 4994 9064 9811 5749 -1003 -7190 -9816 -7406 -1681 5060 9932 10861 6302 -1233 -7261
3492 -7261 -10294 -8070 -2131 5399 10901 10962 6256 -1368 -7858 -10792 -8973 -2509 4800 9799 10450 5815
3508 5815 -995 -8082 -11106 -9278 -3404 3699 8730 10421 6316 -1175 -7657 -10724 -9243 -3800 3546
$$ packed form
3401h58p306l222J632O536P559N517Q75m938p308o690k858J885O138P161N180
3416I303K62m550o889o407k698K168O226P651N062J64m809p226o544k649K698
3431h238O658P287N200N27n080p914o412k614K314O410P803N242J53m545p762
3446i71o939l544J901P048P993N027O29m587p489p160l515K153O045O927N713
3461I231Q32l931p274o908k865R40O149P579N209O18l864o938o293l182K133O449
3477b115P109M070P47m062o752o187k626K410N725O741M872R29m559p535o028
3492g261l033K224N939P530N502O1m706p624o490k934J819O464P309M999O51m635
3508E815o810p087l024J828N874P103N031J691m105p491o482l067J481N443P346
$$ plain form
3523 3546 8821 9451 5660 -715 -6893 -10009 -8305 -2745 4338 8768 9537 5922 -190 -6411 -9265
3538 -9265 -7091 -1626 4792 9395 10141 5757 -920 -6866 -9232 -7281 -1689 5366 9738 10067 5312
3553 5312 -1298 -7590 -10202 -8619 -2372 4683 9345 9782 5719 -1106 -7778 -11004 -8994 -3466 3587
3568 3587 9009 9761 5767 -1298 -7606 -10473 -8858 -3056 3839 8702 9405 5654 -334 -6214 -9507
3583 -9507 -7747 -2910 3675 8600 9698 6046 230 -5760 -8928 -7279 -1899 4365 9013 9429 5703
3598 5703 -650 -6239 -8532 -6831 -2284 4205 8962 8712 5032 -1008 -6981 -9734 -7865 -2083 3985
3613 3985 8467 8746 5041 -1662 -8076 -10490 -8360 -2937 3835 8375 8890 5297 -891 -7170 -10221
3628 -10221 -8708 -3194 3915 8607 9149 6064 -165 -6238 -9339 -7765 -2392 3817 8158 9463 5721
$$ packed form
3523C546N275O30l791o375o178l116J704N560P083M430P69l615o112o221k854
3538i265K174N465O418M603P46m384o677n946k366J951N592P055M372L29m755
3553E312o610o292k612J583O247P055M662M37m063o825o672l226K010N528P053
3568C587N422P52l994p065o308k867J615N802O895M863P03l751n988n880l293
3583i507J760M837O585M925J098l652n816n990l168J649N380O264M648M16l726
3598E703o353n589k293J701M547O489M757k50l680o040n973k753J869N782O068
3613C985M482K79l705o703o414k414K130N423O772M540N15l593o188o279l051
3628a0221J513N514P109M692N42l085o229o073l101J574N373O209M341J305l742
$$ plain form
3643 5721 130 -5589 -8205 -7069 -2656 3560 8404 8959 5561 -148 -5434 -8555 -7124 -2192 3814
3658 3814 8050 8210 4859 -1328 -6719 -9225 -7225 -2326 3338 7627 8286 4787 -1705 -7219 -9642
3673 -9642 -7726 -2794 3870 8317 8672 5050 -1427 -6676 -9583 -8006 -2887 3946 8428 9270 5844
3688 5844 177 -5753 -9124 -7354 -2566 3620 8400 9336 6092 111 -5349 -7760 -6740 -2541 3270
3703 3270 7825 8521 5524 84 -5480 -7943 -7347 -2350 3479 6852 7540 4609 -707 -6142 -8461 -7215
$$ packed form
3643E721n591n719k616J136M413O216M844N55l398n709n286l121J431M932O006
3658C814M236J60l351o187n391k506K000M899N664M289O59l499o492n514k423
3673i642J916M932O664M447L55l622o477n249k907J577N119O833M482Q42l426
3688E844n667n930l371J770M788O186M780R36l244n981n460k411J020M199N811
3703C270M555O96k997n440n564k463N96M997N829L373O88k931n316n435k319J246
$$ [...]
8191h03
##END NTUPLES=NMR FID
##END=
