##TITLE=1H_PR159R_rm2
 DMSO-d6, 8 sc, 
 29.4.2019
##JCAMPDX= 6.0         $$ Bruker NMR JCAMP-DX V2.0
##DATA TYPE= NMR FID
##DATA CLASS= NTUPLES
##ORIGIN= UXNMR, Bruker Analytische Messtechnik GmbH
##OWNER= root
$$ XWIN-NMR		Version 3.5
$$ Mon Apr 29 14:11:04 2019 Russian Standard Time (UT+4h)  she@DPX200
##.OBSERVE FREQUENCY= 200.1315
##.OBSERVE NUCLEUS= ^1H
##.DELAY= (6, 6)
##.ACQUISITION MODE= SIMULTANEOUS
##.ACQUISITION SCHEME= undefined
##.AVERAGES= 8
##.DIGITISER RES= 18
##SPECTROMETER/DATA SYSTEM= spect
##.PULSE SEQUENCE= zg30
##.SOLVENT NAME= CDCl3
##.SHIFT REFERENCE= (INTERNAL, CDCl3, 0, 15.7039)
##AUDIT TRAIL= $$ (NUMBER, WHEN, WHO, WHERE, WHAT)
$$ ##TITLE= Audit trail, XWIN-NMR		Version 3.5
$$ ##JCAMPDX= 5.01
$$ ##ORIGIN= Bruker BioSpin GmbH
$$ ##OWNER= she
$$ F:/spectra/data/she/nmr/H-F/1/audita.txt
$$ ##AUDIT TRAIL=  $$ (NUMBER, WHEN, WHO, WHERE, WHAT)
(   1,<2019-04-29 14:10:00.68 +0400>,<she>,<DPX200>,
      <created by zg, POWCHK disabled, PULCHK disabled
       configuration hash MD5:
       00 E9 B6 7A A2 85 ED C7 34 08 36 98 17 FE 4E 26
       data hash MD5: 16K
       00 E2 A5 CE 60 78 90 37 C7 7B 30 8C 3D 87 FD 04>)
$$ ##END=
$$ 
$$ hash MD5
$$ 94 12 98 B9 C4 90 7D 07 0A BE 30 41 24 93 8E 4A
##$RELAX= 
##$RELAX= 
##$RELAX= 
##$RELAX= 
##$RELAX= 
##$RELAX= 
$$ Bruker specific parameters
$$ --------------------------
##$DU= <F:/spectra>
##$EXPNO= 1
##$NAME= <H-F>
##$PROCNO= 1
##$TYPE= <nmr>
##$USER= <she>
##$AMP= (0..31)
100 100 100 100 100 100 100 100 100 100 100 100 100 100 100 100 100 100 
100 100 100 100 100 100 100 100 100 100 100 100 100 100 
##$AQSEQ= 0
##$AQ_mod= 1
##$AUNM= <au_zg>
##$AUTOPOS= <>
##$BF1= 200.13
##$BF2= 200.13
##$BF3= 200.13
##$BF4= 200.13
##$BF5= 200.13
##$BF6= 200.13
##$BF7= 200.13
##$BF8= 200.13
##$BYTORDA= 1
##$CFDGTYP= 0
##$CFRGTYP= 5
##$CHEMSTR= <none>
##$CNST= (0..31)
1 1 145 1 1 1 1 1 1 1 1 1 1 1 1 1 1 1 1 1 1 1 1 1 1 1 1 1 1 1 1 1 
##$CPDPRG= <>
##$CPDPRG1= <>
##$CPDPRG2= <>
##$CPDPRG3= <>
##$CPDPRG4= <mlev>
##$CPDPRG5= <mlev>
##$CPDPRG6= <mlev>
##$CPDPRG7= <mlev>
##$CPDPRG8= <mlev>
##$CPDPRGB= <>
##$CPDPRGT= <>
##$D= (0..31)
0 1.2 0 0 0 0 0 0 0 0 0 0.03 0 0 0 0 0 0 0 0 0 0 0 0 0 0 0 0 0 0 0 0 
##$DATE= 1556532600
##$DBL= (0..7)
120 120 120 120 120 120 120 120 
##$DBP= (0..7)
150 150 150 150 150 150 150 150 
##$DBP07= 0
##$DBPNAM0= <>
##$DBPNAM1= <>
##$DBPNAM2= <>
##$DBPNAM3= <>
##$DBPNAM4= <>
##$DBPNAM5= <>
##$DBPNAM6= <>
##$DBPNAM7= <>
##$DBPOAL= (0..7)
0.5 0.5 0.5 0.5 0.5 0.5 0.5 0.5 
##$DBPOFFS= (0..7)
0 0 0 0 0 0 0 0 
##$DE= 6
##$DECBNUC= <off>
##$DECIM= 24
##$DECNUC= <off>
##$DECSTAT= 4
##$DIGMOD= 1
##$DIGTYP= 9
##$DL= (0..7)
0 120 120 120 120 120 120 120 
##$DP= (0..7)
150 150 150 150 150 150 150 150 
##$DP07= 0
##$DPNAME0= <>
##$DPNAME1= <>
##$DPNAME2= <>
##$DPNAME3= <>
##$DPNAME4= <>
##$DPNAME5= <>
##$DPNAME6= <>
##$DPNAME7= <>
##$DPOAL= (0..7)
0.5 0.5 0.5 0.5 0.5 0.5 0.5 0.5 
##$DPOFFS= (0..7)
0 0 0 0 0 0 0 0 
##$DQDMODE= 0
##$DR= 18
##$DS= 0
##$DSLIST= <SSSSSSSSSSSSSSS>
##$DSPFIRM= 0
$$ [...]
##$SUBNAM2= <"">
##$SUBNAM3= <"">
##$SUBNAM4= <"">
##$SUBNAM5= <"">
##$SUBNAM6= <"">
##$SUBNAM7= <"">
##$SUBNAM8= <"">
##$SUBNAM9= <"">
##$SW= 24.9337058887773
##$SWIBOX= (0..15)
0 0 2 0 0 0 0 0 0 0 0 0 0 0 0 0 
##$SW_h= 4990.01996007984
##$TD= 16384
##$TD0= 1
##$TE= 0
##$TE2= 300
##$TE3= 300
##$TEG= 300
##$TL= (0..7)
0 120 120 120 120 120 120 120 
##$TP= (0..7)
150 150 150 150 150 150 150 150 
##$TP07= 0
##$TPNAME0= <>
##$TPNAME1= <>
##$TPNAME2= <>
##$TPNAME3= <>
##$TPNAME4= <>
##$TPNAME5= <>
##$TPNAME6= <>
##$TPNAME7= <>
##$TPOAL= (0..7)
0.5 0.5 0.5 0.5 0.5 0.5 0.5 0.5 
##$TPOFFS= (0..7)
0 0 0 0 0 0 0 0 
##$TUNHIN= 0
##$TUNHOUT= 0
##$TUNXOUT= 0
##$USERA1= <user>
##$USERA2= <user>
##$USERA3= <user>
##$USERA4= <user>
##$USERA5= <user>
##$V9= 5
##$VALIST= <valist>
##$VCLIST= <CCCCCCCCCCCCCCC>
##$VD= 0
##$VDLIST= <DDDDDDDDDDDDDDD>
##$VPLIST= <PPPPPPPPPPPPPPP>
##$VTLIST= <TTTTTTTTTTTTTTT>
##$WBST= 1024
##$WBSW= 4
##$XGAIN= (0..3)
0 0 0 0 
##$XL= 0
##$YL= 0
##$YMAX_a= 260448
##$YMIN_a= -259929
##$ZGOPTNS= <>
##$ZL1= 120
##$ZL2= 120
##$ZL3= 120
##$ZL4= 120
##$ABSF1= 10
##$ABSF2= 0
##$ABSG= 5
##$ABSL= 3
##$ALPHA= 0
##$AQORDER= 0
##$ASSFAC= 0
##$ASSFACI= 0
##$ASSFACX= 0
##$ASSWID= 0
##$AUNMP= <proc_1d>
##$AZFE= 0.1
##$AZFW= 0.1
##$BCFW= 1
##$BC_mod= 2
##$BYTORDP= 1
##$COROFFS= 0
##$CY= 11.3945322036743
##$DATMOD= 1
##$DC= 2
##$DFILT= <>
##$DTYPP= 0
##$F1P= 18.9103706918063
##$F2P= -1.10871071338519
##$FCOR= 0.5
##$FTSIZE= 0
##$FT_mod= 4
##$GAMMA= 1
##$GB= 0.15
##$INTBC= 1
##$INTSCL= 1
##$ISEN= 128
##$LB= 0.24
##$LEV0= 0
##$LPBIN= 0
##$MAXI= 10000
##$MC2= 0
##$MEAN= 0
##$ME_mod= 0
##$MI= 1.114404
##$NCOEF= 0
##$NC_proc= 0
##$NLEV= 6
##$NOISF1= 3.799351
##$NOISF2= 2.8
##$NSP= 1
##$NTH_PI= 0
##$NZP= 0
##$OFFSET= 15.70392
##$PC= 1
##$PHC0= -8859.381
##$PHC1= 23.20026
##$PH_mod= 1
##$PKNL= yes
##$PPARMOD= 0
##$PSCAL= 0
##$PSIGN= 0
##$REVERSE= no
##$SF= 200.130013532006
##$SI= 16384
##$SIGF1= 3
##$SIGF2= 2
##$SINO= 400
##$SIOLD= 16384
##$SREGLST= <1H.CDCl3>
##$SSB= 0
##$STSI= 0
##$STSR= 0
##$SW_p= 3612.71676300578
##$SYMM= 0
##$S_DEV= 0
##$TDeff= 0
##$TDoff= 0
##$TI= <>
##$TILT= no
##$TM1= 0
##$TM2= 0
##$TOPLEV= 0
##$USERP1= <user>
##$USERP2= <user>
##$USERP3= <user>
##$USERP4= <user>
##$USERP5= <user>
##$WDW= 1
##$XDIM= 8192
##$YMAX_p= 0
##$YMIN_p= 0
$$ End of Bruker specific parameters
$$ ---------------------------------
##NTUPLES= NMR FID
##VAR_NAME=  TIME,          FID/REAL,        FID/IMAG
##SYMBOL=    X,             R,               I
##VAR_TYPE=  INDEPENDENT,   DEPENDENT,       DEPENDENT
##VAR_FORM=  AFFN,          ASDF,            ASDF
##VAR_DIM=   8192,          8192,            8192
##UNITS=     SECONDS,       ARBITRARY UNITS, ARBITRARY UNITS
##FACTOR=    0.0002004,     1,               1
##FIRST=     0,             0,               0
##LAST=      1.6414764,     0,               0
##MIN=       0,             -259929,         0
##MAX=       1.6414764,     260448,          0
$$ Real data points
##PAGE= N=1
##DATA TABLE= (X++(R..R)), XYDATA
$$ [...]
1907a56M7K35l16L12j10j51j27J66L45j44n40N52J7m07K88K2J14n28L84l02K56
$$ -156 -109 126 -190 122 12 -139 -266 -100 245 101 -439 113 130 -277 11 33 147 -381 3 -299 -43
1928d3p9N06m11K12j15j15J65J87m2k98J0J91K63l51Mj16k7J95p6k26qL6L77k07
$$ -43 -122 384 -27 185 70 -45 120 307 265 -33 -23 168 431 80 84 -32 -59 136 60 -166 -174 -138 239 32
1952C2O0j38K04j58R5p4O9n0k21M31P5p6n06K94J60N4m58n0L18NpJ29qr2k17j60
$$ 32 92 -46 158 0 95 21 90 40 -181 250 325 249 -257 37 197 251 -207 -257 61 66 59 188 180 88 -129 -289
1978b89L0r1J12K56j61J31L1O7L4l81K76l0k3L07l49K05o4J95l03K43l8m17J56
$$ -289 -259 -350 -238 18 -143 -12 19 86 120 -261 15 -15 -38 269 -80 125 61 256 -47 196 158 -259 -103
2001a03k74L45J98l10R2K49j55m49J90M69j85o7P6Q8j24K08m2J01k78m64M62M00
$$ -103 -377 -32 166 -144 -52 197 42 -407 -217 252 67 0 76 164 40 248 206 307 29 -435 27 427
2023D27o50J17J28L72k91m94L13L86l45k89K87K23k66K12O1l14q6J99j1K4P7n20
$$ 427 -223 -106 22 394 103 -391 -78 308 -37 -326 -39 184 -82 130 191 -123 -209 -10 -21 3 80 -440
2045d40P77q3l46J30O2j62J40m22M28Pl19N65M1k69n03L99L36l7o87L03O34n75
$$ -440 337 254 -92 38 100 -62 78 -344 84 91 -228 337 378 109 -394 5 341 304 -383 -80 554 -21
2067b1n00O35J74k89l27R1J63j63K07J70N5j06m19M14j3q7o2j23M62m55R8m4M24
$$ -21 -521 114 288 -1 -328 -237 -74 -237 -30 140 195 89 -330 84 71 -16 -78 -201 261 -194 -96 -140 284
2090B84m11k03P51p9o31k26O34K32k99q7k87K31J66l87M40j62P0k16L03J35m59
$$ 284 -127 -330 421 342 -289 -515 119 351 52 -35 -322 -91 75 -312 128 -34 36 -180 123 258 -201
2111b01K26K53K06q16O1N69k73p6j60J94L68k01k24K27l55P6k11L24L35p11L64
$$ -201 25 278 484 -332 -271 298 25 -51 -211 -17 351 150 -74 153 -202 -126 -337 -13 322 -389 -25
2132b5K96k30l22R9K10M05o99J33K79p5k3J43J66n95l7J82J08N3p2J89K63l86
$$ -25 271 41 -281 -182 28 433 -266 -133 146 71 48 191 357 -238 -275 -93 15 68 -4 185 448 62
2154F2k22K83r8J36k69M3k40L11j73M5M92o07K37M3m3l40J85J52Q6j68j51M84
$$ 62 -160 123 25 161 -108 -65 -305 6 -167 -122 370 -237 0 43 0 -340 -155 -3 83 -85 -236 248
2176B48k19J35k93K06k32K69K9o1K15p7j13M2j82j93J15K78%m38M9L08j5j07k18
$$ 248 29 164 -129 77 -155 114 143 82 297 220 107 149 -33 -226 -111 167 167 -271 -222 86 71 -36 -254
2199b54K96k3j37L2K64k47Q7k66L49j37j69NK61k15J44n8m7K64m78L91Q4j27l00
$$ -254 42 19 -118 -86 178 -69 18 -248 101 -36 -205 -200 61 -154 -10 -68 -115 149 -329 62 146 19 -281
2222b81M16O5j06k18J8J74j14m08M17K60J9m16JP1L75j63J00j20j08j23L67J87
$$ -281 135 200 94 -124 -106 68 -46 -454 -37 223 242 -174 -173 -102 273 110 210 90 -18 -141 226 413
2244D13l23pk54M33mj30l99M84p6J32l77P0m8m0L11k96j31m1K87J79l15k14J03
$$ 413 90 83 -171 262 258 128 -271 213 137 269 -108 -38 -86 -126 185 -111 -242 -283 4 183 -132 -346 -243
2267b43L67p0k28R3oK66m70L54q3J68j10j4J84k66L09O9k62qn42P85l43j6m02
$$ -243 124 54 -174 -81 -87 179 -291 63 -20 148 38 24 208 -58 251 320 58 50 -492 293 -50 -66 -468
2290d68N81K28k59r8k25K53k27K56L4m0k25n3J82R6k56j40L94J24m72pL03j42
$$ -468 113 341 82 -16 -241 12 -215 41 75 35 -190 -243 -61 35 -221 -361 33 157 -315 -322 -19 -161
2312a61r3K03K53j49l55N70m9j98j16J50J17l25J15L48j30J06k00j66M35l21j25
$$ -161 -254 -51 202 53 -302 268 219 21 -95 55 172 -153 -38 310 180 286 86 -80 355 34 -91
2333i1J78K92m17j86K59m5r2N9k5L40k63j93q0K34K19k16J70l5k56J12J56r3j79
$$ -91 87 379 -38 -224 35 -10 -102 -43 -68 272 9 -184 -264 -30 189 -27 143 108 -148 -36 120 27 -152
2356a52k85M52j25k62O7J27L88j51j5k7M31k81r0l70L33m20L35J66o1j95q3N12
$$ -152 -437 15 -110 -372 -305 -178 210 59 44 17 448 167 77 -293 40 -380 -45 121 60 -135 -218 294
2378B94l88J00l55M61j23jj14K56m6j86L47k0o08L64L0R9J54m23j51M58J00j69
$$ 294 -94 6 -349 112 -11 -12 -126 130 84 -102 245 225 -383 -19 11 110 264 -159 -310 148 248 79
2400G9l01K35K95m91j43K89m0N18j98m74j18O3K53J78j02l34L06M5J22l21m7L20
$$ 79 -222 13 308 -183 -326 -37 -77 441 243 -231 -349 -286 -33 145 43 -291 15 60 182 -139 -186 134
2422A34N8l39k15M67k53O26m47k00j25L36K25J90p18J26J47K19m8n54K53m7M9
$$ 134 192 -147 -362 105 -148 478 31 -169 -294 42 267 457 -261 -135 12 231 183 -371 -118 -165 -116
2443a16M97l49k48Q2L36l69K93k46K53K30k99l46m1K09L89Jn39K60j56K50j18
$$ -116 381 32 -216 -134 202 -167 126 -120 133 363 64 -282 -323 -114 275 276 -263 -3 -159 91 -27
2464b7K0K51j05Q1n9m34j30M60J71M7m49M8K7L16r3l36K4j98M93J40l21k30K42
$$ -27 -7 244 139 220 161 -273 -403 57 228 275 -174 -126 -99 217 124 -212 -188 -386 107 247 -74 -304 -62
2487f2L45j64k44P9L54K9k36J27q7m43N78l4k14K10l18R2K30j52J26m62M05k74
$$ -62 283 119 -125 -46 308 337 101 228 141 -302 276 242 28 238 -80 12 242 90 216 -246 159 -115
2509a15L3l79J89N90q3k28N6m38N44o2k12j3J53K35r0j60k67K65J58l13J65k05
$$ -115 -82 -461 -272 318 235 7 63 -375 169 107 -105 -118 35 270 180 20 -247 18 176 -137 28 -177
2531a77J76J06J61l36l22J92L87N8l99R5j64J80j2j51J45j53J33mk54l0J47J51
$$ -177 -1 105 266 -70 -392 -200 187 245 -154 -59 -223 -43 -55 -206 -61 -214 -81 -85 -339 -369 -222 -71
2553g1L05n3l75J46Q3M10m46j00j30N07L1l95J47k78O18k12k58k39J14M02j0q4
$$ -71 234 181 -194 -48 35 445 -1 -101 -231 276 307 -88 59 -219 399 187 -71 -310 -196 206 196 112
2575A12l00L3J52K18j90k85N3J56r0j48K33k3N2j63J2j97K43K45K09m54k27k5
$$ 112 -188 -155 -3 215 25 -260 -207 -51 -141 -289 -56 -79 -27 -190 -178 -375 -132 113 322 -132 -359 -384
2597c84P9N90l86N8o2j60N76o4n28k3N47K10m87l36P5J38K04J06j97J32J40p6
$$ -384 -305 285 -101 -43 -105 -265 311 247 -281 -304 243 453 -34 -370 -295 -157 47 153 -44 88 228 152
2619A52k75N4K60k00M48p84L37r0r8K81R3l13k00K08L85k07r6k35J52M22k97k10
$$ 152 -123 -69 191 -9 439 -345 -8 -98 -196 85 178 -135 -335 -127 258 51 -45 -280 -128 294 -3 -213
2641b13q1M00k38J88M1l84K04M11k63l19J68K87M3q9k92k72K19M22j47j14j10
$$ -213 -294 106 -132 56 97 -287 -83 328 65 -254 -86 201 244 155 -137 -409 -190 232 85 -29 -139
2662a39O3N6q6J05n5J71J09m21p1J39R8J92k4j89m3J09k50J57r0n8N92j45j26
$$ -139 -76 -20 -106 -1 -56 115 224 -197 -268 -129 -31 161 137 -52 -95 14 -236 -79 -169 -227 365 220 94
2685I4m15K39k07J78K36l28L50k89K38j57j98K56K7o0J86l31r7K91J07J7l89m8
$$ 94 -321 -82 -289 -111 125 -203 147 -142 96 -61 -259 -3 24 -36 150 -181 -278 13 120 137 -252 -300
2707c00L94L1k5k13k42M24J11l54J20Q3k9M23m72J59j10K03J20j26m18J62N6J10
$$ -300 94 125 100 -113 -355 69 180 -174 -54 29 0 423 -49 110 0 203 323 197 -221 -59 -3 107
2729A07L08n15l99L36L73j09k75K67k0L34n30j0J62J7L62k93L4m90L10M36j99
$$ 107 415 -100 -499 -163 210 101 -174 93 73 407 -123 -133 29 46 408 115 149 -341 -31 405 206
2750B06l29K82k05K1K31j15n06K37N05k08j97q6j14M63m11J15L8r3N38j46m26
$$ 206 -123 159 -46 -25 206 91 -415 -178 327 119 -78 -164 -278 185 -226 -111 -73 -166 372 226 -200
2771b00j24Q3L81j81L8K14k06j3M3J65k27k28L20J02K4k6l10L31j75j25j28J82
$$ -200 -324 -241 140 -41 -3 211 5 -8 35 200 -27 -255 65 167 191 165 -145 186 11 -114 -242 -60
2793f0K02j87N05m01j18N05j08j00j35j33N1Ok07K75l6%L78o35K76n3J45j68o4
$$ -60 142 -45 460 59 -59 446 338 238 103 -30 21 27 -180 95 59 59 437 -198 78 25 170 2 -62
2816f2M0k55L27J84l50j06m3N89N2m91M1l12P33j35k48p7J15k1n5J99j69J1L42
$$ -62 -22 -277 50 234 -116 -222 -265 324 376 -115 -74 -386 347 212 -36 -113 2 -19 -74 125 -44 -33 309
2839C09l43j05o2kK06M43l19l31lJ36L16k45M7l94O45K7m56j34N7K00J12j85K19
$$ 309 -34 -139 -201 -203 3 446 127 -204 -207 -71 245 0 47 -347 298 325 -131 -265 -208 -8 104 -81 138
2862A38n93N20M31m80j23Q7J43k60J57r6j36K72p2R2j93o0L10J64j2l08l74M95
$$ 138 -455 65 496 16 -107 -20 123 -137 20 -76 -212 60 -12 80 -113 -173 137 301 289 -19 -393 102
2884A02K82l03MJ33p0k31j15J98k22O8q0K13J32km8L47k84J11l33K03O0o4J36
$$ 102 384 81 85 218 148 -83 -198 0 -222 -154 -234 -21 111 109 61 408 124 235 -98 105 165 101 237
2907B37l41K71N7k07M8k19M6K50k66l5J5Q0K21j80n3j9K56j42j93J03O9J58n2
$$ 237 -104 167 224 17 65 -154 -108 142 -124 -159 -144 -64 157 -23 -76 -95 161 19 -174 -71 -2 156 104
2930A04J78l22J70J07j13l57K25j9j47J28K14J31m07M3M41m80O3Q7K23n30J87
$$ 104 282 -40 130 237 124 -233 -8 -27 -174 -46 168 299 -108 -65 376 -104 -41 46 269 -261 -74
2951g4P0J06r4J96k42l4j34L89K34l07l07K43K18m42L64j40k59L06K6k08K3j22
$$ -74 -4 102 8 204 -38 -72 -206 183 417 110 -197 46 264 -178 186 46 -213 93 119 -89 -66 -188
2973a88j8L81m09M20n76O29j15Mr6j63J61r3R3Qk33J87J3j42q7K71P4l6L30o23
$$ -188 -206 175 -234 186 -390 239 124 128 32 -131 30 -63 30 38 -195 -8 5 -137 -224 47 121 85 415 -208
2997b08j09K68K33j90q7j5P91m69m12L41n77L37J04r8j88K75%N39n53J41j60J40
$$ -208 -317 -49 184 -6 -93 -108 683 214 -198 143 -434 -97 7 -91 -279 -4 -4 535 -18 123 -37 103
3019A03j53L1M8J67n9j66J35k61j10O09l03J94j85r6J6j60J18j33N55o93M76K45
$$ 103 -50 -19 29 196 137 -29 106 -155 -265 344 41 235 50 -46 -30 -190 -72 -205 350 -343 133 378
3041C78o24K00j04J59j08J15m1k4n2J93l17K9J54j09K97j63J60l02K81J00k04
$$ 378 -246 -46 -150 9 -99 16 -25 -49 -101 92 -225 -196 -42 -151 146 -17 143 -159 122 222 18
3062A8k75j3K38j6J89p05L67L93j52k28k40K97M74l06j15J15l83M60M0m02K03
$$ 18 -257 -270 -32 -48 141 -564 -197 196 44 -184 -424 -127 347 41 -74 41 -342 118 158 -244 -41
3083d1q8K84J2k9l35M4J45K05m75P4N5P8L40k30J5j4Q0qr9K04j20k6j41k63K47
$$ -41 -129 155 167 138 -197 -153 -8 197 -278 -204 -149 -71 269 39 54 40 120 112 13 217 97 71 -70 -333 -86
3108h6j47L05p8P5k19K33Qk21M2L62l95J43Q8J63k40k18M09l40O7K40l63M64m40
$$ -86 -233 72 -6 69 -150 83 91 -130 -88 274 -121 22 110 273 33 -185 224 -116 -49 191 -172 292 -148
3131a48J63k32R6K80l6j3p1L0j7P5J8m00J54L28k89K55p5k14K46l45P2L51n35
$$ -148 15 -217 -121 159 123 110 39 69 52 127 145 -255 -101 227 -62 193 118 -96 150 -195 -123 228 -307
3154c07K12N15n59O4J88j69J72P8R3l41r7R9J60p9k16J85J89k64j06J01L78m40
$$ -307 -95 420 -139 -75 113 -56 116 194 287 -54 -151 -52 108 29 -187 -2 187 -77 -183 -82 296 -144
3176a44K23pr4m8r5J64P3k81J62P1K2p2r8J00p7J69o6K9k06m8j66L72J55j2j81
$$ -144 79 72 -22 -70 -165 -1 72 -209 -47 24 46 -26 -124 -24 -101 68 2 31 -175 -223 -389 -17 138 126 -55
3201e5j82L31l50J76K69m05L2K9K3R2KN6j72M88j84L2k96R9k75K51O3j28L6K10
$$ -55 -237 94 -256 -80 189 -216 -184 -155 -132 -40 -38 18 -154 334 150 182 -114 -15 -290 -39 24 -104 -68 142
3225A42k1N1j06j55n1j11J15K49j53L67j90L6k08k9J00k40J49pl1M6K8M5J46j90
$$ 142 121 172 66 -89 -140 -251 -136 113 -40 327 137 173 -35 -64 36 -204 -55 -62 -93 -47 -19 26 172 -18
3249a8k12L28k58l31L97J93k28J52k04K83k56j50J19N5J84L2J22j09k10Q0J1j56
$$ -18 -230 98 -160 -491 -94 99 -129 23 -181 102 -154 -304 -185 -130 54 86 208 99 -111 -31 -20 -176
3271a76K16j58K39j41K13j32J00N1p5j74n8J5J19q6J93p1L49m71J82k88M4j45
$$ -176 40 -118 121 -20 193 61 161 212 137 -37 -95 -80 39 -47 146 75 424 -47 135 -153 -109 -254
3293b54J50LJ98L8l46L13j42N2q3L37j30k17K0L21n25J83KK72l10L22m67K44l1
$$ -254 -104 -101 97 135 -211 102 -40 12 -71 266 136 -81 -61 260 -265 -82 -80 192 -118 204 -263 -19 -50
3316e0K33q8j79J73J17k29J26J15m24P6M5K3j05K07l8J38l42K74k72K31K91l31
$$ -50 183 95 -84 89 206 -23 103 218 -206 -130 -85 -62 -167 40 2 140 -202 72 -200 31 322 -9
3338iQ9J43o9l68J74J68j82j75K39K1K5j19L90p3l69K46P3q9rk90J9J51J62N6
$$ -9 80 223 154 -214 -40 128 -54 -229 10 31 56 -63 327 254 -115 131 204 115 106 -184 -165 -14 148 204
3362B04m22j24M22j88L11m46l2K00k7q0Q0K80k79K29l7j04j03O8J58m8k3jj8n6
$$ 204 -218 -342 80 -108 203 -243 -275 -75 -102 -182 -102 178 -101 128 91 -13 -116 -48 110 62 39 38 20 -36
3386c6o8j34O5M5Q4J2k50L29q6j64M6L75j17N9l09J21M0J44P9l25J87k8r4m7K01
$$ -36 -104 -238 -173 -128 -44 -32 -282 47 -39 -203 -157 218 101 160 -149 -28 12 156 235 -90 97 69 -25 -72 129
3411A29j8o2j32K41j17J82l13M7P0j08R3J08j58p3J21j41L47j12k29j20J35J96
$$ 129 111 49 -83 158 41 223 -90 -43 27 -81 12 120 -38 -111 10 -131 216 104 -125 -245 -110 86
3433H6l80L82J85j77r9l83P4O01m9Nk82J38J64K5l04O1j09J45k51J25L93l84P2
$$ 86 -294 88 273 96 -3 -386 -312 289 240 245 -37 101 265 290 -14 47 -62 83 -168 -43 350 -34 38
3456C8o8p1K11J02j44r4K1jJ66L22l76N2k2o2k16j06J41j43K61k26L29J09m59
$$ 38 -30 -101 110 212 68 -26 -5 -6 160 482 106 158 136 74 -142 -248 -107 -250 11 -215 114 223 -236
3479b36L07j79J10m17L60O9K12l11Mpj70J77n9K07o3o2J86j65n4L52k16M1l12
$$ -236 71 -108 2 -415 -55 14 226 -85 -81 -88 -258 -81 -140 67 4 -58 128 -37 -91 261 45 86 -226
3502b26K90j60j19K00M2j66J06l8o9j21J32K57l8m5n1j0J17l70K40J9K33k03j09
$$ -226 64 -96 -215 -15 27 -139 -33 -71 -140 -261 -129 128 90 45 -6 -16 101 -269 -29 -10 223 20 -89
3525h9J4O0J34K75m41j97L74J43j73j8m5j46J35J11l30J80R0j69L27L1j86l52
$$ -89 -75 -15 119 394 -47 -244 130 273 100 82 37 -109 26 137 -193 -13 77 -92 235 266 80 -272
3547b72M44m65L98j4K22m74J07J4K22r1l2Rk90L80l00N6q2M78j99mk74J4J06m8
$$ -272 172 -293 105 91 313 -161 -54 -40 182 91 59 68 -222 158 -142 -86 -168 310 111 107 -167 -153 -47 -95
3571i5J32j26J21j11L73j98n9kO9j5j68J46L0q0K5j89K21k8J54o49Q18l17K2k38
$$ -95 37 -89 32 -79 294 96 37 35 104 89 -79 67 97 17 42 -147 74 46 200 -449 369 52 74 -164
3595a64L98m63K74j70J3K14j62j54K01K59j78j63J62j13J85l22O6PL37J39k32
$$ -164 234 -229 45 -125 -112 102 -60 -214 -13 246 68 -95 67 -46 139 -183 -117 -110 227 366 134
3616A34k31J85j90K94l35J05j20L65q4J1%m57L59J9R8n0j69J08J34j97N8m5K99
$$ 134 -97 88 -102 192 -143 -38 -158 207 123 134 134 -323 36 55 153 103 -66 42 176 -21 37 -8 291
3639B91j97k21J49l8o5M98m52J34r1j62K58R8j94L51n94J39K04R3k99J43j12k5
$$ 291 94 -127 22 -16 -81 417 -35 99 8 -154 104 202 8 359 -235 -96 108 201 -98 45 -67 -92
3661i2J45J23k66L5K40k76k10n4L41N1Q7O0j47k91J63K60j70J1j86K86j17j51
$$ -92 53 176 -90 -55 185 -91 -301 -355 -14 37 124 184 37 -254 -91 169 -1 10 -176 110 -7 -158
3683a58K83l9%L57o27J70k61J44KK62k39L01p2l97K65Lj55L38k82M07m41N01l31
$$ -158 125 86 86 443 -184 -14 -275 -131 -129 133 -106 195 123 -274 -9 -6 -161 177 -105 302 -139 362 31
3706C1k43K72k65O0l2N7L11ol18J64L78l26O0j18j02J47k61L81l6j20k40M8R3
$$ 31 -212 60 -205 -145 -177 -120 191 185 -133 31 409 83 143 25 -77 70 -191 190 154 34 -206 -158 -65
3729f5P7j16Kj34J05J79N9K25m18J68J1o8J54l98J68K90k40o5J76l08J46K34M9
$$ -65 12 -104 -102 -236 -131 48 107 332 -86 82 93 25 179 -219 -51 239 -1 -66 110 -198 -52 182 231
3752B31l34j05J39pJ24j09J80l22R5L06r5k75K86k2Rj56K8M31k66J41m28K79k79
$$ 231 -103 -208 -69 -76 48 -61 119 -203 -108 198 103 -172 114 92 101 -55 -27 404 138 279 -149 130 -149
3775a49O70j61m62J45RJ0k1P8k38J78J45l08rkJ02J15j95J11Q6j94J01l10M63
$$ -149 521 360 -102 43 52 62 41 119 -119 59 204 -104 -113 -115 -13 102 -93 18 104 -90 11 -299 164
3798A64j59j86j04L12K19n09K83m0l3o4j21M72m73j4J65o5J24N41n27J01j25O4
$$ 164 5 -181 -285 27 246 -263 20 -20 -53 -117 -238 234 -239 -253 -88 -153 -29 512 -15 86 -39 25
3820B5o2J2J69J0k02LN1r7l8L80o51K23M95j73J82n80K56J51k22O0LpN32o02J01
$$ 25 -37 -25 144 154 -48 -45 6 -91 -129 251 -400 -177 318 145 327 -253 3 154 -68 -8 -5 -12 520 -82 19
3845A9K9O5k54M97m71J63k93M51o8q6J41k43K8l6j96L08P9Lk22R0P7j47Q0k38
$$ 19 48 113 -141 356 -115 48 -245 206 138 52 193 -50 -22 -58 -254 54 133 136 -86 4 81 -66 14 -224
3869b24K92L2p1j02J23M0j65k3k9K12j64J04Q6l01L12j16j32M31l40J47O6l24
$$ -224 68 100 29 -73 50 90 -75 -98 -127 85 -79 25 111 -190 122 6 -126 305 -35 112 178 -146
3891a46J80RJ69l09R6J96k78J81K73o97M04k70L60l4j31l0K75k25k74M19j85M2
$$ -146 34 43 212 -97 -1 195 -83 98 371 -326 78 -192 168 134 3 -27 248 23 -251 168 -17 25
3913B5OP6J34k38m6j12j86L82o4N42l14l20j25p9K59K12k41P9m6J23J20j80j3
$$ 25 31 107 241 3 -43 -155 -341 41 -23 519 205 -115 -240 -319 -60 152 -89 -10 -56 67 187 7 -6
3936fj99L92N8o2k15K3j91L52o9j93j9K14j37K07O0m85K70K5j98M01p4k88N21
$$ -6 -205 187 245 183 -32 -9 -200 152 83 -110 -129 85 -52 155 215 -270 0 25 -173 228 154 -134 387
3959C87m16J73l06K18L18j60l54J01J12NQK12k18j71J66k01J78m12N97m08K3J88
$$ 387 -29 144 -162 56 374 214 -140 -39 73 78 86 298 80 -91 75 -126 52 -360 237 -171 -148 40
3981D0j33J45J53n4k20l4j30K57j82P1j72J4J80K89m19K20m05N17k97J02L51m08
$$ 40 -93 52 205 151 -69 -103 -233 24 -158 -87 -259 -245 -65 224 -195 25 -380 137 -160 -58 293 -115
4003a15P0%J57j53l41L38J52j26J41K38l78q1L57j66k51K03J1l3K62k13l9L2Q9
$$ -115 -45 -45 112 -41 -382 -44 108 -18 123 361 -17 -98 259 93 -158 45 56 23 285 72 33 65 154
4026A54j72K8J29r1n2J4O4J70l46K57n8m9o8K46l39K01k46K72Q2k0j87N8J34k95
$$ 154 -18 10 139 48 -4 10 74 244 -102 155 97 48 -20 226 -113 88 -158 114 196 176 -11 47 181 -114
4050a14P0p1J73k9J27k03K6J5K03p5J15k97o2nj84J49p6K25M8K27l18J27l92K4
$$ -114 -44 -115 58 29 156 -47 -21 -6 197 122 237 -60 -122 -127 -311 -162 -238 -13 35 262 -56 71 -321 -297
4074b97J28J89m18K16J01j33K82l97J73K29p3mn9M01n44L20j04J08N2k85J27k9
$$ -297 -169 20 -398 -182 -81 -214 68 -329 -156 73 0 -4 -63 338 -206 114 10 118 170 -115 12 -17
4096a7j66R9K67j80M68l48l46K97k46J46k13J2L01j6m10K66J26j20K54j03o3j12
$$ -17 -183 -84 183 3 471 123 -223 74 -172 -26 -239 -227 74 58 -352 -86 40 -80 174 71 8 -104
4118a04J34j77k08L37j93O29l31J42P2m65L5J84k14r0J55L33J0j62Q9k3K69k79
$$ -104 30 -147 -355 -18 -211 418 87 229 301 -164 -129 55 -159 -249 -94 239 249 87 176 153 422 143
4140A43Pn45L99J10K09k40l33L03R8r7R7j92R4l5r3J3J90j11j18j6K55j52K0P
$$ 143 150 -395 4 114 323 83 -250 53 151 54 151 -41 53 18 -75 -62 128 17 -101 -117 138 -14 6 13
4164A3O6o7P1q4QJ32l10J12J87l0K4j47K89m99J61L41J42k11j90p9O8q6J82k21
$$ 13 79 12 83 -1 7 139 -171 -59 128 98 122 -25 264 -235 -74 267 409 198 8 -71 -3 -89 93 -128
4188a28K82K42m48jJ32k52k09O63l32LK8O4L44m72l13O37k37n9M4k47PN66k68
$$ -128 154 396 -52 -53 79 -173 -382 281 -51 -48 -20 44 388 -84 -397 240 3 -56 -12 -259 -252 314 46
4211D6L8o6j75J48K31l84Q0L45m96J96m8pL63q7j51l35J75o6K63K11l31J79j36
$$ 46 84 18 -157 -9 222 -162 -82 263 -233 -37 -85 -92 271 184 33 -302 -127 -193 70 281 -50 129 -7
4234gK0J28j57j17K7j19L79L3l94J86q8kL96l06l4m7K66j74K73k86J76l03K76
$$ -7 13 141 -16 -133 -106 -225 154 187 -207 -21 -109 -111 285 -21 -55 -102 164 -10 263 -23 153 -150 126
4257A26J05p1k07M45k47O6k66M4Q5k49N48k64K05l20P5O1L5m30K3K01p5l31M30
$$ 126 231 160 -47 398 151 217 -49 -5 80 -169 379 115 320 0 75 136 171 -259 -236 -35 -110 -441 -11
4280a1j12L12j98j96K90j12R4k50j24K78l3N2P9J37J9m08K55N0J11n8k72m0L02
$$ -11 -123 189 -9 -205 85 -27 67 -183 -307 -29 -62 -10 69 206 225 -183 72 122 233 175 -97 -137 165
4303A65L7k30J30j91M1J40Q4n98O87k96K63j72j32J45j25J44K4m1m5P4R7J5k90
$$ 165 202 -28 102 -89 -48 92 176 -422 265 -31 232 60 -72 73 -52 92 116 75 30 104 201 216 -74
4326g4L48q2k10k5J12k0j0L8j65J04n8k83J00j63J59K74M3k38N2J23J23j02kk15
$$ -74 274 192 -18 -43 69 49 39 77 -88 16 -42 -325 -225 -388 -229 45 88 -150 -98 25 148 46 44 -171
4350a71R4K21l66j45K99l0k32J19K35k5j69K07nj30j9N1L0o9K1J73j7n44N50K83
$$ -171 -77 144 -222 -367 -68 -98 -330 -211 24 -1 -170 37 32 -98 -117 -66 -36 -105 -84 89 72 -472 78 361
4374C61k13k63R0J60J8j34mk78K93J8J60l43k5M37j6l32M3r7L3K81l87L81k95
$$ 361 148 -115 -25 135 153 19 15 -263 30 48 208 -135 -160 277 261 -71 -28 -125 -92 189 -198 183 -112
4397a12l3n0K55nJ37k18K7M4J12l99J59j11K4J61J20k65L38l26K52J37q5j68j80
$$ -112 -145 -195 60 55 192 -26 1 45 157 -242 -83 -194 -170 -9 111 -154 184 -142 110 247 162 -6 -186
4420a86O7J40q4j7l01J55K27l25K60l0J06k0j46J91J86o9k90j06N00l34m6J09
$$ -186 -119 21 -63 -80 -381 -226 1 -324 -64 -94 12 -8 -154 37 223 154 -136 -242 258 -76 -122 -13
4442a3K60j4k95j90P47m82Q7k93r5K92M58o28M1L07l44M29o7r0O7p4p4P0j51j0
$$ -13 247 233 -62 -252 495 13 100 -193 -288 4 462 -166 -125 182 -162 267 200 110 177 103 29 99 -52 -62
4466f2j92M89O0l58P7J69M4j66K34l72P7J42J39m41K36Q5j01l01L26k09M38m12
$$ -62 -254 235 295 -63 14 183 227 61 295 -77 0 142 281 -160 76 161 60 -241 85 -124 314 -98
4488i8L48k02j80k9j05M81j91j7n4J47J33j87l44N65J9n13K45j39P7k70L40Rl37
$$ -98 250 48 -132 -161 -266 215 24 7 -47 100 233 46 -298 267 286 -227 18 -121 -44 -314 26 35 -302
4511c02J08j4K98j14N4j62K24k08p1M2L30r9N4p8o8k2K07m34R3o4jK44J1j04p8
$$ -302 -194 -208 90 -24 30 -132 92 -116 -187 -145 185 86 140 62 -6 -28 179 -255 -162 -226 -227 17 28 -76 -154
4536a54PL91m55M30j02n59J74L61j65J63N5O2m84J22J84q3J97J6j61k1O9k91L99
$$ -154 -147 244 -211 219 117 -442 -268 93 -72 91 146 208 -276 -154 30 -53 144 160 -1 -22 47 -244 155
4559A55jl38J07l4Q6J66m3j04m54K90L36k09J77L9j46n7J22l54J84J94k90J97
$$ 155 154 -184 -77 -111 -25 141 98 -6 -460 -170 166 -43 134 173 27 -30 92 -262 -78 116 -174 23
4581B3Q1k79P8j02J15j30K08j19r9N04k25q9K82l98K79l66M94k69k9l6J97Rk63
$$ 23 104 -175 -97 -199 -84 -214 -6 -125 -224 280 55 -34 248 -150 129 -237 257 -12 -41 -77 120 129 -134
4604a34K21J49k93j39K70J57r2q5r0l39J68L65j0J41l07M12k21k2l15K87J38l86
$$ -134 87 236 -57 -196 74 231 139 54 -36 -375 -207 158 148 289 -18 394 173 151 -164 123 261 -125
4626a25M9l8j8K71j53k87N91k22o6k7J75m27J28K18q9l5O3j32K39P4j24k61J0
$$ -125 -76 -114 -132 139 -14 -301 290 68 2 -25 150 -277 -149 69 -20 -55 8 -124 115 189 65 -196 -186
4649a86o2J53j25j87O56j11m2k18N6J8n7j46L40j11k56L21j5j03JM2K34Q3j10
$$ -186 -248 -95 -220 -407 249 138 96 -122 -66 -48 -105 -251 89 -22 -278 43 28 -75 -74 -32 202 285 175
4672A75j98M1j65K46j15j4P4k6n5M5M6q5j93M5K20J1k52o2K25L6j23r2J85r2K15
$$ 175 -23 18 -147 99 -16 -30 44 18 -37 8 54 -31 -224 -179 41 52 -200 -262 -37 -1 -124 -216 -31 -123 92
4697I2k03K53k61O8N9K27j21k28P9k04N23m38r5K52J82j44j40K51J13n99M17j27
$$ 92 -111 142 -119 -51 8 235 114 -114 -35 -239 284 -154 -249 3 185 41 -99 152 265 -334 83 -44
4719d4p0J38J22P5k39j56K26L7k3j23j50L56K9k33K98k64J35%j16j73M30l27n9
$$ -44 -114 24 146 221 -18 -174 52 89 66 -57 -207 149 178 -55 243 -21 114 114 -2 -175 255 -72 -131
4742a31L3K81j56j01L91m15K55m04M11J47p2j33j18N6k3k95J75K47l96L82l16
$$ -131 -98 183 27 -74 317 -98 157 -247 164 311 239 106 -12 44 21 -274 -99 148 -248 134 -182
4763a82r0n9M24j10j8j07J65j90L13k59OK24L73l56L21l27l15n3Q7M44n21J69
$$ -182 -272 -331 93 -17 -35 -142 23 -167 146 -113 -107 117 490 134 455 128 -187 -240 -153 291 -230 -61
4785f1J44n1K67m6l75L43l00L32k56j77L52m12lK12k4N7M06m18N1J36kL2r3q8
$$ -61 83 32 299 253 -122 221 -79 253 -3 -180 172 -240 -243 -31 -55 2 408 -10 41 177 175 207 114 26
4809B6M6Q9k98N1K18j85P3k35K84Q9l17o9N9k3o0K47J31k97J36K6k60j34J31N37
$$ 26 72 161 -137 -86 132 -53 20 -215 69 158 -159 -228 -169 -192 -252 -5 126 -171 -35 -9 -269 -403 -272 265
4833B65K06j23m00r9L73j16j03l8j21k64O80l26K91j21k54k8J17K68k82R5L3j80
$$ 265 471 348 -52 -151 222 106 3 -35 -156 -420 260 -66 225 104 -150 -178 -61 207 -75 20 53 -127
4855a27J27J9q0J14J22k4j01k66K88k07J2J47j43L30o49L27K13l77l4L10J4j74
$$ -127 0 19 -61 53 175 151 50 -216 72 -135 -123 24 -119 211 -438 -111 102 -275 -309 1 15 -159
4877a59L77j1j81J21L1j51j51J9J28j8k70L58j75L97m84M4J81M5j03j9M83o00
$$ -159 218 207 26 147 178 27 -124 -105 23 5 -265 93 -82 315 -169 -125 56 101 -2 -21 462 -138
4899a38J32K68n89J12K17r4k5O1j46M17l55L8j42L70j23p8J17j1m3J7J44k87n2
$$ -138 -6 262 -327 -215 2 -92 -117 -56 -202 215 -140 -102 -244 126 3 -75 42 31 -12 5 149 -138 -190
4922a90O3l0K08k58L54m33J33Q4l25M07q4J17l02J89L89j69J49l06l45M29k85
$$ -190 -127 -157 51 -207 147 -286 -153 -69 -394 13 -71 46 -256 -67 322 153 302 -4 -349 80 -205
4943b05J84k6L46m83R4p6P6J60j05J20J2j66L54l66O6K01j23j61M9o1J87j49K77
$$ -205 -21 -47 299 -184 -90 -166 -90 70 -35 85 97 -69 285 -81 -15 186 63 -98 -49 -110 77 -72 205
4966B05l85K53r5l38K40P1J6K83j44r7J44n13K65L79l5k96k43N46l44L50j47j65
$$ 205 -180 73 -22 -360 -120 -49 -33 250 106 9 153 -360 -95 284 249 -47 -290 256 -88 262 115 -50
4988e0N5l3J6R6j36o1K74N8K8k35L36pj6k61J35n05L87O2k2j70O8RJ64o6j68p0
$$ -50 5 -28 -12 84 -52 -113 161 219 247 12 348 341 325 64 199 -306 81 143 121 -49 19 28 192 126 -42 -112
5014a12Rj90J33M08k67j42O5j5pJ9J62j34K04kq3j89M0q6M08k22R6j05J97l15
$$ -112 -103 -293 -160 248 -19 -161 -96 -111 -118 -99 63 -71 133 131 48 -141 -101 -187 221 -1 95 -10 187 -128
5038a28RJ95N8P1L9k03k02J99j72J69K6j14R0J8j80R4N8L28n78L43j35J38P3m61
$$ -128 -119 76 134 205 244 41 -161 38 -134 35 61 -53 37 55 -125 -31 27 355 -223 120 -15 123 196 -265
5062b65L62l55K7L49r2K33lm58K70j51k23L01l43L63k38m2M78k22Qo6O2N7J78
$$ -265 97 -258 -231 118 26 259 256 -202 68 -83 -306 -5 -348 15 -223 -265 213 -9 -1 -67 -5 52 230
5085B30k08J2J23r4j11J28j97J18j11J56N5k2j12O5k7K88l01P5j64L5P5J97o54
$$ 230 22 34 157 63 -48 80 -117 1 -110 46 101 79 -33 32 5 293 -8 67 -97 -62 13 210 -444
5108d44M20J20l1j02Q3k07K49J05n28J83m2K7K93l9j20K84n94N77k47k03K30J31
$$ -444 -24 96 65 -37 46 -161 88 193 -335 -152 -194 -167 126 87 -33 251 -343 234 -13 -216 14 145
5130A45O1j03o1j11P7qr2J03j93P1L27j6l80N1j34J14J30J2k35O3j01N13j41l03
$$ 145 206 103 42 -69 8 0 -92 11 -182 -111 216 200 -180 -129 -263 -149 -19 -7 -242 -179 -280 233 92 -211
5154b11M75k37L8k87L19m3j45K44M6n90L11mJ76k07JJj84L42j86j63L68K14k77
$$ -211 264 27 65 -222 97 54 -91 153 199 -391 -80 -84 92 -115 -114 -113 -297 45 -141 -304 64 278 1
5177Ar6J3J76l54J48l7Q4k10J93K37%k59J69m67R2N67l98K55q9K16J7l05K20j09
$$ 1 -95 -82 94 -260 -112 -149 -65 -275 -82 155 155 -104 65 -402 -310 257 -141 114 25 241 258 -47 173 64
5201F4J30l58L12k10k24L82j00Q6q3p2L1J30j78k05L34j02K2o9r8L41j93k9M22
$$ 64 194 -164 148 -62 -286 96 -4 82 -1 -73 -42 88 -90 -295 39 -63 -41 -110 -208 133 -60 -89 333
5224C33j81q3m8j80K8J37k4r0J10J31j51l4J21j02o4m43M97j24J9n5N0L08k25
$$ 333 152 69 21 -159 -131 6 -18 -108 2 133 -18 -52 69 -33 -97 -540 -43 -167 -148 -203 -153 155 -70
5247g0K19k78J3J93j17R3j07k29N74k01j66K14j59J86l17K90n4k42J56m6K21l0
$$ -70 149 -129 -116 77 -40 53 -54 -283 291 90 -76 138 -21 165 -152 138 84 -158 -2 -48 173 143
5269A43j78M9j57L19l46J53J75J12m83Q9J89m36K28L92l1j51l1j6O6k02K92l31
$$ 143 -35 14 -143 176 -170 -17 158 270 -213 -124 65 -371 -143 249 218 67 36 20 86 -116 176 -155
5291a55J15n7j10K62N8j83j92M04k47K26k36P3L1j49J73J4J57Q4k76J55k55L28
$$ -155 -40 -97 -207 55 113 -70 -262 142 -105 121 -115 -42 -11 -160 13 27 184 268 -8 147 -108 220
5313B20l32p5N49o93J48K67J10m70L10l4o9K23k88K2J53J2o1j01J52l13J41j6
$$ 220 -112 -187 362 -331 -183 84 194 -276 34 0 -69 154 -134 -112 41 53 -8 -109 43 -270 -129 -145
5335a45K40m0m1K38P8m2j61J27j72m4P3j05J69l64M05r0m7l8M9m20L66l46n6N96
$$ -145 95 55 14 252 330 288 127 254 82 38 111 6 175 -189 216 126 79 41 90 -330 36 -310 -366 230
5359B30n35J32L32j7l75L80n5J18k18l33L69j72K24p6q8J67l10l4J94L3L4Kr1
$$ 230 -305 -173 159 142 -233 147 92 210 -8 -341 28 -144 80 4 -84 83 -227 -261 -67 -34 0 2 -89
5382h9q6J79L3oJ35j56J7j91K19N6j58j03p2M52j86K42j91l13O2R0k1j35O6L64
$$ -89 -175 4 37 31 166 10 27 -164 55 111 -47 -150 -222 230 44 286 95 -218 -156 -66 -87 -222 -156 208
5406B08k05l79M00Mj5m1K24j86l9J50j96j7j29M28l7j91J95k5l96O47k37l60M30
$$ 208 3 -376 24 28 13 -28 196 10 -29 121 -75 -92 -221 207 170 -21 174 149 -247 400 163 -197 233
5429B33n3L02k93l74M75l61K85m45M88N1k23J08M6k75j9J36j33J00k76K55r2J05
$$ 233 180 482 189 -185 290 -71 214 -231 257 308 85 193 239 -36 -55 81 -52 48 -228 27 -65 40
5451D0k01L05J07k93j31J45j40J23m1jj43J65K3J61o9j43L09k66J17j68l0K59
$$ 40 -161 144 251 -42 -173 -28 -168 -45 -86 -87 -230 -65 -42 119 50 -93 216 -50 67 -101 -131 128
5473A28J57k80k1O5K39k90k8J20j37j78K66p3K32m66M51j86j62J83k75R8M65k06
$$ 128 285 5 -16 49 288 -2 -30 90 -47 -225 41 -32 200 -266 185 -1 -163 20 -255 -157 308 102
5495A02k41J18J40rl02N5K28J14k34Q8j84K22J33q0k6j09k88M97l5k36j1J53k5
$$ 102 -139 -21 119 110 -192 -137 91 205 -29 59 -125 97 230 150 124 15 -273 224 189 -47 -58 95 70
5518G0m64M02K01l7j74K60j83n8m7L40j31L8k13o2J12j05Q8k28p1J83Q8J37n7
$$ 70 -394 8 209 172 -2 258 75 17 -30 310 179 217 4 -58 54 -51 37 -191 -262 -79 9 146 89
5541H9l00K27J8j4J2K21l62k05L51k82J69L05k72J4K24k17l06J05L6M69m50O7
$$ 89 -211 16 34 20 32 253 -109 -314 37 -245 -76 229 -43 -29 195 -22 -328 -223 -187 282 -168 -101
5563a01K32k21K5M5Jn0N5J92j65j42J99l9JR1k60O4J90q3P6l90J29J66J75l20
$$ -101 131 -90 -65 -20 -19 -69 -14 178 13 -129 70 31 32 123 -137 -73 117 34 110 -280 -151 15 190 -130
5587a30O5K00Lj45J30o1L1K8m4j55J18K4K04j55m03J61K49j93L2L32M6k94L41
$$ -130 -65 135 138 -7 123 62 93 121 77 -78 40 64 268 113 -290 -129 120 -73 -41 291 337 43 384
5610C84n20M6L06k96K78k46j52r9R6K52j1K22k07p9K61k12j53kJ64j69mR6M7J35
$$ 384 -136 -90 216 -80 198 -48 -200 -299 -203 49 38 260 53 -26 235 23 -130 -132 32 -137 -141 -45 2 137
5634A37k76J34Q7j60K04j74m5K05l31K96j72J36k95K00M48l07K00n21O27k41k00
$$ 137 -139 -5 82 -78 126 -48 -93 112 -219 77 -95 41 -254 -54 394 87 287 -234 393 152 -48
5655d8r1k6K16k45M17j93j49K35k16R5j0J88l01K16j55N3J05k69L53j58%j98K29
$$ -48 -139 -165 51 -194 223 30 -119 116 -100 -5 -15 173 -128 88 -67 -14 91 -178 175 17 17 -181 48
5678D8o1R2Kp1J25j31M5L5K0j45j9qR7J22m06L9J60j77M1K29q6J91J13k36J69
$$ 48 -13 79 81 10 135 4 49 84 104 -41 -60 -68 29 151 -255 -216 -56 -233 -192 37 -49 142 255 19 188
5703A88o3k05J12l6m7j15M8L20m51J81Qj7j65L13k3J5l4k8m7j20m5J56j37J46
$$ 188 125 -80 32 -4 -51 -166 -118 202 -249 -68 -60 -77 -242 71 48 63 29 1 -46 -166 -211 -55 -192 -46
5727d6J9k84L35K7j98L72j22J35o5N2m6j02l4J68k48l9L63j56J9j18j58J76J49
$$ -46 -27 -311 24 51 -147 225 103 238 173 225 179 77 43 211 -37 -76 287 131 150 32 -126 50 199
5750A99j34L1k70J56M8k84K49J65j13J16j00k7k87M23q0p3j76ooJ64M9k00L41
$$ 199 65 96 -174 -18 30 -254 -5 160 47 163 63 36 -251 172 92 19 -157 -163 -169 -5 44 -156 185
5773A85k04R8k09L5J76j56j04K31J05j13J85j75R6k35J85k19J74K93j94j52J49
$$ 185 -19 79 -130 -95 81 -75 -179 52 157 44 229 54 150 -85 100 -119 55 348 154 2 151
5794A51j62j2j82L29J67l33J55k88J15O3J71p7J2k9j78L98l51k75K85L30k84J08
$$ 151 -11 -23 -205 124 291 -42 113 -175 -60 3 174 97 109 80 -98 300 -51 -326 -41 289 5 113
5816A13k46K80J11n08M6L4J58Q2k5k26O2J60j8J6k2k74K42j22Q4J52p1j32J59
$$ 113 -133 147 258 -250 -204 -170 -12 70 45 -181 -119 41 23 39 17 -257 -15 -137 -53 99 28 -104 55
5839E5m4J90n10M57l28M68j95k24K24j68J14K3j93J87j05J76K4j23L28l76K31
$$ 55 11 201 -309 148 -180 288 93 -131 93 -75 39 62 -131 56 -49 127 151 28 356 -20 211
5860B11l44K58k42K15j69M3j39L61p7j42k6k9k82N12k92K39j92J12j42r0L53k17
$$ 211 -133 125 -117 98 -71 -28 -167 194 117 -25 -51 -80 -362 150 -142 97 -95 17 -125 -215 138 -79
5882g9K7L7j5m4J23k62N3j33L12j87M5J42j80O3J21J07J54l23j4q9L45m23L26
$$ -79 -52 -15 -30 -74 49 -213 -160 -293 19 -168 -123 19 -161 -98 23 130 284 -39 -53 -142 203 -220 106
5905A06oj54J21k98q3M20k51PL34lj88l11M00j45k0N5L6m5l6R3j83j49K17J35
$$ 106 100 -54 67 -231 -314 106 -145 -138 196 193 5 -306 94 -51 -71 -16 20 -25 -61 32 -151 -300 -83 52
5929E2j36Pk29J74J30k76L08K83l28l16O41l58l3j09J37L6p0p4M04l99K96r1Q5
$$ 52 -84 -77 -306 -132 -2 -278 30 313 -15 -331 310 -48 -81 -190 -53 -17 -87 -161 243 -156 140 49 134
5952A34l57M16j26jO7n11O98l28J81o2o5l05L33j68q0L35P7l37L24j60l36L05
$$ 134 -223 193 67 66 133 -378 320 -8 173 111 46 -259 74 -94 -174 161 238 -99 225 65 -271 34
5974C4q8R2l2K7Jk7kkm4J28j13k05K70o2J1Ol00M16k30l7L48n39K14J92j56L57
$$ 34 -54 38 6 33 34 7 5 3 -41 87 -26 -231 39 -23 -12 -6 -306 110 -120 -157 191 -348 -134 58 -98 259
6000B59l35k9K61Rn7m7k39M72J20m86NJ02p6j17K24m2l1O0p6N5Q7O6j47Po3p9
$$ 259 -76 -105 156 165 108 61 -178 294 414 -72 -67 35 -41 -158 66 24 -7 53 -23 32 119 185 38 45 -18 -97
6026i7O3MJ3J5j46J74j6M3k15K3j53K79J1L2k14K49l54K17m2O4K24o5J17k25K28
$$ -97 -34 -30 -17 -2 -148 26 10 53 -162 -139 -292 -13 -2 30 -184 65 -289 -72 -114 -50 174 109 226 1 229
6051B29j56j28K44K85l12j2j44L03m51L98n4j95J29j65M4k10K51%j3L0K02k79
$$ 229 73 -55 189 474 162 150 6 309 -142 256 202 7 136 -29 15 -195 56 56 43 73 275 -4
6073dK6K0l62K80R2p9KJ1N6k07L20l2k03R4K54j17k31R3N6j52K86j80j33J26k55
$$ -4 22 42 -320 -40 52 -27 -25 -14 42 -165 155 123 -80 14 268 151 -80 13 69 -83 203 23 -110 16 -239
6098b39J21p0L63l26K02k95L34k17N2j9L54o43M37k04k74L46R1j34K47j79ln4
$$ -239 -118 -188 175 -151 51 -244 90 -127 -75 -94 260 -383 54 -150 -424 -78 13 -121 126 -53 -56 -110
6120a10k6k9M96o27K23q6J10j37j14L88k76R2J60k05L73k32o9Pj9J93j15J37l45
$$ -110 -136 -165 331 -296 -73 -159 -49 -186 -300 88 -188 -96 64 -141 232 0 -69 -62 -81 112 -3 134 -211
6143b11L48m36K63L99l81K76k71j72L83k64j47J57k5j11J22J27L01o39N84m9k89
$$ -211 137 -299 -36 363 -18 258 -13 -185 198 -66 -213 -56 -81 -192 -70 57 358 -281 303 254 -35
6164c5j46P5J33j87J12P0r2K0J97k33M4J65l41kQ0l8J77q8J79q0J76n36N11k9
$$ -35 -181 -106 27 -160 -48 22 -70 -50 147 -86 -42 123 -218 -220 -140 -178 -1 -89 90 10 186 -350 161 132
6188A32l26L3J78N8n49N00Q7pJ27P8J5m46O3J09j30q0QO2j43L52r5L52l73K4M7
$$ 132 -194 -161 17 75 -474 26 113 106 233 311 326 -120 -57 52 -78 -158 -150 -88 -231 121 26 378 5 29 76
6213G6k26N6J46j17l3j16L79l6n4O3p7J12n3j18k12J91K15p8l40K13O2l04r2J67
$$ 76 -150 -94 52 -65 -98 -214 165 129 75 138 61 173 120 2 -210 -19 196 118 -222 -9 53 -251 -343 -176
6237a76K55j32J81L5p3l2J0M1k03j40L65k86j80J11K02J70n99L77J55r7L3l8R3
$$ -176 79 -53 128 163 90 58 68 109 -94 -234 131 -155 -335 -224 -22 148 -451 -74 81 -16 17 -21 72
6260G2j29o9J41J50l73L33l15K50j77J94k17M34l28r7L33m77J89L19l08q6oM1
$$ 72 -57 -126 15 165 -208 125 -190 60 -117 77 -140 294 -34 -131 202 -275 -86 233 -75 -161 -167 -126
6282a26K58r7R1j81K8L48l50k34M35m98N83J4l63mK11o5K04j22k61L22M4l20J40
$$ -126 132 35 126 -55 -27 321 -29 -263 172 -326 257 271 -92 -96 115 50 254 132 -129 193 237 -83 57
6305E7p0K90l79J21j28M14m21R6K0k21l0P7J17p7J20J52k12L10o7k29r9K45m2
$$ 57 -13 277 -102 19 -109 305 -116 -20 0 -221 -251 -174 -57 -134 -14 138 -74 236 169 -60 -159 86 44
6328D4k03L55j22K20M7n70J83K99l65K47J3k29J86m4k53L56K00l76K33k2j89N6
$$ 44 -159 196 74 294 341 -229 -46 253 -112 135 148 -81 105 61 -192 164 364 -12 221 199 10 66
6350F6k16k11N25l04M8J30j00K64n6j55K08j0l96N0J35j9K69j74j29M8J78j9j37
$$ 66 -150 -361 164 -140 -92 38 -62 202 146 -9 199 189 -207 -157 -22 -41 228 54 -75 -27 151 132 -5
6373ek39M47m09M58l56J47J26n1k62K65j79j6R3k33L69k59J13r0J62m50N45r0
$$ -5 -244 203 -206 252 -104 43 169 118 -144 121 -58 -74 19 -214 155 -104 9 -81 81 -369 176 86
6395H6j2q4k7m6J92L3lk09J37j29N3J20n8r3lm7po8M1L11k22J15j1j6o2J4J04
$$ 86 74 -10 -37 -83 109 142 139 -70 67 -62 -9 111 53 -40 -43 -90 -97 -165 -124 187 -35 80 69 53 -9 5 109
6422A09r9K27l3k54o7M65j68J13k48j19O5L4j23j27R7k1J61O5j58J13K30M0l26
$$ 109 10 237 204 -50 -117 348 180 293 45 -74 -9 25 -98 -225 -128 -149 12 77 -81 32 262 302 -24
6445b4N8P7l58L24m6KK04k76j74j04L87r8J32k41k9K11K78k15N1l10J00LN3K5
$$ -24 34 111 -247 77 31 33 237 -39 -213 -317 70 -28 104 -137 -166 45 323 108 159 -151 -51 -48 5 30
6469C0j92L00k2J82l90K47k8q4L9l25J29J72k6o7K8pj94q3Q1J02k6J75k95M75
$$ 30 -162 138 116 298 -92 155 127 43 82 -243 -114 58 32 -35 -7 -14 -208 -291 -210 -108 -134 41 -254 221
6493B21j56%j87J6m5J39k4j71L04J08M15p46r7L84j40Q7N5j38r8K86j80J98k28
$$ 221 65 65 -122 -106 -151 -12 -36 -207 97 205 620 -126 -223 161 21 108 163 25 -73 213 33 231 3
6516Cm7j44m6K95J99l77j74J18L59Ok00q6j56N30m73O6K40j75J92j06J97j04n08
$$ 3 -44 -188 -234 61 260 -117 -291 -173 186 192 -8 -94 -250 280 -193 -127 113 -62 130 24 221 117 -391
6539c91L74J4q5L42J24p33L05K39q3p2j85K6m9K64j24k76J46J07L66m61L6L37
$$ -391 -17 -3 -88 254 378 -355 -50 189 106 34 -151 -125 -174 90 -34 -310 -164 -57 309 -152 -116 221
6561B21Q2m75q5J38r8K61j88K41Lk01k08K96o9J4j18K06k49j7L05K9L44l26R2
$$ 221 303 -172 -257 -119 -217 44 -144 97 100 -101 -309 -13 -82 -68 -186 20 -229 -246 59 88 432 106 198
6584A98l43J12K05m56N6L46K60m80L1J65j8j64j64M41k91m39P49l55L37k44Q9
$$ 198 -145 -33 172 -284 -228 118 378 -102 -71 94 76 -88 -252 189 -102 -541 208 -147 190 -54 35
6605C5Qj80J19k11J05L4k63M29N3j78QJ27q6j3m78N35J88j05j28r4K00j50L60
$$ 35 43 -137 -18 -229 -124 -90 -353 76 129 -49 -41 86 0 -13 -491 44 232 127 -1 -95 105 -45 315
6628C15m54J95l50K95M7J56k52j84P1N7K58m19K25L35k59j05J2M6j22M6R1K82
$$ 315 -139 56 -294 1 48 204 -48 -232 -161 -104 154 -265 -40 295 36 -69 -57 -11 -133 -87 4 286
6650B86m66L92l56n3K93L6j48m1K66k84j35J65R2j9J72k40P5J13l57L91k99K94
$$ 286 -180 212 -144 -197 96 132 -16 -57 209 -75 -210 -45 47 28 200 -40 35 148 -209 182 -117 177
6672A77N2k51j74J33J33q2J29K37l66J91j71m5J90l85L22j8K00m96J88K63j30
$$ 177 229 -22 -196 -63 70 -12 117 354 -12 179 8 -37 153 -232 90 72 272 -224 -36 227 97
6693I7N6m0l8m3o4LJ00j33j25M28J65k34m3J34n0j82J75j08j35j12NJ34l4j28
$$ 97 153 113 75 32 -32 -29 71 -62 -187 241 406 172 129 263 213 31 206 98 -37 -149 -144 -10 -44 -172
6717a72J08Q4n7j39J37j11J55j41j78K71K22k39J66j3J49M0k33j39m5R5q1K64
$$ -172 -64 20 -37 -176 -39 -150 5 -136 -314 -43 179 -60 106 93 242 282 49 -90 -135 -40 -121 143
6739A43J3j77L81l17k96K95k54L30m27J21K92O2J8p6J67m21M7KK20k2j9Pk11k4
$$ 143 156 -21 360 43 -253 42 -212 118 -309 -188 104 166 184 108 275 -146 -99 -97 123 101 82 89 -122 -146
6763a46j15M92m8j91k28L24Q3k87R8k63J77Nr3j1K84J11J28m17l1J26K3l64L57
$$ -146 -261 231 183 -8 -236 88 171 -116 -18 -281 -104 -99 -192 -203 81 192 320 -97 -128 -2 21 -343 14
6786A4K1j29K36m23K07p0L6n2J46j27J07J23R0k04p8L16j90j83J9K89j09J06J4
$$ 14 35 -94 142 -281 -74 -144 -108 -160 -14 -141 -34 89 179 -25 -103 213 23 -160 -141 148 39 145 159
6809A59j17j27J52l80N2L16l6N5R4j35j39K98k27K78k37j62L15j17l8o1J92j16
$$ 159 42 -85 67 -313 -261 55 19 74 168 33 -106 192 -35 243 6 -156 159 42 4 -57 135 19
6831A9k29M9J62o1K5J97l83j24M47r1N5j03k48J39jJ49j50K96o3l29K7K18O0M4
$$ 19 -210 -161 1 -60 -35 162 -221 -345 102 11 66 -37 -285 -146 -147 2 -148 148 85 -244 -217 1 61 105
6855A05j17q2M23m44K24P9j20K3k48J14J35j9q3k21K19N4l79N74k90p2PO8m2J74
$$ 105 -12 -94 329 -115 109 188 68 91 -157 -43 92 73 -10 -231 -12 42 -337 237 -53 -125 -118 -50 -92 82
6879H2k61L02j15o6M7j05L23k37K23mp5l33K62j3r4k57K30k07k5N24m63P47o14
$$ 82 -179 123 8 -58 -11 -116 207 -30 193 189 114 -219 43 30 -64 -321 -91 -298 -323 201 -262 485 -129
6902a29j69L16m20K34k1L25m21M35m6m52M80l1j63J64J5Qm4J67k94M9j72P4m12
$$ -129 -298 18 -402 -168 -189 136 -285 150 104 -348 132 101 -62 102 117 125 81 248 -46 3 -169 -95 -507
6925e07N38r3KJ21r7J97j71l1n1K47k14J36j53J85k68L69j14l90O7L43j21j07
$$ -507 31 -62 -60 61 -36 161 -10 -41 -92 155 -59 77 -76 109 -159 210 96 -294 -227 116 -5 -112
6947a12Mk2k22M90j2k07K29J29l89J35j11K61k61K7K37p8j82k7k9J49q3J11J73
$$ -112 -108 -130 -352 138 126 -81 148 277 -112 23 -88 173 -88 -61 176 98 -84 -111 -140 9 -74 37 210
6970B10k7k23j35Q0K85j06Q7l07k16K75r1N8J87k08J28J26j42R8J0p2J45j77m7
$$ 210 183 -40 -175 -95 190 84 171 -136 -352 -77 -168 -110 77 -131 -3 123 -19 79 89 17 162 -15 -62
6993f2J51m47K75n2k36j3K43K33k17j51J87K28l15mK94j44J83J22j41j47M4M3
$$ -62 89 -358 -83 -135 -371 -384 -141 92 -125 -276 -89 139 -176 -180 114 -30 153 275 134 -13 31 74
7015G4lj71L4J49j63k11P8Mj15N93o4m57K35J91j63N7j3j5nj1K05l5ql48K69k96
$$ 74 71 -100 -66 83 -80 -291 -213 -209 -324 269 205 -252 -17 174 11 68 55 40 35 24 229 194 186 -162 107 -189
7041a89K73M3k51K07Jo8K06j4j11r3k63M48o3j92k04L56j49N9k42J81J31J43l69
$$ -189 84 127 -124 83 84 16 222 208 97 4 -259 189 126 -66 -270 86 -63 -4 -246 -65 66 209 -160
7064a60K62j53J05k97L37j18j9p5O2J80m92J00J97P7j03J89j31K09k0J39l48K08
$$ -160 102 -51 54 -243 94 -24 -43 -118 -56 124 -368 -268 -71 6 -97 92 -39 170 150 289 -59 149
7086A49k9l39J73J60l8L9l56J02J47M02m03j00j9j41L30j13J01k72K17j12mK90
$$ 149 120 -219 -46 114 76 115 -241 -139 8 410 7 -93 -112 -253 77 -36 65 -207 10 -102 -106 184
7108A84o59M38J0J69j74n4p0L39l26J86j86K32k57K18O9r4K35j83p4l03J77R6
$$ 184 -475 -37 -27 142 -32 -86 -156 183 -143 43 -143 89 -168 50 119 25 260 77 3 -300 -123 -27
7130b7p0L08L7n6M5j05L8k75l9M1J82o4J06R2k36N5k92L66p0P7n3k31K49j03M59
$$ -27 -97 211 248 192 237 132 170 -105 -144 -103 79 15 121 213 -23 32 -260 106 36 113 60 -171 78 -25 434
7155D34o26K64k05J00K28r6k9J2J7k4k6J75l55J21J46k34L83j78m5n3L0k60K74
$$ 434 -192 72 -133 -33 195 99 70 82 99 75 49 224 -131 -10 136 -98 285 107 62 9 39 -221 53
7178E3PKK76l74J50j8m5j19j11K64k07R4K57j54l12L23l6J84k59j13J38r0k13
$$ 53 60 62 338 -36 114 96 51 -68 -179 85 -122 -28 229 75 -237 86 50 234 -25 -138 0 -90 -303
7201c03J64K67l24K28J61k69K76k36l8O0j67J91m17L71K77l32J11K25k56j3j96
$$ -303 -139 128 -196 32 193 -76 200 -36 -74 -14 -181 10 -407 -36 241 -91 20 245 -11 -24 -220
7222b20J04J72k39M74j36k10L12k41j88M05n50Q40n91P4m08K41M77l08Q9j73J36
$$ -220 -116 56 -183 291 155 -55 257 16 -172 233 -317 523 -68 6 -402 -161 316 8 97 -76 60
7243F0M3q0N1l47j09M43m5j25J98J8K8k19j4N9n7J92k18K06k07K90N6l65K19l89
$$ 60 103 23 74 -273 -382 61 16 -109 89 107 135 -84 -98 -39 -96 96 -122 84 -123 167 223 -142 77 -312
7267c12J88K34o0P9l74Q8j3K60K7L12o30P8J97P0k71j2L43k45j50m1NM71j08m14
$$ -312 -124 110 50 129 -245 -157 -170 90 117 429 -201 -123 74 144 -127 -139 204 -41 -191 -232 -227 244 136 -278
7291b78L46Q9l20J96J41m42L50k67J68J02m8p9J64k0j89L00l42K75k95Q3J27q7
$$ -278 68 157 -163 33 174 -268 82 -185 -17 85 37 -42 122 102 -87 213 -129 146 -149 -66 61 -26
7313b6l15R2M49K8J10l07j10M39l66J20k69N7j22K55L47p04M64k36K97l7j53j8
$$ -26 -341 -249 200 228 338 31 -79 360 -6 114 -155 -98 -220 35 382 -322 142 -94 203 166 13 -5
7335eJ73p2k84n0L57L2k83L12m09L59k07k1L55l1k32L57l31J32J34J51m60R2o6
$$ -5 168 96 -188 -238 119 151 -132 180 -229 130 -77 -98 257 226 -6 351 20 152 286 437 -23 69 3
7358Cp1K71l94K82k02K75j90j52l5L10k2k08r2J55J24N4j09M2k43J50J64k76k9
$$ 3 -68 203 -191 91 -111 164 -26 -178 -213 97 75 -133 -225 -70 54 108 -1 41 -202 -52 112 -164 -193
7381a93j80N7K61j74M57j97J5L4k5J43NJ1m02L55j67j05o6K14m0j49J55l15K54
$$ -193 -373 -316 -55 -229 228 31 46 80 55 198 203 214 -188 167 0 -105 -171 43 3 -146 9 -306 -52
7404e2P9k85L2Q3K90J9j14m25K35J12k2K21o7k55O67m05j81M4j07l5k4J97k72
$$ -52 27 -258 -226 -143 147 166 52 -373 -138 -26 -48 173 106 -149 518 113 -68 -24 -131 -166 -190 7 -265
7427b65M75j72L85l57R2o9O2j70J22k32N8k2O9l68K30P3P9J53k00M64m28M4j65
$$ -265 210 38 423 66 158 89 151 -19 103 -129 -71 -93 -24 -392 -162 -89 -10 143 -57 407 -21 23 -142
7450a42K83k2j45o9K68l93K53j15L83m31K88k20K77l32L06k89M1N4L69l91PJ39
$$ -142 141 119 -26 -95 173 -220 33 -82 301 -130 158 -62 215 -117 189 -100 -59 -5 364 -27 -20 119
7472A19P9j65M8q5L10k35M0k30r0P6K59P6j40l8j22j87J94l5M8r9J61J76r8j25
$$ 119 198 33 81 -4 306 71 111 -119 -209 -133 126 202 62 24 -98 -285 -91 -126 -78 -177 -16 160 62 -63
7496f3k86N11j96J53k88K32l5m9J53L2l30L20l51O3J78k16o3N0N2J10k30J56O06
$$ -63 -349 162 -34 119 -169 63 28 -21 132 164 -166 154 -197 -134 44 -172 -235 -185 -133 -23 -253 -97 509
7519E09m93j63P8K31K1l17J28L7k15J39r6m3K62j74p8J28J20l3p5J8m4j68K61
$$ 509 16 -147 -69 162 183 -134 -6 31 -184 -45 -141 -184 78 -96 -174 -46 74 41 -34 -16 -60 -228 33
7542C3j29j8K36j59Q0j46j5L21q1r7K0J47O8J12m83J64J8k19J29K52J18k58J80
$$ 33 -96 -114 122 -37 43 -103 -118 203 122 25 45 192 260 372 -111 53 71 -148 -19 233 351 93 273
7565B73l10r0L91j40nO8o7j86j31P8K06k94K25q7P7m7J46k92P6l48O58j4j01m7
$$ 273 -37 -127 264 124 119 187 120 -66 -197 -119 87 -207 18 -69 8 -39 107 -185 -109 -457 201 187 86 39
7589C9r8K42k10o4j27J25P2j21k9m0R5L88l40l0L0K28k12L2j12J2n3O9J11q0m6
$$ 39 -59 183 -27 -91 -218 -93 -21 -142 -171 -211 -116 272 -68 -98 -68 160 -52 -20 -132 -120 -173 -104 7 -73 -119
7614a19L21j72j39K70k78K09o4J21k71K08j14J54j07K8j3k9m11M52K6r8O81n24
$$ -119 202 30 -109 161 -117 92 28 149 -122 86 -28 126 19 47 34 5 -406 46 72 -26 655 131
7636A31m9kJ97k94l18jM02k12K09Q6j19k32m6K69m5K09k61K34l64O32m08o9J12
$$ 131 82 80 277 -17 -335 -336 66 -146 63 149 30 -202 -248 21 -24 185 -76 158 -206 426 18 -51 61
7659F1Jm45K01K30M1k44J39K08k17M7J18k03K60j90nl04J20J44l0K54l32k9O5
$$ 61 62 -383 -182 48 89 -155 -16 192 -25 22 140 -63 197 7 2 -302 -182 -38 -68 186 -146 -175 -110
7682a10M74m91p1K63n71O90l99P0R0j13J09P5%P1M7j58l1r1L81k50P6k89M14Q7
$$ -110 364 -127 -198 65 -506 184 -215 -145 -55 -168 -59 16 16 87 134 -24 -55 -146 235 -15 61 -228 186 273
7706B73m20R3N73o87L43R6n16M14m55L25p3K40k5j65j81J57p0J4K37k87K04p6
$$ 273 -147 -54 519 -168 175 271 -245 169 -286 39 -34 206 181 16 -165 -8 -78 -64 173 -114 90 14
7728A4K26j01K0j69P4k09K52k08m54N14N4j90L59l00L01N2O7k04j15j68K2J34
$$ 14 240 139 159 -10 64 -145 107 -101 -555 -41 13 -177 182 -118 183 235 302 98 -17 -185 -163 -29
7750b9Np0p4K0J61n2N6N7j1P6l25K78j83L08l79R6K82k67K00k42M1L71r3j33O
$$ -29 -24 -94 -168 -148 13 -39 17 74 63 139 -186 92 -91 217 -162 -66 216 -51 149 -93 -52 319 226 93 99
7775I9l23K98L7k61lO60l40m66K96J3r8M0k6P2k78L63j57K18k22o0J00J25o9O5
$$ 99 -224 74 111 -150 -153 507 167 -299 -3 10 -88 -48 -74 -2 -280 83 -74 144 -78 -138 -38 87 18 83
7799H3K17l35L2L61n65J06K8r5K47m8J78j81k03k15K65J31J1K43n16K82J02l19
$$ 83 300 -35 -3 358 -207 -101 -73 -168 79 31 209 28 -175 -390 -125 6 17 260 -256 26 128 -191
7821a91J66l14L9L31j9j98J51Jj02Q8J61J51k29j67nJ97k97Q2J70m58L79j23J48
$$ -191 -25 -339 -300 31 12 -186 -35 -34 -136 -48 113 264 35 -132 -137 60 -237 -155 15 -443 -64 -187 -39
7844c9Q4Q4j3k85L91m88N1K09l96M26J36J89m48k1l6J03J29J3k83L68l03J03q9
$$ -39 45 129 116 -169 222 -266 -215 -6 -402 24 160 349 -99 -120 -156 -53 76 89 -194 174 -129 -26 -115
7867a15M3J88J66L3l15J98k50l9L05n22M30j19J35k7j69J32O0k6j74j11L49j89
$$ -115 -72 116 282 315 0 198 -52 -91 214 -308 122 3 138 111 -58 74 134 108 -66 -177 172 -17
7889a7J85k1j58ML21m00R9J40o6j89L0J72J89j22l64J55j00mj6N2j55K9J04J32
$$ -17 168 147 -11 -7 314 -86 13 153 87 -102 -72 100 289 167 -197 -42 -142 -146 -162 -110 -265 -236 -132 0
7913@K29l44m7J03O8j81k52L61K67l54n2M10j03R7j36j54O4k62K65L34n15L54
$$ 0 229 -115 -162 -59 9 -172 -424 -63 204 -150 -202 208 105 202 66 -88 -24 -286 -21 313 -202 152
7935A52j05K10m17J23J16k60J77n9k92M56J30m36L75l79J40j45J63L29k92j58
$$ 152 47 257 -160 -37 79 -181 -4 -63 -355 101 231 -205 170 -209 -69 -214 -51 278 -14 -172
7955a72L45k60J17K38m30M9K15k30j1J15l2j91j15o7M48O9K58m20P8j9n8m8L50
$$ -172 173 -87 30 268 -162 -113 102 -128 -139 -24 -56 -247 -362 -429 19 88 346 -74 4 -15 -73 -121 229
7978B29m05J67l9k1o7K49l68K54j83K49k22M7J03n1j07N4L33n18L01J21k00j04
$$ 229 -176 -9 -48 -69 -136 113 -255 -1 -184 65 -157 -110 -7 -58 -165 -111 222 -296 5 126 -74 -178
8000a78L07N2l03J25R8o7k98L41l71K7K66K0m2l72N95m04J05j1k45J93L04k6j65
$$ -178 129 181 -122 3 101 34 -264 77 -294 -267 -1 19 -23 -395 200 -204 -99 -110 -355 -162 142 116 -49
8023d9k1J32k02K85R0j37l26P26n08J70l19L06m10J91R9l71n0L85L13l40r8M0
$$ -49 -70 62 -140 145 235 98 -228 498 -10 160 -159 147 -263 -72 27 -344 -394 -9 304 -36 -134 -94
8045i4q8L3J67K1n0K0K03k23K7N5j25j62L51m3l28L3J82j12n0K49q6pj54R6K29
$$ -94 -182 -149 18 39 -11 9 212 -11 16 71 -54 -216 135 92 -236 -203 -21 -133 -183 66 -20 -27 -181 -85 144
8070A44k29LL4J93j64m1J56m69L59o7k03L38r6J2j3kJ6QK79O3n66K50q9J08Oj69
$$ 144 -85 -82 -48 145 -19 -60 96 -373 -14 -81 -284 54 -42 -30 -43 -45 -29 -21 258 321 -245 5 -84 24 30 -139
8096a39O9lK1j41L95j1k65K53j88m8j62m4M21q6J82k01p0k72L11J95n3k98M1j35
$$ -139 -70 -73 -52 -193 202 191 -74 179 -9 -57 -219 -263 158 72 254 53 -17 -289 22 217 164 -134 -93 -228
8120b28J66L04l68K67k22K65k41L98L8m48RL42l73O7R0l7j42k3L10l28R1JJ48
$$ -228 -62 242 -126 141 -81 184 -57 341 379 -69 -60 282 -91 -24 66 29 -113 -136 174 -154 -63 -62 86
8143H6j97J76p0m6N04k16j79M9l81J27P4J20j77L74q3j39j59L5Q2k54L91k86J27
$$ 86 -111 65 -5 -51 453 237 58 107 -274 -147 -73 47 -130 244 161 22 -137 -102 -20 -274 117 -169 -42
8166d2J09n0n9M6N1j68L1J69q8NK9J6l04K70K4P7J16r2o7j50M1k3qJ23l8
$$ -42 67 17 -42 4 55 -113 -82 87 -1 4 33 49 -255 15 39 116 232 140 73 -77 -36 -59 -67 56 18
8191A8
$$ Imaginary data points
##PAGE= N=2
##DATA TABLE= (X++(I..I)), XYDATA
0@%%%%%%%%qJ6j6J6k1K9l2L9m7N6o4P2q8J04j20J39j62J85k09K38k70L06l45L87
$$ 0 0 0 0 0 0 0 0 0 -8 8 -8 8 -13 16 -16 23 -24 32 -32 40 -48 56 -64 75 -87 98 -111 127 -143 163 -182 205
32B05m35M87n44O06o75P49q31R22j023J133j252J387j536J704j895K109k354K641
$$ 205 -230 257 -287 319 -356 393 -438 484 -539 594 -658 729 -807 897 -998 1111 -1243 1398
50A398k977L376l869M489n291O383p964J0470j5066K6271j02378j74771J15025
$$ 1398 -1579 1797 -2072 2417 -2874 3509 -4455 6015 -9051 17220 -85158 -259929 -144904
63a44904R8966r625p1796R937K7026r10o755L3587J3518q265J4485M1892n010
$$ -144904 -45938 -55563 -127359 -117422 -90396 -91306 -98061 -64474 -50956 -59221 -44736 -2844 -7854
76g854l0955K2655P0581Q596o1822l3013L6221K4684k2129j6926J8133Q200j4186
$$ -7854 -38809 -16154 54427 63023 1201 -31812 4409 29093 6964 -9962 8171 16371 2185
89B185l712O307j7730k0091J7006K3552k5011l9506J7484N4936J2710l7415k5376
$$ 2185 -1527 4780 -12950 -33041 -16035 7517 -17494 -57000 -39516 15420 28130 -9285 -34661
102c4661J1313J4624K581K203q14r240M463K1129M321k5410q889L0593J7558l4023
$$ -34661 -23348 -8724 -6143 -3940 -4754 -13994 -9531 11598 15919 -9491 -18380 12213 29771 -4252
116d252l6803K1085M6495O815k9791j5049J0148R704j665m585n777l042J2388
$$ -4252 -41055 -19970 26525 33340 3549 -11500 -1352 8352 6687 2102 -3675 -6717 5671
129E671J7027n556k0968K318K7782L811l2549k0553K0617K6826k335j5998l996
$$ 5671 22698 17142 -3826 -1508 26274 30085 -2464 -23017 -2400 24426 22091 6093 2097
142B097M444O58J171P62j0114r967J0810J6814q102k2147N060K9970P263k7065
$$ 2097 6541 7199 8370 9132 -982 -10949 -139 16675 8573 -13574 -8514 21456 28719 1654
156A654j9828J1508J7335J174m780l47p73n50O747K394j3955j2062J3353J7915
$$ 1654 -18174 -6666 10669 11843 7063 6716 5943 5393 12140 14534 579 -11483 1870 19785
170A9785j2081k6166L522L0267R745k5470k0897P779J5279k29q846m259L523P983
$$ 19785 7704 -18462 -14940 15327 25072 -398 -21295 -13516 1763 1534 -7312 -11571 -8048 -65
184f5O891m249j3932m164J6252J3078j3335k1049O664K5511Q249j5901j3550M797
$$ -65 6826 2577 -11355 -15519 733 13811 476 -20573 -13909 11602 19851 3950 -9600 -4803
198d803Q898j213o663m093J012P784P908m134j5408m382J5773J1552j2542j9052
$$ -4803 4095 2882 -3781 -7874 -6862 922 8830 4696 -10712 -15094 679 12231 -311 -19363
212a9363K485J8890Q308q196q315K855P001K580m018q495k823J0295J4475k198
$$ -19363 -16878 2012 10320 2124 -6191 -3336 3665 6245 2227 -6268 -9091 1204 15679 13481
226A3481j7860n627J6434J3291j2293j9807M30J6357O433q760q967K491Q438M051
$$ 13481 -4379 -10006 6428 19719 7426 -12381 -11951 4406 10839 2079 -6888 -4397 4041 8092
240H092n462j0948m121J0725J2756l805j5372j501J6910J1344j0206j5464J401
$$ 8092 2630 -8318 -12439 -1714 11042 7237 -8135 -9636 7274 18618 8412 -7052 -5651
253e651J1617M376n158n625J84O399O497k243j1882p568P905J2110m410j5349
$$ -5651 5966 10342 5184 -441 -257 6142 12639 10396 -1486 -9054 -1149 10961 6551 -8798
267h798k569J4334R001p684j1656m67P215L797k723n742k198O565J0272J071j0863
$$ -8798 -11367 2967 11968 4284 -7372 -7839 -624 3173 450 -5292 -7490 -925 9347 10418 -445
282d45p895Q415J2502m521j4062l008J3296R075m992r501k518N248M185k523q356
$$ -445 -8340 75 12577 8056 -6006 -9014 4282 13357 8365 -1136 -3654 1594 5779 3256 -5100
297e100n047N910J0104O6j1217n848Q222R453m726j2172k234R591P955j872o151
$$ -5100 -10147 -4237 5867 5933 -5284 -11132 -2910 6543 1817 -10355 -12589 -2998 4957 3085 -3066
312c066j390N869N898j732r097m218O416R479n46r357l571P675O857m237j0064
$$ -3066 -4456 1413 7311 5579 -3518 -7736 -1320 8159 7613 -1744 -5315 2360 9217 4980 -5084
327e084l348M858N342n82n516k923M416O562Q1q532o086M565Q630N94p334k799
$$ -5084 -8432 -3574 1768 1186 -4330 -7253 -2837 3725 3806 -4726 -10812 -6247 2383 2977 -4357 -7156
343g156P533Q417j169q074m623M607O489m93o335l557N857P989o05q517o398L715
$$ -7156 377 8794 7625 -449 -5072 -465 6024 5531 -804 -4361 1496 9485 8880 363 -6035 -2320
359b320O550j141q191l606O098Q090o20p244m328K883N476k57n950l031N388Q004
$$ -2320 4230 3089 -5102 -8708 -2610 5480 4860 -2384 -6712 -3829 1647 1390 -4560 -7591 -2203 5801
375E801J279n605l979L156N303m67o581l461M701O595Q96n364m204K431M645j272
$$ 5801 7080 1475 -2504 652 5955 5488 -1093 -4554 147 6742 7638 2274 -1930 501 5146 3874
391C874o757n270L613P025K060n561m276K922N280k34o361m497L288P345J640
$$ 3874 -2883 -8153 -4540 2485 4545 -1016 -5292 -2370 2910 2676 -3685 -8182 -4894 2451 4091
406D091l748k862L659N488n36o438m446K847N790J530l892k957K857M651k21o019
$$ 4091 343 -2519 1140 6628 6092 -346 -4792 -1945 3845 5375 1483 -1474 1383 6034 5813 -206
422b06n509J319N163R67l565l555L408N750P97o113n540J897N461J408l795k139
$$ -206 -5715 -4396 767 1734 -1831 -5386 -1978 3772 4569 -1544 -7084 -5187 274 1682 -2113 -4252
438d252L708N452J676m971m445R60M346P55l590k676K488N411J641m353n301M58
$$ -4252 -544 4908 6584 1613 -2832 -1872 2474 3229 -361 -3037 -549 4862 6503 2150 -3151 -2693
454b693L269N75l754l243K342N146K063l241m325P74L338J160l233l765K117O119
$$ -2693 576 1151 -2603 -5846 -3504 1642 3705 464 -3861 -3087 251 1411 -1822 -5587 -3470 2649
470B649L255l073m342Q88M024L09m183l305K019M990K008k710l619P03K975L56
$$ 2649 5904 2831 -1511 -623 3401 3710 -473 -3778 -1759 3231 5239 2529 -1090 -387 2588 2944
486B944m347m006Q85N017K829k833l318J317L733J68l978k947J453L731K054j155
$$ 2944 -1403 -5409 -4524 493 3322 489 -2829 -1512 2221 2389 -1589 -4536 -3083 648 2702 1547
502A547j545L60K976J428k398n234J25M150K875k574l450J715L949K29m116l236
$$ 1547 2 362 3338 4766 2368 -2866 -2741 1409 4284 1710 -1740 -25 3924 4153 37 -3199
518c199K91K015J687o80k394K90L433K746k693m977j14M512J948k823k502K989
$$ -3199 -2908 -893 794 114 -2280 -1990 1443 4189 1496 -3481 -3595 917 2865 42 -2460 529
534E29L440M41k454k038n75J265J448k91k849q30L554L371k561m982q82L841P81
$$ 529 3969 4410 1956 -82 -657 608 2056 1765 -1084 -1914 1640 5011 2450 -2532 -3414 427 1208
551A208l481j836J649L007R86n85j488j577P91K730n63l444j037M420M345k342
$$ 1208 -2273 -4109 -2460 547 1533 948 -540 -2117 -1326 1404 841 -2603 -3640 780 5125 2783
567B783m250P77L860n45l845j193J338J268Q85R07j823j874M65K375m90m947j392
$$ 2783 -1467 -690 3170 2625 -1220 -2413 -1075 193 1078 1985 162 -1712 -1247 1128 638 -4309 -5701
584e701M260L661k426l005K128K998o12k656o4k9O23J864K086j470k822J620M004
$$ -5701 -1441 2220 -206 -3211 -1083 1915 1303 -1353 -1417 -1446 -823 1041 3127 1657 -1165 455 4459
601D459j003m876j669M079K033l413j942K533K028j352j539J3j559o58J838K463
$$ 4459 3456 -1420 -3089 990 3023 -390 -2332 201 2229 877 -662 -649 -2208 -2866 -1028 1435
617A435k115k731K544M010q11m853K93L630J157k960j229K778J297k16K85J90
$$ 1435 -680 -3411 -867 3143 2332 -2521 -2228 1402 2559 -401 -1630 1148 2445 2229 2514 2704
633B704k683j617K635K586l545l492L194L868j753m779J46L986k81l471o86J800
$$ 2704 21 -1596 1039 3625 80 -3412 -218 3650 1897 -2882 -2736 1250 969 -2502 -3188 -1388
649a388N84Q8J899M05k513j356L367J704l331k454L054L957j674l347J475K864
$$ -1388 -804 -716 1183 1588 -925 -2281 1086 2790 -541 -2995 59 4016 2342 -1005 470 3334
665C334j015k872j35J001j108j54K219K99k957j447L238J025l445k880K341L523
$$ 3334 2319 -553 -688 313 -795 -949 1270 1569 -1388 -2835 403 1428 -2017 -4897 -2556 967
681I67j426k593J832K599q03j528R8O87j144L41L159J22l287m33L832J457l948
$$ 967 -459 -3052 -1220 1379 576 -952 -854 -167 -1311 -970 2189 2311 -976 -1409 2423 3880 -68
698f8k393K588J648l223j669K581K309j767j129P39o5k769N92L178k2l695k45
$$ -68 -2461 127 1775 -1448 -3117 -536 1773 6 -1123 -384 -449 -3218 -2626 552 530 -3165 -3410
715c410M774J330l588q75K821R83l312q46L183J164j486P77J638k078k681J269
$$ -3410 1364 2694 -894 -1769 1052 2035 -1277 -2123 1060 2224 738 1515 3153 1075 -1606 -337
731c37L613j899m043P52M271q68l452R26L634j311l934l99K767r4j182K549K503
$$ -337 3276 1377 -2666 -1914 2357 1489 -1963 -1037 2597 1286 -2648 -3047 -280 -374 -1556 993 3496
748C496l273l251K510M055k232m077K211L381j670l008K511L259j835l388R19
$$ 3496 223 -3028 -518 3537 1305 -2772 -561 2820 1150 -1858 653 3912 2077 -1311 -392
763c92J962k968j242L605K165m131k293L778K392l579l554L280K186k611j707
$$ -392 1570 -1398 -2640 965 3130 -1001 -3294 484 2876 -703 -4257 -977 1209 -1402 -3109
778c109L579K347k636j552K738P1l840k61M579J214m069j317M414J349l921j499
$$ -3109 470 2817 181 -1371 1367 1438 -2402 -2663 1916 3130 -939 -2256 2158 3507 -414 -1913
794a913L116N78l924r38L509J348l137K0K803p10m013N04L805M38m722M22M603
$$ -1913 1203 1781 -2143 -3081 428 1776 -1361 -1341 1462 752 -3261 -2757 1048 1486 -3236 -2814 1789
811A789N69l017j32K791o53l629L55L236l8k248J309K499k100l325J371K982j302
$$ 1789 2358 -659 -791 2000 1347 -2282 -1927 1309 1271 -977 332 2831 731 -2594 -1223 1759 457
828D57l316R62K543n67j971J594K766k654k801J697J733j600j382L240K484k840
$$ 457 -2859 -1897 646 79 -1892 -298 2468 -186 -2987 -1290 443 -1157 -2539 701 3185 345
844C45k580K512K217k175k051J833J305j540j298K590J310k186j579J153N53k297
$$ 345 -2235 277 2494 319 -1732 101 1406 -134 -1432 1158 2468 282 -1297 -144 409 -1888
860a888r65L050J537k281j131J762J256k046j079J740M21j962M5K809Q50j998
$$ -1888 -2853 197 1734 -547 -1678 84 1340 -706 -1785 -45 376 -1586 -1541 1268 2118 120
876A20j87J717m28k878L7K792N51j896l94J926j87j708q9J350q54j911N55J694
$$ 120 -67 1650 1222 -1656 -1619 1173 1724 -172 -566 1360 1173 -535 -624 726 -128 -2039 -1484 210
894B10j53j355R63J752j165k264O77J354k52j376O67K090O0j249L88J081j052
$$ 210 57 -1298 -335 1417 252 -2012 -1335 19 -233 -1609 -942 1148 1208 -41 347 1428 376
911C76j874J123J175m41j219Q80J515q24j520J48Q29n28j326M67J039m90q4O00
$$ 376 -1498 -375 800 359 -860 20 1535 711 -809 -661 168 -360 -1686 -1219 -180 -670 -754 -154
929a54J070j350r87O29J123r65p29J536J134l73q93O29P63q92j175Q72Q10r81
$$ -154 916 -434 -1421 -792 331 -634 -1363 173 1307 934 41 670 1433 541 -634 238 1048 67
947F7l86J116J004j167j094N84K08j081q19J150P18p38m79R64K65q43n17R53j81
$$ 67 -319 797 1801 634 -460 124 332 -749 -1568 -418 300 -438 -917 47 312 -531 -1048 -95 -276
966b76o69Q5J370Q68j121j16R76J85j435k25O80L84p95j7R43J74q29m14L82j03
$$ -276 -945 -860 510 1378 257 141 1117 1302 -133 -358 322 706 -89 -106 837 1011 182 -232 150 47
986D7j161k52J101L83p07j40J233j66q37k60P96k88j94M87O83J21m65L14M59n11
$$ 47 -1114 -1366 -265 118 -589 -729 504 338 -499 -759 37 -251 -445 42 725 846 381 695 1154 643
1006F43r57N1R20j70n33J56P85p9o99j28K88p20p26L25M39R1k19L43N56o64o25
$$ 643 -314 -263 657 487 -46 110 895 816 117 -11 277 -443 -1169 -844 -405 -314 -533 -190 366 -298 -923
1027i23O19M12m88l2L04M76L0J40R6J76m36n99N54J23n06q6L29K35p9j52k88K39
$$ -923 -304 108 -380 -412 -108 368 398 538 634 810 374 -225 329 452 -54 -140 189 424 345 193 -95 144
1049A44l73j18k3m41M42J28K78K70l85J45k47m21N6K66M30K97O5k55L66j52j79
$$ 144 -229 -347 -370 -811 -369 -241 37 307 -78 67 -180 -601 -545 -279 151 448 513 258 624 472 293
1070B93J24k38J58m92N4M87q4l53K11J22k06p49L9L40N9k21K97J94j97N25k44
$$ 293 417 179 337 -155 -101 386 302 -51 160 282 76 -673 -634 -294 -235 -456 -159 35 -162 363 119
1091A19l41K3n16N50L55K54k28L54j22J59j07l64l13n3L10j00M6j70M20j34p3
$$ 119 -222 -199 -715 -165 190 444 216 570 448 607 500 136 -177 -230 80 -20 26 -144 276 142 69
1112F9m84j53J79L14k72J13P4M07K15l39P9j97j18O7j18J07M43J69j9N3j18q54
$$ 69 -415 -568 -389 -75 -347 -234 -160 247 462 123 202 5 -113 -46 -164 -57 386 555 536 589 471 -383
1134c83M09l33J64n5j61L80m8K65m7j64m43L62l56J02p0J62L14J56k5l4o7k35
$$ -383 26 -307 -143 -198 -359 21 -27 238 191 27 -416 -54 -410 -308 -378 -216 98 254 229 195 128 -107
1156a07K50j85j7L94Q5K08j5l63k50K23j51n39l7L50k37Q09m44k53O12n38j39
$$ -107 143 -42 -59 335 420 628 613 250 0 223 72 -467 -504 -154 -391 418 -26 -279 333 -205 -344
1177c44J23m26K03k23M76L96j44j37J33L14k17n43Q0M69L08q4k35K58L93n68Q1
$$ -344 -221 -647 -444 -667 -191 205 61 -76 57 371 154 -389 -309 160 468 384 149 407 800 232 313
1198C13j66m76j09M48R6l53J45K29j39m7k40l92J94J72k2N20r4j0J81L82o43O5
$$ 313 147 -329 -438 10 106 -247 -102 127 -12 -59 -299 -691 -497 -325 -347 173 79 69 250 632 -11 54
1220E4l44O33J19l70p0P60n3N2p91J42j02j46K59m02J74j83P2O86kp09k76K48
$$ 54 -290 343 462 92 22 782 729 781 -10 132 30 -116 143 -259 -85 -268 -196 490 488 -221 -497 -249
1242b49R9m99K54N14M44m86o0mM68l57j98O57j42n64P53K86j39n52l75L52k57
$$ -249 -150 -649 -395 119 563 77 17 13 481 124 -74 583 441 -123 630 916 777 225 -150 202 -55
1263e5o05Q0O02J63n49M11L36p20j32K89R9l09l38M88Q17j41m14L8L28m65m13
$$ -55 -660 -580 22 185 -364 47 383 -337 -469 -180 -81 -390 -728 -240 577 436 22 60 388 -77 -490
1284d90K64P53K4k91K49J69m19l12L91M6p49o59L99J004k75l73L81L37o62m26
$$ -490 -226 527 551 260 509 678 259 -53 338 384 -365 -1024 -625 379 104 -269 112 449 -213 -639
1304f39M5O35k74k55P59m7p37K46R83o9q98k92O57N18n54l23Q35j2p34r7O34k46
$$ -639 -594 41 -233 -488 271 224 -513 -267 716 647 -251 -543 114 632 78 -245 590 578 -156 -253 381 135
1326A35o14M75M44m36p97M41R09K70j523Q0O17l61m50K83J284m59m82M58M54p38
$$ 135 -479 -4 440 4 -793 -352 557 827 -696 -616 1 -360 -810 -527 757 298 -184 274 728 -10
1346a0m69K17P94k37j364Q10J243j77q18j13J063j194n45L52Q72l36k82J88K33
$$ -10 -479 -262 532 295 -1069 -259 984 807 -11 -124 939 -255 -800 -448 424 88 -194 -6 227
1365B27j09j059R37P31j114n86N14R60O8q39O84N19j113p69J167L63o28n82J222
$$ 227 118 -941 -4 727 -387 -973 -459 501 569 -270 414 933 -180 -949 218 581 -47 -629 593
1384E93M97j369l06J122O06j143q26M23P49m39n52P80L39q42l44P50Kn54J71J104
$$ 593 1090 -279 -585 537 1143 0 -826 -403 346 -93 -645 135 474 -368 -712 38 40 -514 -343 761
1404G61q7j455K41J070L05q96k40L09J45o19M1J102O0q38q1O14r7j322M54Q20
$$ 761 674 -781 -540 530 835 -61 -301 8 153 -466 -425 677 737 -101 -182 432 335 -987 -533 287
1424B87o7j106K0J169M09q06k08M38k95m99P6P88M2k22l8O44q49o16O54J088l98
$$ 287 220 -886 -866 303 712 -94 -302 136 -159 -658 -582 206 248 26 -12 632 -217 -833 -179 909 511
1445E11q26j03Q10l4q43O49J53l08j101Q67M56m87n26Q60O52n42j088O86N97K8
$$ 511 -315 -418 392 358 -485 164 317 9 -1092 -225 231 -256 -782 78 730 188 -900 -214 383 411
1465D11j146Q51N36n23m40O63M71l87o25K31P20j254k54J047M62q67o60P60P12
$$ 411 -735 116 652 129 -311 352 823 436 -189 42 762 -492 -746 301 763 -104 -764 -4 708
1484G08p41p58P10M46r97j17P58O47q20m25P28N35j176m17J364M77q05m65P86
$$ 708 -33 -791 -81 365 -632 -749 9 656 -164 -589 139 674 -502 -919 445 922 117 -348 438
1503D38L91p97q2O23j93j128J11J402q7j063j5J003q8j277n8J070n3j007K57P42
$$ 438 829 32 -50 573 380 -748 -637 765 678 -385 -400 603 515 -762 -820 250 197 -810 -553 189
1523A89K74q64k8R86l32n82N5O30k29p02R09O33l83j166N03P51j87j015K31P44
$$ 189 463 -401 -429 557 225 -357 -302 328 99 -603 306 939 556 -610 -107 644 457 -558 -327 417
1543D17m16q97Q16P01l59j083M53M65o04m30N37J281r41l77K96M52k75n44P43
$$ 417 1 -896 -80 621 262 -821 -368 97 -507 -937 -400 881 -60 -437 -141 311 36 -508 235
1562B35M73p34p2M44K23l19o11Q97k19n60l75Q97J78m83k04M86K17j081J58Q39
$$ 235 708 -26 -98 346 569 250 -361 536 317 -243 -618 279 457 -26 -230 256 473 -608 -450 389
1582C89q1n00k43O10j3k67O6M08l8q00j25P20N46p67%N78j46m94M1O24K00p12
$$ 389 308 -192 -435 175 162 -105 -39 369 331 -469 -594 126 672 -95 -95 483 337 -157 -116 508 708 -4
1604dr5L34r7m37J34Q95m15o30P8J94Lj55N0L71j70o17P23J87l19m32L57K55k28
$$ -4 -99 235 138 -299 -165 730 315 -315 -237 -43 -40 -195 -145 226 56 -561 162 349 30 -402 -45 210 -18
1627a8j91N02L09l21k76Q8K34l64K9q3O14m23l21M51l9J23n86J62K93m24j09K57
$$ -18 -209 293 602 281 5 93 327 -37 -8 -91 523 100 -221 230 191 314 -272 -110 183 -241 -350 -93
1649i3J5J75k64o4M80p08K04J70N24l97j83K99K24n39K82J70j61k79j39M61l93
$$ -93 -78 97 -167 -231 249 -459 -255 -85 439 42 -141 158 382 -157 125 295 134 -145 -284 177 -216
1670b16J93m7Q4J72j27o60P33k07j30J11K69r1j71q7K07J17k51j93J53K11j80
$$ -216 -23 -70 14 186 59 -601 132 -75 -205 -94 175 84 -87 -174 33 150 -101 -294 -141 70 -110
1691a10nL45j75k35L46M7K5k96k28r6L49J25r5K65j63l46J30p9J35j22J8J48J05
$$ -110 -115 230 55 -180 166 213 238 -58 -286 -382 -33 92 -3 262 99 -247 -117 -196 -61 -183 -165 -17 88
1714H8j61k9L23j24j77m9N5k4J28o2M35j56j5m20M80p00K88l4K68l60L79n1M2
$$ 88 -73 -102 221 97 -80 -129 -74 -98 30 -32 403 247 232 -188 292 -408 -120 -154 114 -246 133 82 124
1737A24j13k01J03O5n01N26J0K32l07R4J22N2l03K0L82k41R3k77jL31L3k02o8
$$ 124 11 -190 -87 -22 -523 3 13 245 -62 32 154 206 -97 -77 305 64 157 -120 -121 210 243 41 -27
1760b7Q1r6k62K27k35L05R7q1L83m11n06L06K62j15j18r3K42K97r5O5l86K65l33
$$ -27 54 -42 -304 -77 -312 -7 90 9 392 -19 -525 -219 43 -72 -190 -283 -41 256 161 226 -160 105 -228
1783b28L02J5k40L74K08j55O6l87J61O7n23M02K4j72O5Q2J75Kk12r9j64k23M82
$$ -228 74 89 -151 223 431 276 342 -45 116 183 -340 62 86 -86 -21 61 236 238 26 -73 -237 -460 22
1806B2j2j6J56k36K47j24K73k81J91p7j77q5J30K23k49j41N69L0n49K29k34J14
$$ 22 10 -6 150 -86 161 37 310 29 220 143 -34 -119 11 234 -15 -156 413 443 -106 123 -111 3
1828Ck05J74Q7n0j1p6M4l08K78L76k67j31k46N66k31q3J27J39p3k49JK25k38R6
$$ 3 -202 -28 59 9 -2 -78 -34 -342 -64 312 45 -86 -332 234 3 -80 47 186 113 -136 -135 90 -148 -52
1852e2K58p4J97l62l49J49J76J35m95L86K4l2J48j01l79J22L85rJ4l37L85q4j54
$$ -52 206 132 329 -33 -382 -233 -57 78 -417 -31 -7 -39 109 8 -371 -249 136 127 141 -196 189 105 -49
1875d9L75l33L10k72M5l06K77n1L62L0k66r3J69N0m51J54j42kK52n5J69Nk61K66
$$ -49 326 -7 303 31 76 -230 47 -4 358 388 122 29 198 248 -203 -49 -191 -193 59 4 173 178 -83 183
1899A83k46K18j23j10L42K0j50l4J3k51L97m44J6N5L99M0M5l33J50k32k2OJ7l0
$$ 183 -63 155 32 -78 264 284 134 100 113 -138 259 -185 -169 -114 285 325 370 37 187 -45 -67 -61 -44 -74
1923g4j07L00L8l03K8k06J68K57l21K06r5K48n3r5k3N4P0n7j14l09K41Q3K19l6
$$ -74 -181 119 157 -146 -118 -324 -156 101 -220 -14 -109 139 86 -9 -32 22 92 35 -79 -388 -147 -64 155 119
1947A19k12L24j93r0nL2M8r1j05p6m6M80j48Q4j3m12K29M7K23M5l18qJ94J97k01
$$ 119 -93 231 38 -52 -57 -25 23 -68 -173 -249 -295 185 37 121 108 -304 -75 -28 195 240 -78 -86 108 305 104
1972A04lM3QK1o01N15j69J43J65n7j41n50M88K39k25k97L16J7K76m92K89N1q2
$$ 104 101 144 152 173 -428 87 -82 61 226 169 28 -522 -34 205 -20 -317 -1 16 292 -200 89 140 58
1995E8k43j3K31Q0k66O8L07j20l50L93J71l23l52J55L48k66k9L57P4k17k02M07
$$ 58 -185 -198 33 113 -153 -85 222 102 -248 145 316 -7 -359 -204 144 -122 -151 206 280 63 -139 268
2017B68j25j69k13K55K70k78O7j57K63k49k99K15L83j75m02L01j81K39J07l1Q3
$$ 268 143 -26 -239 16 286 8 75 -82 181 -68 -367 -152 231 56 -346 -45 -226 13 120 89 172
2038A72k43K75J99m41K28m03K84J98k15l81L78j71l01L12j20J35j52J25M01n17
$$ 172 -71 204 403 -38 190 -213 71 269 54 -327 51 -120 -421 -109 -229 -94 -246 -121 280 -237
2058b37M3p6K85M33m55j63K49q3k37l8K83J59m85K52J37j59N9J6N62o31j48K44
$$ -237 -194 -270 15 448 -7 -170 79 -4 -241 -279 4 163 -322 -70 67 -92 -33 -17 545 -86 -234 10
2080A0P36q80o6KK06k5l61L26L77k96l51L46P7om46L73J70r3l57J22K79p8j49
$$ 10 746 -134 -200 -198 8 -17 -378 -52 325 29 -322 24 101 95 -351 22 192 99 -258 -136 143 65 -84
2103h4O4K31l81J13nJ52k10J75P7j99m5N3J18j02K0j35L23j24K85n46L88N1k71
$$ -84 -20 211 -170 -57 -62 90 -120 55 132 -67 -112 -59 59 -43 -23 -158 165 41 326 -220 168 219 -52
2126e2J81j94K97n40K9M64K46n21r1M78k00n7j59K57M6k02L5J62j76l42J35L73
$$ -52 129 -65 232 -308 -279 185 431 -90 -181 297 97 40 -119 138 184 -18 17 179 3 -339 -204 169
2148A69m00J67K2K27l74k59P90J67n28Ml71M83j14J95M7j55Jm15P9L52l74j6L46
$$ 169 -231 -64 -42 185 -189 -448 342 509 -19 -15 -386 97 -17 178 225 70 71 -344 -265 87 -287 -303 43
2171D3K30k03n34N37p8R2j04O5M0k63J72J69k52P1k80L66K20m08k9N14k97l10
$$ 43 273 70 -464 73 -5 87 -17 48 88 -175 -3 166 -86 -15 -295 71 291 -117 -146 368 71 -239
2193b39J53L05J91l88m8M8J48l82P5N8K99k58l1L38r3m64M06K43j30k45J8K74
$$ -239 -86 219 410 22 -26 22 170 -212 -137 -79 220 -38 -69 269 176 -288 118 361 231 -14 4 278
2215B78j65o8k27J37K2j22N20Kj61l25K16K86l13j42j66N95r8o31J2N92O6r5j43
$$ 278 113 45 -182 -45 -23 -145 375 377 216 -109 107 393 80 -62 -228 367 269 -362 -350 242 308 213 70
2238G0K69n46M4O7K35L3m62K69J88k51J19l42O15l87Q8J88l07P5k1L29j50j24
$$ 70 339 -207 -163 -96 139 172 -290 -21 167 -84 35 -307 308 -79 9 197 -110 -35 -56 273 123 -1
2260aj42R0k54K84m2j02K08J6k62K71J47j67l13K14R2K64j94J14l42J39m3O9J64
$$ -1 -143 -53 -307 -23 -65 -167 41 57 -205 66 213 46 -267 -53 39 303 109 223 -119 20 -23 46 210
2283B10l34L23k97K40j08m19L61J12J38m57k6M82m05J90J33k1l16J02M61k40n37
$$ 210 -124 199 -98 142 34 -385 -24 88 226 -231 -257 225 -180 10 143 122 -194 -92 369 129 -408
2304d08J16N0L64m53L3L17q2J93k88Q3Q7K49m58K09J31j23Q5K44j40k89J38R8
$$ -408 -292 -242 122 -331 -298 19 -63 130 -158 -75 12 261 -197 12 143 20 105 349 209 -80 58 156
2326A56j23m72L32j12K65O7r8K19l27n0K85LQ5k85J24Nl47%J77K58P8m29J14L2
$$ 156 33 -439 -107 -219 46 113 15 234 -93 -143 142 145 230 -55 69 74 -273 -273 -96 162 240 -189 -75 -43
2350d3K86J75p9p16M04J23Oj16k17M6K36Q0n78J89j69N06j14j06k70L66j78K72
$$ -43 243 418 339 -377 27 150 156 40 -177 -131 105 185 -393 -204 -373 133 19 -87 -357 9 -169 103
2372A03L44m78j57N5K37j63J37l22R3L50l57k52K21L72L6p3k42k23M27k05K96
$$ 103 447 -31 -188 -133 104 -59 78 -244 -151 199 -158 -410 -189 183 219 146 -96 -319 108 -97 199
2393A99k29m52N76j29j96j44L65q2N31p28j81K95J42K67n27M01L9k20K49j49L0
$$ 199 -30 -482 94 -35 -231 -375 -10 -92 439 -289 -470 -175 -33 234 -293 108 147 -73 176 27 57
2414E7J06J5q1m0n03M33L25k39O2n13K19K66j93M00m48j30K78j6R6k27k13M2O51
$$ 57 163 178 97 57 -446 -13 312 73 135 -378 -159 107 -86 314 -134 -264 14 -2 94 -133 -346 -304 347
2437C47n04J05kN16j24o18K39o1K49m4j31k30mN72n08JK16k90L57K16l97K01l99
$$ 347 -157 -52 -54 462 338 -280 -41 -102 147 103 -28 -258 -262 310 -198 -197 19 -271 86 302 -95 106 -293
2460b93K22J94Q1J84l99j07K97q7j13q2L77j62j0o7l5L58l36R1j02l15L96K37
$$ -293 -71 123 204 388 -11 -118 179 92 -21 -103 274 112 102 35 0 358 22 113 11 -304 92 329
2482C29l11j76J02k18M12j13j96r0J52L10j53m64K03%J87L53l25j10K33R1J40
$$ 329 18 -158 -56 -274 138 25 -171 -261 -109 201 48 -416 -213 -213 -26 327 2 -108 125 216 356
2503C56K5n33J17m4J91j01k75J47K07L26o96J28Q7L29n0m68O6K90N6j25J01m58
$$ 356 381 -152 -35 -79 112 11 -264 -117 90 416 -280 -152 -65 264 214 -254 -188 102 158 33 134 -324
2525c24K15J97o8k43J91O5M71n17j51r3J35L65q9j66r1J52k1Q2k03j66n6L81k06
$$ -324 -109 88 20 -223 -32 33 504 -13 -164 -257 -122 243 154 -12 -103 49 28 110 -93 -259 -315 66 -140
2548a40j29j70J83L09K97j67l30j1L24j28k2l98N11J47r6r5k57l3O14L8m42K47
$$ -140 -269 -439 -256 53 350 183 -147 -158 166 38 16 -382 129 276 180 85 -172 -205 409 447 5 252
2570B52l55J11M9J0m12r5N69K1k50j92M19J33N3j71j73j9K36o8k02N3q1L3K13
$$ 252 -103 8 57 67 -345 -440 129 150 -100 -292 127 260 313 142 -31 -50 186 118 -84 -31 -112 -79 134
2593A34k81L8K42J5K25l22l52K75J92k42q8k8M55k47m9Q0l10J41O0M61j44o39
$$ 134 -147 -109 133 148 373 51 -301 -26 166 -76 -164 -192 263 16 -33 47 -263 -122 -62 399 255 -384
2615c84L67J32J79l00k77%P89R4n81k2N0K98k24j5l10L94j72J53O7m00jj28J87
$$ -384 -17 115 294 -6 -283 -283 506 600 19 -3 47 345 121 106 -204 190 18 171 238 -162 -163 -291 -104
2638a04J27k3j08K92K3l22L7pR4J68j81m54J56L81L78l73l38R9o5L54l04n1r7
$$ -104 23 0 -108 184 207 -115 -78 -85 9 177 -4 -458 -302 79 457 84 -254 -155 -220 134 -170 -221 -318
2661c18M30K80l34M8p3n0L24l12j41k55M70J76l94j96L01j48M78m89j65J52M67
$$ -318 112 392 58 106 33 -17 307 -5 -146 -401 69 245 -149 -345 -44 -192 286 -203 -368 -216 251
2682B51K30k96k44L7L01j7k80q4k63J05N99l74j31k88M94Q1k25j69K42O6K5j9
$$ 251 481 185 -59 -22 279 262 -18 -102 -365 -260 339 -35 -166 -454 40 121 -104 -273 -31 35 60 41
2704D1k87L29n0L47k91m27L21L78k72r4p8K25J14j9k00k41J43P8P3j08n1j75J39
$$ 41 -246 83 33 380 89 -338 -17 361 89 -5 -83 142 256 237 37 -204 -61 17 90 -18 -69 -244 -105
2727a05K16j71k5k33K34L64r9o18K61M66J14n16k85K51j23L26n4r2k84N03Q8R3
$$ -105 111 -60 -85 -318 -84 280 181 -437 -176 290 404 -112 -397 -146 -269 57 3 -89 -373 130 218 311
2749C11m36l13M28l2L65l00j21K21j49L8k59R7J79M25j03n71J42J63N8j69m4j83
$$ 311 -125 -438 -10 -42 323 23 -98 123 -26 12 -247 -150 29 454 351 -220 -78 85 143 -26 -70 -253
2771b53L03q3M01m85J9j3K97o7o7k52J82L6K59k59l57N94J1l14J73l32L62J24
$$ -253 50 -33 368 -117 -98 -111 186 119 52 -200 -18 18 277 18 -339 255 266 -48 125 -207 155 279
2793B79n1k95j81N48j46k73J62Q3k68N0M24m56j19pN79k33j88j7L36j21p8l03
$$ 279 228 -67 -248 300 154 -119 43 126 -142 -92 332 -124 -243 -250 329 96 -92 -109 227 106 28 -275
2815b75L52k4k41J83j89M7m3J57M25m60j11O6J53j89J77n89Q56m87K81o6k23M16
$$ -275 77 53 -188 -5 -194 -147 -190 -33 392 -68 -179 -113 40 -149 28 -561 295 -192 89 23 -200 216
2837B16l95N77k10n80M01M28j86l10j02O6K12K75m68k02L25NK26l03J61j81k42
$$ 216 -179 398 188 -392 9 437 251 -59 -161 -95 117 392 -76 -278 47 52 278 -25 136 -45 -287
2858b87K32J75j95l9J25K08l30J01K12k3l75K58O0k36l2R0o9K51k53K06j48J15
$$ -287 -55 120 -75 -114 11 219 -111 -10 202 179 -196 62 122 -114 -146 -56 -125 126 -127 79 -69 46
2880D6J75o58R04l96rj05j34N29k94j0j41l9M86n17N7J6j33l5J89j21l8K54Q9
$$ 46 221 -437 467 71 62 -43 -177 352 58 48 -93 -132 354 -163 -106 -90 -223 -258 -69 -190 -228 26 115
2903A15r3j82K95k08J05j06QmK38o2m24N76k40N5K8J5j2l48O8J86m2J8k80N24
$$ 115 22 -160 135 -73 32 -74 -66 -70 168 106 -318 258 18 73 101 116 104 -244 -176 10 -32 -14 -294 230
2927B30m57K83R6%l27J79P0J35m16j58M44K83k24l06j35M42J76n26L41L00m61
$$ 230 -227 56 152 152 -175 4 74 209 -207 -365 79 362 138 -168 -303 139 315 -211 130 430 -31
2948c1q8R0N0k6K2J91k80q8O2K49J91k33P5k37l8J86j43o8K37J75q2l09j00M05
$$ -31 -119 -29 21 -5 17 208 -72 -160 -98 151 342 109 184 -53 -91 95 -48 -116 121 296 214 -95 -195 210
2972B10l85M88m32MK3O2K6j78J04L6p8J27o4N9J82l30K28k07K38Jj15L71k91j
$$ 210 -175 313 -119 -115 -92 -30 -4 -182 -78 -42 -120 7 -57 2 184 -146 82 -125 113 114 -1 370 79 78
2996G8K1l01K15R2K01m83M39N2o00L57j70J20L1N1k26O5L11j69k28o5M66m7O8
$$ 78 99 -202 13 105 306 -177 262 314 -286 71 -99 21 52 103 -123 -58 253 84 -144 -209 257 210 278
3019B78m08K37l24P0M6J66L8l02K27J91j2j17r5k65J65R6j0j81K12k69J12r2J74
$$ 278 -130 107 -217 -147 -101 65 103 -199 28 219 207 90 -5 -270 -105 -9 -19 -200 12 -257 -145 -237 -63
3042f3m9J34j16J53p4j8J14j70k8P7j2J94k70r1L61j90J68j11J44l60p1N70m63
$$ -63 -112 22 -94 59 -15 -33 81 -89 -117 -40 -52 142 -128 -219 142 -48 120 9 153 -207 -278 292 -171
3065a71Q4j66M1K68k26P2k27K32J2r1K38j11J31n0O5j39l11L43j05M10l39M7j49
$$ -171 -87 -253 -212 56 -170 -98 -325 -93 -81 -172 66 -45 86 36 101 -38 -349 -6 -111 299 -40 7 -142
3088a42R4k28K22j71J21M17m05K58m66K62R2J09p0j29P1R5N0m7nl94L93p1l16
$$ -142 -48 -276 -54 -225 -104 313 -92 166 -300 -38 54 163 93 -36 35 130 180 133 128 -266 127 56 -260
3111b60l7j79O68K06m87M07j75m5m36R9K4J50O3nK55l38M33k87j73j0j8J36J76
$$ -260 -297 -476 192 398 -89 318 143 98 -338 -239 -215 -65 -2 -7 248 -90 343 56 -117 -127 -145 -9 167
3134A67o2j00k1L5K12kn29M69Q4k09M9M2k49QnK90m36K51k17J51J24j82j87QL01
$$ 167 105 5 -16 19 231 229 -300 169 253 44 93 135 -114 -106 -111 179 -257 -6 -223 -72 52 -130 -317 -309 -8
3159hJ29p7k60K12J65j45k39J1j74K21J43K02k69J96lp6o9j33N27m34K14j62m15
$$ -8 121 44 -216 -4 161 16 -223 -212 -386 -165 -22 180 -89 107 104 28 -41 -174 353 -81 133 -29 -444
3182d44N18k62K70K24l64L04k02p0K1j06l31L95L0J47j49k00J58J12Oj97K20J87
$$ -444 74 -188 82 306 -58 246 44 -26 -5 -111 -442 -47 -17 130 -19 -219 -61 51 57 -140 80 267
3204B67p5j92k19p0K93j23J78R9j38M85l43j27m4M6j10K64j41j27J03J15p0j79
$$ 267 192 0 -219 -289 4 -119 59 158 20 505 162 35 -9 37 -73 191 50 -77 26 141 71 -108
3226a08L05j74j50L71j87L4P8j31R1j25J31m3k2J07p9k02Q5j96K46j30l0L1j21
$$ -108 197 23 -127 244 57 91 169 38 129 4 135 92 70 177 98 -104 -19 -215 31 -99 -129 -98 -219
3249b19M36m00K73r8n5k48L50j12k5J23Q4R6j75k62L72k33J59r8J69k4k23J45
$$ -219 217 -183 90 -8 -63 -311 39 -73 -98 25 109 205 30 -232 140 -93 66 -32 137 113 -110 35
3271C5k40R4M65k90K8M8j65J89j60j23J32k1k5rK04j47P5p6L2J37m03M83Jq9k41
$$ 35 -205 -111 354 64 92 140 -25 164 4 -119 13 -8 -33 -42 162 15 90 14 46 183 -220 263 264 175 -66
3296f6n0K36N3l76L74m44K64O6J15k57L12k62k63M22j78J4M3j14o9j66J61J61
$$ -66 -116 120 173 -203 171 -273 -9 57 172 -85 227 -35 -298 124 -54 -40 3 -111 -180 -346 -185 -24
3318b4J56J02k01k08Q2O5Q6k50j02L01j79nm0j20J11M01J93k40l25M82j84j46
$$ -24 132 234 33 -175 -93 -28 58 -192 -294 7 -172 -177 -217 -337 -226 175 368 128 -197 285 101 -45
3340d5j88p1M84k38m6Q5q4J17j81L31k66J51m60M45k49Q7p8J47K62m07K69j50
$$ -45 -233 -304 180 -58 -104 -19 -103 14 -167 164 -102 49 -411 34 -215 -128 -206 -59 203 -204 65 -85
3362h5J8p6L56m27L94k68p7J39j64m9J92L1J64j45J06j38P8l0m23M28j22K32k05
$$ -85 -67 -143 213 -214 180 -88 -165 -26 -190 -239 -47 -16 148 3 109 -29 49 19 -404 24 -98 134 -71
3385g1L83m97K6L57j84k65M89l46p9K42k71M22l94J10J37J05o4l29N89k10m41
$$ -71 312 -185 -159 198 14 -251 238 -108 -187 55 -216 206 -188 -78 59 164 100 -229 360 150 -291
3406b91O1J68R6j2Q8l20L21j82k10K65J5l23L07l46L27j75J32J88k02L9j40L92
$$ -291 -230 -62 34 22 110 -210 111 -71 -281 -16 -1 -324 -17 -363 -36 -211 -79 109 -93 -54 -194 198
3428A98r2%j04K56n54L33k61L62k6j98lJ6Q2J0r2m2P1r5J47M0J35k2k58P4J42
$$ 198 106 106 2 258 -296 37 -224 138 112 -86 -89 -73 9 19 -73 -115 -44 -139 8 48 183 161 -97 -23 119
3453A19r0l0j8J24j81p9J86j74NJ07k42L99p1J42k27O3m28M27j98n9L83j50j49
$$ 119 29 -1 -19 105 -76 -155 31 -143 -138 -31 -273 126 55 197 -30 33 -395 32 -166 -225 158 8 -141
3476a41M15j27l41J67Q9m7k34k25O60k83K09K94m93j83J15J15k25K71j55L21j63
$$ -141 274 147 -194 -27 62 15 -219 -444 216 -67 142 436 -57 -240 -125 -10 -235 36 -119 202 39
3497C9j23j66N00j37k49J89J34j08J83k32j83K70k09j62J88J89o5r3k08J82k24
$$ 39 -84 -250 250 113 -136 53 187 79 262 30 -153 117 -92 -254 -66 123 58 -35 -243 -61 -285
3518b85L32K46l95rJ53m1j2L3j14P7O4q0J71j95j22K54k26K0J65l02K61L4P5o7
$$ -285 47 293 -102 -111 42 1 -11 22 -92 -15 49 -31 140 -55 -177 77 -149 -129 36 -266 -5 29 104 37
3542C7k46J32j17K29k18L84j88J75j60j59J81J38p1j98L00j39l27M41r7j1J1q
$$ 37 -209 -77 -194 35 -183 201 13 188 28 -131 50 188 117 -81 219 80 -247 194 97 86 97 89
3564H9pk89Pq8L6J93J4k34K80k31J85L64J92l03Q5l76J57m15K63m2L16l42k10
$$ 89 82 -207 -200 -288 -252 -59 -45 -279 1 -230 -45 319 511 208 293 -83 74 -341 -78 -120 196 -146 -356
3587c56M97k04j70J36J21L6Pj94N1J81o1j83O3j78L24q1j0Q0j10q6M3k5L80n24
$$ -356 141 -63 -233 -97 24 60 67 -127 -76 105 44 -139 -76 -254 70 -11 -21 59 -51 -137 -94 -119 261 -263
3611b63K42j91K70J0l41J36J43j08M5m8L29R6m48J8K44J27o50L81K63j77l0K09
$$ -263 -21 -212 58 68 -273 -137 6 -102 -57 -105 224 320 -128 -110 134 261 -389 -8 255 78 48 257
3633B57n16M48j56j91M8J12L0k14J63j48L99l34K93k26L9j55M06j30k09L9P6j00
$$ 257 -259 189 33 -158 -110 2 32 -182 -19 -167 232 -102 191 -35 4 -151 255 125 -84 -45 31 -69
3655f9L13k65pP3r9m2J95k02P2M3j5L56l20N3P9r5O4l19K57j89N5J51p1j78L64
$$ -69 244 -21 -28 45 -54 -96 99 -103 -31 12 -3 353 33 86 165 70 134 -185 72 -117 -62 89 18 -160 204
3680B04l6j91k81O34m20M20l67k05L61j03K53n18J76L0J66k85q4J26L33k80k9
$$ 204 168 -23 -304 330 -90 330 -37 -242 119 16 269 -249 -73 -43 123 -162 -246 -120 213 -67 -96
3701i6m7N3l2J22L3j64j1L92l46p9J46l50L24O9O9r8n6m2J88N0N9j0l62L39Pk18
$$ -96 -143 -90 -122 0 33 -131 -142 250 -96 -175 -29 -379 -55 14 83 -15 -71 -113 75 125 184 174 -188 151 158 -60
3727f0J17k05L43l95p3J48L40k79N8O4N5l11ML38j97J6J00j46J33j34j30M05k62
$$ -60 57 -148 195 -200 -273 -125 215 -64 -6 58 113 -198 -194 144 -53 -37 63 -83 50 -84 -214 191 -71
3750g1K58m40K76k4M6j34J74L2j21L04l17J78j04K5J5j91M9L15r5j05J11m96O3
$$ -71 187 -253 23 -1 45 -89 85 117 -4 300 -17 161 57 82 97 -94 -45 270 175 70 181 -315 -252
3773b52K78Q6J02l21j28L06j43N14n25K68l13j41l8K26QJ28l51J63O3PK09J69
$$ -252 26 112 214 -107 -235 71 -72 442 -83 185 -128 -269 -307 -81 -73 55 -296 -133 -70 -63 146 315
3795C15j90r4j28k32O63o32J39K27k35M94k32j86O3M7K54m04j74L99K34l79J13
$$ 315 125 31 -97 -329 334 -298 -159 68 -167 327 95 -91 -28 19 273 -131 -305 94 328 -51 62
3816F2l7k15J17o7J98M1p8j67P6l9J68l6P7L25m43l83L93J09J79k88K5K05l04
$$ 62 25 -190 -73 -140 58 99 21 -146 -70 -109 59 23 100 425 -18 -401 -8 101 280 -8 17 222 -82
3839h2K38k20q8r6K50J57k03n0j58R2K79j97N2J80j02m2k98p3M45J19o4k37J63
$$ -82 156 -64 -152 -248 2 159 -44 -94 -252 -160 119 -78 -26 154 52 10 -288 -361 84 203 139 -98 65
3862F5n5l9k19J72q4J99k12K02p0K80l49K70Q0j69j83P2nj66P7K52o3N3k91j80
$$ 65 10 -29 -248 -76 -160 39 -173 29 -41 239 -110 160 240 71 -112 -40 -45 -211 -134 118 55 108 -183 -363
3886c63M66n29L69j82M40op8k84J52k21j61O47l01J25j40J49L4j58K08j12O1l44
$$ -363 103 -426 -57 -239 201 195 117 -167 -15 -236 -397 250 -51 74 -66 83 117 -41 167 55 116 -228
3908b28K94J52l34K27J0k36K86r0k28K38m6L58o53o1O58j50kj31O5j73N07m20
$$ -228 66 218 -116 111 121 -115 171 81 -147 91 45 403 -250 -311 347 197 195 64 129 -44 463 43
3930D3J59K34J6k90p1k01R4J92j77J07k88K04L6K1k6R5j1n16K44j57N32q5j42
$$ 43 202 436 452 162 91 -110 -16 176 -1 106 -182 22 58 79 53 148 137 -379 -135 -292 240 155 13
3953A3j07n8L7J61m22M10j6q7k0O1k9j27K52j59P6J77J31l57j51J49j11M26j60
$$ 13 -94 -152 -115 46 -376 34 18 -69 -89 -28 -57 -184 68 -91 -15 162 293 -64 -215 -66 -177 249 89
3976H9l28K77r1K19k6j08J91j60j26J53q2j14r4K63k60M62j84j5q2j71L21n2J8
$$ 89 -239 38 -53 166 140 32 223 63 -63 90 8 -106 -200 63 -197 265 81 66 -16 -187 134 82 100
3999A00Q5m48K41k94L22Kj65N29l81O9j19k36O18P2J3m47J51j29o9K78M4l97K66
$$ 100 185 -263 -22 -316 6 8 -157 372 -9 60 -59 -295 323 395 408 -39 112 -17 -86 192 236 -161 105
4022A05J01m63K19N7J76j17K58p74L22J13n4M1j36J03j33L16J9n71L28J71J23
$$ 105 206 -257 -38 19 195 78 336 -438 -116 -3 -57 -16 -152 -49 -182 134 153 -418 -90 81 204
4043B04k62Q9N1k51N96n27J73j75K36K84l32k1j41J36j63K71j21k44K88k20L48
$$ 204 -58 31 82 -169 427 -100 73 -102 134 418 86 65 -76 60 -103 168 47 -197 91 -129 219
4064B19j93J20m13K05NJ15j16k6L98n80K98Rj25j42L97L2k29r1J1k05M86j86k75
$$ 219 26 146 -267 -62 -57 58 -58 -84 314 -266 32 41 -84 -226 171 203 -26 -117 -106 -311 175 -11 -286
4087b86J93J35Q2m41M72p5J63k16rn4j71J19K12J62k58K12k16K47l07o9pO6O57
$$ -286 -93 42 124 -317 155 80 243 27 18 -36 -207 -88 124 286 28 240 24 271 -36 -105 -112 -46 611
4110F11p27J39R8J8k5j16J36j13Q0J50j57J34k3n5l71J31J80j96K21l15M30k62
$$ 611 -116 23 121 139 114 -2 134 21 101 251 94 228 205 150 -221 -90 90 -106 115 -200 230 -32
4132c2K66j83J53K7jL4l72m6J85M0j06k2K94k00J23k6j76j97O8K17j07J09j88
$$ -32 234 51 204 231 230 264 -108 -154 31 71 -35 -57 237 37 160 134 -42 -239 -171 46 -61 48 -140
4155a40J39J01M1k70J90K28k68K7k73l4M34k40L2N4P7k64J10Q4j45K00J04k2j61
$$ -140 -1 100 141 -129 61 289 21 48 -225 -259 175 -65 -33 21 98 -166 -56 28 -117 83 187 165 4
4178DJ67m25K26k5J94j95J11J4Jl14P1OMM86n35K78K47k58j48O2K9K02o35L46
$$ 4 171 -254 -28 -53 141 -54 57 71 72 -242 -171 -165 -161 325 -210 68 315 57 -91 -29 0 202 -433 -87
4202h7J26K61l54K48k27O3M8m61N63j35K10l74Q3J35j65j18J83j58n4L19k20R4
$$ -87 39 300 -54 194 -33 30 78 -383 180 45 255 -119 -36 99 -66 -184 -1 -159 -213 106 -114 -20
4224b0L4j64J50o6J67j33q0J15j91K25j13K98l99j46N45k55P2N2j84K43k91J70
$$ -20 14 -150 0 -66 101 -32 -112 3 -188 37 -76 222 -177 -323 222 -33 39 91 -93 150 -141 29
4246B9P6j80K92j09j20o4P3q6J26r5r7PJ05o4O6K68l29K78k17j28L48l63M0k31
$$ 29 105 -75 217 108 -12 -76 -3 -89 37 -58 -155 -148 -43 -107 -41 227 -102 176 -41 -169 179 -184 -144 -375
4270c75M34j51P7k87J4K15L19k56L79k66k77L8kL49q7m93L14K98l04j19O14l49
$$ -375 59 -92 -15 -302 -288 -73 246 -10 369 103 -174 -136 -138 211 124 -369 -55 243 -61 -180 434 85
4292H5N0j92K3Q1p8J33k20K07j01k06L41k73L11k51P5K4j21K2L99o4om31J57N0
$$ 85 135 -57 -34 47 -31 102 -118 89 -12 -218 123 -150 161 -90 -15 9 -112 -90 309 245 239 -192 -35 15
4316A5j36l2J88j3q1J4j10o0K29j73K54j02M2r2j62J59k04lJ31L29k78l8J30j10
$$ 15 -121 -153 35 22 -59 -45 -155 -215 14 -159 95 -7 35 -57 -219 -60 -264 -267 -136 193 -85 -123 7 -103
4340a03N3K6R5jm20L91l7J20M0j08j01K02l38J36j33L72m11J91K31j49J00jK13
$$ -103 -50 -24 71 70 -350 41 4 124 164 56 -45 157 -181 -45 -178 194 -217 -26 205 56 156 155 368
4363C68o47M26l95j37K96M6j57K92N5k13L02n4j88J2K66k53p9O0J60N2m8l2l04
$$ 368 -279 147 -248 -385 -89 -43 -200 92 147 -66 236 182 -6 6 272 19 -60 0 160 212 164 132 -172
4386a72J55L09j6l00n1M9K34m9j44Q2o1n6J40K07j87l77l03O65j49k00M28l05
$$ -172 -17 292 276 -24 -75 -26 208 159 15 97 36 -20 120 327 140 -237 -540 125 -24 -224 204 -101
4408a01j35K98j64O2j06m7K18j8P1j77P6q5N2K85J78l19N1l3p4j7Q7j96j39L45
$$ -101 -236 62 -102 -40 -146 -193 25 7 78 -99 -23 -108 -56 229 407 88 139 106 32 15 102 -94 -233 112
4432A12j42K23Om64L10l00M03k22oK51k32R3l54L48j50K06l29oK57P4k90J04n2
$$ 112 -30 193 199 -265 45 -255 148 -74 -80 171 -61 32 -322 26 -124 82 -247 -253 4 78 -212 -108 -160
4455a60J66j7p0l35M83m3j47K12M23m40m1k60M53k74J34R5o4j77r2J35O4k13K87
$$ -160 6 -11 -81 -416 67 24 -123 89 512 72 31 -229 224 -50 84 179 115 -62 -154 -19 45 -168 119
4478A19j07j29L96l99M11n76K62K47o1QJ38k94j09J27J22m7M3p3j8k26P8J37j94
$$ 119 12 -117 279 -120 291 -285 -23 224 163 171 309 15 -94 33 155 108 151 78 60 -166 -88 49 -145
4501a45j4L17j27K7J13j70L21l00k09q3L56j02J49j07K07o5J08k09j64pRJ96M5
$$ -145 -159 158 31 58 171 1 322 22 -187 -270 86 -16 133 26 233 168 276 67 -97 -104 -95 101 146
4524A46j17Q3J13k72K88j84p9J94o1j81K66j70o2j26K6J39j50L41l72P0j45j53
$$ 146 29 112 225 -47 241 57 -22 172 111 -70 196 26 -36 -162 -136 3 -147 194 -178 -108 -253 -406
4546d06O77o28O67k91k55K53mk01M43o6J07j54j85j99L42m07J84R8q9r0J72k06
$$ -406 271 -357 310 19 -236 17 13 -188 255 189 296 142 -43 -242 100 -307 -123 -25 -114 -204 -32 -238
4568b38J40M99k97j3J3J46j00j49J98l47L4K00j74k26L7M63k18K95j66J5J58j61
$$ -238 -98 401 104 91 104 250 150 1 199 -148 -114 86 -88 -314 -277 186 -32 263 97 112 270 109
4590A09j29o3j36J31K05n2k45J46n2J15l80Q5L91Q1k52J33j94q6K82j93M4l12
$$ 109 -20 -83 -219 -88 117 65 -180 -34 -86 29 -351 -266 125 206 -46 87 -107 -193 89 -104 -60 -372
4612c72M62j14j87R0J94q1K01j88Q3k10O0K60j77J3k73L39k74L43l58J32N4l70
$$ -372 90 -24 -211 -121 73 -8 193 5 88 -122 -62 198 21 34 -239 100 -174 169 -189 -57 -3 -373
4634c73N08j52J72j49n3N1J14K21k03l36J76j07K19j32Nj48K13M9m8j8j80K30
$$ -373 135 -17 155 6 -47 4 118 339 136 -200 -24 -131 88 -44 -39 -187 26 75 27 9 -171 59
4656E9j04K37k72J33M1P4j50j51K68k23n3L06j00k03K06O0j35rJ68l66M04m56
$$ 59 -45 192 -80 53 94 168 18 -133 135 -88 -141 165 65 -138 68 128 -7 -16 152 -214 190 -266
4678b66M94m35K87k31K42l03K02o5K35k33o8L43l91J05K18k74J5L30k01j13J71
$$ -266 228 -207 80 -151 91 -212 -10 -75 160 -73 -141 202 -189 -84 134 -140 -125 205 4 -109 62
4699F2K7L6J2J72k18j31o6K92l7l29J41L16k19j30L96l24j1j21K59k49J61K9J63
$$ 62 89 125 137 309 91 -40 -106 186 149 -180 -39 277 58 -72 324 0 -11 -132 127 -122 39 68 231
4722B31o7L1l06j93M29m15J76J41J62j58l00K37K36k79J59k34P8m2J45j8K90k31
$$ 231 164 195 -111 -304 125 -290 -114 27 189 31 -269 -32 204 -75 84 -150 -72 -114 31 13 303 72
4744G2k61K18j03j11J53j01L43n46K73K68l42K37m24L97k52K27K20j17J9k51m2
$$ 72 -189 29 -74 -185 -32 -133 210 -336 -63 205 -137 100 -324 73 -179 48 268 151 170 -81 -123
4765a23Jj76J25J96j43nk0K13l5L45o79L78p3l1%J27k15L2K58k99Q8J65k11P6
$$ -123 -122 -298 -173 23 -120 -125 -145 68 33 378 -301 77 4 -27 -27 100 -115 -83 175 -124 -36 129 -82 -6
4789fJ11k20J91J44P2m46J47k84M03j29j48O7K43k05k53O52k34l48M38l50K44
$$ -6 105 -115 76 220 292 -154 -7 -291 112 -17 -165 -98 145 -60 -313 339 105 -243 195 -155 89
4810H9K32k38l09J79K21J4m1j50o3K54j46L5l82K91M1J69k20j4K49m16M69j30
$$ 89 321 83 -226 -47 174 188 147 -3 -66 188 42 77 -305 -14 27 196 -24 -38 211 -205 264 134
4832A34k90L12J16j63l48K30%J21j56K6K06r1k7k8j55j55Q5M47k71k90J68K08
$$ 134 -156 156 272 109 -239 -9 -9 112 -44 -18 188 97 70 42 -113 -268 -183 264 -7 -297 -129 79
4854G9l9p3O3l34L44m3j73p4L17K55j60o2K9k18J53j5k83M3l1K06L50m04r6K26
$$ 79 40 -33 30 -304 40 -3 -176 -250 67 322 162 100 129 -89 64 49 -234 -191 -222 -16 334 -70 -166 60
4878F0j76K84J62k53K9l31J96k5mP5M8K5K69o16K77rQ1l43L89j06j55J32K27k09
$$ 60 -116 168 330 77 106 -225 -29 -54 -58 17 65 90 359 -257 20 11 92 -251 138 32 -123 9 236 27
4902B7p4J99j77J57P0k02j15N03l19O3k71p3R1K60j81j74L93k19n5L03l22K95
$$ 27 -47 152 -25 132 202 0 -115 388 69 132 -139 -212 -121 139 -42 -216 177 -42 -97 206 -116 179
4924A79l84J54J57R8r1p3J73l14j35L91L51k60m00K33j42L6K66j49j28L63j78
$$ 179 -205 -51 106 204 113 40 213 -101 -236 155 506 246 -154 79 -63 -27 239 90 -38 325 147
4945A47j16K43k73RJ11m3K19j31k61J71j33k57M12m07N39l54J20Q1j37J56Q8P8
$$ 147 31 274 1 10 121 78 297 166 -95 76 -57 -314 98 -309 230 -124 -4 77 -60 96 184 262
4967B62k45K00k05J22l26L58l24K03O6k58J56j90j9L14l98M20M2m97K83q6K0K29
$$ 262 17 217 12 134 -192 166 -158 45 111 -147 9 -181 -200 114 -284 136 178 -319 -36 -122 -102 127
4989A27k6L30o90J96K57k09j13K56l12J4K26J01l0k17r4L22R9N2j33j40k38J89
$$ 127 101 431 -259 -63 194 -15 -128 128 -184 -170 56 157 127 -90 -184 138 237 289 156 16 -222 -33
5011c3L0l0k0J05j93n9p6L89l37L60l9k67K92M1k45M8J48J61k67k84L03l42K79
$$ -33 -3 -33 -53 52 -141 -200 -276 113 -224 136 97 -170 122 163 -82 -34 114 275 8 -276 27 -315 -36
5034c6L84m64j21K54j38K96k49P1j70L00j68K32k30k48K40j7k9j58K24L90l70
$$ -36 348 -116 -237 17 -121 175 -74 -3 -173 127 -41 191 -39 -287 -47 -64 -93 -251 -27 363 -7
5055gjk6J55m23M6J41L26m23N01k35k4j26K56K8l3k9m9j1j2j8J26j00j97Q8j70
$$ -7 -8 -34 121 -302 -256 -115 211 -212 289 54 30 -96 160 188 155 126 77 66 54 36 162 62 -135 -47 -217
5080b17K65j41j53L82l61p3K20P7j99L34j06j66K55o4m0k9j25K52j37r9L96m65
$$ -217 48 -93 -246 136 -225 -298 -78 -1 -200 134 28 -138 117 53 13 -16 -141 111 -26 -125 271 -194
5102a94Q04p91R0J02K3J25j10r6R7k73L4o2qJ37pJ82k57K08P0j65K99j99k22K53
$$ -194 610 -181 -91 11 34 159 49 -47 50 -223 -189 -251 -259 -122 -129 53 -204 4 74 -91 208 9 -213 40
5126D0L58l81k49K50L6m7K5m51K88N8J87j07O1Jn0qm1J69J72k50n1k11K22J16
$$ 40 398 17 -232 18 54 7 32 -419 -131 -73 114 7 68 69 19 11 -30 139 311 61 10 -201 21 137
5150A37Q3m24J47k03J75Q8j13J55l3O5J98J12o13K44m9L7k70L35K5J35k65O6Q
$$ 137 220 -204 -57 -260 -85 3 -110 45 12 77 275 387 -226 18 -31 6 -264 71 96 231 -34 32 40
5173D0K56m94J75k26M54j41j0LO6p1J13l8j58O5K50l9k85K57l8k45k79P21m36
$$ 40 296 -198 -23 -249 205 64 54 57 123 52 165 127 -31 34 284 245 -40 217 179 -66 -345 376 -60
5196f0r8p6pR1J66r2m4J26OQ8j52R8j03m6L9j74K53n7P3o1k3j31KK99l6r6K63
$$ -60 -158 -234 -241 -150 16 -76 -120 6 12 100 -52 46 -57 -103 -64 -238 15 -42 31 -30 -53 -184 -182 117 81 -15 248
5223B48Kk15R0k14p1n3J47j2rj5Q9J80j35J89j02m0J07pk87J55o2L4n3K24k29
$$ 248 250 35 125 -89 -160 -213 -66 -78 -87 -102 -13 167 32 221 119 79 186 179 -108 47 -15 19 -34 190 -39
5248c9O4J87k35Q6q8M4K57l54J9m0L43j24k03J77l74K01J52r8J7j4J73l6K0P3
$$ -39 25 212 -23 63 -25 19 276 -78 -59 -99 244 120 -83 94 -280 -79 73 -25 -8 -22 151 115 135 208
5272B08l37J52j15LJ81p5l50M05j64M88j17n23L90l44M17p7r5o0J95j72l23J98
$$ 208 -129 23 -92 -89 92 17 -333 72 -92 396 279 -244 146 -198 219 142 47 -13 182 10 -313 -115
5294a15k98N11j2%k78o2L70j09K48o34M51j84r0J04j82K98j01L4j24J53J29nj58
$$ -115 -413 98 86 86 -192 -254 116 7 255 -379 72 -112 -202 -98 -280 18 -83 -49 -173 -20 109 104 -54
5317e4J25J9J25l57M68n17K96k1j0P6J80n09J61r8o4L67k35L76k67j04n8J28q2
$$ -54 71 90 215 -142 326 -191 105 84 74 150 330 -179 -18 -116 -180 187 -48 328 61 -43 -101 27 -55
5340e5J44j84k49M78k20L95k71N9m28K09N21m21j75N63l94J61k60J3J12Q1l70
$$ -55 89 -95 -344 134 -86 309 38 97 -331 -122 399 -22 -197 366 -28 133 -127 -114 -2 79 -291
5361b91M55K30o27K84j70L65j52m6l71K66K28j78j45J11J8N8K2j52L90j53l1j6
$$ -291 164 394 -233 51 -119 246 94 48 -323 -57 171 -7 -152 -41 -23 35 57 -95 295 142 111 95
5383I5K5Ol3k3n9K39l43k1N49l05J20j13l14j9L60l43N93l15l3k11K17l41lM66
$$ 95 120 126 93 70 11 250 -93 -114 435 130 250 137 -177 -196 164 -179 414 99 66 -145 72 -269 -272 194
5407A94k13J80k48l48L42K04l3Q9l78L61k89L49l32n5q0R3P7J71Ll9m8J19o5J36
$$ 194 -19 161 -87 -435 -93 111 78 167 -211 150 -139 210 -122 -177 -257 -164 -87 84 87 48 0 119 54 190
5431A90k09j50K56k04O8L7M4j28J34j13Q3J98r1m6j63L1K55j19k40Q6J48j63J20
$$ 190 -19 -169 87 -117 -49 -12 32 -96 38 -75 8 206 115 69 -94 -63 192 73 -167 -81 67 -96 24
5454B4J15r3p3k41L25k58K94j39j6J56j86J65J20j00o6K88l76m35L44J30J24n28
$$ 24 139 46 -27 -268 57 -201 93 -46 -62 94 -92 73 193 93 27 315 -61 -496 -152 -22 102 -426
5476d26N29r6M4kj42p4L62j35j03P7k20L46J34l26JJ71J17r5j39j36L15Mk05k51
$$ -426 103 7 51 49 -93 -167 195 60 -43 34 -186 160 294 -32 -31 140 257 162 23 -113 202 206 1 -250
5500b50L73k09n2L64K5j71K9k62P7k07K61j67K79j04M6m4j31j99O14l16j33K11
$$ -250 123 -86 -138 226 251 80 109 -153 -76 -283 -22 -189 90 -14 32 -12 -143 -342 272 -44 -177 34
5522C4k72K83k69J90K36m33p2K85K69o48K10K48k36L59k81j27N25l18n4n5J22
$$ 34 -238 45 -224 -34 202 -231 -303 -18 251 -397 -187 61 -175 184 -97 -224 301 -17 -71 -126 -4
5543dk62L84p4l44K86K47j03k69L65k86L7j85K31J19J5m3L7r8j25J21k04K98l70
$$ -4 -266 118 44 -300 -14 233 130 -139 226 -60 -23 -208 23 142 157 114 151 53 -72 49 -155 143 -227
5566b27L60k37J31JN0r4p0J56J09j1j06K23k47m7J84k48O0l08J86J96k55J26R8
$$ -227 133 -104 27 28 78 -16 -86 70 179 168 62 285 38 -9 175 -73 -13 -321 -135 61 -194 -68 30
5589C0j39j8K36j75j72K78J75l07J20j90RO7k72J06K14N4R7k58L85j96n1l3k05
$$ 30 -109 -127 109 -66 -238 40 215 -92 28 -162 -153 -86 -358 -252 -38 16 113 -145 240 44 -7 -40 -245
5612b45L65n02L44n8J16l9q7n6J79j74J78K9j21P0q9J09j26L48m32J75K11q8l25
$$ -245 120 -382 -38 -96 20 -19 -106 -162 17 -157 21 50 -71 -1 -90 19 -107 241 -191 -16 195 107 -218
5635b18K25J09j99P3K2j77K63l15J94o2J10j23N5J43L0l55M85l69K32Kk29K2J11
$$ -218 7 116 -83 -10 12 -165 98 -217 -23 -85 25 -98 -43 100 130 -225 260 -109 123 125 -104 -82 29
5658B9k52K81l4j07k13K45J64k97R7K26l01l3k3L58j3n03J89N2O9L7j52L19j69
$$ 29 -223 58 24 -83 -296 -51 113 -184 -87 139 -162 -195 -218 140 127 -376 -187 -135 -66 -29 -181 138 -31
5681c1n1L5L15n4l92J00K02j56q2J84n72N52j48L0j7K74j87Q7l43L43l50L47j29
$$ -31 -82 -47 268 214 -178 -78 124 -32 -114 70 -502 50 -98 -68 -85 189 2 89 -254 89 -261 86 -43
5704d3m2J43P5kj12l76K70J79P4k62M8N9k43O50n62M12n10K02J47L1mj40k25L69
$$ -43 -85 58 133 131 19 -357 -87 92 166 -96 -48 11 -232 418 -144 268 -242 -40 107 138 134 -6 -231 138
5728A38k71Q0j53L45j61l3K67n82N67k46L20l15M0M3k20K65j0k53J72J25J84j47
$$ 138 -133 -53 -206 139 -22 -55 212 -370 197 -49 271 -44 -4 39 -181 84 74 -179 -7 118 302 155
5750A55j30j07j21K10J38l74J87n8p2K58L4M3j24j43J77j18K7m4l1K59k12J9J73
$$ 155 25 -82 -203 7 145 -229 -42 -100 -172 86 120 163 39 -104 73 -45 -18 -62 -93 166 -46 -27 146
5773A46k67P9R2P7K10Kk60J3m3J54l8j22j15K55l26K44J38j36k57K45k63K21N7
$$ 146 -121 -42 50 127 337 339 79 92 49 203 165 43 -72 183 -143 101 239 103 -154 91 -172 49 106
5796A06q1n3J9M36n21N5L60n11K02j27n4L92l91K29j9J54l83N13l67K55l07K06
$$ 106 25 -28 -9 427 -94 -39 321 -190 12 -115 -169 223 -168 61 42 196 -187 326 -41 214 -93 113
5818A13k95J81R3k73J59R2K9o3J08r3l9o1J09l05K50j2k48J37K18L57k82l98L35
$$ 113 -182 -1 92 -181 -22 70 99 36 144 51 12 -49 60 -245 5 -7 -255 -118 100 457 175 -223 112
5841A12j54q2L87q09L74r4L63l1k89K55l9J37O7j35o0L06k13J8j21j7J28k25K04
$$ 112 -42 -124 263 -546 -172 -266 97 66 -223 32 -7 130 197 62 2 308 95 113 -8 -25 103 -122 82
5864H2n0N2L5R5p9r6J91k76L8k12J94J68R6m82k7K98J28J23j73%Pk91J47p2j50
$$ 82 32 84 119 214 135 39 230 -46 -8 -220 -26 142 238 -244 -271 27 155 278 105 105 112 -179 -32 -104 -254
5889b54K39J29K31m23K69j12K6m1J19m00M40l00l88O12q5p2jL23k23j41j6l51
$$ -254 -15 114 345 -78 191 79 105 64 183 -217 223 -77 -465 147 62 -10 -11 312 89 -52 -68 -419
5911d19O10n14J49K9N1P5r9K04n8j95J68j24K8j17j65L66N6l1k86K87R4m03J26
$$ -419 191 -323 -174 -145 -94 -19 -118 86 28 -167 1 -123 -95 -212 -377 -11 45 14 -272 15 109 -294 -168
5934a68L40k40j68L36k75J30j47L3j4L20O1l09J63J10l51J17L20l31J55r3j45
$$ -168 172 -68 -236 100 -175 -45 -192 -159 -173 147 208 -101 62 172 -179 -62 258 -73 82 -11 -156
5955a56N6J17J51k71K86k61J78J11j85L6K51m13j1J5P4J99k45L91l23L15k89N
$$ -156 -100 17 168 -103 183 -78 100 211 26 62 313 -100 -111 -96 -22 177 -68 323 0 315 26 31
5977C1k43K05r3L60j81j37j32k28N25p8j00J97j06K3M0L21n16Q2K6r1n60M97K90
$$ 31 -212 -7 -100 260 79 -58 -190 -418 107 29 -71 126 20 43 83 404 -112 -30 -4 -95 -655 -158 132
$$ [...]
8191I8
##END NTUPLES=NMR FID
##END=
