##TITLE=1H_PR159R_EtOH
 DMSO-d6, 8 sc, 
 7.5.2019
##JCAMPDX= 6.0         $$ Bruker NMR JCAMP-DX V2.0
##DATA TYPE= NMR FID
##DATA CLASS= NTUPLES
##ORIGIN= UXNMR, Bruker Analytische Messtechnik GmbH
##OWNER= root
$$ XWIN-NMR		Version 3.5
$$ Tue May  7 12:49:35 2019 Russian Standard Time (UT+4h)  she@DPX200
##.OBSERVE FREQUENCY= 200.1315
##.OBSERVE NUCLEUS= ^1H
##.DELAY= (6, 6)
##.ACQUISITION MODE= SIMULTANEOUS
##.ACQUISITION SCHEME= undefined
##.AVERAGES= 8
##.DIGITISER RES= 18
##SPECTROMETER/DATA SYSTEM= spect
##.PULSE SEQUENCE= zg30
##.SOLVENT NAME= DMSO
##.SHIFT REFERENCE= (INTERNAL, DMSO, 0, 15.7039)
##AUDIT TRAIL= $$ (NUMBER, WHEN, WHO, WHERE, WHAT)
$$ ##TITLE= Audit trail, XWIN-NMR		Version 3.5
$$ ##JCAMPDX= 5.01
$$ ##ORIGIN= Bruker BioSpin GmbH
$$ ##OWNER= she
$$ F:/spectra/data/she/nmr/H-F/1/audita.txt
$$ ##AUDIT TRAIL=  $$ (NUMBER, WHEN, WHO, WHERE, WHAT)
(   1,<2019-05-07 12:48:13.34 +0400>,<she>,<DPX200>,
      <created by zg, POWCHK disabled, PULCHK disabled
       configuration hash MD5:
       00 E9 B6 7A A2 85 ED C7 34 08 36 98 17 FE 4E 26
       data hash MD5: 16K
       F6 1E 73 5D EE 49 AD 49 33 29 11 1B AF 32 EF EA>)
$$ ##END=
$$ 
$$ hash MD5
$$ 69 B5 E3 4C E7 88 A0 28 45 B9 00 67 2B 8D 85 BF
##$RELAX= 
##$RELAX= 
##$RELAX= 
##$RELAX= 
##$RELAX= 
##$RELAX= 
$$ Bruker specific parameters
$$ --------------------------
##$DU= <F:/spectra>
##$EXPNO= 1
##$NAME= <H-F>
##$PROCNO= 1
##$TYPE= <nmr>
##$USER= <she>
##$AMP= (0..31)
100 100 100 100 100 100 100 100 100 100 100 100 100 100 100 100 100 100 
100 100 100 100 100 100 100 100 100 100 100 100 100 100 
##$AQSEQ= 0
##$AQ_mod= 1
##$AUNM= <au_zg>
##$AUTOPOS= <>
##$BF1= 200.13
##$BF2= 200.13
##$BF3= 200.13
##$BF4= 200.13
##$BF5= 200.13
##$BF6= 200.13
##$BF7= 200.13
##$BF8= 200.13
##$BYTORDA= 1
##$CFDGTYP= 0
##$CFRGTYP= 5
##$CHEMSTR= <none>
##$CNST= (0..31)
1 1 145 1 1 1 1 1 1 1 1 1 1 1 1 1 1 1 1 1 1 1 1 1 1 1 1 1 1 1 1 1 
##$CPDPRG= <>
##$CPDPRG1= <>
##$CPDPRG2= <>
##$CPDPRG3= <>
##$CPDPRG4= <mlev>
##$CPDPRG5= <mlev>
##$CPDPRG6= <mlev>
##$CPDPRG7= <mlev>
##$CPDPRG8= <mlev>
##$CPDPRGB= <>
##$CPDPRGT= <>
##$D= (0..31)
0 1.2 0 0 0 0 0 0 0 0 0 0.03 0 0 0 0 0 0 0 0 0 0 0 0 0 0 0 0 0 0 0 0 
##$DATE= 1557218892
##$DBL= (0..7)
120 120 120 120 120 120 120 120 
##$DBP= (0..7)
150 150 150 150 150 150 150 150 
##$DBP07= 0
##$DBPNAM0= <>
##$DBPNAM1= <>
##$DBPNAM2= <>
##$DBPNAM3= <>
##$DBPNAM4= <>
##$DBPNAM5= <>
##$DBPNAM6= <>
##$DBPNAM7= <>
##$DBPOAL= (0..7)
0.5 0.5 0.5 0.5 0.5 0.5 0.5 0.5 
##$DBPOFFS= (0..7)
0 0 0 0 0 0 0 0 
##$DE= 6
##$DECBNUC= <off>
##$DECIM= 24
##$DECNUC= <off>
##$DECSTAT= 4
##$DIGMOD= 1
##$DIGTYP= 9
##$DL= (0..7)
0 120 120 120 120 120 120 120 
##$DP= (0..7)
150 150 150 150 150 150 150 150 
##$DP07= 0
##$DPNAME0= <>
##$DPNAME1= <>
##$DPNAME2= <>
##$DPNAME3= <>
##$DPNAME4= <>
##$DPNAME5= <>
##$DPNAME6= <>
##$DPNAME7= <>
##$DPOAL= (0..7)
0.5 0.5 0.5 0.5 0.5 0.5 0.5 0.5 
##$DPOFFS= (0..7)
0 0 0 0 0 0 0 0 
##$DQDMODE= 0
##$DR= 18
##$DS= 0
##$DSLIST= <SSSSSSSSSSSSSSS>
##$DSPFIRM= 0
$$ [...]
##$SUBNAM2= <"">
##$SUBNAM3= <"">
##$SUBNAM4= <"">
##$SUBNAM5= <"">
##$SUBNAM6= <"">
##$SUBNAM7= <"">
##$SUBNAM8= <"">
##$SUBNAM9= <"">
##$SW= 24.9337058887773
##$SWIBOX= (0..15)
0 0 2 0 0 0 0 0 0 0 0 0 0 0 0 0 
##$SW_h= 4990.01996007984
##$TD= 16384
##$TD0= 1
##$TE= 0
##$TE2= 300
##$TE3= 300
##$TEG= 300
##$TL= (0..7)
0 120 120 120 120 120 120 120 
##$TP= (0..7)
150 150 150 150 150 150 150 150 
##$TP07= 0
##$TPNAME0= <>
##$TPNAME1= <>
##$TPNAME2= <>
##$TPNAME3= <>
##$TPNAME4= <>
##$TPNAME5= <>
##$TPNAME6= <>
##$TPNAME7= <>
##$TPOAL= (0..7)
0.5 0.5 0.5 0.5 0.5 0.5 0.5 0.5 
##$TPOFFS= (0..7)
0 0 0 0 0 0 0 0 
##$TUNHIN= 0
##$TUNHOUT= 0
##$TUNXOUT= 0
##$USERA1= <user>
##$USERA2= <user>
##$USERA3= <user>
##$USERA4= <user>
##$USERA5= <user>
##$V9= 5
##$VALIST= <valist>
##$VCLIST= <CCCCCCCCCCCCCCC>
##$VD= 0
##$VDLIST= <DDDDDDDDDDDDDDD>
##$VPLIST= <PPPPPPPPPPPPPPP>
##$VTLIST= <TTTTTTTTTTTTTTT>
##$WBST= 1024
##$WBSW= 4
##$XGAIN= (0..3)
0 0 0 0 
##$XL= 0
##$YL= 0
##$YMAX_a= 198467
##$YMIN_a= -286576
##$ZGOPTNS= <>
##$ZL1= 120
##$ZL2= 120
##$ZL3= 120
##$ZL4= 120
##$ABSF1= 10
##$ABSF2= 0
##$ABSG= 5
##$ABSL= 3
##$ALPHA= 0
##$AQORDER= 0
##$ASSFAC= 0
##$ASSFACI= 0
##$ASSFACX= 0
##$ASSWID= 0
##$AUNMP= <proc_1d>
##$AZFE= 0.1
##$AZFW= 0.1
##$BCFW= 1
##$BC_mod= 2
##$BYTORDP= 1
##$COROFFS= 0
##$CY= 11.3945322036743
##$DATMOD= 1
##$DC= 2
##$DFILT= <>
##$DTYPP= 0
##$F1P= 18.9103706918063
##$F2P= -1.10871071338519
##$FCOR= 0.5
##$FTSIZE= 0
##$FT_mod= 4
##$GAMMA= 1
##$GB= 0.15
##$INTBC= 1
##$INTSCL= 1
##$ISEN= 128
##$LB= 0.24
##$LEV0= 0
##$LPBIN= 0
##$MAXI= 10000
##$MC2= 0
##$MEAN= 0
##$ME_mod= 0
##$MI= 1.114404
##$NCOEF= 0
##$NC_proc= 0
##$NLEV= 6
##$NOISF1= 3.799351
##$NOISF2= 2.8
##$NSP= 1
##$NTH_PI= 0
##$NZP= 0
##$OFFSET= 15.70392
##$PC= 1
##$PHC0= -8867.47
##$PHC1= 29.00026
##$PH_mod= 1
##$PKNL= yes
##$PPARMOD= 0
##$PSCAL= 0
##$PSIGN= 0
##$REVERSE= no
##$SF= 200.130013532006
##$SI= 16384
##$SIGF1= 3
##$SIGF2= 2
##$SINO= 400
##$SIOLD= 16384
##$SREGLST= <1H.CDCl3>
##$SSB= 0
##$STSI= 0
##$STSR= 0
##$SW_p= 3612.71676300578
##$SYMM= 0
##$S_DEV= 0
##$TDeff= 0
##$TDoff= 0
##$TI= <>
##$TILT= no
##$TM1= 0
##$TM2= 0
##$TOPLEV= 0
##$USERP1= <user>
##$USERP2= <user>
##$USERP3= <user>
##$USERP4= <user>
##$USERP5= <user>
##$WDW= 1
##$XDIM= 8192
##$YMAX_p= 0
##$YMIN_p= 0
$$ End of Bruker specific parameters
$$ ---------------------------------
##NTUPLES= NMR FID
##VAR_NAME=  TIME,          FID/REAL,        FID/IMAG
##SYMBOL=    X,             R,               I
##VAR_TYPE=  INDEPENDENT,   DEPENDENT,       DEPENDENT
##VAR_FORM=  AFFN,          ASDF,            ASDF
##VAR_DIM=   8192,          8192,            8192
##UNITS=     SECONDS,       ARBITRARY UNITS, ARBITRARY UNITS
##FACTOR=    0.0002004,     1,               1
##FIRST=     0,             0,               0
##LAST=      1.6414764,     0,               0
##MIN=       0,             -286576,         0
##MAX=       1.6414764,     198467,          0
$$ Real data points
##PAGE= N=1
##DATA TABLE= (X++(R..R)), XYDATA
$$ plain form
0 0 0 0 0 0 0 0 0 -8 8 -8 16 -16 19 -24 32 -37 44 -49 63 -72 84 -97 113 -129 152 -176 198 -224 256 -289
30 -289 325 -366 409 -460 511 -572 637 -706 781 -869 962 -1065 1179 -1305 1446 -1605 1782
47 1782 -1985 2218 -2487 2805 -3186 3651 -4238 5003 -6042 7555 -9959 14405 -25413 113473
61 113473 80249 -196931 -181704 -32920 149996 192554 116231 -65111 -173339 -116453 67075
72 67075 172272 131972 -2194 -112986 -144130 -47900 110363 187032 75931 -107193 -176869
83 -176869 -72359 82711 156691 96794 -42666 -147914 -112334 30905 136814 104548 -7518
94 -7518 -91221 -98033 -38257 57377 117565 73212 -48327 -125332 -81359 32240 110044 91933
106 91933 -7396 -106918 -111580 -5419 104005 101717 1852 -82003 -83186 -23817 43149 76147
$$ packed form
0@%%%%%%%qJ6j6K4l2L5m3N6o9Q1r3J12j35J56j81K10k42K81l28L74m22M80n45
30b89O14o91P75q69R71j083J209j343J487j650J831k027K244k484K751l051L387
47A782l767M203m705N292n991O837p889R241j1045J3597j7514K4364l9818J38886
61A13473l3224k77180J5227J48784J82916M2558p6323j81342j08228N6886J83528
72F7075J05197m0300j34166j10792l1144R6230J58263P6669j11101j83124o9676
83a76869J04510J55070P3980n9897j39460j05248L5580J43239J05909l2266j12066
94g518q3703o812N9776R5634O0188m4353j21539p7005M3973J13599P7804j8111
106I1933r9329r9522m662J06161J09424k288r9865q3855j183N9369O6966L2998
$$ plain form
118 76147 48965 -24922 -79137 -60670 8748 65666 68863 18086 -54719 -87634 -34095 61177
130 61177 94866 29894 -56782 -77655 -28885 34949 64906 42256 -17612 -61295 -45291 8277
142 8277 43998 40845 14293 -22595 -51944 -39325 19004 66566 45170 -21804 -62555 -42088
154 -42088 12085 53849 49328 -1304 -52012 -48947 2165 42064 35346 4554 -18029 -29305 -25756
167 -25756 2585 37132 37952 -6 -37565 -39608 -8572 29898 46016 19093 -32064 -52366 -15778
180 -15778 34955 42909 9801 -21743 -28303 -16478 5207 26080 26093 1650 -22325 -24929 -9536
193 -9536 11997 29273 25239 -7983 -40384 -30071 15228 42147 23297 -14413 -31803 -20727
205 -20727 5636 26260 24279 -107 -22497 -19560 -1007 11441 14757 13944 1716 -19432 -25746
$$ packed form
118G6147k7182p3887n4215J8467O9418N6918L197n0777p2805l2915N3539R5272
130F1177L3689o4972q6676k0873M8770O3834K9957k2650n9868m3683J6004N3568
142H277L5721l153k6552l6888k9349J2619N8329M7562k1396o6974m0751K0467
154d2088N4173M1764m521n0632n0708L065N1112L9899o718l0792k2583j1276L549
167b5756K8341L4547Q20l7958l7559k043L1036L8470J6118k6923n1157k0302L6588
180a5778N0733P954l3108l1544o560J1825K1685K0873J3k4443k3975k604J5393
193i536K1533J7276m034l3222l2401J0313M5299K6919j8850l7710j7390J1076
205b0727K6363K0624j981k4386k2390K937J8553J2448L316q13j2228k1148o314
$$ plain form
218 -25746 -1663 27495 27327 -140 -24607 -25243 -3904 21409 27713 5416 -22728 -25091 -1526
231 -1526 17600 14714 3088 -4981 -10282 -13039 -4112 12796 18687 5869 -11826 -19125 -9909 9250
245 9250 23016 14042 -11709 -25939 -10798 14712 20826 6139 -9596 -12963 -7346 2336 9740
258 9740 9392 1153 -6613 -8774 -5976 1194 11081 13485 66 -16971 -15920 3521 18425 13086
272 13086 -4363 -14789 -10223 2456 12386 9627 -2068 -9303 -5560 615 3036 3160 5500 3245
286 3245 -4997 -10677 -4172 8115 12259 3596 -8454 -12569 -4117 9215 12780 2733 -9773 -10231
300 -10231 40 6973 5056 429 -1268 -2107 -3620 -2522 1920 5582 4772 -812 -7355 -7093 1100
315 1100 10302 8131 -3564 -11022 -6035 4944 8791 3290 -3814 -5209 -2533 1379 3273 1740 623
$$ packed form
218b5746K4083K9158j68k7467k4467o36K1339K5313O304k2297k8144k363K3565
231a526J9126k886j1626q069n301k757Q927J6908N891j2818j7695p299R216J9159
245I250J3766q974k5751j4230J5141K5510O114j4687j5735l367N617R682P404
258I740l48q239p766k161K798P170R887K404j3419j7037J051J9441J4904n339
272A3086j7449j0426M566J2679R930k759j1695p235L743O175K421J24K340k255
286C245q242n680O505J2287M144q663j2050m115Q452J3332L565j0047j2506m58
300a0231J0271O933j917m627j697q39j513J098M442L662q10n584o543K62Q193
315A100R202k171j1695p458M987J0979L847n501p104j395K676L912J894j533j117
$$ plain form
330 623 122 -1670 -3718 -2354 3230 7100 2950 -5661 -8071 -1056 6840 6981 -345 -6445 -5528 564
346 564 5230 3932 -1353 -3609 -1777 548 182 -242 1672 3037 150 -4476 -4255 1273 5924 4164
362 4164 -2364 -6884 -3637 3708 6785 2272 -4041 -5095 -584 3384 2114 -709 -1157 32 -309 -1263
378 -1263 -1008 1789 3327 1122 -3075 -4806 -890 4324 4876 -266 -5291 -3890 1979 4679 2048 -2149
394 -2149 -3181 -529 1317 589 -480 142 1057 337 -1768 -2115 327 3433 2547 -1667 -4767 -1895 2955
411 2955 4466 875 -3480 -3485 50 2826 1469 -711 -1724 -339 785 -69 -613 22 1671 1020 -1307
428 -1307 -3035 -746 2868 3206 -262 -3717 -2435 1468 3323 1228 -2086 -2778 -29 1600 1092 -429
444 -429 -937 142 634 -446 -1293 -286 1801 1811 -965 -2801 -1383 1890 3130 563 -2531 -2157 578
$$ packed form
330F23n01j792k048J364N584L870m150q611k410P015P896J41p326o100R17O092
346E64M666j298n285k256J832K325l66m24J914J365k887m626K21N528M651j760
362D164o528m520L247P345L077m513o313j054M511L968j270k823m48J189l41r54
378a263K55K797J538k205m197j731L916N214N52n142n025J401N869K700k631m197
394b149j032K652J846p28j069O22R15p20k105l47K442L106q86m214l100K872M850
411B955J511l591m355nL535K776j357k180j013J385J124q54n44O35J649o51k327
428a307j728K289L614L38l468l455J282L903J855k095l314o92K749J629n08j521
444d29n08J079M92j080q47J007K087J0k776j836J418L273J240k567l094L74K735
$$ plain form
461 578 2269 1436 -748 -1736 -580 1077 842 -740 -1057 362 1071 -491 -1962 -494 1905 2027 -473
478 -473 -2426 -1529 956 2388 806 -1268 -2248 -191 1855 1078 -716 -1192 218 1063 -30 -803 -311
495 -311 945 886 -730 -1461 -692 929 2014 825 -1622 -1907 -39 2302 1156 -1312 -1649 93 1274
512 1274 459 -922 -287 503 580 -112 -393 -538 401 1472 444 -1655 -1620 994 2621 702 -1603 -1149
530 -1149 101 1375 804 165 -774 -601 485 868 -92 -912 26 1200 159 -1403 -805 1081 1267 -210
548 -210 -1388 -730 452 1142 1126 -251 -1752 -753 1394 1628 -823 -1546 -23 1196 78 -1049 15
565 15 724 294 -281 -350 -228 -112 928 848 -1078 -1654 226 2144 861 -1319 -1390 648 964 99 -136
584 -136 -177 -558 -2 780 803 -633 -661 885 903 -846 -858 812 1427 87 -1132 8 567 359 221 62
$$ packed form
461E78J691q33k184r88J156J657k35j582l17J419P09j562j471J468K399J22k500
478d73j953Q97K485J432j582k074r80K057K046p77j794m76J410Q45j093p73M92
495c11J256n9j616p31P69J621J085j189k447k85J868K341j146k468l37J742J181
512A274q15j381O35P90P7o92k81j45R39J071j028k099L5K614J627j919k305M54
530a149J250J274n71o39r39J73J086L83r60q20R38J174j041j562N98J886J86j477
548b10j178O58J182O90j6j377j501R99K147K34k451p23J523J219j118j127J064
565A5P09m30n75o9J22J16J040q0j926n76J880J918j283k180p1K038L16q65k35
584a36m1l81N56P82K3j436k8J546J8j749j2J670O15j340j219J140N59k08j38j59
$$ plain form
604 62 -922 -621 458 1596 -329 -1740 -532 1528 914 -1130 -594 527 281 -486 130 217 -127 -405
622 -405 228 312 -684 -362 1432 1069 -1228 -1743 760 1733 62 -1421 -124 67 -90 774 555 -169 -1535
641 -1535 -194 1487 801 -1376 -532 1339 284 -1441 -101 1304 137 -954 -572 162 -25 -18 1010
658 1010 381 -1729 -796 1453 1888 -120 -1658 -374 878 145 184 779 288 -1238 -305 1158 535 -884
676 -884 -317 824 -111 -1554 271 1815 66 -1859 -836 647 625 279 245 -173 -1287 -977 1345 1450
694 1450 -843 -1739 95 773 -330 -138 976 765 -1457 -911 1052 1099 -212 -471 157 -744 -1064 777
712 777 2173 -66 -2166 -1063 1407 707 -403 -20 312 -1096 -943 1312 1221 -633 -1282 137 804
729 804 -617 -290 1141 598 -1814 -1301 1073 1600 -58 -864 -8 -305 -884 710 1768 42 -1820
$$ packed form
604F2r84L01J079J138j925j411J208K060o14k044N36J121k46p67O16Q7l44k78
622d05O33Q4r96L22J794l63k297n15K503R73j671j483J297J91j57Q64k19p24j366
641a535J341J681o86k177Q44J871j055j725J340J405j167j091L82P34j87PJ028
658A010o29k110R33K249M35k008j538J284J252p33L9N95m91j526R33J463o23j419
676h84N67J141r35j443J825J544j749j925J023J483k2l46l4m18j114L10K322J05
694A450k293q96J834O78j103J92J114k11k222N46J963M7j311k59O28r01l20J841
712G77J396k239k100J103K470p00j110L83L32j408J53K255r1j854o49J419O67
729H04j421L27J431n43k412N13K374N27j658q06Q56k97n79J594J058j726j862
$$ plain form
746 -1820 -200 1300 729 -631 -101 594 -449 -1055 837 1554 -218 -1202 -246 872 -364 256 1136
763 1136 591 -1609 -974 1504 1324 -412 -867 106 20 -508 552 1181 -4 -1453 -709 1210 901 -552
781 -552 -277 553 -518 -958 463 1397 -324 -1264 -651 812 198 -155 578 251 -1304 -782 1159 1484
799 1484 -540 -1251 140 241 -355 108 1172 72 -1504 -667 1044 802 -435 -192 296 -511 -594 518
817 518 1055 148 -1598 -248 633 272 -267 260 179 -937 -677 899 1520 -440 -1198 99 572 -384 -96
836 -96 845 306 -823 -422 756 783 -766 -500 370 -347 -644 338 1329 -145 -1414 -174 915 693 -173
855 -173 401 155 -673 -346 868 1244 -287 -781 68 288 -301 -441 960 50 -737 -643 664 321 -361
874 -361 -448 72 -289 -442 553 772 -201 -1225 33 765 668 -444 175 426 -545 -553 425 828 -197 -764
$$ packed form
746a820J620J500n71j360N30O95j043o06J892P17j772r84R56J118j236O20Q80
763A136n45k200O35K478j80j736m55R73q6n28J060O29j185j449P44J919l09j453
781e52K75Q30j071m40J421R34j721r40O13J463o14l53P33l27j555N22J941L25
799A484k024p11J391J01n96M63J064j100j576Q37J711k42j237K43M88q07q3J112
817E18N37r07j746J350Q81l61n39N27q1j116K60J576O21j960p58J297M73r56K88
836i6R41n39j129M01J178K7j549K66Q70p17k97R82R91j474j269J240J089k22q66
855a73N74k46q28L27J214L76j531m94Q49K20n89j40J401r10p87R4J307l43o82
874c61q7N20l61j53R95K19r73j024J258P32r7j112O19K51r71qR78M03j025n67
$$ plain form
894 -764 218 71 -499 -87 585 349 -697 -519 800 479 -212 -536 186 169 -229 159 456 0 -658 92
914 92 422 199 -393 -188 8 -494 -346 209 365 -374 -894 246 409 -213 -17 -81 254 -648 -251 271 745
935 745 -8 -432 255 220 -519 44 364 93 -549 -303 511 139 -36 -339 548 -310 -451 465 662 -59 -208
956 -208 -51 118 -199 206 292 273 -475 -254 318 419 -163 -104 -107 70 -165 -306 403 -79 -272 -126 339 243
978 243 -231 -165 -103 -74 -269 91 433 -154 -404 52 333 -27 -160 -75 36 -82 167 361 301 -104 22 -45
1000 -45 358 -22 -139 196 -45 -19 -270 313 -302 13 -37 -6 -52 -283 42 111 -18 -77 112 211 -164 145 131
1023 131 -211 -300 -91 19 -18 -156 -296 164 -100 103 -98 66 224 119 -170 -111 55 -376 -56 127 -175
1044 -175 39 -5 26 -269 24 -159 361 -251 41 40 147 418 245 -23 -76 -143 373 167 -196 -199 58 -264 -42
$$ packed form
894g64R82j47n70M12O72k36j046J78J319l21o91l24P22j7l98L88K97m56o58P50
914I2L30k23n92K05J96n02J48N55J56p39n20J140J63o22J96o4L35r02L97N22M74
935G45p53m24O87l5p39N63L20k71o42K46Q14l72j75l03Q87q58j41R16J97p21j49
956b08J57J69l17M05Q6j9p48K21N72J01n82N9lJ77k35j41P09m82j93J46M65r6
978B43m74O6O2K9j95L60L42n87k50M56K81l60j33Q5J11j18K49J94o0m05J26o7
1000d5M03l80j17L35k41K6k51N83o15L15n0L1m6k31L25O9j29n9J89R9l75L09j4
1023A31l42q9K09J10l7j38j40M60k64K03k01J64J58j05k89N9J66m31L20J83l02
1044a75K14m4L1k95K93j83N20o12K92jJ07K71j73k68n3o7N16k06l63lK57l22K22
$$ plain form
1067 -42 -73 -190 -168 4 181 63 358 136 -34 -147 -61 37 89 -50 56 -9 33 -138 -29 72 -31 315 -67
1090 -67 128 -203 171 59 -43 49 -90 147 -2 0 62 147 145 24 116 -41 19 35 33 102 -96 -107 279 -217 -65
1115 -65 58 -21 -87 77 -350 -166 -6 -474 -64 102 -95 23 328 14 -17 -268 81 172 174 -24 -220 99
1137 99 45 87 -82 -199 -110 137 -95 -272 -21 381 -94 -118 -137 -81 -247 -127 -34 106 222 -153 -131 205 18
1160 18 -65 154 132 -187 -25 -49 211 -384 305 -24 -203 -135 -59 173 449 108 162 118 139 -265 -155 -34 -118
1183 -118 -142 -82 219 -326 -340 10 -259 95 -279 -55 -106 -220 86 25 -26 0 26 165 -232 -115 -107 -114 -59 -165
1207 -165 29 76 -109 -209 -179 -12 -10 -184 10 -48 132 124 79 -125 85 -138 -46 145 -296 -396 -75 285 16
1230 16 -77 425 85 131 -41 -87 -75 78 -11 3 61 58 -63 -307 291 -184 -134 334 44 -159 -94 -173 203 -12
$$ packed form
1067d2l1j17K2J72J77j18K95k22j70j13Q6R8N2j39J06o5M2j71J09J01j03L46l82
1090f7J95l31L74j12j02R2j39K37j49KO2Q5kj21R2j57O0J6kO9j98j1L86m96J52
1115f5J23p9o6J64m27J84J60m68M10J66j97J18L05l14l1k51L49R1Kj98j96L19
1137I9n4M2j69j17Q9K47k32j77K51M02m75k4j9N6j66J20R3J40J16l75K2L36j87
1160A8q3K19k2l19J62k4K60n95O89l29j79O8P6K32K76l41N4m4K1m04J10J21q4
1183a18k4O0L01n45j4L50k69L54l74K24n1j14L06o1n1K6K6J39l97J17QpN5j06
1207a65J94M7j85j00L0J67Kj74J94n8J80qm5k04K10k23R2J91m41j00L21L60k69
1230A6r3N02l40M6j72m6J2J53q9J4N8lj21k44N98m75N0M68k90k03O5p9L76k15
$$ plain form
1254 -12 -71 -141 -99 87 111 166 -114 -80 -269 49 270 -99 -108 260 91 -296 -361 353 -152 -155 94 -165 -287 -68
1278 -68 182 -53 -134 -174 -295 -35 205 -199 -92 -364 41 16 331 143 30 -128 -110 -75 115 -133 -85 162
1300 162 55 -178 542 148 -387 240 92 -9 -87 -71 -46 -371 -15 137 230 181 -283 -180 87 93 -43 107
1322 107 264 33 -312 -179 204 -236 -93 7 253 -383 -210 166 119 -588 4 352 -214 -263 279 170 25
1343 25 -198 244 273 -135 -183 -205 203 185 216 -86 173 -153 -100 71 209 -238 -99 -29 106 -17 8 89 94 -375
1367 -375 -513 172 358 -142 230 114 124 -96 52 150 103 -247 -314 -148 -66 -211 277 228 -291 -274 205 130 -191
1390 -191 -336 23 -31 -165 -89 103 114 -77 -114 490 370 -104 -233 -133 259 -239 285 447 -1 -125 218
1411 218 159 48 -119 -121 78 -195 -149 165 430 94 -184 -101 6 -299 39 217 57 -178 -448 79 -201 -83
$$ packed form
1254a2n9p0M2J86K4N5k80L4j89L18K21l69rL68j69l87o5P14n05lK49k59j22K19
1278f8K50k35q1m0j21K60K40m04J07k72M05k5L15j88j13j58J8L5J90k48M8K47
1300A62j07k33P20l94n35O27j48j01p8J6K5l25L56J52R3m9m64J03K67Oj36J50
1322A07J57k31l45J33L83m40J43J00K46o36J73L76m7p07N92L48n66m9N42j09j45
1343B5k23M42K9m08m8k2M08j8L1l02K59l26N3J71J38m47J39P0J35j23K5Q1Nm69
1367c75j38O85J86n00L72j16J0k20J48R8m7l50o7J66Q2j45M88m9n19J7M79p5l21
1390a91j45L59n4j34P6J92J1j91l7O04j20m74j29J00L92m98N24J62m48j24L43
1411B18n9j11j67kJ99k73M6L14K65l36k78Q3J07l05L38J78j60k35k70N27k80J18
$$ plain form
1433 -83 70 77 -43 17 -30 99 33 -274 -72 227 320 -145 -57 268 -167 -439 242 155 216 -263 -132 96 -386
1456 -386 230 219 30 155 -134 370 260 -122 -397 122 -207 -280 -160 278 70 -524 130 285 365 -124 43
1477 43 291 6 47 293 506 -240 -33 206 -4 253 -254 168 338 -355 -206 365 669 38 -450 -23 -22
1498 -22 -277 17 238 48 -258 -244 190 410 -257 -256 -80 -234 -342 53 343 93 -481 127 264 195 118 -94
1520 -94 124 -90 -193 112 319 61 -250 -89 -180 -9 92 179 18 -308 -138 233 391 -252 105 68 14 182
1542 182 23 338 7 -54 -150 168 276 -53 5 276 -209 -244 -105 303 155 -242 156 -139 -12 -56 103 109
1564 109 -117 136 160 104 -54 -132 14 77 13 171 74 -75 -22 -189 149 33 -15 -47 -17 -190 -300 114 202 -240
1588 -240 -344 -42 140 -372 -101 230 -155 -197 -311 119 -9 -324 -15 24 -36 -115 99 121 -171 -173 -251 120 414
$$ packed form
1433h3J53Pj20O0m7J29o6l07K02K99R3m65Q8L25m35k72O81q7O1m79J31K28m82
1456c86O16j1j89J25k89N04j10l82k75N19l29p3J20M38k08n94O54J55Q0m89J67
1477D3K48k85M1K46K13p46K07K39k10K57n07M22J70o93J49N71L04o31m88M27J
1498b2k55K94K21j90l06J4M34K20o67JJ76j54j08L95K90k50n74O08J37o9p7k12
1520i4K18k14j03L05K07k58l11J61r1J71J01Q7j61l26J70L71J58o43L57l7n4J68
1542A82j59L15l31o1r6L18J08l29N8K71m85l5J39M08j48l97L98k95J27m4J59O
1564A09k26K53K4n6j58p8J46O3o4J58r7j49N3j67L38j16m8l2L0j73j10M14Q8m42
1588b40j04L02J82n12K71L31l85m2j14M30j28l15L09L9o0p9K14K2k92kp8L71K94
$$ plain form
1611 414 -69 107 123 -203 27 -78 221 -105 -199 54 128 60 45 -57 142 79 -164 0 -35 -282 -85 -26 69
1634 69 -71 -20 175 202 124 205 -28 -35 -48 -122 -218 63 -174 136 103 225 -295 237 65 114 -305 63 679 -162
1658 -162 258 30 -290 -23 92 269 117 -38 129 396 13 53 32 38 359 99 -147 -115 -114 -102 2 132 146
1681 146 190 189 161 -113 -119 -128 50 121 116 305 94 -172 -141 132 -239 -351 -74 -11 -113 -173 11 -142 -166 -174 -11 -252
1707 -252 -107 -55 -53 135 4 56 93 -160 -311 -90 21 -23 -73 -184 43 393 47 -196 172 209 -26 129 -83
1730 -83 252 -195 -99 160 -184 63 -178 21 94 -201 -16 160 28 -171 -61 -116 182 -276 -68 16 -132 126
1752 126 33 59 110 502 -54 -267 -2 -218 -87 -126 37 -60 14 84 -163 68 23 -148 -142 -72 112 -281 83 186
1776 186 137 -150 -22 -107 -68 114 -83 -143 290 315 -26 -153 -359 -265 294 -139 45 17 -156 14 -87 -7 361
$$ packed form
1611D14m83J76J6l26K30j05K99l26r4K53P4o8j5j02J99o3k43J64l5k47J97N9R5
1634F9j40N1J95K7p8Q1k33pj3p4r6K81k37L10l3J22n20N32j72M9m19L68O16q41
1658a62M20k28l20K67J15J77j52j55J67K67l83M0k1OL21k60k46L2JJ2J04J30J4
1681A46M4jk8k74orJ78P1nJ89k11k66L1K73l71j12K77O3j02o0J84j53k4qJ63k41
1707b52J45N2KJ88j31N2L7k53j51K21J11m4n0j11K27L50l46k43L68L7k35J55k12
1730h3L35m47R6K59l44K47k41J99P3k95J85J76j32j99J10n5K98m58K08Q4j48K58
1752A26r3K6N1L92n56k13K65k16J31l9J63r7P4P0k47K31m5j71OP0J84l93L64J03
1776A86m9k87J28q5L9J82j97o0M33K5l41j27k06R4N59m33J84k8j73J70j01Q0L68
$$ plain form
1799 361 -539 -65 -126 108 -167 68 176 -38 -163 89 -246 -6 109 146 137 151 165 -176 -311 -133 55 -5
1821 -5 176 149 -254 62 52 -69 -18 88 175 -14 190 -178 226 -28 -82 -420 549 -3 177 215 -165 -58 224
1844 224 -267 -27 -288 -402 20 -26 192 -198 196 -182 259 88 33 -128 51 -188 92 131 10 -357 -121
1865 -121 -405 -24 -26 -22 -143 119 174 -239 165 338 377 122 15 -25 -267 84 130 -154 -99 -187 118 -59 33 -160
1889 -160 28 92 46 -57 43 353 -72 194 217 68 75 -210 -92 -47 156 -14 28 -24 79 -248 124 143 -324
1912 -324 -225 56 115 251 -104 7 14 64 4 -448 -182 297 -235 78 -122 181 209 132 -50 47 153 2 288
1935 288 -20 -48 47 -57 -94 -223 45 -178 -61 62 320 -56 -13 -114 -6 -100 102 -137 156 -76 -270 101
1957 101 -83 -208 -232 -165 -270 104 48 -298 336 -25 147 -221 -70 110 -181 167 201 189 189 -29 -245 -31
$$ packed form
1799C61r00M74o1K34k75K35J08k14j25K52l35K40J15L7rJ4J4l41j35J78J88o0
1821eJ81k7m03L16j0j21N1J06Q7j89K04l68M04k54n4l38R69n52J80L8l80J07K82
1844B24m91K40k61j14M22m6K18l90L94l78M41j71n5j61J79k39K80L9j21l67K36
1865a21k84L81kMj21K62N5m13M04J73L9k55j07m0k42L51M6k84N5q8L05j77R2j93
1889a60J88O4m6j03J00L10m25K66K3j49Pk85J18M5K03j70M2n2J03l27L72J9m67
1912c24R9K81N9J36l55J11PN0o0m52K66M79n32L13k00L03K8p7j82R7J06j51K86
1935B88l08k8R5j04l7j29K68k23J17J23K58l76M3j01J08r4K02k39K93k32j94L71
1957A01j84j25k4O7j05L74n6l46O34l61J72l68J51J80k91L48L4j2%k18k16K14
$$ plain form
1979 -31 -5 410 -77 202 -92 -201 -154 337 -207 -174 -236 15 86 -359 -177 -95 69 123 61 98 -261 16 -65 150
2003 150 -85 -23 174 -288 -225 25 341 153 -43 11 -178 135 154 -18 34 56 -65 246 -256 75 295 270
2025 270 408 -96 -14 191 115 33 -127 -83 46 122 155 -139 -87 57 135 42 192 96 225 383 204 -161 -426
2048 -426 -182 202 -104 9 174 -261 -191 -364 -203 217 221 232 145 -271 7 -133 -8 -286 -91 -184 69 106
2070 106 51 14 44 -185 36 144 199 -173 47 46 -569 -71 11 531 -51 -129 118 -319 -78 63 -116 -45 9
2093 9 13 -119 174 220 252 -164 -125 122 175 36 5 60 -101 -16 102 182 166 87 -59 -267 278 -133 -130 -151 -160 -26
2119 -26 -203 -95 111 -187 -162 92 -113 257 -262 178 -11 164 -286 37 92 71 -204 9 110 268 -41
2140 -41 181 81 -60 -104 -306 526 190 -158 -87 -63 242 332 39 426 -320 39 66 -156 93 -67 -153 -257
$$ packed form
1979c1K6M15m87K79k94j09M7M91n44L3o2K51P1m45J82Q2J64N4o2L7l59K77q1K15
2003A50k35O2J97m62O3K50L16j88j96N4j89L13J9j72N2K2j21L11n02L31K20k5
2025B70J38n04Q2K05p6q2j60M4J29P6L3k94N2J44P8r3J50r6J29J58j79l65k65
2048d26K44L84l06J13J65m35P0j73J61M20MJ1q7m16K78j40J25k78J95r3K53L7
2070A06n5l7L0k29K21J08N5l72K20jo15M98Q2N20n82p8K47m37K41J41j79P1N4
2093IMj32K93M6L2m16L9K47N3j39l1N5j61Q5J18Q0j6p9j46k08N45m11Lk1rJ34
2119b6j77J08K06k98K5K54k05L70n19M40j89J75m50L23N5k1k75K13J01J58l09
2140d1K22j00j41m4k02Q32l36l48P1K4L05R0k93L87p46L59K7k22K49j60q6j04
$$ plain form
2162 -257 -144 362 -242 -20 -182 129 51 -46 92 -69 -324 -232 -178 21 76 22 -24 -145 -37 107 -169 131
2184 131 201 -52 48 130 181 -182 18 -94 119 114 -295 -252 123 -190 402 126 -58 -136 -25 -145 -138 -121 -180 -35
2208 -35 6 230 320 301 192 -115 82 -141 -132 241 15 -37 -96 166 -276 63 -10 -38 221 -271 117 15 -55 289
2232 289 -72 132 -103 -236 -71 5 108 -245 131 240 1 -124 -102 -335 -221 45 -57 197 -20 108 -137
2253 -137 -198 -59 105 -61 193 -107 269 -94 168 -35 -91 65 -110 -59 -99 125 169 262 -192 -5 291 -142
2275 -142 -57 -49 256 -22 -139 -121 138 279 -96 65 -102 -152 1 9 -309 -68 -21 -57 83 151 108 88 -137 153
2299 153 -222 111 -230 18 53 31 -366 -205 -32 -129 2 -9 158 -164 -151 -20 243 244 235 -227 -95 -9 56 274
2323 274 126 93 -208 -212 -143 84 6 205 76 99 -21 -198 -110 81 -302 27 177 -5 -103 -139 -101 -27 -160 110
$$ packed form
2162b57J13N06o04K22j62L11p8r7J38j61k55R2N4J99N5n4m6j21J08J44k76L00
2184A31P0k53J00Q2N1l63K00j12K13nm09M3L75l13N92k76j84p8J11j20PJ7n9J45
2208c5M1K24R0j9j09l07J97k23RL73k26n2n9K62m42L39p3k8K59m92L88j02p0L44
2232B89l61K04k35j33J65P6J03l53L76J09k39j25K2k33J14K66j02K54k17J28k45
2253a37o1J39J64j66K54l00L76l63K62k03n6J56j75N1m0K24M4R3m54J87K96m33
2275a42Q5QL05k78j17J8K59J41l75J61j67n0J53Ql18K41M7l6J40O8m3k0k25K90
2299A53l75L33l41K48L5k2l97J61J73r7J31j1J67l22J3J31K63Jrm62J32Q6O5K18
2323B74j48l3l01mO9K27p8J99j29K3j20j77Q8J91l83L29J50j82r8l6L8P4j33K70
$$ plain form
2347 110 156 -16 120 6 -20 -197 -122 98 31 -14 -1 116 21 157 -49 254 -14 275 -78 -350 -206 -15
2369 -15 -75 339 206 -185 114 149 39 116 -106 210 448 -362 -116 96 23 -17 -60 -106 272 85 63 -30 252
2392 252 53 2 44 199 85 -26 -205 2 171 -236 -9 234 264 25 -180 -90 72 -18 -17 129 -60 126
2414 126 53 21 162 182 45 172 185 -94 138 -118 -46 39 187 122 21 -135 -89 -450 -12 -162 -41 307 313
2437 313 55 -241 -125 -162 -11 -226 59 102 -20 51 28 -112 84 271 26 64 106 199 255 22 -197 -83 -8
2460 -8 77 -125 92 171 -243 -102 261 -15 8 164 -197 -119 72 82 -96 99 347 76 -113 -167 -119 0 -9 59
2484 59 -124 -49 2 129 24 -336 241 306 204 -301 20 -55 -8 274 213 -54 -175 -109 122 -4 -104 -202 248
2507 248 105 -195 8 -222 66 172 -266 52 47 212 -52 137 -89 73 149 33 -19 87 -225 143 35
$$ packed form
2347A10M6j72J36j14k6j77P5K20o7m5J3J17r5J36k06L03k68K89l53k72J44J91
2369a5o0M14j33l91K99L5j10P7k22L16K38q10K46K12p3m0m3m6L78j87k2r3K82
2392B52j99n1M2J55j14j11j79K07J69m07K27K43L0k39k05R0J62r0JJ46j89J86
2414A26p3l2J41K0j37J27J3k79K32k56P2Q5J48o5j01j56M6l61M38j50J21L48O
2437C13k58k96J16l7J51k15K85M3j22P1k3j40J96J87k45L8M2R3N6k33k19J14P5
2460hQ5k02K17P9m14J41L63k76K3J56l61P8J91J0j78J95K48k71j89n4M8J19rO8
2484E9j83P5N1J27j05l60N77O5j02n05L21p5M7K82o1k67j21O6K31j26j00r8M50
2507B48j43l00K03k30K88J06m38L18nJ65k64J89k26J62P6j16n2J06l12L68j08
$$ plain form
2528 35 -215 232 -252 32 102 17 -13 -161 -38 262 154 151 233 260 -63 73 -24 42 13 16 -21 54 149 -335 58
2553 58 -212 -102 -54 -40 74 73 172 69 -139 -19 433 -84 147 -184 -45 124 -88 258 18 101 356 -44
2575 -44 30 -148 -35 -37 55 18 -327 232 92 68 -109 65 -69 -85 -132 177 -217 -81 -98 -287 161 74 62 -326
2599 -326 317 -12 -105 -102 108 89 62 23 -28 114 281 -113 -132 338 -403 62 -43 32 164 199 -36 -220 257
2622 257 68 124 -165 -163 83 73 210 154 -141 -50 -38 -20 254 65 30 -29 -103 -202 76 88 192 173 -30 189 -333
2647 -333 97 -128 28 -146 34 -129 -148 -81 -16 -43 -46 248 112 -80 -187 26 -133 -8 81 39 78 -149 141
2670 141 6 -40 -87 64 136 -202 -83 41 -145 70 18 -15 16 -162 113 225 -56 -111 13 55 14 87 -51
2693 -51 -107 -202 30 145 102 23 144 2 -181 72 102 -107 112 31 -156 84 -214 -35 296 163 -216 -159 -97
$$ packed form
2528C5k50M47m84K84P0q5l0j48J23L00j08lQ2K7l23J36r7O6k9Ll7P5R5m84L93
2553E8k70J10M8J4J14jR9j03k08J20M52n17K31l31J39J69k12L46k40Q3K55m00
2575d4P4j78J13kR2l7l45N59j40k4j77J74j34j6m7L09l94J36j7j89M48q7j2l88
2599c26O43l29r3LK10j9k7l9n1J42J67l94j9M70p41M65j05P5J32L5k35j84M77
2622B57j89N6k89KK46j0J37n6k95R1J2J8K74j89l5n9p4r9K78J2J04j9k03K19n22
2647c33M30k25J56j74J80j63j9O7O5k7lK94j36j92j07K13j59J25Q9m2L9k27K90
2670A41j35m6m7J51P2l38J19J24j86K15n2l3L1j78K75J12k81n5J24M2m1P3j38
2693e1n6r5K32J15m3p9J21j42j83K53L0k09K19q1j87K40k98J79L31j33l79N7O2
$$ plain form
2716 -97 -278 -40 66 213 311 115 132 -121 113 133 144 121 -140 148 -135 -103 26 261 -59 -323 181 113 -136
2739 -136 148 343 -171 -212 75 -28 -244 76 34 -129 120 4 -70 71 8 19 84 -370 -8 -83 -186 -214 400
2762 400 125 313 26 -93 -211 159 -45 118 317 3 -54 -25 148 -19 -126 -197 -57 148 -93 -146 42
2783 42 145 -63 118 180 2 -43 63 99 -175 -66 87 102 45 -322 85 128 -98 142 -57 -86 97 158 306
2806 306 356 241 29 -324 99 46 121 -272 141 9 77 -140 -135 -102 -45 17 13 109 15 -28 73 -96 416 58 5
2831 5 -19 30 157 -3 -120 -38 175 -120 7 -117 -88 -276 180 -17 68 209 -54 -17 80 107 -331 -13 -250
2854 -250 -282 -24 15 64 -263 -39 50 -132 -26 -143 13 -303 -19 54 -71 79 55 322 -12 236 -55 316
2876 316 83 -93 361 219 -78 -156 3 -4 146 105 -149 70 246 -60 -50 -89 -48 -157 199 -186 170 8
$$ packed form
2716i7j81K38J06J47R8j96J7k53K34K0J1k3k61K88k83L2J29K35l20k64N04o8k49
2739a36K84J95n14m1K87j03k16L20m2j63K49j16p4J41o3J1O5m54L62p5j03k8O14
2762D00k75J88k87j19j18L70k04J63J99l14n7K9J73j67j07p1J40K05k41n3J88
2783D2J03k08J81O2j78m5J06L6k74J09J53J5n7l67M07M3k26K40j99k9J83O1J48
2806C06N0j15k12l53M23n3P5l93M13j32O8k17NL3N7O2mR6r4m3J01j69N12l58n3
2831Ek4M9J27j60j17Q2K13k95J27j24K9j88M56j97Q5J41k63L7R7K7m38L18k37
2854b50l2K58L9M9l27K24Q9j82J06j17J56l16K84P3j25J50k4K67l34K48k91L71
2876C16k33j76M54j42k97p8J59pJ50m1k54K19J76l06J0l9M1j09L56l85L56j62
$$ plain form
2898 8 174 28 8 139 -158 281 140 -66 95 -9 -139 92 -172 -103 53 -18 99 -205 -193 -20 275 45
2920 45 217 -96 133 5 101 -187 -214 -7 -68 36 -52 39 112 -295 72 332 -540 -56 67 -24 327 182 -124
2943 -124 -98 -352 81 49 280 42 33 -609 -179 -18 -278 -231 -120 144 123 -434 -21 260 -235 -18 -151 21
2965 21 304 132 171 7 60 134 -90 -43 -49 52 -89 60 192 -42 132 -274 287 303 -282 -90 -69 120 -14
2988 -14 -37 161 -121 -268 242 66 174 66 249 58 -142 116 21 -57 131 -107 -4 -253 204 189 240 -147
3010 -147 54 -37 176 182 -19 -90 -42 37 -173 186 -97 -128 41 81 206 75 -66 174 153 153 -98 -172 -201 -94
3034 -94 -217 116 -80 233 242 -97 116 -349 -85 113 -61 304 30 -99 164 -152 -26 199 102 234 -115
3055 -115 54 -349 -287 -249 107 -6 -154 -94 -189 -21 -37 60 -101 230 157 99 -52 83 -175 116 14 17 -136
$$ packed form
2898HJ66j46k0J31k97M39j41k06J61j04j30K31k64O9J56p1J17l04J2J73K95k30
2920D5J72l13K29j28R6k88k7K07o1J04q8R1P3m07L67K60q72M84J23r1L51j45l06
2943a24K6k54M33l2K31k38ro42M30J61k60M7J11K64k1n57M13K81m95K17j33J72
2965B1K83j72L9j64N3P4k24M7oJ01j41J49J32k34J74m06N61J6n85J92K1J89j34
2988a4k3J98k82j47N10j76J08j08J83j91k00K58r5p8J88k38J03k49M57j5N1l87
3010a47K01r1K13Ok01p1M8P9k10L59k83l1J69M0J25j31j41K40k1%k51p4k9J07
3034i4j23L33j96L13Rl39K13m65K64J98j74L65k74j29K63l16J26K25r7J32l49
3055a15J69m03O2L8L56j13j48O0r5J68j6R7j61L31p3n8j51J35k58K91j02Lj53
$$ plain form
3078 -136 -7 244 -190 -56 123 21 365 106 -8 -58 -48 -266 88 -1 -74 69 77 83 -485 -99 21 -366 -116
3101 -116 467 -88 62 -67 45 -246 -243 -103 -19 -208 252 132 43 104 -350 -44 -104 32 -13 0 28 59 -86
3124 -86 15 149 165 4 -198 379 50 -149 -114 -16 191 14 116 165 87 191 217 273 165 -355 104 -264 -140
3147 -140 41 -47 -317 -146 14 -116 116 -90 -40 174 -10 230 -332 -12 147 -438 -5 -19 270 98 -83
3168 -83 -33 8 140 -184 128 168 -194 65 -289 417 -181 -47 21 -92 161 179 16 -62 -139 37 -105 25 174
3191 174 -130 39 -177 26 -345 -283 277 3 -230 -14 -66 -10 -126 -15 -460 -60 229 76 -596 -13 -289
3212 -289 77 233 17 -201 -35 -188 133 -162 -74 220 292 2 181 233 50 92 -175 156 -278 208 -136
3233 -136 -105 88 -3 50 -155 -160 51 -1 16 130 -48 -142 6 310 -97 -133 -45 123 121 -30 255 -23 60 -128
$$ packed form
3078a36J29K51m34J34J79j02L44k59j14n0J0k18L54q9p3J43QOn68L86J20l87K50
3101a16N83n55J50j29J12k91LJ40Q4j89M60j20q9O1m54L06o0J36m5J3K8L1j45
3124h6J01J34J6j61k02N77l29j99L5R8K07j77J02M9p8J04K6N6j08n20M59l68J24
3147a40J81q8k70J71J60j30K32k06N0K14j84K40n62L20J59n85M33j4K89j72j81
3168h3N0M1J32l24L12M0l62K59l54P06n98J34O8j13K53J8j63p8p7J76j42J30J49
3191A74l04J69k16K03l71O2N60k74k33K16n2N6j16J11m45M00K89j53o72N83k76
3212b89L66J56k16k18J66j53L21k95Q8K94P2k90J79N2j83M2k67L31m34M86l44
3233a36L1J93r1N3k05nK11n2J7J14j78r4J48L04m07l6Q8J68kj51K85k78Q3j88
$$ plain form
3257 -128 177 -129 126 275 46 -19 -25 192 196 -18 208 33 -55 203 -30 178 61 202 -82 -183 58 -24
3279 -24 39 -112 -351 -255 29 -144 211 -101 163 -54 183 -12 97 -211 -28 89 53 -189 26 219 242 -76
3301 -76 -179 -38 43 48 -103 293 -58 -29 -226 186 36 -197 -49 -414 -218 -128 -109 190 -153 -240 7 -20 236
3324 236 156 115 -133 5 164 -231 0 39 22 308 103 -301 168 61 74 212 87 189 21 157 93 -54
3346 -54 115 10 -240 -193 34 179 281 -237 -78 -267 -116 -300 -301 -259 -302 -197 -13 -69 -34 -23 156 209 251 -387
3370 -387 132 221 -177 182 -95 -297 -214 -37 29 11 154 199 412 -86 313 -295 -26 150 20 -445 -80 100
3392 100 -147 -98 -74 84 16 141 145 -82 183 -102 11 -160 -252 180 60 -189 -4 -273 -132 60 -60 131
3414 131 60 -84 169 -80 -60 121 172 -35 213 299 -80 256 -271 103 264 99 217 8 -5 28 18 179
$$ packed form
3257a28L05l06K55J49k29o5oK17Mk14K26j75q8K58k33K08j17J41k84j01K41q2
3279b4O3j51k39R6K84j73L55l12K64k17K37j95J09l08J83J17l6k42K15J93K3l18
3301g6j03J41Q1Nj51L96l51K9j97M12j50k33J48l65J96R0J9K99l43q7K47k7K56
3324B36q0m1k48J38J59l95K31L9j7K86k05m04M69j07J3J38j25J02j68J36o4j47
3346e4J69j05k50M7K27J45J02n18J59j89J51j84jM2m3J05J84n6L5J1J79N3M2o38
3370c87N19Q9l98L59k77k02Q3J77O6j8J43M5K13m98L99o08K69J76j30m65L65J80
3392A00k47M9K4J58o8J25Mk27K65k85J13j71r2M32j20k49J85k69J41J92j20J91
3414A31p1j44K53k49K0J81N1k07K48Q6l79L36n27L74J61j65J18k09j3L3j0J61
$$ plain form
3436 179 164 -62 -124 -99 -148 -75 -295 -43 41 -212 162 -38 177 -101 -70 129 143 -51 14 -63 80 -117 -34 38
3460 38 -155 -366 -200 -146 26 210 176 -20 160 -93 260 122 -28 39 60 164 -48 106 -155 -196 164 -165
3482 -165 10 226 156 269 -114 -81 128 -87 36 -64 93 55 77 184 71 131 155 33 147 -11 -11 214 301
3505 301 61 -99 148 134 -205 3 -33 130 71 -71 242 145 174 223 142 -97 42 129 96 -152 6 33 -27 -113
3529 -113 111 45 -25 240 32 -101 -15 -364 112 39 -91 -20 9 -208 66 87 -356 -53 -102 73 159 251 177 59
3553 59 -59 -423 151 -73 -184 36 231 -277 40 -11 -35 185 121 -1 -55 -225 -402 -25 20 71 -39 -12 204
3576 204 71 -213 -116 -259 -174 -153 -126 75 -51 393 76 86 46 178 -268 67 75 95 -159 301 127 139 -144
3599 -144 -70 270 55 101 -307 70 -153 -131 -118 68 113 160 -263 68 -197 -157 55 75 84 -146 23 10 -17 -130
$$ packed form
3436A79j5k26o2K5m9P3k20K52Q4k53L74k00K15k78L1J99J4j94O5p7J43j97Q3P2
3460C8j93k11J66N4J72J84l4j96J80k53L53j38j50O7K1J04k12J54k61m1L60l29
3482a65J75K16p0J13l83L3K09k15J23j00J57l8K2J07j13O0K4j22J14j58%K25Q7
3505C01k40j60K47j4l39K08l6J63n9j42L13r7K9M9q1k39J39Q7l3k48J58K7o0q6
3529a13K24o6p0K65k08j33Q6l49M76p3j30P1K9k17K74K1m43L03m9J75Q6R2p4j18
3553E9j18l64N74k24j11K20J95n08L17n1k4K20o4j22n4j70j77L77M5N1j10K7K16
3576B04j33k84R7j43Q5K1K7K01j26M44l17J0m0J32m46L35QK0k54M60j74J2k83
3599a44P4L40k15M6m08L77k23K2J3J86M5M7m23L31k65M0K12K0Rk30J69j3k7j13
$$ plain form
3623 -130 -36 -291 -61 -12 27 -214 193 20 84 -189 211 -247 -229 236 -8 14 -67 -338 180 109 376 -14 -172
3646 -172 -136 149 40 293 -7 -40 134 -238 91 183 305 22 251 49 -143 -94 158 87 46 156 73 43 -55
3669 -55 -29 174 -86 212 -16 242 211 378 64 177 -58 -221 -186 -72 -157 -106 -315 56 -218 9 -108 38
3691 38 99 -218 -61 -194 185 -31 31 -86 -41 -56 -52 -54 -79 169 44 54 -339 -56 -211 -135 65 -54 -138 -64 -145
3716 -145 102 -322 202 227 -48 138 181 -288 173 -325 -55 145 -21 -155 -128 -481 34 29 102 -61 86 -89
3738 -89 -124 199 -65 -7 62 261 -130 -102 157 26 327 -43 -199 77 -138 114 -76 23 -180 28 -53 336
3760 336 -235 -154 -148 -57 -71 -61 -133 43 -85 241 32 -8 251 -110 -96 184 -44 -47 34 -74 65 60 -18 222 180
3785 180 262 -172 -377 275 -269 333 41 29 -117 -31 -50 7 -256 -47 53 75 -361 16 222 -170 -247 105
$$ packed form
3623a30R4k55K30M9L9k41M07j73O4k73M00m58J8M65k44K2q1k71N18p1K67l90j58
3646a72L6K85j09K53l00l3J74l72L29R2J22k83K29k02j92M9K52p1m1J10q3l0r8
3669e5K6K03k60K98k28K58l1J67l14J13k35j63L5J14q5N1k09L71k74K27j17J46
3691C8O1l17J57j33L79k16O2j17M5j5Mkk5K48j25J0l93K83j55P6K00j19q4P4q1
3716a45K47m24N24K5k75J86M3m69M61m98K70K00j66j34K7l53N15nP3j63J47j75
3738h9l5L23k64N8O9J99l91K8K59j31L01l70j56K76k15K52j90R9k03K08q1L89
3760C36n71Q1OR1j4J0p2J76j28L26k09m0K59l61J4K80k28lQ1j08J39np8K40m2
3785A80Q2m34k05O52n44O02k92j2j46Q6j9N7k63K09J00K2m36L77K06l92p7L52
$$ plain form
3807 105 84 -83 6 197 -36 -194 -61 -143 -60 15 366 -197 -23 -186 178 -131 329 -104 -18 -32 2 -220 -82
3830 -82 -205 -222 20 262 -217 -114 246 157 -95 -113 69 -78 216 157 139 121 -91 267 -127 33 38 192 -90
3853 -90 -135 88 -89 -75 -72 -50 97 103 151 149 -60 189 -42 271 -240 128 188 271 265 -250 162 64 162 -187 199 96
3879 96 125 -226 -105 -15 157 -239 -100 54 -106 110 -173 -397 -20 166 -247 -61 272 1 -10 155 -128
3900 -128 -11 281 13 -144 36 -17 -104 -98 465 20 108 -61 -177 -229 -101 280 21 41 76 -76 22 117 69 -19
3924 -19 91 13 171 -220 -296 -48 -165 -14 -93 104 -191 -195 -102 125 -4 45 108 -112 -145 -100 -157 -52 -53 -310 -18
3949 -18 -6 -169 159 -326 294 -134 192 -95 238 38 108 74 110 106 -95 -49 -273 32 -365 -38 2 171 -6
3972 -6 -60 -27 73 -3 249 -303 -310 26 52 187 307 16 -283 51 -110 -81 -47 -3 -118 -92 -31 -68 -19 74 -239
$$ packed form
3807A05k1j67Q9J91k33j58J33q2Q3P5L51n63J74j63L64l09M60m33Q6j4L4k22J38
3830h2j23j7K42K42m79J03L60q9k52j8J82j47K94n9j8j8k12L58l94J60NJ54k82
3853i0m5K23j77J4LK2J47OM8kk09K49k31L13n11L68O0Q3on15M12r8R8l49L86j03
3879I6K9l51J21R0J72l96J39J54j60K16k83k24L77J86m13J86L33k71j1J65k83
3900a28J17K92k68j57J80n3q7ON63m45Q8j69j16n2J28L81k59K0L5j52R8R5m8q8
3924a9J10p8J58l91p6K48j17J51p9J97k95mR3K27j29M9O3k20l3M5n7J05jk57K92
3949a8J2j63L28m85O20m28L26k87L33k00P0l4L6mk01M6k24L05l97L27M0J69j77
3972fn4L3J00p6K52n52pL36K6J35J20k91k99L34j61K9L4M4j15K6O1l7M9R3l13
$$ plain form
3997 -239 -153 28 -88 -88 26 -341 183 200 136 -196 -75 88 80 46 167 52 -524 319 324 193 99 110 26 319
4021 319 -16 -107 -270 41 42 -97 -41 10 -9 27 156 -105 -399 -121 -37 -228 216 -83 -289 131 58 -145 -59
4044 -59 -71 399 -8 -305 -139 -157 -54 -40 -227 196 150 -220 -93 -86 37 -66 -27 -270 266 74 331 136 178
4067 178 30 -74 394 136 20 206 77 -123 -68 157 52 -130 33 34 114 -73 119 124 120 -65 -83 5 -247
4090 -247 51 166 1 -133 314 -196 96 34 150 -131 169 90 22 203 -84 66 -167 -303 -9 -26 -66 -170
4112 -170 13 10 74 58 -85 -112 -49 12 -160 -126 -187 96 -39 -326 -196 149 -139 103 291 87 168 -72 58
4135 58 69 34 133 48 28 -103 -97 -60 -32 2 -29 75 -216 -51 101 -92 -307 174 -238 -27 75 97 57 -36 89
4160 89 -7 139 -75 -256 -160 -2 109 99 24 74 218 -158 -162 55 124 335 151 -5 158 -112 -97 108 131 105
$$ packed form
3997b39Q6J81j16%J14l67N24J7o4l32J21J63ql4J21j15n76Q43Nj31r4J1q4K93
4021C19l35r1j63L11Jj39N6N1j9L6J29k61k94K78Q4j91M44k99k06M20p3k03Q6
4044e9j2M70m07k97J66j8J03J4j87M23m6l70J27PJ23j03L9k43N36j92K57j95M2
4067A78j48j04M68k58j16J86j29k00N5K25j05j82J63JQ0j87J92Nmj85j8Q8k52
4090b47K98J15j65j34M47n10K92o2J16k81L00p9o8J81k87J50k33j36K94j7m0j04
4112a70J83lO4j6j43k7O3O1j72L4o1K83j35k87J30L45k88K42J88k04Q1k40J30
4135E8J1l5R9q5k0j31OL7K8L4l1J04k91J65J52j93k15M81m12K11J02K2m0r3J25
4160H9r6J46k14j81R6J58J11j0p5N0J44l76mK17O9K11j84j56J63k70J5K05K3k6
$$ plain form
4184 105 316 -63 87 98 -114 -46 18 19 -78 -151 -340 48 -174 -53 192 123 -99 79 -241 -205 111 -307 125
4207 125 -34 32 36 -32 -11 141 198 -15 47 75 100 270 171 53 31 -393 -31 12 -69 292 325 217 238 -72 116
4232 116 152 172 -17 -482 -190 -267 81 -106 36 -43 3 -142 39 -18 153 265 78 -38 -145 -123 -46 42 392
4255 392 -139 230 -228 141 -25 -95 -85 170 -82 59 -93 120 5 -25 30 -105 22 -74 -3 -28 18 218 -74
4278 -74 182 -151 52 -111 -4 327 34 115 123 -94 -72 11 -79 31 308 -30 -83 -126 108 13 -38 -119 -162 237
4302 237 252 -181 152 17 93 10 -35 89 44 332 -99 60 30 172 83 -46 -6 -71 180 172 -102 -95 10 120
4326 120 69 -122 -113 -40 97 -2 -120 -67 -221 172 25 117 179 -153 -20 -160 -228 87 -48 140 157 -254 247
4349 247 263 115 15 139 178 -18 85 139 -16 -125 292 -117 -88 34 103 36 -177 61 119 40 1 14 191
$$ packed form
4184A05K11l79J50J1k12O8O4Jr7p3j89L88k22J21K45o9k22J78l20L6L16m18M32
4207A25j59O6Mo8K1J52N7k13O2K8K5J70r9j18k2m24L62M3q1L61L3j08K1l10J88
4232A16L6K0j89m65K92p7L48j87J42p9M6j45J81n7J71J12j87j16j07K2P7Q8L50
4255C92n31L69m58L69j66p0J0K55k52J41j52K13j15l0N5j35J27r6P1k5M6K00k92
4278g4K56l33K03j63J07L31k93Q1Qk17K2Q3r0J10K77l38n3m3K34r5n1q1m3L99
4302B37J5m33L33j35P6q3m5J24m5K88m31J59l0J42q9j29M0o5K51qk74PJ05J10
4326A20n1j91RP3J37r9j18N3j54L93j47R2O2l32J33j40o8L15j35J88J7m11N01
4349B47J6j48j00J24L9j96J03N4j55j09M17m09K9J22O9o7k13K38N8p9l9J3J77
$$ plain form
4372 191 166 -172 -380 97 160 -225 -36 -264 146 -147 -121 14 -117 228 134 -167 116 169 178 143 341 86 34
4395 34 221 -180 47 171 -78 257 -54 -158 -144 182 20 -116 -10 137 -56 -241 48 -43 105 223 360
4416 360 -81 -153 -54 310 -47 -59 99 233 101 -252 118 9 41 -303 -9 284 4 -13 13 188 142 5
4438 5 223 -157 162 -130 -76 39 10 -40 158 82 225 -162 -57 189 -242 -280 -41 305 136 280 -100 7
4460 7 -132 -145 -174 344 133 258 99 23 55 180 124 224 24 -335 99 284 -157 269 -52 90 305 114
4482 114 -29 -134 338 -183 -131 5 19 -251 40 134 -31 238 29 67 -191 -261 39 -46 65 115 19 284 38
4505 38 -40 26 -155 -40 157 -119 90 140 133 311 -47 -175 -316 144 139 97 12 -65 -146 93 263 -10 -114 1
4529 1 -331 37 -84 -137 170 -141 87 91 -165 46 259 5 -213 172 -85 152 -254 140 67 289 -25 -137
$$ packed form
4372A91k5l38k08M77O3l85J89k28M10k93K6J35j31L45r4l01K83N3Rl5J98k55n2
4395C4J87m01K27J24k49L35l11j04J4L26j62j36J06J47j93j85K89r1J48J18J37
4416C60m41p2R9L64l57j2J58J34j32l53L70j09L2l44K94K93k80j7K6J75m6j37
4438EK18l80L19k92N4J15k9n0J98p6J43l87J05K46m31l8K39L46j69J44l80J07
4460Gj39j3k9N18k11J25j59p6L2J25n6J00k00l59M34J85m41M26l21J42K15j91
4482A14j43j05M72n21N2J36J4k70K91R4j65K69k09L8k58p0L00q5J11N0r6K65k46
4505C8p8O6j81J15J97k76K09N0pJ78l58j28j41M60nm2q5p7q1K39J70k73j04J15
4529Al32L68j21n3L07l11K28Mk56K11K13k54k18L85k57K37m06L94p3K22l14j12
$$ plain form
4551 -137 -47 -80 12 127 29 177 130 -223 166 77 277 366 196 1 29 -2 0 -148 329 129 36 158 96 -75
4575 -75 132 -83 -141 63 -35 -49 67 34 242 -175 -216 40 110 -244 50 205 268 128 -219 -3 83 50 -33 -15
4599 -15 72 144 -206 118 42 -290 -64 -107 -92 174 231 -52 212 -130 135 246 -89 106 120 74 15 -60 -154 50
4623 50 -38 62 -100 -55 -76 -153 270 -149 -212 -15 -94 164 108 -263 66 -50 50 -4 -217 157 17 -111 71
4646 71 302 -140 -130 279 -241 -173 -425 1 77 218 52 104 43 -33 13 -83 48 191 14 -17 -131 215 -70
4669 -70 47 66 37 160 -80 -57 155 -318 245 -205 -86 -157 281 59 -48 331 -18 56 28 332 -173 130
4691 130 106 142 264 189 -70 -266 74 -8 59 427 84 -79 228 -16 185 109 38 -89 275 515 -198 -26
4713 -26 -72 -193 205 -280 -49 -120 134 -225 -173 -54 232 254 135 288 -112 101 -145 99 443 6 326 74
$$ packed form
4551a37R0l3R2J15r8J48m7l53L89q9K00Q9j70j95K8l1Kj48M77k00r3J22o2j71
4575g5K07k15n8K04r8j4J16l3K08m17m1K56P0l54K94J55O3j40l47K16Q6l3q3J8
4599a5Q7P2l50L24p6l32K26m3J5K66N7k83K64l42K65J11l35J95J4m6n9p5r4K04
4623E0q8J00j62M5k1p7M23m19o3J97p9K58n6l71L29j16J00n4k13L74j40j28J82
4646G1K31m42J0M09n20O8k52M26P6J41j66N2o1p6M6r6J31J43j77l1j14L46k85
4669g0J17J9k9J23k40K3K12m73N63m50J19p1M38k22j07L79l49P4k8L04n05L03
4691A30k4L6J22p5k59j96L40q2O7L68l43j63L07k44K01p6p1j27L64K40p13J72
4713b6m6j21L98m85K31p1K54l59N2J19K86K2j19J53m00K13k46K44L44m37L20k52
$$ plain form
4735 74 114 -218 -91 18 163 162 -241 1 45 24 53 -192 76 -51 -89 -312 163 -186 81 87 -120 -165 -48 33
4759 33 96 92 156 -17 -111 229 0 67 84 -368 -7 4 215 311 -178 147 -238 138 92 65 -41 -45 -143 169 244
4784 244 67 134 227 49 375 99 110 -232 7 -278 -87 61 -101 -6 134 -30 -140 -117 82 307 66 81
4806 81 132 27 -9 277 331 60 -106 -95 -178 -144 -198 -122 135 -11 -32 -11 8 105 234 93 -290 -53 189 146 87
4831 87 -322 72 1 44 120 85 58 6 -26 187 283 285 -170 -27 95 215 -283 -58 158 217 31 106 -13 -115
4855 -115 106 160 -438 6 73 47 74 190 -46 -295 -39 -124 7 319 15 -45 -95 -50 48 -122 132 -120 -213
4878 -213 -2 -285 -238 151 -449 106 67 -239 -33 257 104 -18 -342 -337 152 -74 -133 111 240 130 -269 -124
4900 -124 274 66 -133 -26 -218 96 33 -218 350 -158 -227 0 112 279 292 102 136 -68 -158 19 -18 119
$$ packed form
4735G4M0l32J27J09J45jm03K42M4k1K9k45K68j27l8k23M75l49K67Ok07m5J17Q1
4759C3O3mO4j73r4L40k29O7J7m52L61J1K11R6m89L25l85L76m6k7j06mr8L12P5
4784B44j77O7R3j78L26k76J1l42K39k85J91J48j62R5J40j64j10K3J99K25k41J5
4806H1N1j05l6K86N4k71j66J1q3L4n4P6K57j46k1K1J9R7J29j41l83K37K42m3n9
4831H7m09L94p1M3P6l5k7n2l2K13R6Km55J43J22J20m98K25K16N9j86P5j19j02
4855a15K21N4n98M44O7k6K7J16k36k49K56q5J31L12l04o0n0M5R8j70K54k52r3
4878b13K11k83M7L89o00N55l9l06K06K90j53j22l24NM89k26n9K44J29j10l99J45
4900a24L98k08j99J07j92L14o3k51N68n08o9K27J12J67J3j90L4k04r0J77l7J37
$$ plain form
4922 119 17 50 67 -62 88 244 259 76 -225 182 100 41 -107 -51 -306 55 28 281 12 159 4 119
4944 119 26 145 -44 26 277 100 397 -170 -89 277 -132 19 254 381 48 -226 -83 61 286 -183 -236
4965 -236 -255 -262 265 118 -115 -15 -250 176 58 7 -51 134 166 141 -225 -45 3 98 233 -21 -12 -89 230 -146
4989 -146 -210 67 -92 -92 216 -59 -37 -72 55 142 -242 143 -268 8 -75 -38 176 148 108 27 -48 -322 317 -192
5013 -192 -237 -40 -492 15 13 -1 22 31 -2 150 218 -51 -22 94 16 -54 11 -33 285 -57 -186 102 -100 -64 215
5038 215 -75 125 36 -27 197 77 124 123 -260 -133 123 122 62 122 -11 -151 -133 -170 79 261 114 42 119 -48
5062 -48 118 121 191 -338 -13 127 90 -67 -73 -11 20 -15 211 34 -260 190 142 329 63 74 56 -152 -179 -2 -344
5087 -344 359 16 188 -290 -67 311 123 69 -158 6 140 -4 -37 -165 -311 -30 -8 -55 69 -70 163
$$ packed form
4922A19j02L3J7j29J50J56J5j83l01M07q2n9j48N6k55L61k7K53k69J47j55J15
4944A19r3J19j89P0K51j77K97n67Q1L66m09J51K35J27l33k74J43J44K25m69n3
4965b36j9pN27j47k33J00k35M26j18n1n8J85L2k5l66J80M8R5J35k54Rp7L19l76
4989a46o4K77j59%L08k75K2l5J27Q7l84L85m11K76q3L7K14k8m0q1p5k74O39n09
5013a92m5J97m52N07kj4K3Rl3J52O8k69K9J16p8p0O5m4L18l42j29K88k02L6K79
5038B15k90K00q9o3K24j20M7jl83J27K56jo0O0j33j40J8l7K49J82j47p2P7j67
5062d8J66LP0n29L25J40l7j57oO2L1l5K26j77k94M50m8J87k66J1j8k08k7J77l42
5087c44P03l43J72m78K23L78j88n4k27J64J34j44l3j28j46K81K2m7J24j39K33
$$ plain form
5108 163 13 -63 -140 180 290 -89 -167 -27 141 58 86 -208 177 169 222 278 -71 -218 1 -158 50 -29 -123 281
5132 281 -52 -63 124 -102 -135 255 -407 209 -279 21 -6 -213 -206 74 -15 47 15 10 -261 -251 109 -242 -50 108
5156 108 110 -68 -17 -100 106 -66 -316 -250 -166 -4 204 -210 221 92 83 -55 -84 -19 -6 -42 -56 -188 -220 -164 -150
5181 -150 -55 77 -78 -228 148 190 -67 50 116 127 -40 -69 93 47 -321 -60 103 114 -185 118 -97 -250
5203 -250 -80 -164 -214 28 74 -93 -106 -258 -155 -195 -208 -209 135 -244 -50 371 77 -83 86 -288 -34 190 -36
5226 -36 7 -87 -98 -191 -17 10 154 32 58 93 78 -29 -39 91 62 -159 274 -33 63 150 -32 -6 66 110 -135
5251 -135 -95 105 108 198 259 75 -88 -10 -32 279 -192 279 250 -18 145 -189 -49 -143 -38 -289 -73 149 168
5274 168 62 117 -217 65 -217 -72 210 -310 -102 -228 2 -316 -129 59 -141 -18 121 -110 143 -9
$$ packed form
5108A63j50p6p7L20J10l79p8J40J68q3K8k94L85qN3N6l49j47K19j59K08p9r4M04
5132B81l33j1J87k26l3L90o62O16m88L00k7k07PK80q9O2l2nk71J0L60l51J92J58
5156A08Kj78N1q3K06j72k50O6Q4J62K08m14M31j29rj38k9O5J3l6j4j32l2N6J4
5181a50R5J32j55j50L76M2k57J17O6J1j67k9J62m6l68K61J63J1k99L03k15j53
5203b50J70q4n0K42M6j67j3j52J03m0j3jL44l79J94M21k94j60J69l74K54K24k26
5226c6M3r4j1r3J74K7J44j22K6L5j5j07j0J30k9k21M33l07R6Q7j82K6P2M4k45
5251a35M0K00LR0O1j84j63P8k2L11m71M71k9k68J63l34J40r4J05k51K16K22J9
5274A68j06N5l34K82k82J45K82n20K08j26K30l18J87J88k00J23J39k31K53j52
$$ plain form
5294 -9 250 35 58 -188 151 227 85 139 5 -5 154 -56 291 -271 -108 -184 -55 63 -173 -12 -233 59
5316 59 84 -169 117 -153 -48 -121 -12 -11 -127 108 147 62 48 50 -186 321 -179 106 225 204 -245 -127 -199 38
5340 38 136 -95 224 -152 310 -56 -71 -72 241 192 102 35 51 139 74 -201 -216 -77 80 -2 86 132 88 142 88 112
5366 112 -358 -47 -60 44 87 -117 -74 -293 -32 -90 92 -186 -339 27 -87 -140 -80 -222 18 -48 -5 -65 132
5389 132 135 -167 85 114 -52 -208 58 17 105 101 -71 -168 249 -116 101 129 -54 164 184 -240 214 -24 114
5412 114 148 111 -312 -73 228 316 71 -258 -207 -200 -42 -219 -68 -56 125 -142 125 -66 58 177 -225 104
5434 104 398 14 54 310 407 155 -62 140 155 288 -160 153 -132 -246 -129 -163 -245 -32 -56 306 -200 -143
5456 -143 178 173 47 167 -90 150 159 -147 126 -291 98 -119 -213 -377 -142 -213 164 225 67 31 -59 -82 -118 32
$$ packed form
5294iK59k15K3k46L39P6j42N4j34j0J59k10L47n62J63p6J29J18k36J61k21K92
5316E9K5k53K86k70J05p3J09Jj16K35L9q5j4Kk36N07n00K85J19k1m49J18p2K37
5340C8R8k31L19l76M62l66j5jL13m9r0o7J6Q8o5k75j5J39J57q2Q8M6m4N4n4K4
5366A12m70L11j3J04M3k04M3k19K61n8J82k78j53L66j14n3O0j42K40o6M3o0J97
5389A32Ll02K52K9j66j56K66m1Q8mj72r7M17l65K17K8j83K18K0m24M54k38J38
5412A14L4l7m23K39L01Q8k45l29N1PJ58j77J51J2J81k67K67j91J24J19m02L29
5434A04K94l84M0K56R7k52k17K02J5J33m48L13k85j14J17l4q2K13k4L62n06N7
5456a43L21nj26J20k57K40Rl06K73m17L89k17r4j64K35p1L77O1j58l6r0k3l6J50
$$ plain form
5480 32 242 -15 64 62 2 133 1 -156 35 -292 -119 29 -254 12 -122 -235 -73 9 12 179 -67 -141 54
5503 54 134 127 -39 -109 -69 241 -90 114 54 314 175 118 133 7 -33 -280 -324 351 -10 155 -41 -39 -152 -357
5527 -357 -251 70 35 -65 5 -163 229 -30 254 55 -73 70 81 110 -87 19 79 -114 237 -192 -345 31
5549 31 111 -252 -71 160 49 -113 -10 -28 33 -137 -29 20 114 71 -124 184 -126 117 -110 290 -159 -219 54
5572 54 -12 209 -91 -51 -286 26 -157 -10 292 212 174 -11 -117 -47 31 -141 170 -178 63 293 -61 83
5594 83 8 -93 -9 -138 318 -132 -37 -20 203 -96 -23 84 52 -13 31 -253 1 -158 -277 -179 -111 -57 210 66
5618 66 -184 212 61 -78 225 -284 132 -6 169 3 176 40 -137 355 330 -104 108 112 -17 0 -319 62
5640 62 -324 -268 -127 22 -211 235 -160 -398 -50 226 238 19 -14 -41 201 -266 -159 129 80 -127 16 -14
$$ packed form
5480C2K10k57P9ko0J31j32j57J91l27J73J48k83K66j34j13J62Q2LJ67k46p4J95
5503E4Q0pj66p0M0L10l31K04o0K60j39n7J5j26m0k47m4O75l61J65j96Kj13k05
5527c57J06L21l5j00P0j68L92k59K84j99j28J43J1K9j97J06O0j93L51m29j53L76
5549C1Q0l63J81K31j11j62J03j8O1j70J08M9R4m3j95L08l10K43k27M00m49o0K73
5572E4o6K21l00M0k35L12j83J47L02q0l8j85j06P0P8j72L11l48K41K30l54J44
5594H3p5j01Q4j29M56m50R5J7K23k99P3J07l2o5M4k84K54j59j19R8O8N4K67j44
5618F6k50L96j51j39L03n09M16j38J75j66J73j36j77M92k5m34K12Mj29J7l19L81
5640F2l86N6J41J49k33M46l95k38L48K76J2k19l3k7K42m67J07K88m9k07J43l0
$$ plain form
5662 -14 170 6 -93 38 228 -135 83 265 154 -29 94 -188 -59 91 -130 -35 73 -17 -269 -29 27 -9
5684 -9 119 -9 64 197 -121 286 4 226 153 -9 227 235 132 -127 89 -148 -26 224 39 301 -78 -68
5706 -68 82 -111 -37 226 -28 116 7 -155 -120 -250 -96 -173 38 146 185 -69 -8 59 51 -122 -65 142 -117
5729 -117 267 -161 77 -329 -24 185 57 -210 -197 3 -101 25 -25 42 -141 53 -70 -187 39 75 194
5750 194 -65 -419 -166 -76 -64 136 -49 131 -452 -126 -148 -332 -154 -118 119 143 40 -88 274 150 -153 -262
5772 -262 -111 -75 35 -125 92 4 -323 -209 224 126 -163 100 45 -103 60 182 112 -164 -27 -311 57 314
5794 314 61 -23 -16 160 288 -207 43 -121 -242 -76 -116 142 -63 121 102 143 -14 -72 2 55 82 34 -15 214
5818 214 112 68 215 -55 25 174 195 218 -66 363 6 156 267 -179 -81 9 -220 -263 -7 -92 -216 248 97
$$ packed form
5662a4J84j64r9J31J90l63K18J82j11j83J23k82J29J50k21R5J08r0k52K40N6l6
5684iJ28j28P3J33l18M07k82K22p3j62K36Qj03k59K16k37J22K50j85K62l79J0
5706f8J50j93P4K63k54J44j09j62L5j30J54p7K11J08L9k54O1O7qj73N7K07k59
5729a17L84m28K38m06L05K09j28k67J3K00j04J26n0O7j83J94j23j17K26L6J19
5750A94k59l54K53R0J2K00j85J80n83L26k2j84J78L6K37K4j03j28L62j24l03j09
5772b62J51L6J10j60K17q8l27J14M33r8k89K63n5j48J63J22p0k76J37k84L68K57
5794C14k53q4PJ76J28m95K50j64j21J66m0K58k05J84j9M1j57n8P4N3K7m8m9K29
5818B14j02m4J47k70Q0J49K1K3k84M29l57J50J11m46R8R0k29m3K56q5j24M64j51
$$ plain form
5841 97 136 -308 1 -73 -31 147 74 -7 -170 3 -162 34 -96 113 -133 358 174 104 77 82 -100 178 63
5864 63 -186 -221 43 113 -150 -52 104 62 -58 174 15 40 -110 -123 33 -3 65 142 20 -66 214 275 68 193
5888 193 -194 -132 -111 -43 53 -176 69 -25 14 43 -232 285 189 -261 213 -63 26 -93 294 4 -64 192 99 -182
5912 -182 183 0 49 325 12 -4 -295 -96 -252 -24 -9 32 87 -43 119 159 -115 -110 89 340 84 -93 -73
5935 -73 -211 317 -146 -83 77 39 -145 -274 -32 -135 -369 -354 342 186 -3 -85 -65 -165 43 -31 -197 66
5957 66 247 1 288 -48 -186 -58 -158 -60 -325 34 14 151 -72 257 -210 121 -52 89 33 -218 -37
5978 -37 347 176 69 -5 -52 -54 -97 -151 -156 206 59 -31 -243 118 98 75 -187 -301 -257 -9 -47 78 38 5 119
6003 119 -52 -199 -4 -67 -121 -66 67 383 -136 -43 -191 81 46 -113 29 77 -146 -11 -213 -22 -40 163
$$ packed form
5841I7L9m44L09p4M2J78p3q1j63J73j65J96j30K09k46M91j84p0k7Nj82K78j15
5864F3k49l5K64P0k63R8J56m2j20K32j59K5j50j3J56l6O8P7j22q6K80O1k07J25
5888A93l87O2K1O8R6k29K45r4L9K9k75N17r6m50M74k76Q9j19L87k90o8K56r3k81
5912a82L65j83M9K76l13j6k91J99j56K28J5M1N5j30J62M0k74NJ99K51k56j77K0
5935g3j38N28m63O3J60l8j84j29K42j03k34J5O96j56j89q2K0j00K08p4j66K63
5957F6J81k46K87l36j38J28j00R8k65L59k0J37k23L29m67L31j73J41n6k51J81
5978c7L84j71j07p4m7km3n4nL62j47r0k12L61k0k3k62j14M4K48l8J25m0l3J14
6003A19j71j47J95o3n4N5J33L16n19R3j48K72l5j59J42M8k23J35k02J91j8K03
$$ plain form
6025 163 111 277 -107 -54 -161 -142 -85 140 244 117 69 -137 -54 -62 -165 0 -10 -82 199 -176 -89 146 119 -17
6049 -17 -104 265 -122 352 120 -9 -91 -89 157 157 26 -292 239 179 16 -157 -148 255 114 -50 133 70 -176 -187
6073 -187 -275 -52 117 -108 -52 -248 87 172 126 -211 109 -18 -354 231 81 -189 221 48 133 26 -6 357
6095 357 -65 -22 -9 -43 91 -1 -244 -10 -137 -86 -2 -243 294 -128 -71 65 -299 54 -45 -218 274 143 179
6118 179 132 255 -159 -3 -227 19 77 4 -137 -62 -153 -109 128 13 426 54 82 24 194 -268 -51 -130 60
6141 60 96 -297 110 181 -85 -69 193 -301 -72 51 -40 -208 -95 -120 -97 207 119 311 -33 -163 84 -168 -159
6164 -159 21 -1 22 -21 -138 319 -107 115 -40 18 238 67 -493 163 -54 -68 366 17 -110 -99 332 47
6186 47 -20 256 -271 167 132 12 75 59 91 206 -89 -181 -261 -291 262 -145 -50 63 47 -64 -190 -184 -47 76
$$ packed form
6025A63n2J66l84N3j07J9N7K25J04j27m8k06Q3qj03J65j0p2K81l75Q7K35k7j36
6049a7q7L69l87M74k32j29q2KK46%j31l18N31o0j63j73RM03j41j64J83o3k46j1
6073a87q8K23J69k25N6j96L35Q5m6l37L20j27l36N85j50k70M10j73Q5j07l2L63
6095C57m22M3J3l4J34r2k43K34j27N1Q4k41N37m22N7J36l64L53r9j73M92j31L6
6118A79m7J23m14J56k24K46N8p3j41P5r1M4K37j15M13l72K8n8J70m62K17p9J90
6141F0L6l93M07P1k66J6K62m94K29J23r1j68J13k5K3L04q8J92l44j30K47k52R
6164a59J80k2K3m3j17M57m26K22j55N8K20j71n60O56k17j4M34l49j27J1M31k85
6186D7o7K76n27M38l5j20O3j6L2J15k95r2q0l0N53m07R5J13j6j11j26OJ37J23
$$ plain form
6210 76 -197 -46 193 122 -124 21 -34 -103 -50 43 -217 29 -19 75 95 60 4 -49 -229 -445 -133 50 -136 -14
6234 -14 -202 -130 211 48 -157 217 136 63 -262 56 -63 -86 -159 -35 463 110 -84 -45 98 -16 11 -5 87
6257 87 -171 43 53 -87 -30 13 81 -92 -92 -133 -448 -20 -215 -282 142 235 33 297 -324 209 230 -30 -276 -83
6281 -83 -51 379 71 41 -238 57 267 -183 82 -159 50 107 249 115 65 -80 -43 -22 43 30 194 -83 -126
6304 -126 -138 -215 -74 175 37 155 -163 128 31 -1 -88 77 -78 5 -146 95 201 16 187 192 -25 -199 -89
6327 -89 -6 -115 148 -21 -82 -84 -119 -24 -10 -125 -69 90 274 154 -149 85 -130 224 327 -186 37 69 230
6350 230 49 173 -187 94 -162 251 221 198 -52 -4 -34 22 -30 321 3 287 110 22 162 72 31 172 57
6373 57 112 -47 -20 -129 -95 413 -201 -34 44 -174 -64 -23 -91 64 -281 -9 -144 -37 210 -283 105 -68
$$ packed form
6210G6k73J51K39p1k46J45n5o9N3R3k60K46m8R4K0l5n6n3j80k16L12J83j86J22
6234a4j88P2L41j63k05L74q1p3l25L18j19k3p3J24M98l53j94L9J43j14K7j6R2
6257H7k58K14J0j40N7M3O8j73%m1l15M28j95o7M24R3k02K64o21N33K1k60k46J93
6281h3L2M30l08l0k79K95K10m50K65k41K09N7J42j34n0j45L7K1O5j3J64k77m3
6304a26j2p7J41K49j38J18l18K91r7l2q7J65j55Q3j51K41J06j85J71Nk17j74J10
6327h9Q3j09K63j69o1kl5R5J4j15N6J59J84j20l03K34k15L54J03n13K23L2J61
6350B30j81J24l60K81k56M13l0k3k50M8l0N6n2L51l18K84j77q8J40r0m1J41j15
6373E7N5j59K7j09L4N08o14J67P8k18J10M1o8J55l45K72j35J07K47m93L88j73
$$ plain form
6395 -68 48 -43 -262 160 126 -43 -220 -220 -222 236 74 -202 -66 -245 -275 77 151 -133 -63 86 -153 79 -68
6418 -68 -146 147 -13 23 222 -81 -116 60 -39 -73 138 69 93 106 -178 73 -121 -216 113 -38 -12 316 20 -48
6442 -48 -90 50 60 -85 -335 -225 -194 47 156 153 164 -45 -144 125 17 162 -226 326 -51 -182 -146 -104 16
6465 16 -23 123 352 65 -104 -136 -158 264 248 -130 -150 113 118 -2 -32 -15 -204 -27 -84 174 -17 175 104 110 -99
6490 -99 -122 402 143 32 73 -293 116 148 -37 -88 -40 272 195 167 -121 -231 -165 21 15 129 43 -180 -303 -1
6514 -1 1 198 -59 -167 -107 -184 -125 -50 -78 24 -56 -18 -36 -260 51 -135 433 -38 -306 75 -102 -183 20 76 285
6539 285 -137 192 148 5 -8 128 213 151 -163 332 188 -46 167 -249 141 -83 290 -221 -165 30 -125 231
6561 231 53 -204 -11 62 376 8 249 -5 -106 -9 -259 -103 240 -244 -178 -140 1 228 166 -53 -88 -23
$$ packed form
6395f8J16r1k19M22l4j69j77%kM58j62k76J36j79l0L52P4k84P0J49k39K32j47
6418f8p8K93j60L6J99l03l5J76r9l4K11o9K4J3k84K51j94r5L29j51K6L28k96o8
6442d8m2J40J0j45k50J10L1K41J09lJ1k09r9K69j08J45l88N52l77j31L6M2J20
6465A6l9J46K29k87j69l2k2M22j6l78k0K63Nj20l0J7j89J77n7K58j91J92p1Ok09
6490i9k3N24k59j11M1l66M09L2j85n1M8L12p7k8k88j10O6J86oJ14q6k23j23L02
6514aKJ97k57j08O0p7N9P5k8J02q0L8j8k24L11j86N68m71k68L81j77q1K03N6K09
6539B85m22L29m4j43j3J36Q5o2l14M95j44k34K13m16L90k24L73n11N6J95j55L56
6561B31j78k57J93P3L14l68K41k54j01R7k50J56L43m84O6L8J41K27o2k19l5O5
$$ plain form
6583 -23 -26 38 -150 -202 182 -177 -43 -124 134 29 84 152 284 -83 -29 -124 -169 -157 -65 -204 -37 369 184 -32
6607 -32 -140 155 -287 99 -138 -97 290 -251 45 356 -37 7 266 251 -96 107 -135 133 -2 139 58 96
6629 96 -104 23 19 41 224 5 -213 -66 97 48 -231 58 -57 -111 86 -70 -34 -160 -4 62 276 -31 -36
6652 -36 -221 167 -538 144 -42 -106 128 31 28 -56 251 -170 -230 101 -118 3 -102 175 264 -184 -32 -111 170
6675 170 -43 58 -16 2 -196 313 -63 181 -259 -27 85 -192 -128 -214 -5 -350 370 -188 -10 -117 -123 2
6697 2 -59 -81 -231 -123 44 -79 -256 -281 -36 80 147 224 -279 -71 -120 -45 -355 264 -31 276 -269 -38 108
6720 108 50 -184 125 70 -56 1 177 222 -427 173 138 -264 -173 -59 -4 -237 -72 -27 -123 -2 -21 -5 -162 -33
6744 -33 107 238 62 -355 136 -228 -125 94 27 -6 -17 12 60 192 -19 -129 -48 61 97 -177 26 76 -71
$$ packed form
6583b3lO4j88n2L84l59J34q1K58j05N5O8J32l67N4r5m5J2R2j39J67M06j85k16
6607c2j08K95m42L86k37M1L87n41K96L11l93M4K59j5l47K03k42K68j35J41q1L8
6629I6k00J27mK2J83k19k18J47J63m9k79K89j15n4J97j56L6j26J56O6K14l07n
6652c6j85L88p05O82j86o4K34r7lq4L07m21o0L31k19J21j05K77Q9m48J52p9K81
6675A70k13J01p4J8j98N09l76K44m40K32J12k77O4q6K09l45P20n58J78j07oJ25
6697Bo1k2j50J08J67j23j77k5K45J16O7P7n03K08m9P5l10O19k95L07n45K31J46
6720A08n8k34L09n5j26N7J76M5o49O00l5m02R1J14N5k33J65M5r6J21j9J6j57J29
6744c3J40J31j76m17M91l64J03K19o7l3j1K9M8J32k11j10Q1J09L6k74K03N0j47
$$ plain form
6767 -71 321 -188 -125 138 -137 -166 -170 45 -343 -113 421 99 142 -11 16 -4 -73 -112 8 90 35 -138 -185 -16
6791 -16 39 64 -128 -161 -122 92 112 -90 209 124 -245 -147 -26 158 -74 -52 42 266 195 -14 8 103 40 48 84 -74
6817 -74 -184 -138 76 -50 -74 67 -148 47 95 -46 -108 225 367 253 -37 167 -83 -130 -78 -12 -58 33 40 81
6841 81 -169 -52 65 271 -30 -91 24 -39 -78 -392 -6 -14 -268 -14 331 73 -9 200 -201 -446 85 -231
6863 -231 165 -74 -178 -194 64 -148 -55 -56 98 -30 -282 48 -152 144 25 32 -89 -314 206 153 -25 182
6885 182 -99 33 9 -153 -120 17 -163 196 -74 22 36 16 -51 -50 308 -145 -108 -183 -170 157 141 -70 176 164
6909 164 103 116 170 -197 -109 19 77 277 -240 -156 -137 -167 -7 -49 -66 74 242 68 266 -75 -1 -121 -65 6
6933 6 -33 206 -174 -53 157 -154 56 -278 -197 61 -68 8 -155 245 62 106 217 -447 -154 -45 -134 -43 97
$$ packed form
6767g1L92n09O3K63k75k9mK15l88K30N34l22M3j53K7k0o9l9J20Q2n5j73m7J69
6791a6N5K5j92l3L9K14K0k02K99q5l69R8J21J84k32K2R4K24p1k09K2R5o3QL6j58
6817g4j10M6K14j26k4J41k15J95M8j41o2L33J42j14k90K04k50m7N2O6m6R1PM1
6841H1k50J17J17K06l01o1J15o3l9l14L86qk54K54L45k58q2K09m01k45N31l16
6863b31L96k39j04j6K58k12R3jJ54j28k52L30k00K96j19Pj21k25N20n3j78K07
6885A82k81J32k4j62L3J37j80L59k70R6J4k0o7JL58m53L7p5J3L27j6k11K46j2
6909A64o1J3N4l67Q8J28N8K00n17Q4J9l0J60m2j7J40J68j74J98l41P4j20N6P1
6933Fl9K39l80J21K10l11K10l34Q1K58j29P6j63M00j83M4J11o64K93J09q9R1J40
$$ plain form
6956 97 5 173 -21 -156 140 -138 -102 127 245 335 -200 -46 360 88 -204 -80 184 57 228 -126 15
6977 15 -190 -77 351 162 150 72 97 -119 -293 -180 -22 46 28 163 199 120 -127 -69 -152 391 265 -236 -65
7000 -65 43 -17 -249 56 -81 -167 -128 -139 63 60 345 -19 -39 -40 171 111 15 -140 -13 -54 -41 -58 -14 46 -96 -125
7026 -125 -305 156 -84 -57 323 24 -294 -127 83 86 -120 5 345 -109 -205 307 -34 -186 40 -186 93
7047 93 54 197 33 -309 -91 31 162 -210 -41 30 210 -83 -132 -35 19 -56 172 -122 -135 198 257 -179 174
7070 174 -165 133 68 323 -191 33 165 -102 -99 -8 -192 25 141 18 -76 114 -90 -83 232 -85 238 8
7092 8 179 -30 117 -54 -121 128 43 96 -147 45 411 -87 40 -192 -110 139 -192 -14 120 195 -217 7
7114 7 -493 78 96 -13 -9 -27 139 -42 257 -181 -215 68 52 -270 -138 -85 262 101 157 -96 -5 55 273 30
$$ packed form
6956I7r2J68j94j35K96k78L6K29J18R0n35J54M06k72k92J24K64j27J71l54J41
6977A5k05J13M28j89j2p8K5k16j74J13J58O8j8J35L6p9k47N8q3N43j26n01J71
7000f5J08o0k32L05j37q6L9j1K02lK85l64k0jK11o0r6j55J27m1J3j7M4O0j42k9
7026a25j80M61k40K7L80k99l18J67K10Lk06J25L40m54r6N12l41j52K26k26K79
7047I3l9J43j64l42K18J22J31l72J69P1J80k93m9R7N4p5K28k94j3L33N9m36L53
7070A74l39K98o5K55n14K24J32k67LR1j84K17J16j23r4J90k04PL15l17L23k30
7092HJ71k09J47j71o7K49q5N3k43J92L66m98J27k32Q2K49l31J78J34P5m12K24
7114Gn00N71J8j09Mj8J66j81K99m38l4K83j6l22J32N3L47j61N6k53R1O0K18k43
$$ plain form
7138 30 161 172 -39 92 -90 -46 252 -64 -29 -199 -125 7 -73 -80 -238 78 172 -225 -156 -39 202 -4 89 115
7162 115 -350 -60 111 7 103 157 -241 66 -183 198 -93 18 157 166 18 13 126 -106 6 235 181 -4
7184 -4 -195 48 -182 -190 -89 -37 -188 27 -4 24 -169 -46 219 179 4 -24 152 -269 261 38 206 219 -58
7207 -58 -93 236 -117 -70 -19 190 -454 77 -81 5 10 -7 -79 -66 -421 -74 -121 287 127 10 -301 -118 -123 43
7231 43 -148 149 326 -184 109 66 -142 -58 -324 208 -13 20 220 182 193 -199 34 213 -65 64 89 291
7253 291 -277 388 -287 -100 187 -151 -11 99 131 79 22 -72 228 -283 158 -138 19 30 -130 -56 23 -43 -100
7276 -100 106 22 131 -76 -298 -102 -93 -30 -62 0 -110 -71 -90 -284 -134 -115 -111 27 117 -250 103 36 -1 -216 8
7301 8 164 -330 -293 -189 -247 239 -76 -59 260 22 188 56 61 61 147 121 471 79 146 4 -6 128 -119 273
$$ packed form
7138C0J31J1k11J31j82M4K98l16L5j70P4J32q0pj58L16R4l97O9J17K41k06R3K6
7162A15m65K90J71j04R6N4l98L07k49L81k91J11J39Rj48nJ13k32J12K29n4j85
7184dj91K43k30qJ01N2j51K15l1K8j93J23K65m0j75k8J76m21N30k23J68J3k77
7207e8l5L29l53M7N1K09o44N31j58Q6Nj7p2J3l55L47m7M08j60j17l11J83nJ66
7231D3j91K97J77n10K93m3k08Q4k66N32k21L3K00l8J1l92K33J79k78J29K5K02
7253B91n68O65o75J87K87l38J40J10L2n2n7r4L00n11M41k96J57J1j60P4P9o6n7
7276a00K06q4J09k07k22J96RO3l2O2j10L9j9j94J50J9MJ38R0l67L53o7l7k15K24
7301HJ56m94L7J04n8M86l15J7L19k38J66j32N%Q6k6L50l92O7j42j0J34k47L92
$$ plain form
7325 273 116 248 349 132 8 -33 -248 -214 36 -98 -174 65 100 -197 109 -213 149 -182 -206 36 1 87
7347 87 71 -273 -113 -254 -85 -282 44 -79 35 174 -157 11 45 163 12 -85 -303 -141 67 -15 -140 84
7369 84 -386 -220 97 135 -117 -25 218 -295 -24 79 211 102 -207 -214 42 -245 -79 -136 -136 -118 -206 -55 -12 81
7393 81 -265 -66 -104 -32 -175 -75 -37 -108 272 -197 194 189 -252 -130 102 -156 -264 141 49 66 39 0 172 9
7417 9 87 80 -76 -356 104 269 144 -125 106 91 50 55 153 107 -109 -136 137 -6 -236 -64 150 -77 46 34
7441 34 120 98 -139 3 28 215 -230 76 -118 -35 -91 -59 110 61 71 -176 -11 108 -189 -131 -143 9 478 50
7465 50 117 149 -15 -242 -134 3 87 -136 -28 -168 2 -151 -147 -57 -250 250 -256 -27 -6 -142 119 54 60 -131
7489 -131 -138 34 198 -231 -143 -14 -110 -211 -44 143 31 18 -323 215 95 -207 82 -51 -34 -2 -78 -235 -10
$$ packed form
7325B73j57J32J01k17j24m1k15L4K50j34p6K39L5k97L06l22L62l31k4K42l5Q6
7347H7j6l44J60j41J69j97L26j23J14J39l31J68L4J18j51r7k18J62K08q2j25K24
7369H4m70J66L17L8k52R2K43n13K71J03J32j09l09pK56k87J66n7%J8q8J51M3R3
7393H1l46J99l8P2j43J00L8p1L80m69L91nm41J22K32k58j08M05r2J7k7l9J72j63
7417IP8pj56k80M60J65j25k69K31j5m1NR8m6k16k7K73j43k30J72K14k27J23j2
7441C4Q6k2k37J42K5J87m45L06j94Q3n6L2J69m9J0k47J65J19k97N8j2J52M69m28
7465E0O7L2j64k27J08J37Q4k23J08j40J70j53MR0j93N00n06K29K1j36K61o5Oj91
7489a31pJ72J64m29Q8J29r6j01J67J87j12j3l41N38j20l02K89j33J7L2p6j57K25
$$ plain form
7512 -10 121 -36 -387 284 85 -17 89 -95 -81 104 -104 -181 -76 -64 -80 -209 103 98 -88 -99 274 219 57
7535 57 -42 102 -27 237 -49 158 97 261 -273 -196 155 162 -24 115 -126 82 -307 -43 -255 159 -58 -168
7557 -168 -280 -1 86 -210 120 54 -232 172 -18 217 226 -57 -154 -24 -166 -27 237 74 145 -113 2 -3 162
7580 162 -140 183 -147 133 117 -164 -148 285 19 79 211 122 346 180 -128 -292 -206 -91 121 -168 159 -193
7602 -193 -18 33 117 -263 -36 -187 -113 -173 245 120 -36 -41 38 9 -109 -126 -176 164 -248 14 156 65 70 60 355
7627 355 -128 -135 74 -308 -155 -137 -390 -85 18 14 76 -240 -44 -53 432 -6 46 26 -136 6 60 98 -48 46
7651 46 -223 -97 -125 165 -154 58 -125 -62 134 -116 154 -228 -162 55 -13 -101 -169 -285 -15 -26 314 55 -87
7674 -87 184 148 -23 9 214 71 -234 -177 -102 -56 -260 -236 -170 66 102 316 51 -296 119 -158 38 111 271
$$ packed form
7512a0J31j57l51O71j99j02J06j84J4J85k08p7J05J2j6j29L12nj86j1L73n5j62
7535E7r9J44j29K64k86K07o1J64n34P7L51Pj86J39k41K08l89K64k12M14k17j10
7557a68j12K79Q7k96L30o6k86M04j90K35Rk83r7J30j42J39K64j63P1k58J15nJ65
7580A62l02L23l30K80j6k81J6M33k66O0J32q9K24j66l08j64Q6J15K12k89L27l52
7602a93J75N1Q4l80K27j51P4o0M18j25j56nP9k9j18j7n0L40m12K62J42r1Nj0K95
7627C55m83pK09l82J53J8k53L05J03mO2l16J96rM85m38N2k0j62J42N4L8j46R4
7651D6k69J26k8K90l19K12j83O3J96k50K70l82O6K17o8q8o8j16K70j1L40k59j42
7674h7K71l6j71L2K05j43l05N7P5M6k04K4O6K36L6K14k65l47M15k77J96P3J60
$$ plain form
7697 271 12 -281 -122 147 -11 -186 220 -311 75 -11 -15 -7 -216 111 262 -145 95 40 154 17 63 29 -47
7720 -47 -78 -3 -105 -69 57 190 -58 -227 -320 -38 -7 233 -367 12 271 -176 -8 -133 -238 1 54 410
7742 410 -275 20 1 -159 4 30 262 -26 77 -28 -52 9 -276 -254 -87 -83 167 324 53 59 508 -216 -16
7765 -16 -231 148 -24 109 -118 -283 141 -386 -13 -181 111 284 -142 -150 251 125 164 -125 -108 -50 36 -127
7787 -127 147 69 11 89 -147 280 -53 -226 -163 -121 147 47 -120 -188 -142 151 210 203 416 -98 -218 86 2 -166
7811 -166 -25 222 -142 -72 -225 -11 -235 47 103 -119 133 268 118 -76 -134 39 -56 -223 -87 71 161 3
7833 3 -139 -134 -411 -73 175 16 -277 -273 82 53 -130 209 150 -78 -29 -28 -290 282 229 -96 116 149 99 249 -40
7858 -40 175 63 13 -95 -74 -116 -77 169 -314 88 -205 -105 -49 -61 337 -15 95 -268 -215 -63 -221 214 -135
$$ packed form
7697B71k59k93J59K69j58j75M06n31L86q6mQk09L27J51m07K40n5J14j37M6l4p6
7720d7l1P5j02L6J26J33k48j69r3K82L1K40o00L79K59m47J68j25j05K39N3L56
7742D10o85K95j9j60J63K6K32k88J03j05k4O1k85K2J67MK50J57k71OM49p24K00
7765a6k15L79j72J33k27j65M24n27L73j68K92J73m26qM01j26L9k89J7N8Q6j63
7787a27K74p8n8P8k36M27l33j73O3M2K68j00j67o8M6K93N9pK13n14j20L04q4j68
7811a66J41K47l64P0j53K14k24K82N6k22K52J35j50j94n8J73r5j67J36J58R0j58
7833Cj42Nk77L38K48j59k93ML55k9j83L39n9k28M9Jk62N72n3l25K12L3n0J50k89
7858d0K15j12n0j08K1m2L9K46m83M02k93J00N6j2L98l52J10l63N3J52j58M35l49
$$ plain form
7881 -135 177 98 59 200 91 75 165 -259 17 -215 -268 20 111 62 126 -33 -120 82 -72 119 -257 297 -72
7904 -72 40 80 -24 25 -122 -88 77 -73 -129 -57 -16 -40 -152 -112 -179 -158 6 38 -2 219 -42 218 -307 61
7928 61 -63 -277 102 190 102 14 136 -196 116 -193 76 51 153 -35 -137 16 137 49 -24 -58 216 240 69
7951 69 -249 191 150 -449 -78 5 -2 177 -67 85 27 -86 -116 55 -65 -165 148 174 -129 -52 -342 20 -21
7974 -21 -206 -132 -97 33 -354 -232 -130 165 -124 -132 34 149 -88 71 -242 -41 245 120 156 125 -44 -56 332
7997 332 177 -83 -78 54 128 -38 -166 -53 -41 -20 25 -77 3 -4 194 4 2 22 -234 -189 -127 -189 -314 3 -80
8022 -80 -115 -178 332 30 92 14 135 -253 154 122 281 118 143 -11 -42 -30 36 -81 144 54 17 201 -19 45
8046 45 -195 13 53 81 -79 -17 129 7 92 -90 154 -64 160 164 -235 -65 -124 5 -325 -83 -23 183 -119
$$ packed form
7881a35L12p9l9J41j09j6R0m24K76k32n3K88R1m9O4j59q7K02j54J91l76N54l69
7904g2J12M0j04M9j47L4J65j50n6P2M1k4j12M0o7K1J64L2m0K21k61K60n25L68
7928F1j24k14L79Q8q8q8J22l32L12l09K69k5J02j88j02J53J21q8p3l4K74K4j71
7951F9l18M40m1n99L71Q3pJ79k44J52n8j13l0J71j20j00L13K6l03P7k90L62m1
7974b1j85P4L5J30l87J22J02K95k89qJ66J15k37J59l13K01K86j25L6l1j69j2L88
7997C32j55k60NJ32P4j66j28J13J2K1M5j02Q0pJ98j90kK0k56M5O2o2j25L17q3
8022h0l5o3N10l02O2p8J21l88M07l2J59j63K5j54l1J2O6j17K25r0l7J84k20O4
8046D5k40K08M0K8j60O2J46j22Q5j82K44k18K24Ml99J70n9J29l30K42O0K06l02
$$ plain form
8069 -119 -121 -226 48 -76 -54 -303 -39 -50 60 161 13 158 386 149 40 -152 147 -90 -40 -329 -240 152
8091 152 -2 159 -280 25 -140 77 -53 -99 -173 -24 101 69 176 285 61 -167 141 308 15 -99 -94 -227
8113 -227 42 -137 95 -123 70 -25 -170 29 34 -203 182 33 -78 -37 -19 -111 -140 -48 -375 95 77 27 -95
8136 -95 -204 65 206 -7 -334 -67 -183 143 -105 0 63 -10 215 -244 133 108 -8 131 93 -142 156 66
8158 66 -25 -149 -106 139 -159 -242 -139 20 253 211 -106 160 387 -153 -25 64 -23 -181 -158 26 108 -44 80
8181 80 -32 163 64 -56 13 -88 -150 205 342 188
$$ packed form
8069a19kj05K74j24K2k49K64j1J10J01j48J45K28k37j09j92K99k37N0k89Q9L92
8091A52j54J61m39L05j65K17j30m6p4J49J25l2J07J09k24k28L08J67k93j14Nj33
8113b27K69j79K32k18J93r5j45J99Nk37L85j49j11M1J8r2k9R2l27M70j8n0j22
8136i5j09K69J41k13l27K67j16L26k48J05O3p3K25m59L77k5j16J39l8k35K98r0
8158F6r1j24M3K45k98q3J03J59K33m2l17K66K27n40J28Q9q7j58K3J84Q2j52J24
8181H0j12J95r9j20O9j01o2L55J37j54
8191A88
$$ Imaginary data points
##PAGE= N=2
##DATA TABLE= (X++(I..I)), XYDATA
$$ plain form
0 0 0 0 0 0 0 0 0 0 0 8 -8 8 -8 14 -16 17 -24 24 -32 36 -41 49 -56 65 -78 86 -100 112 -126 143 -162 181
32 181 -203 228 -252 283 -314 346 -386 427 -472 524 -578 641 -713 790 -878 980 -1097 1231
50 1231 -1397 1590 -1835 2146 -2557 3134 -4003 5448 -8310 16174 -84288 -286576 -149065
63 -149065 75193 198467 132650 -18053 -161933 -174039 -34783 142260 170876 43951 -105396
74 -105396 -151310 -88721 42902 152838 136866 -24792 -173660 -151676 16079 149188 135654
85 135654 7480 -121329 -149636 -44488 102200 146201 45600 -83875 -121113 -60106 31063
96 31063 96417 93853 7179 -99668 -117177 -19490 93927 114944 36637 -70093 -118506 -61214
108 -61214 59545 125678 63725 -57367 -108943 -55654 30818 75844 61519 2187 -63245 -78476
$$ packed form
0@%%%%%%%%%Qj6J6j6K2l0L3m1M8n6O8p7R0j05J21j43J64j86K12k38K69l05L43
32A81l84M31m80N35n97O60p32Q13q99R96j102J219j354J503j668J858k077K328
50A231k628K987l425L981m703N691p137R451j3758K4484j00462k02288J37511
63a49065K24258J23274o5817j50703j43880j2106J39256J77043K8616j26925j49347
74a05396m5914O2589J31623J09936j5972j61658j48868K1984J67755J33109j3534
85A35654j28174j28809k8307J05148J46688M4001j00601j29475l7238O1007R1169
96C1063O5354k564q6674j06847j7509R7687J13417K1017p8307j06730m8413N7292
108f1214J20759O6133o1953j21092n1576N3289Q6472M5026j4325n9332o5432j5231
$$ plain form
120 -78476 -23070 51875 75723 35867 -30922 -76492 -62136 13860 87494 74451 -16883 -87483
132 -87483 -64631 13817 66658 58211 6290 -49205 -62300 -17838 40474 54656 21978 -18203
144 -18203 -41186 -41128 -8450 43407 61761 13639 -52252 -63628 -13222 43252 57069 22334 -32187
157 -32187 -59574 -28703 29932 53658 21965 -20184 -33325 -23395 -4692 21140 38170 20018
169 20018 -22916 -45088 -23422 17185 41727 31897 -7695 -46669 -41822 8645 49621 34463
181 34463 -13246 -37822 -25026 1051 20671 26416 12262 -15104 -29585 -17122 7278 23032
193 23032 23574 6423 -23465 -37931 -12116 31543 40911 4858 -32639 -33215 -5451 21163 27969
206 27969 11370 -15785 -28388 -12820 10931 18608 11207 935 -10022 -20747 -14823 11615 30793
$$ packed form
120g8476N5406P4945K3848l9856o6789m5570J4356P5996P3634j3043r1334p0600
132h7483K2852P8448N2841q447n1921n5495j3095M4462N8312J4182l2678m0181
144a8203k2983N8L2678N1857J8354m8122o5891j1376N0406N6474J3817l4735n4521
157c2187k7387L0871N8635K3726l1693m2149j3141R930J8703K5832J7030j8152
169B0018m2934k2172K1666M0607K4542r830l9592l8974M847N0467M0976j5158
181C4463m7709k4576J2796K6077J9620N745j4154k7366j4481J2463K4400J5754
193B3032N42j7151k9888j4466K5815M3659R368l6053l7497n76K7764K6614O806
206B7969j6599k7155j2603J5568K3751P677p401j0272j0957j0725N924K6438J9178
$$ plain form
219 30793 16526 -16387 -30610 -15112 12152 28177 18949 -9006 -28773 -18055 11190 24336
231 24336 11006 -7000 -12145 -9637 -5131 4934 15368 12481 -4496 -18322 -14812 1495 17090
244 17090 19088 2198 -20493 -22631 843 22985 19103 -3503 -17096 -12146 467 9543 10920
257 10920 4633 -4899 -9889 -6742 507 6874 10744 6606 -7201 -17609 -8764 11416 19538 5419
271 5419 -12696 -16138 -4374 9746 13217 4761 -7806 -10985 -3096 5523 5739 2637 1880 -1163 -6904
286 -6904 -7933 1305 11103 9141 -2780 -12184 -9371 2540 12242 9802 -3636 -12877 -7756 5008
300 5008 9475 3477 -3195 -3934 -2186 -1638 434 3555 4603 996 -4197 -6778 -3178 5215 10032 3580
316 3580 -7677 -11017 -1470 9008 8607 -939 -6871 -5693 512 3656 3270 453 -1770 -1543 -1762 -1885
$$ packed form
219C0793j4267l2913j4223J5498K7264J6025r228k7955j9767J0718K9245J3146
231B4336j3330j8006n145K508M506J0065J0434k887j6977j3826L510J6307J5595
244A7090J998j6890k2691k138K3474K2142l882k2606j3593M950J2613R076J377
257A0920o287r532m990L147P249O367L870m138j3807j0408Q845K0180Q122j4119
271E419j8115l442J1764J4120L471q456j2567l179P889Q619K16l102p57l043n741
286f904j029R238R798j962j1921r404K813J1911R702k440j3438r241N121J2764
300E008M467n998o672p39J748N48K072L121J048l607n193k581L600Q393M817o452
316C580j1257l340R547J0478m01r546n932J178O205L144l86k817k223K27k19j23
$$ plain form
332 -1885 -88 4295 5200 -591 -7766 -6174 2479 8847 4597 -4175 -7889 -3248 4150 6515 2320
347 2320 -3591 -4339 -696 2122 1013 -252 929 1216 -1491 -4371 -2015 3726 5709 1373 -4847 -6090
363 -6090 -614 5721 5946 -585 -5889 -4149 1765 4303 1972 -1574 -1658 140 102 -675 57 2202 2385
380 2385 -411 -3702 -2848 1376 5132 2913 -2719 -5665 -1797 3701 4755 275 -3768 -3164 508 2302
396 2302 1319 -630 -474 264 50 -1655 -1119 1356 3162 1014 -2989 -3841 -55 3920 3537 -966 -4204
413 -4204 -2256 1756 3261 640 -1930 -1730 -178 1212 48 -673 163 955 386 -1890 -1838 686 3139
430 3139 2048 -1764 -3637 -1141 2940 3416 93 -2862 -2222 1049 2444 1020 -924 -1042 268 788
446 788 -609 -1103 256 1336 1351 -1533 -2348 -128 2484 2445 -810 -2867 -1342 1486 2460 479 -1625
$$ packed form
332a885J797M383R05n791p175J592Q653O368m250q772l714M641P398K365m195
347B320n911p48L643K818j109j265J181K87k707k880K356N741J983m336o220j243
363f090N476O335K25o531n304J740N914K538k331l546q4J798l8p77P32K145J83
380B385k796l291Q54M224L756k219n632k946L868N498J054m480m043O04L672J794
396B302r83j949J56P38k14j705N36K475J806k148m003q52L786L975l83m503l238
413d204J948M012J505k621k570K00J552J390j164p21Q36P92n69k276N2K524K453
430C139j091l812j873K496M081M76l323k955O40L271J395j424j944j18J310N20
446G88j397m94J359J080J5k884q15K220K612l9l255k057J525K828R74j981k104
$$ plain form
463 -1625 -1533 276 1406 836 -524 -425 682 767 -711 -1492 290 1959 1742 -1079 -2531 -815 1931
480 1931 2301 -5 -1870 -1475 638 2049 992 -1039 -1622 427 958 52 -1053 -19 1402 660 -1075
497 -1075 -1684 -305 1521 1400 -124 -1999 -1240 915 2384 625 -2170 -1651 378 1657 69 -792
513 -792 -101 508 395 -367 -392 -280 631 822 -4 -1793 -815 1844 2064 -95 -1977 -1108 1134 1519 1
532 1 -545 -782 -355 601 835 -312 -694 110 1021 -12 -1480 -252 1647 1367 -932 -1458 -390 749
550 749 1105 368 -765 -1488 81 1419 1327 -1103 -1784 58 1321 367 -1031 -29 827 134 -576 -262
568 -262 -230 -107 938 354 -1116 -1465 374 1945 406 -1873 -1020 1051 1189 192 -557 -256 -343 128 715
587 715 260 -924 -725 1005 628 -774 -1041 788 1444 -202 -1286 195 1140 303 -149 -193 -297 -518
$$ packed form
463a625R2J809J130n70j360R9J107Q5j478p81J782J669k17k821j452J716K746
480A931L70k306j865L95K113J411j057k031n83K049N31r06j105J034J421p42j735
497a075o09J379J826j21j524j875P59K155J469j759k795N19K029J279j588q61
513g92O91O09j13p62k5J12R11J91q26j789R78K659K20k159j882Q69K242L85j518
532An46k37M27R56K34j147l82Q04R11j033j468J228J899k80k299n26J068J139
550G49L56p37j133p23J569J338r2k430o81J842J263r54j398J002Q56o93p10L14
568b62L2J23J045n84j470l49J839J571j539k279Q53K071J38r97p49L01q7M71N87
587G15m55j184J99J730l77j402k67J829O56j646j084J481R45q37m52m4j04k21
$$ plain form
605 -518 496 1215 -59 -1601 -479 1762 421 -1399 -715 518 762 -673 -52 474 -267 -275 431 452
623 452 -611 -395 1058 916 -1029 -1459 918 1580 -560 -1550 -97 568 81 297 436 -425 -1202 286
641 286 1731 331 -1329 -413 1164 391 -1137 -53 1047 311 -1345 -384 499 339 -249 326 -28 -1280
659 -1280 -830 1721 1501 -838 -1674 30 1595 190 -147 547 -183 -1117 -380 1659 792 -966 -234 711
677 711 -136 -1054 420 1647 0 -1902 -477 1473 1017 -333 -358 -352 -858 -255 1448 1357 -1007 -1748 374
696 374 1436 -203 -632 555 361 -1339 -749 1144 1185 -723 -846 100 -168 -774 814 1781 -443 -1950
714 -1950 -617 1656 1114 -782 -467 84 -490 -634 1068 1322 -859 -1399 197 948 -309 -442 785
731 785 271 -1351 -710 1153 1354 -436 -1139 54 167 -269 542 994 -451 -1877 -14 1812 999 -1383
$$ packed form
605e18J014P19j274j542J122K241j341j820O84J233K44j435O21N26p41qP06K1
623D52j063K16J453j42j945m30K377O62k140r90J453O65m87K16J39q61p77J488
641B86J445j400j660R16J577p73j528J084J100p36j656R61Q83j60n88N75l54j252
659a280M50K551k20k339q36J704J565j405l37O94p30r34P37K039q67j758P32R45
677G11q47r18J474J227j647j902J425J950m56j350k5On06O03J703r1k364p41K122
696C74J062j639m29J187j94j700N90J893M1j908j23R46k68o06J588R67k224j507
714a950J333K273n42j896L15N51n74j44J702K54k181n40J596P51j257j33J227
731G85n14j622O41J863K01j790p03J193J13m36Q11M52j445j426J863J826q13k382
$$ plain form
749 -1383 -409 547 -112 -1003 1006 1580 -445 -1608 -72 751 -130 -234 460 293 -1505 -816 1656 1369
767 1369 -1014 -1490 72 689 -101 114 787 -381 -1662 -558 1449 772 -861 -189 569 8 -743 715
785 715 1324 -528 -1692 -422 1128 288 -387 258 329 -1146 -509 1329 1545 -917 -1190 447 733 56
803 56 -203 889 -175 -1357 -255 1382 813 -1128 -415 709 -260 -319 729 1200 -423 -1677 21
820 21 1151 198 -639 0 12 -734 -406 896 1081 -541 -1049 443 622 145 58 695 -93 -1175 -232 1091
840 1091 752 -720 -508 337 -84 -484 390 830 -275 -1193 -498 867 208 -606 -191 64 -401 -232 820
859 820 577 -641 -1196 45 641 43 -6 375 28 -1008 -51 840 619 -525 -441 7 6 -308 156 694
879 694 -430 -951 -142 1080 139 -591 -361 68 -401 -628 332 742 -479 -598 127 552 -62 -157 301 -126
$$ packed form
749a383R74R56o59q91K009N74k025j163J536Q23q81j04O94j67j798O89K472k87
767A369k383m76J562O17p90K15O73j168j281J104K007o77j633O72P58n61p51J458
785G15O09j852j164J270J550q40o75O45P1j475O37J838K16k462k73J637K86o77
803E6k59J092j064j182J102J637n69j941P13J124r69n9J048M71j623j254J698
820B1J130r53q37O39J2p46L28J302J85j622n08J492J79m77q7O37p88j082R43J323
840A091l39j472K12Q45m21m00Q74M40j105r18O95J365o59q14M15K55m65J69J052
859H20k43j218n55J241N96n98m9L81l47j036R57Q91k21j144Q4M48jl14M64N38
879F94j124n21Q09J222r41p30K30M29m69k27R60M10j221j19P25M25o14r5M58m27
$$ plain form
899 -126 -822 -473 972 473 -438 -461 101 262 -261 370 420 -33 -968 172 641 118 -258 -349 139 144 -295
920 -295 256 544 -149 -496 288 683 -87 -192 113 147 -673 -178 11 607 -610 -295 106 411 121 129 421
941 421 85 -374 67 567 75 -162 102 305 -33 67 350 307 -185 -512 239 211 -148 -285 401 -109 -64
962 -64 40 240 204 -330 -400 403 89 106 -6 65 -91 -259 -81 362 184 -282 -106 452 -171 3 90 164 -188
985 -188 -296 277 251 -97 47 155 -67 -94 -83 265 7 -355 -292 274 180 219 -372 -26 2 -419 -123 182 297
1008 297 -54 69 85 -108 -72 157 130 -75 -200 -3 137 -33 -264 -65 -36 114 -37 -113 336 -71 -178 293
1030 293 244 -162 29 56 69 -227 -184 -187 42 -315 32 214 46 -71 -128 223 -173 -206 -239 164 226 9 -127
1053 -127 7 -71 -16 40 -88 -132 86 -246 254 -99 -59 -60 133 -8 -282 405 304 -42 85 -179 147 -43
$$ packed form
899a26o96L49J445m99r11k3N62J61n23O31N0m53r35J140M69n23l76r1M88Nm39
920b95N51K88o93l47P84L95p70j05L05L4q20M95J89N96j217L15M01L05k90QK92
941D21l36m59M41N00m92k37K64K03l38J00K83m3m92l27P51k8l59j37O86n10M5
962f4J04K00l6n34p0Q03l14J7j12P1j56j68J78M43j78m66J76N58o23J74Q7P4l52
985a88j08N73k6l48J44J08k22k7J1L48k58l62O3N66r4L9n91L46K8m21K96L05J15
1008B97l51J23J6j93L6K29k7k05j25J97J40j70k31J99K9J50j51p6M49m07j07M71
1030B93m9m06J91K7J3k96M3lK29l57L47J82j68j17n7L51l96l3l3M03O2k17j36
1053a27J34p8N5N6j28m4K18l32N00l53M0jJ93j41k74O87j01l46J27k64L26j90
$$ plain form
1075 -43 -201 150 -199 0 111 -2 285 58 48 163 169 -158 -43 81 -74 13 -46 192 -447 -125 -203 -199 -458
1098 -458 197 -18 -383 -183 -73 142 -16 -21 107 -207 17 61 115 50 406 -118 62 160 -35 326 -35 -74
1120 -74 -190 -195 -141 22 190 -240 265 39 84 144 290 260 -192 181 62 35 285 -154 95 -12 60 226 218 -16
1144 -16 297 46 70 10 245 -287 348 49 101 -56 -36 143 -106 160 -24 148 116 -60 248 -45 -137 235
1166 235 -233 -186 28 -124 -68 271 -145 75 -173 -136 -94 57 184 59 242 344 -116 -37 98 302 185 -277
1188 -277 266 -23 -122 -21 57 -96 -96 -335 224 99 -346 71 71 126 259 -55 -321 135 3 205 207 -214 -43
1211 -43 78 91 85 -338 -51 150 -301 351 -72 -66 103 170 60 -57 -303 88 154 3 -415 17 342 281 70
1234 70 32 41 -32 174 -21 -108 121 -207 49 119 52 -88 94 397 163 -128 -161 276 -5 189 -52 -114 134
$$ packed form
1075d3j58L51l49J99J11j13K87k27j0J15Ol27J15J24j55Q7n9K38o39L22p8Mk59
1098d58O55k15l65K00J10K15j58nJ28l14K24M4N4o5L56n24J80R8j95L61l61l9
1120g4j16nN4J63J68m30N05k26M5O0J46l0m52L73j19k7K50m39K49j07P2J66qk34
1144a6L13k51K4o0K35n32O35k99N2j57K0J79k49K66j84J72l2j76L08k93r2L72
1166B35m68M7K14j52N6L39m16K20k48L7M2J51J27j25J83J02m60P9J35K04j17m62
1188b77N43k89r9J01P8j53%k39N59j25m45M17%N5J33l14k66M56j32K02Km21J71
1211d3J21J3om23K87K01m51O52m23OJ69O7j10j17k46L91O6j51m18M32L25o1k11
1234G0l8Rp3K06j95q7K29l28K56P0o7j40J82L03k34k91l3M37k81J94k41o2K48
$$ plain form
1257 134 -222 86 -49 -205 112 202 -67 -233 -35 28 332 1 -32 222 -74 18 -1 -6 -89 37 -57 318 -142
1280 -142 -48 181 543 131 -193 -241 412 6 -60 253 101 -111 17 298 496 37 -343 11 88 64 118 96
1302 96 -215 10 144 135 108 12 139 42 105 -356 126 146 -48 -377 65 225 302 -207 72 218 -214 -36 180
1325 180 176 -167 56 -24 -73 -16 22 338 -70 -124 -221 170 210 107 42 176 -121 -126 140 -47 18 -218 -99 101
1349 101 127 -18 -335 250 102 -331 105 163 256 -89 260 39 -80 18 358 96 -391 -64 633 238 -6
1370 -6 -43 220 -31 -113 125 38 215 -533 -239 274 -83 121 178 47 -89 -265 118 113 -213 -258 -140 203 186
1393 186 252 -162 -91 -314 5 102 329 -281 -284 30 99 -38 184 280 -1 -84 51 144 174 -85 217 248 -180 1
1417 1 230 167 -318 -351 63 353 -135 -134 10 -46 -110 -421 145 98 15 -328 90 -78 -291 -113 -96 -80 -126 186
$$ packed form
1257A34l56L08j35j56L17R0k69j66J98O3L04l31l3K54k96R2j9nq3J26r4L75m60
1280a42R4K29L62m12l24m8O53m06o6L13j52k12J28K81J98m59l80L54P7k4N4k2
1302I6l11K25J34rk7r6J27r7O3m61M82K0j94l29M42J60P7n09K79J46m32J78K16
1325A80ml43K23q0m9N7L8L16m08n4r7L91M0j03o5J34k97nK66j87O5k36J19K00
1349A01K6j45l17N85j48m33M36N8R3l45L49k21j19R8L40k62m87L27O97l95k44
1370fl7K63k51q2K38q7J77p48K94N13l57K04N7j31j36j76L83nl26m5J18L43j7
1393A86O6m14P1k23L19R7K27o10lL14O9j37K22R6k81q3J35R3L0k59L02L1m28J81
1417AK29o3m85l3M14K90m88JJ44n6o4l11N66m7q3l43M18j68k13J78J7J6m6L12
$$ plain form
1441 186 231 35 39 77 172 -259 -166 -55 66 -26 88 64 209 82 -74 40 -82 -300 -58 133 106 2 -325
1464 -325 65 86 59 -113 78 164 -470 -98 137 419 -124 72 68 -400 -188 238 128 -379 -511 65 424 -136
1486 -136 -266 -187 -11 -114 -360 -62 470 -315 196 -3 4 125 -262 429 -522 -375 301 211 385 -262 -393
1507 -393 -218 -178 -530 241 287 -154 -186 -28 283 33 -36 -153 270 -354 15 228 130 -288 -217 244 48 -64
1529 -64 294 205 43 -415 -31 419 162 -34 -159 26 -167 142 78 120 -122 -188 122 465 89 -303 15 -78
1551 -78 -87 -118 23 76 -164 -291 -11 15 197 16 -115 -17 -154 -104 165 426 -493 -38 24 109 -181 114 86 -80
1575 -80 -221 -166 47 -183 95 -245 237 146 -246 96 -28 -129 -140 59 -75 -129 -55 -57 -49 -8 -5 177 208 -111 -243
1600 -243 25 67 -12 -21 402 233 -309 -19 14 294 60 298 83 56 295 330 -182 37 135 -127 -51 -25 -13 277
$$ packed form
1441A86M5j96ML8R5m31R3J11J21r2J14k4J45j27j56J14j22k18K42J91k7j04l27
1464c25L90K1k7j72J91Q6o34L72K35K82n43J96mm68K12M26j10n07j32N76L59n60
1486a36j30P9J76j03k46K98N32p85N11j99PJ21l87O91r51J47O76r0J74o47j31
1507c93J75M0l52P71M6m41l2J58L11k50o9j17M23o24L69K13r8m18P1M61j96j12
1529f4L58q9j62m58L84M50k57j96j25J85j93L09o4M2k42o6L10L43l76l92L18r3
1551g8rl1J41N3k40j27K80K6J82j81j31R8j37N0K69K61r19M55O2Q5k90K95k8j66
1575h0j41N5K13k30K78l40M82r1l92L42j24j01j1J99j34n4P4kQM1LJ82L1l19j32
1600b43K68M2p9rM23j69n42K90L3K80k34K38k15k7K39L5n12K19R8k62P6K6J2K90
$$ plain form
1624 277 78 -132 135 87 65 -94 -222 282 -208 101 -308 157 -92 -151 -212 61 -66 -170 -172 -173 -37 -258 211
1647 211 149 66 -36 62 155 45 309 136 73 13 103 251 161 155 15 162 43 -163 132 -68 -151 7 76 197
1671 197 293 -137 167 -158 -22 311 -84 27 -180 -491 59 53 194 -332 67 31 -138 -12 -180 145 68 -20
1693 -20 -313 -41 201 -83 -17 193 69 -122 -93 212 107 -83 -300 -2 -79 -219 -199 -157 -103 178 156 95 -194
1716 -194 162 -249 -71 232 -71 182 -69 -129 0 -94 -39 37 23 -142 70 -32 -30 340 356 -59 47 -296 -6
1739 -6 -56 -73 204 17 320 -174 -90 271 7 16 -68 -112 -4 -206 45 -182 -131 92 -130 -68 -191 -296 -145 -128
1763 -128 -110 -314 19 157 -45 82 -24 -25 305 89 142 125 18 -316 -107 -77 -98 -170 -154 -77 25 -77 -19 20
1787 20 54 57 -48 -34 -65 -136 -65 63 250 88 326 -134 102 182 -210 -12 123 22 174 109 -171 224 -201
$$ packed form
1624B77j99k10K67m8k2j59j28N04m90L09m09M65k49n9o1K73j27j04kjJ36k21M69
1647B11o2q3j02R8R3j10K64j73o3o0R0J48r0oj40J47j19k06K95k00q3J58O9J21
1671A97R6m30L04l25J36L33l95J11k07l11N50oJ41n26L99l6j69J26j68L25p7q8
1693b0k93K72K42k84O6K10j24j91K9L05j05j90k17K98p7j40K0M2N4K81k2o1k89
1716a94L56m11J78L03l03K53k51o0J29r4N5P6j4j65K12j02KL70J6m15J06l43K90
1739fn0j7K77j87L03m94Q4L61k64Rq4m4J08k02K51k27N1K23k22O2j23j05J51J7
1763a28J8k04L33J38k02J27j06jL30k16N3j7j07l34K09L0k1p2J6P7J02j02N8L9
1787B0L4Lj05J4l1p1P1J28J87j62K38m60K36Q0l92J98J35j01J52o5k80L95m25
$$ plain form
1810 -201 43 116 -141 61 374 9 24 -186 -112 122 -35 -245 242 147 -283 84 110 308 364 359 -224 184 -52
1833 -52 -5 -104 166 -16 276 199 -48 9 69 2 -217 -59 -355 42 107 -134 -65 -249 275 7 61 118 98 -250
1857 -250 20 -136 130 64 -48 30 -243 29 6 -41 -124 60 200 -143 -239 74 12 21 -127 -166 -128 9 8 108
1881 108 -80 168 -411 257 302 23 101 186 -333 188 4 -43 125 -54 -216 -15 247 207 -250 -32 217 -210
1903 -210 177 -69 125 -59 -9 -138 328 -79 -52 -4 -141 -151 -97 -63 -71 -118 -14 16 -92 -144 -4 15 -41 236
1927 236 -27 -101 -81 381 -5 201 -206 442 53 203 330 77 -3 55 118 -135 106 -142 -196 -93 -135 -121 136
1950 136 -120 32 -220 162 -101 -64 -324 152 50 -31 166 -70 14 -169 -87 282 209 69 62 -151 -159 -85 -284
1973 -284 208 -123 78 7 110 -28 -90 122 77 -387 54 61 61 -109 -234 -57 8 -92 -238 92 -441 -66 58
$$ packed form
1810b01K44P3k57K02L13l65J5k10P4K34j57k10M87r5m30L67K6J98N6nn83M08k36
1833e2M7r9K70j82K92p7k47N7O0o7k19J58k96L97O5k41O9j84N24k68N4N7k0l48
1857b50K70j56K66o6j12P8k73K72k3m7q3J84J40l43r6L13o2Rj48l9L8J37jJ00
1881A08j88K48n79O68M5k79P8Q5n19N21j84m7J68j79j62K01K62m0m57K18K49m27
1903b10L87k46J94j84N0j29M66m07K7M8j37j0N4L4qm7J04L0j08n2J40J9n6K77
1927B36k63p4K0M62l86K06m07O48l89J50J27k53q0N8O3k53K41k48n4J03m2J4K57
1950A36k56J52k52L82k63L7k60M76j02q1J97k36Q4j83Q2L69p3j40pk13qP4j99
1973b84M92l31K01p1J03j38o2K12m5m64M41P%j70j25J77O5j00j46L30n33L75J24
$$ plain form
1996 58 61 59 269 186 128 235 -208 7 124 106 84 16 275 -10 184 60 -42 181 -184 35 93 62 107 87 99
2021 99 -25 85 90 167 -11 -249 -8 -49 -124 -178 -37 1 289 -74 -156 62 -159 74 -121 -529 -109 129 71
2044 71 211 -25 14 93 -182 88 -57 83 76 -42 -93 -173 -51 170 34 258 -160 157 266 138 -136 -71 -215
2067 -215 221 -113 -169 221 -195 -54 -179 284 -118 -6 -62 115 53 97 -23 216 -105 158 291 -42 -102 -270
2089 -270 125 6 45 -50 -55 279 -129 297 94 -170 -149 32 66 -188 91 -245 -127 186 -220 -95 -170 -71 16
2112 16 -85 -87 -197 -68 71 46 64 21 186 13 -160 279 357 131 -4 -110 87 159 -230 -76 141 -228 -1
2135 -1 37 53 45 -162 -104 78 -113 194 24 175 -275 1 -107 77 60 174 -64 -152 -180 90 18 182 -295 -197
2159 -197 -97 -96 -192 -166 223 -171 -124 -162 65 226 -76 -160 274 -83 -105 172 160 -143 -83 -126 -31 -168 -203 128
$$ packed form
1996E8LkK10q3n8J07m43K15J17j8k2o8K59k85J94j24j02K23l65K19N8l1M5k0J2
2021I9j24J10NP7j78k38K41m1p5n4J41L8K88l63q2K18k21K33j95m08M20K38n8
2044G1J40k36L9P9k75K70j45J40pj18n1q0J22K21j36K24m18L17J09j28k74O5j44
2067b15M36l34n6L90m16J41j25M63m02J12n6J77o2M4j20K39l21K63J33l33o0j68
2089b70L95j19L9r5nL34m08M26k03k64K1J81L4k54K79l36J18L13m06J25p5R9Q7
2112A6j01kj10J29J39k5J8m3J65j73j73M39P8k26j35j06J97P2l89J54K17l69K27
2135aL8J6qk07N8J82j91L07j70J51m50K76j08J84j7J14k38q8k8K70p2J64m77R8
2159a97J00Jr6K6L89l94M7l8K27J61l02q4M34l57k2K77j2l03O0m3R5j37l5L31
$$ plain form
2183 128 -278 -203 -75 102 350 -34 98 -183 142 -138 -47 -121 120 121 -133 197 -95 -128 311 -127 -260 -7
2205 -7 -88 79 103 -136 -6 103 177 11 -51 -388 2 138 -110 31 -77 236 112 238 -113 -143 -106 -117 -224
2228 -224 -392 330 249 -355 -151 76 133 291 100 386 200 -174 72 68 -205 -49 73 -34 129 22 204
2249 204 -266 -125 -21 59 81 -334 -206 31 -193 -64 -154 98 156 165 -17 40 25 298 109 -14 -74 -140 -129 -316
2273 -316 -261 -37 65 -209 -140 102 6 57 -151 -70 -211 88 -88 -101 229 120 24 24 -9 -23 -58 -284 -20 -154
2297 -154 -281 -127 159 4 -40 -160 -6 -155 182 46 67 -141 222 48 475 316 -120 149 10 -171 122
2318 122 60 145 -152 -99 57 35 -29 10 95 -296 42 19 400 -140 137 -22 -41 -142 -205 89 -120 -8 -138
2341 -138 -25 7 74 -236 -146 -162 -173 -321 -74 -197 63 -107 -116 157 -55 -135 -150 54 -94 3 207 243 49 207
$$ packed form
2183A28m06P5J28J77K48l84J32k81L25k80R1p4K41Jk54L30k92l3M39m38j33K53
2205gq1J67K4k39J30J09P4j66o2l37L90J36k48J41j08L13j24J26l51l0L7j1j07
2228b24j68P22q1o04K04K27N7J58j91K86j86l74K46mk73J56J22j07J63j07J82
2249B04m70J41J04Q0K2m15J28K37k24J29r0K52N8Rj82N7j5K73j89j23o0o6J1j87
2273c16N5K24J02k74O9K42r6N1k08Q1j41K99j76j3L30j09r6%l3j4l5k26K64j34
2297a54j27J54K86j55m4j20J54j49L37j36K1k08L63j74M27j59m36K69j39j81K93
2318A22o2Q5k97N3J56k2o4L9Q5l91L38k3L81n40K77j59j9j01o3K94k09J12j30
2341a38J13L2O7l10R0j6j1j48K47j23K60j70rK73k12q0j5K04j48R7K04L6j94J58
$$ plain form
2365 207 231 245 3 -78 29 31 111 225 138 205 -162 -44 -67 -36 -249 -304 234 -265 -125 -41 46 -151 118 62 173
2390 173 -131 331 -50 -31 -50 -30 -86 95 -3 -42 -143 -186 192 35 136 161 -264 -272 -158 34 203 96 64 11
2414 11 -148 -90 337 -33 4 -24 254 194 193 -98 239 -60 59 -86 133 -560 126 138 -76 29 35 173 -91
2437 -91 58 14 65 112 -28 -122 -330 211 69 267 -322 351 -33 -195 225 113 0 5 183 246 -11 179 -178
2460 -178 -67 89 107 220 -134 -59 14 -93 -6 74 -11 -4 132 8 -132 142 -3 -49 257 -158 314 89 380
2483 380 204 -4 -292 62 -79 -186 111 -157 34 -112 126 73 -23 -183 -193 112 -1 116 -96 356 -48
2504 -48 6 153 -111 140 35 66 -158 -90 -110 -39 -1 143 108 -41 -33 -32 -19 439 252 -24 -90 93 -116 -123 20
2529 20 -15 58 357 -207 -121 114 95 -324 203 148 23 100 30 -67 122 -145 -27 -110 115 201 21 -45 -326 104
$$ packed form
2365B07K4J4k42q1J07KQ0J14q7O7l67J18k3L1k13n5N38m99J40Q4Q7j97K69n6J11
2390A73l04M62l81J9j9K0n6J81r8l9j01m3L78j57J01K5m25qJ14J92J69j07l2n3
2414A1j59N8M27l70L7k8K78o0jk91L37k99J19j45K19o93O86J2k14J05OJ38k64
2437i1J49m4N1M7j40r4k08N41j42J98n89O73l84j62M20j12j13NJ78O3k57J90l57
2460a78J11J56J8J13l54P5P3j07Q7Q0q5PJ36j24j40K74j45m6L06m15M72k25K91
2483C80j76k08k88L54j41j07K97k68J91j46K38n3r6j60j0L05j13J17k12M52m04
2504d8N4J47k64K51j05L1k24O8k0P1L8J44l5j49QJJ3M58j87k76o6J83k09pJ43
2529B0l5P3K99n64Q6K35j9m19N27n5j25P7p0r7J89k67J18q3K25Q6j80o6k81M30
$$ plain form
2553 104 -14 196 -78 150 10 -29 54 258 -76 197 166 -5 -124 -117 -213 -178 -150 186 143 -112 -44 241 -180
2576 -180 50 -74 117 15 163 -78 -366 391 -38 33 22 -42 6 93 66 -142 -9 64 269 177 -12 11 121
2599 121 -93 -253 -82 -173 93 9 -138 101 21 23 113 -159 226 33 97 270 -323 80 -335 288 -42 -90 -106
2622 -106 -102 17 -217 63 55 46 -214 -175 -67 8 29 -59 109 -46 95 -44 75 -56 107 -252 243 15 137
2645 137 -64 -24 -83 -99 168 66 -192 70 -35 -176 68 -14 -84 -171 83 -72 59 185 230 133 -301 146 44
2668 44 7 22 79 -86 169 -102 349 -86 -270 199 -214 -164 248 240 -113 -73 101 118 30 -116 82 335 -86
2691 -86 15 116 -83 -473 -198 -126 -100 157 -84 14 268 60 124 79 -109 119 -23 286 -290 -138 107 32
2713 32 113 -144 134 120 -180 113 -72 -126 -94 -9 101 -159 -50 -70 -247 -344 -113 -170 247 52 228 -11 -200
$$ packed form
2553A04j18K10k74K28j40l9Q3K04l34K73l1j71j19Pr6L5K8L36m3k55O8K85m21
2576a80K30j24J91j02J48k41k88P57m29P1j1o4M8Q7k7k08J33P3K05r2j89K3J10
2599A21k14j60J71r1K66q4j47K39q0KR0k72L85j93O4J73n93M03m15O23l30m8j6
2622a06MJ19k34K80qrk60L9J08P5K1q8J68j55J41j39J19j31J63l59M95k28J22
2645A37k01M0n9j6K67j02k58K62j05j41K44q2p0q7K54j55J31J26M5r7m34M47j02
2668D4l7J5N7j65K55k71M51m35j84M69m13N0M12ql53M0J74J7q8j46J98K53m21
2691h6J01J01j99l90K75P2K6K57k41R8K54k08O4m5j88K28j42L09n76J52K45p5
2713C2Q1k57K78j4l00K93j85n4L2Q5J10k60J09k0j77r7K31n7M17j95J76k39j89
$$ plain form
2736 -200 -160 -214 -167 67 -212 233 56 -148 16 -500 -259 193 176 -140 -57 -256 200 339 -140 249 46 -44
2758 -44 222 53 -217 -9 132 51 -167 -239 -232 57 -127 81 24 354 -5 -91 220 -415 -50 -100 -73 144 38
2781 38 -7 -47 77 122 156 18 -127 3 129 -114 -55 -107 -167 48 134 109 -40 17 -150 115 -479 376 178 -19
2805 -19 113 212 -55 -10 47 -27 -30 -264 259 -82 -167 96 162 -57 -75 186 -148 117 -212 210 99 6 61 -5
2829 -5 -91 88 263 169 -73 -161 61 211 -122 58 -254 104 58 0 181 -52 -267 -347 -138 -91 108 194 47
2852 47 50 -76 146 -92 -153 232 445 -22 281 57 227 72 -117 -345 -182 -176 -48 121 -227 -122 -135 38
2874 38 -262 -106 -109 271 -78 -18 -127 -206 -50 -95 -54 86 -75 57 -39 -144 -227 163 -113 29 252 -57 -2
2897 -2 -96 104 -268 -133 502 144 105 117 -129 -184 -23 202 -21 -225 215 -204 -311 117 -117 78 160 78 -237
$$ packed form
2736b00M0n4M7K34k79M45j77k04J64n16K41M52j7l16Q3j99M56J39m79L89k03r0
2758d4K66j69k70K08J41q1k18p2PK89j84K08n7L30l59q6L11o35L65n0K7K17j06
2781C8m5m0J24M5L4j38j45J30J26k43N9n2o0K15Q6k5j49N7j67K65n94Q55j98j97
2805a9J32R9k67M5N7p4lk34N23l41q5K63O6k19j8K61l34K65l29M22j11r3N5o6
2829eq6J79J75r4k42q8K22J50l33J80l12L58m6n8J81k33k15q0K09M7J99Q6j47
2852D7Lj26K22k38o1L85K13m67L03k24J70j55j89k28J63OJ28J69l48J05j3J73
2874C8l00J56lL80l49O0j09p9J56m5M1J40j61J32r6j05q3L90k76J42K23l09N5
2897br4K00l72J35O35l58l9J2k46n5J61K25k23k04M40m19j07M28k34J95Q2q2l15
$$ plain form
2920 -237 104 101 -340 11 7 209 -131 20 -90 108 31 -197 4 73 -19 -30 -214 -29 82 144 -4 -162 -46
2943 -46 -113 247 -203 -161 -282 110 -46 194 15 63 -173 141 -95 -186 25 -144 -96 168 -204 -13 -61 -58 -340
2966 -340 -224 96 -18 -46 -9 307 57 97 -33 24 154 -33 -84 58 -25 -171 140 -98 -71 255 -15 -131
2988 -131 352 -22 -203 -137 82 -148 101 -93 222 129 -203 36 -176 -77 -147 -61 -57 216 220 -192 -300 -115 -17
3011 -17 237 382 -66 109 -254 138 -61 -228 130 -226 -19 -18 104 42 -137 -111 72 142 165 -61 -190 152
3033 152 146 -303 -12 488 269 -17 -23 142 22 121 -313 -92 19 -94 51 -144 -111 -149 240 -169 204 -31
3055 -31 -267 -121 22 -55 -175 457 219 -51 -115 -136 220 13 -182 22 24 -30 103 182 -52 -250 91 59 255
3078 255 192 -146 25 127 -17 -275 391 -43 199 91 -128 90 382 -14 186 184 90 19 -181 192 -158 55
$$ packed form
2920b37L41lm41L51mK02l40J51j10J98p7k28K01O9r2j1j84J85J11O2j48j58J16
2943d6o7L60m50M2j21L92j56K40j79M8k36L14k36r1K11j69M8K64l72J91m8Lk82
2966c40J16L20j14k8L7L16k50M0j30N7J30j87n1J42q3j46L11k38K7L26k70j16
2988a31M83l74j81O6K19k30K49j94L15r3l32K39k12R9p0Q6MK73Mm12j08J85R8
3011a7K54J45m48J75l63L92j99j67L58l56K07JJ22o2j79K6J83P0K3k26j29L42
3033A52om49K91N00k19k86oJ65j20R9m34K21J11j13J45j95L3l8L89m09L73k35
3055c1k36J46J43p7j20O32k38k70o4k1L56k07j95K04Kn4J33P9k34j98L41l2J96
3078B55o3l38J71J02j44k58O66m34K42j08k19K18K92l96K00kr4p1k00L73l50K13
$$ plain form
3100 55 -27 -27 -196 172 112 220 -63 40 -219 -139 101 96 -77 152 97 -16 142 57 31 109 -140 105 65 -64
3124 -64 48 -17 -134 -53 -6 178 166 -138 -107 109 3 177 -92 36 -19 80 -374 144 44 -22 -176 -75 -154
3147 -154 285 -277 19 155 -158 147 265 -249 45 82 -150 13 20 -64 -207 -42 119 98 -22 40 37 -17 -236
3170 -236 -16 112 60 -23 -341 20 51 -277 -59 506 141 -36 -74 46 -22 -79 85 -306 119 -261 306 239
3192 239 113 -139 22 317 -203 191 209 163 -96 -9 305 148 -127 108 112 181 13 112 -144 166 206 229 9
3215 9 150 223 264 374 130 220 234 -330 -131 86 -195 -50 94 -129 -113 76 -291 -427 -141 -63 83 -131 24
3238 24 24 118 168 -369 172 62 -241 140 283 302 201 -89 -157 20 0 112 -241 144 -226 100 54 -99 -14
3261 -14 117 192 92 -5 -36 -112 14 62 -23 204 -3 36 -163 67 -107 47 41 9 86 56 146 -91 -3 316 2
$$ packed form
3100E5q2%j69L68o0J08k83J03k59Q0K40nj73K29n5j13J58q5k6P8k49K45m0j29
3124f4J12o5j17Q1M7J84j2l04L1K16j06J74k69J28n5R9m54N18j00o6j54J01p9
3147a54M39n62K96J36l13L05J18n14K94L7k32J63Pq4j43J65J61k1j20O2ln4k19
3170b36K20J28n2q3l18L61L1l28K18N65l65j77l8J20o8n7J64l91M25l80N67o7
3192B39j26k52J61K95n20L94J8m6k59Q7L14j57k75K35MO9j68R9k56L10M0K3k20
3215IJ41P3M1J10k44R0J4n64J99K17k81J45J44k23J6J89l67j36K86P8J46k14J55
3238B4%R4N0n37N41j10l03L81J43J9j01k90o8J77k0J12l53L85l70L26m6j53Q5
3261a4J31P5j00r7l1p6J26M8q5K27k07L9j99K30j74J54ol2P7l0R0k37Q8L19l14
$$ plain form
3286 2 2 -166 155 -166 -96 47 137 49 -285 144 64 -118 -82 -83 -143 45 167 -115 9 -39 240 23 -317 111
3310 111 8 245 198 227 -67 -333 152 3 -68 -61 -58 27 55 235 0 138 99 -17 -101 140 69 4 -87 115 198
3335 198 -2 -97 149 141 -176 -67 -98 -56 63 214 14 127 -84 -351 -15 -262 -423 -100 -103 137 89 -157 -173
3358 -173 -38 -155 73 -54 -117 -19 -94 358 -107 -239 -156 -157 -129 -397 400 -177 -134 -14 271 -94 241 -86 44
3381 44 21 298 -186 38 222 -65 -171 55 149 79 16 197 -117 333 139 75 88 283 169 67 -27 110 135
3404 135 -198 -315 -85 195 -4 -35 -190 24 -86 7 -42 96 -119 46 58 167 -237 197 163 -4 108 304
3426 304 -34 45 199 -6 59 -38 121 45 170 -146 -60 -113 94 -77 -249 47 145 166 99 200 -111 159 -6
3449 -6 -138 -82 -111 -93 -195 62 -4 -57 166 130 17 90 6 -91 -213 3 -359 -102 -181 44 45 128 -91 137 -266
$$ packed form
3286B%j68L21l21P0J43R0q8l34M29q0j82L6jo0J88J22k82J24m8K79k17l40M28
3310A11j03K37m7K9k94k66M85j49p1PLQ5K8J80k35J38l9j16q4K41p1o5r1K02Q3
3335A98k00r5K46ql17J09l1M2J19J51k00J13k11k67L36k47j61L23lK40m8k46j6
3358a73J35j17K28j27o3R8p5M52m65j32Q3jK8k68P97n77M3J20K85l65L35l27J30
3381D4k3K77m84K24J84k87j06K26R4p0o3J81l14M50j94o4J3J95j14j02r4J37K5
3404A35l33j17K30K80j99l1j55K14j10R3m9J38k15J65J2J09m04M34l4j67J12J96
3426C04l38P9J54k05O5r7J59p6J25l16Q6n3K07j71j72K96R8K1o7J01l11K70j65
3449fj32N6k9J8j02K57o6n3K23l6j13P3q4r7j22K16l62K57p9K25JQ3k19K28m03
$$ plain form
3474 -266 203 62 108 -46 84 184 -158 44 161 93 -35 8 113 90 -9 -216 52 88 -169 28 395 -45
3496 -45 366 141 -102 -107 14 88 52 87 100 212 169 36 136 98 13 96 89 52 27 225 -321 48 -139 128 155
3521 155 19 -170 -149 -110 -260 112 55 -11 256 -260 7 -61 152 -17 -114 -93 15 -195 -11 103 -89 120
3543 120 -62 380 362 -33 154 -238 -101 -210 -429 -10 -53 -62 49 -173 -176 189 20 -91 -50 377 8 -63 140
3566 140 31 -176 89 -247 -40 -95 496 -211 29 -76 21 301 -27 -128 88 -101 -37 -263 100 19 36 -281
3588 -281 -103 26 -259 272 50 -19 -150 -39 76 -167 -64 -186 202 -34 -240 69 58 -26 -45 124 -15
3609 -15 -228 260 132 290 -157 45 53 -196 -163 52 2 -72 65 283 224 -117 -71 77 225 119 -1 185 -148
3632 -148 -149 99 138 141 3 59 -197 39 75 205 72 161 53 103 56 90 -171 106 -99 -375 -305 109 -26 -11
$$ packed form
3474b66M69j41M6j54J30J00l42K02J17o8j28M3J05k3r9k07K68L6k57J97L67m40
3496d5M11k25k43nJ21P4l6L5J3J12m3j33J00l8q5Q3pl7k5J98n46L69j87K67K7
3521A55j36j89K1L9j50L72n7o6K67n16K67o8K13j69r7K1J08k10J84J14j92K09
3543A20j82M42j8l95J87l92J37j09k19M19m3rJ11k22lL65j69j11M1M27l69p1K03
3566A40j09k07K65l36K07n5N91p07K40j05R7K80l28j01K16j89O4k26L63q1J7l17
3588b81J78J29k85N31k22o9j31J11J15k43J03j22L88k36k06L09j1q4j9J69j39
3609a5k13M88j28J58m47K02Qk49L3K15n0p4J37K18n9l41M6J48J48j06j20J86l33
3632a48jK48L9Lj38N6k56K36L6J30j33Q9j08N0m7L4k61K77k05k76P0M14j35J5
$$ plain form
3656 -11 16 -73 -204 152 121 172 -287 -215 2 -176 17 -238 94 -109 72 -78 333 32 -127 -67 -116 -31 383
3679 383 -32 33 -192 -244 -7 52 29 14 -191 -24 268 45 392 -93 75 44 -44 221 -226 286 150 -113
3701 -113 3 -217 100 -435 -122 92 177 31 55 29 -29 -120 -39 271 125 22 -20 -191 254 -180 -258 53 -12
3724 -12 204 193 -58 -144 226 -96 168 -175 -96 -287 41 -55 -79 -130 49 225 275 92 243 -177 34 182 208
3747 208 70 -58 201 284 -334 -250 -75 57 -109 13 12 -669 135 195 -15 132 395 -77 -127 -185 18 -4 -255
3770 -255 -41 -54 196 -26 9 10 331 -267 75 383 -403 -56 -161 -311 -194 -115 116 -152 167 -29 65 60 75
3793 75 -45 268 -154 149 79 -34 188 29 96 70 123 46 115 65 -74 122 -37 46 70 -227 -113 -64 -184 -36
3817 -36 49 -17 -8 -41 -205 -35 -187 -50 248 95 -236 106 -369 -30 119 -63 188 50 -251 107 -52 97
$$ packed form
3656a1K7q9j31L56l1N1m59P2K17j78J93k55L32k03J81j50M11l01j59O0m9Q5M14
3679C83m15O5k25n2K37N9k3j5k05J67K92k23L47m85J68l1q8K65m47N12j36k63
3701a13J16k20L17n35L13K14Q5j46K4k6n8r1Q1L10j46j03m2j71M45m34p8L11o5
3724a2K16j1k51q6L70l22K64l43P9j91L28r6k4n1J79J76N0j83J51m20K11J48K6
3747B08j38j28K59Q3o18Q4J75J32j66J22jo81Q04O0k10J47K63m72n0n8K03k2k51
3770b55K14j3K50k22L5JL21n98L42L08p86L47j05j50J17P9K31k68L19j96R4nJ5
3793G5j20L13m22L03p0j13K22j59O7k6N3p7O9n0j39J96j59Q3K4k97J14M9j20J48
3817c6Q5o6Rl3j64J70j52J37K98j53l31L42m75L39J49j82K51j38l01L58j59J49
$$ plain form
3839 97 -135 2 -349 231 -76 -122 218 -231 14 -60 -245 62 187 -135 -91 119 198 7 117 -255 146 -140
3861 -140 186 140 278 269 -218 -122 -179 -43 -13 52 -176 100 193 197 -91 -27 -167 -268 -87 -31 -96 -46 240 349 -105
3886 -105 128 -31 -76 -61 31 37 170 238 117 184 -89 -308 -223 -315 66 -46 279 129 25 -162 0 -74 -279
3909 -279 33 126 -205 67 133 -184 197 -107 182 73 -51 -52 351 -15 93 -373 71 188 -146 -225 -8 203
3931 203 -23 -145 337 152 200 255 -132 -23 69 21 -21 -130 -111 67 -3 55 35 148 -112 -2 15 443 -36
$$ packed form
3839I7k32J37l51N80l07m6L40m49K45p4j85L07J25l22M4K10P9j91J10l72M01k86
3861a40L26m6J38rm87R6n7J36L0O5k28K76R3Mk88O4j40j01J81N6o5N0K86J09m54
3886a05K33j59m5J5R2OJ33O8j21O7k73k19Q5r2L81j12L25j50j04j87J62p4k05
3909b79L12R3l31K72O6l17L81l04K89j09j24jM03l66J08m66M44J17l34p9K17K11
3931B03k26j22M82j85M8N5l87J09R2m8m2j09J9J78p0N8k0J13k60J10J7M28m79
$$ [...]
8191A71
##END NTUPLES=NMR FID
##END=
