##TITLE=1H_PR158_K
 CDCl3, 8 sc, 
 11.3.2019
##JCAMPDX= 6.0         $$ Bruker NMR JCAMP-DX V2.0
##DATA TYPE= NMR FID
##DATA CLASS= NTUPLES
##ORIGIN= UXNMR, Bruker Analytische Messtechnik GmbH
##OWNER= root
$$ XWIN-NMR		Version 3.5
$$ Mon Mar 11 13:58:18 2019 Russian Standard Time (UT+4h)  she@DPX200
##.OBSERVE FREQUENCY= 200.1316
##.OBSERVE NUCLEUS= ^1H
##.DELAY= (6, 6)
##.ACQUISITION MODE= SIMULTANEOUS
##.ACQUISITION SCHEME= undefined
##.AVERAGES= 8
##.DIGITISER RES= 18
##SPECTROMETER/DATA SYSTEM= spect
##.PULSE SEQUENCE= zg30
##.SOLVENT NAME= CDCl3
##.SHIFT REFERENCE= (INTERNAL, CDCl3, 0, 15.7039)
##AUDIT TRAIL= $$ (NUMBER, WHEN, WHO, WHERE, WHAT)
$$ ##TITLE= Audit trail, XWIN-NMR		Version 3.5
$$ ##JCAMPDX= 5.01
$$ ##ORIGIN= Bruker BioSpin GmbH
$$ ##OWNER= she
$$ F:/spectra/data/she/nmr/H-F/1/audita.txt
$$ ##AUDIT TRAIL=  $$ (NUMBER, WHEN, WHO, WHERE, WHAT)
(   1,<2019-03-11 13:57:15.89 +0400>,<she>,<DPX200>,
      <created by zg, POWCHK disabled, PULCHK disabled
       configuration hash MD5:
       00 E9 B6 7A A2 85 ED C7 34 08 36 98 17 FE 4E 26
       data hash MD5: 16K
       AE 59 A0 97 05 FE 5C BE 8D B8 95 94 C4 21 08 9E>)
$$ ##END=
$$ 
$$ hash MD5
$$ E3 B4 23 5E 39 69 A5 EB 16 A3 AE 08 F2 BC 5A CE
##$RELAX= 
##$RELAX= 
##$RELAX= 
##$RELAX= 
##$RELAX= 
##$RELAX= 
$$ Bruker specific parameters
$$ --------------------------
##$DU= <F:/spectra>
##$EXPNO= 1
##$NAME= <H-F>
##$PROCNO= 1
##$TYPE= <nmr>
##$USER= <she>
##$AMP= (0..31)
100 100 100 100 100 100 100 100 100 100 100 100 100 100 100 100 100 100 
100 100 100 100 100 100 100 100 100 100 100 100 100 100 
##$AQSEQ= 0
##$AQ_mod= 1
##$AUNM= <au_zg>
##$AUTOPOS= <>
##$BF1= 200.13
##$BF2= 200.13
##$BF3= 200.13
##$BF4= 200.13
##$BF5= 200.13
##$BF6= 200.13
##$BF7= 200.13
##$BF8= 200.13
##$BYTORDA= 1
##$CFDGTYP= 0
##$CFRGTYP= 5
##$CHEMSTR= <none>
##$CNST= (0..31)
1 1 145 1 1 1 1 1 1 1 1 1 1 1 1 1 1 1 1 1 1 1 1 1 1 1 1 1 1 1 1 1 
##$CPDPRG= <>
##$CPDPRG1= <>
##$CPDPRG2= <>
##$CPDPRG3= <>
##$CPDPRG4= <mlev>
##$CPDPRG5= <mlev>
##$CPDPRG6= <mlev>
##$CPDPRG7= <mlev>
##$CPDPRG8= <mlev>
##$CPDPRGB= <>
##$CPDPRGT= <>
##$D= (0..31)
0 1.2 0 0 0 0 0 0 0 0 0 0.03 0 0 0 0 0 0 0 0 0 0 0 0 0 0 0 0 0 0 0 0 
##$DATE= 1552298235
##$DBL= (0..7)
120 120 120 120 120 120 120 120 
##$DBP= (0..7)
150 150 150 150 150 150 150 150 
##$DBP07= 0
##$DBPNAM0= <>
##$DBPNAM1= <>
##$DBPNAM2= <>
##$DBPNAM3= <>
##$DBPNAM4= <>
##$DBPNAM5= <>
##$DBPNAM6= <>
##$DBPNAM7= <>
##$DBPOAL= (0..7)
0.5 0.5 0.5 0.5 0.5 0.5 0.5 0.5 
##$DBPOFFS= (0..7)
0 0 0 0 0 0 0 0 
##$DE= 6
##$DECBNUC= <off>
##$DECIM= 24
##$DECNUC= <off>
##$DECSTAT= 4
##$DIGMOD= 1
##$DIGTYP= 9
##$DL= (0..7)
0 120 120 120 120 120 120 120 
##$DP= (0..7)
150 150 150 150 150 150 150 150 
##$DP07= 0
##$DPNAME0= <>
##$DPNAME1= <>
##$DPNAME2= <>
##$DPNAME3= <>
##$DPNAME4= <>
##$DPNAME5= <>
##$DPNAME6= <>
##$DPNAME7= <>
##$DPOAL= (0..7)
0.5 0.5 0.5 0.5 0.5 0.5 0.5 0.5 
##$DPOFFS= (0..7)
0 0 0 0 0 0 0 0 
##$DQDMODE= 0
##$DR= 18
##$DS= 0
##$DSLIST= <SSSSSSSSSSSSSSS>
##$DSPFIRM= 0
$$ [...]
##$SUBNAM2= <"">
##$SUBNAM3= <"">
##$SUBNAM4= <"">
##$SUBNAM5= <"">
##$SUBNAM6= <"">
##$SUBNAM7= <"">
##$SUBNAM8= <"">
##$SUBNAM9= <"">
##$SW= 24.9336934301222
##$SWIBOX= (0..15)
0 0 2 0 0 0 0 0 0 0 0 0 0 0 0 0 
##$SW_h= 4990.01996007984
##$TD= 16384
##$TD0= 1
##$TE= 0
##$TE2= 300
##$TE3= 300
##$TEG= 300
##$TL= (0..7)
0 120 120 120 120 120 120 120 
##$TP= (0..7)
150 150 150 150 150 150 150 150 
##$TP07= 0
##$TPNAME0= <>
##$TPNAME1= <>
##$TPNAME2= <>
##$TPNAME3= <>
##$TPNAME4= <>
##$TPNAME5= <>
##$TPNAME6= <>
##$TPNAME7= <>
##$TPOAL= (0..7)
0.5 0.5 0.5 0.5 0.5 0.5 0.5 0.5 
##$TPOFFS= (0..7)
0 0 0 0 0 0 0 0 
##$TUNHIN= 0
##$TUNHOUT= 0
##$TUNXOUT= 0
##$USERA1= <user>
##$USERA2= <user>
##$USERA3= <user>
##$USERA4= <user>
##$USERA5= <user>
##$V9= 5
##$VALIST= <valist>
##$VCLIST= <CCCCCCCCCCCCCCC>
##$VD= 0
##$VDLIST= <DDDDDDDDDDDDDDD>
##$VPLIST= <PPPPPPPPPPPPPPP>
##$VTLIST= <TTTTTTTTTTTTTTT>
##$WBST= 1024
##$WBSW= 4
##$XGAIN= (0..3)
0 0 0 0 
##$XL= 0
##$YL= 0
##$YMAX_a= 102821
##$YMIN_a= -150131
##$ZGOPTNS= <>
##$ZL1= 120
##$ZL2= 120
##$ZL3= 120
##$ZL4= 120
##$ABSF1= 10
##$ABSF2= 0
##$ABSG= 5
##$ABSL= 3
##$ALPHA= 0
##$AQORDER= 0
##$ASSFAC= 0
##$ASSFACI= 0
##$ASSFACX= 0
##$ASSWID= 0
##$AUNMP= <proc_1d>
##$AZFE= 0.1
##$AZFW= 0.1
##$BCFW= 1
##$BC_mod= 2
##$BYTORDP= 1
##$COROFFS= 0
##$CY= 11.3945322036743
##$DATMOD= 1
##$DC= 2
##$DFILT= <>
##$DTYPP= 0
##$F1P= 18.9103706918063
##$F2P= -1.10871071338519
##$FCOR= 0.5
##$FTSIZE= 0
##$FT_mod= 4
##$GAMMA= 1
##$GB= 0.15
##$INTBC= 1
##$INTSCL= 1
##$ISEN= 128
##$LB= 0.24
##$LEV0= 0
##$LPBIN= 0
##$MAXI= 10000
##$MC2= 0
##$MEAN= 0
##$ME_mod= 0
##$MI= 1.114404
##$NCOEF= 0
##$NC_proc= 0
##$NLEV= 6
##$NOISF1= 3.799351
##$NOISF2= 2.8
##$NSP= 1
##$NTH_PI= 0
##$NZP= 0
##$OFFSET= 15.70392
##$PC= 1
##$PHC0= -8844.772
##$PHC1= 12.20014
##$PH_mod= 1
##$PKNL= yes
##$PPARMOD= 0
##$PSCAL= 0
##$PSIGN= 0
##$REVERSE= no
##$SF= 200.130013532006
##$SI= 16384
##$SIGF1= 3
##$SIGF2= 2
##$SINO= 400
##$SIOLD= 16384
##$SREGLST= <1H.CDCl3>
##$SSB= 0
##$STSI= 0
##$STSR= 0
##$SW_p= 3612.71676300578
##$SYMM= 0
##$S_DEV= 0
##$TDeff= 0
##$TDoff= 0
##$TI= <>
##$TILT= no
##$TM1= 0
##$TM2= 0
##$TOPLEV= 0
##$USERP1= <user>
##$USERP2= <user>
##$USERP3= <user>
##$USERP4= <user>
##$USERP5= <user>
##$WDW= 1
##$XDIM= 8192
##$YMAX_p= 0
##$YMIN_p= 0
$$ End of Bruker specific parameters
$$ ---------------------------------
##NTUPLES= NMR FID
##VAR_NAME=  TIME,          FID/REAL,        FID/IMAG
##SYMBOL=    X,             R,               I
##VAR_TYPE=  INDEPENDENT,   DEPENDENT,       DEPENDENT
##VAR_FORM=  AFFN,          ASDF,            ASDF
##VAR_DIM=   8192,          8192,            8192
##UNITS=     SECONDS,       ARBITRARY UNITS, ARBITRARY UNITS
##FACTOR=    0.0002004,     1,               1
##FIRST=     0,             0,               0
##LAST=      1.6414764,     0,               0
##MIN=       0,             -150131,         0
##MAX=       1.6414764,     102821,          0
$$ Real data points
##PAGE= N=1
##DATA TABLE= (X++(R..R)), XYDATA
$$ [...]
2827a767n730Q994M202o905k95O989k587q790J625P529m35m092R92J55m561J344
2843c332N680j038m468K059L168o066k848Q966M263r115l850Q927J928r055n6
2858d837J1203m12j0668K3R579j328p261L412O555m085o154L078L775k322p34
2873a76L254k328m706K794M128l514j630N213n00q418M56J0140K48r405O72Q232
2889D460l646q039N643J0035n436r634M316P298m179m168N738K630o028k923M996
2904A063J665k982J271R06l278j803N066P18n400Q08N485k915o910L974P423m358
2920G33p220N431O948p007o218P520N900o998m212O634L042o293j849O668J046
2935D125n241q03L564j277j081L191K8m264L53L894k270l249M336L554o680m586
$$ y = [-1767, -7497, 1497, 5699, -1206, -1501, 5488, 2901, -5889, -4264, 3265, 2830, -1262, -270, -115, -4676, -3332, 2348, 1310, -3158, -1099, 2069, -3997, -6845, 2121, 6384, -2731, -6581, 2346, 4274, -4781, -4837, 6366, 5954, -4714, -4691, 4888, 3560, -3701, -289, 6266, 2181, -3973, -895, 2880, 558, -176, 3078, 750, -3956, -1162, 2966, -548, -2178, 3035, 2535, -5883, -5427, 4713, 4961, -4444, -3772, 4460, 814, -7225, -1582, 8453, 3017, -6617, -2301, 4997, 818, -3350, 2388, 5018, -1010, -3933, 1063, 2728, -254, 1017, 1923, -1355, -3158, 1908, 2626, -2774, -1966, 3519, 604, -6306, -2332, 5091, 733, -6487, -1056, 5892, -1115, -7333, 187, 6087, -911, -5123, 1511, 4553, -1740, -3589, 3079, 4125, -1116, -1919, 1645, 368, -713, 2478, 2506, -1758, -1405, 2489, 219, -3030, 1306, 4860, -1820, -6406]
2951f406P199M560o869l614O926K137p841j452Q851J387q319j009O983K09m801
2966b059R00L981j560l189J969J771j532r2J710j853j963L215J924m735j456N476
2982B507P58o325m95O773l05p569Q32P487q42p569P28P656j470o029J864N037
2998C038k159l985K260L596j916j699J299j22j38J206Q06k667m68L144n24l840
3014b169J581N061l065n876K785O351k727o108K534N255l598m804L990M419l409
3029B20m369K993L392j834k368J656R36j026k89J009k91K86R63j399j521K487
3045H45K556l263l152L627L151l901k893L757L132m474l293M798K830m877k997
3060d154L850K904k933k060K373J099j907j231J893J079q7j573m76P21K033Q6
$$ y = [-6406, 793, 5353, -1516, -5130, 1796, 3933, -3908, -5360, 3491, 4878, -3441, -4450, 2533, 2742, -2059, -1159, 2822, 1262, -1927, 42, 1813, 281, 189, 1899, 46, -1917, 1298, 3222, -1513, -2969, 2507, 3265, -3060, -3555, 3218, 2913, -4656, -3824, 3663, 2821, -4748, -4020, 3636, 2166, -3863, -1999, 3038, 879, -3106, -846, 2750, 834, -865, 434, 312, 174, 1380, 2186, -481, -949, 2195, 1671, -2169, -588, 4473, 1408, -4468, -1683, 4668, 1941, -4167, -1633, 3622, 24, -4780, -790, 3629, 220, -4149, -1156, 2236, 402, -1966, -310, 626, -400, -689, 320, 29, 315, 1278, -121, -1642, 845, 3401, 138, -3014, 613, 3764, -137, -3030, 727, 3859, -615, -3908, 890, 3720, -1157, -4154, -304, 2600, -333, -2393, -20, 1079, -828, -2059, -166, 913, 826, -747, -1223, -502, 1531, 1617]
3076A617k280o49K747N96k832m41L917R0m968l69M565J257m460j588M302Q90m162
3093a768k99L500O46l609j279K780J716j704j601J000J044L92j378l41J147J142
3109A388j863j336K079K846k063l338J293L552q62l737J019L338j158l502Q78
3124a466L754n55m446k9L567R36l255n17J816Q06j211j075J472J633j094k143
3140a807l8L070O07k256r90K056J880k296j560K720J824k602k590K511L026k361
3156A194l074J406K824j356k605R38K411j020k545J68K522O60k359j651J747J710
3172I70j017j917R61K157q41k447P48K809K68l343o55L251J039k251j590K376
3188E18J579k192k011K435J725j778k719J484K806p72k445n36K508L4j855m09
$$ y = [1617, -663, -1312, 1435, 2031, -801, -1242, 2675, 2765, -2203, -2572, 1993, 3250, -1210, -2798, 1504, 2394, -1768, -2067, 1433, 2079, -1530, -2809, -29, 1687, -17, -1618, -618, 426, 818, -560, -901, 246, 1388, -475, -1811, 268, 3114, 1051, -2287, -994, 2558, 1696, -2041, -1022, 2316, 1158, -2344, -1466, 2288, 1733, -2713, -2742, 825, 1761, -1494, -2011, -195, 611, -600, -1675, -203, 1430, 336, -1807, -1845, 1225, 1832, -424, -1414, 642, 2522, 226, -1334, 1386, 3210, 608, -1982, 529, 3555, 1194, -1880, -474, 2350, 994, -1611, -673, 1738, 718, -1827, -1659, 863, 1523, -836, -2487, -740, 970, -47, -1964, -1003, 1154, 313, -2134, -1386, 1423, 1691, -1652, -2307, 944, 1983, -268, -1858, 518, 2097, -95, -2106, 329, 2054, 276, -2443, -959, 1847, 1075, -1370, -1906, 602, 636, -1219, -1628]
3204a628K141P75k006j395J818K720j882k378R56K726m91k546Q90K196M6k733
3220g91k02L406P30l752p30K639J519k406j390J573J239j495k143J365K141r07
3236G96k514m44K476O68k095j705K102J103j801j360J988J992k070k712J758L544
3252A726j125k766N10L166o62k177O54K505k31k308l92K484J342k224j062J264
3268G04J233r31j131K83J621k22k540K0K154P43k675j576K440J701k227k197K268
3285c32K062k498k305K435K518k101k663J537L007j043j930P12J384l37r10l5
3301d99J519K38p39j415K66K785l27k495p17K657P19k812o69L475M45m289o44
3318b502L911J446l721j488L143J101k810j160K738J073k221j528J479J415n99
$$ y = [-1628, 513, 1288, -718, -2113, -295, 2425, 543, -1835, -879, 1847, 1356, -1190, -300, 1896, 1942, -791, -993, 2413, 3143, -609, -1339, 1300, 2819, 413, -977, 596, 1835, 340, -1803, -438, 1703, 796, -1718, -2162, 314, 982, -1113, -2818, -716, 387, -1414, -2774, -786, 1206, -864, -3576, -1818, 1726, 601, -2165, -1655, 1511, 849, -1328, -674, 1831, 1600, -708, -1100, 1384, 2726, 502, -560, 704, 1937, 1006, -125, 158, 1779, 1557, -983, -963, 1191, 1934, -741, -2317, 123, 1824, -403, -2600, -332, 1730, -768, -3073, -638, 1880, -221, -2884, -1347, 1660, 617, -1313, -601, 783, 446, -464, -499, 1020, 1258, 519, -896, -630, 2155, 1828, -667, -1384, 1273, 1992, -820, -1489, 1986, 2431, -1858, -2502, 1409, 2855, -866, -2354, 789, 1890, -920, -2080, 658, 1731, -490, -2018, -539, 876, 277]
3333B77j013j81R90N22o87j392N81K191q28k362M88L211j124l698Q10M790o26
3350A949m713L51M243o06l705J527L481j035l570K11L312K01j783J48Q81p08l44
3367a60Q79o6Q74J20j353k197J789K907j240l547R86L456j751l851K596M253l121
3384E74m620K669M087k606l418L077K962k993l151K709K139j696q57J472J9p50
3400c83K0M05o14R38J547j570k948J849L335k213k835K844K374m821k773N290
3416D45L864m745l557M011J905m126r31N113J099m489j915L491J125j337Q23R20
3432A696j788o93J751K84q57J378J161k842k478L760K706m082j928M099Q99n715
3448b649j445O881J199o448j062N306m10n579J096N595q12m799O35K886j537n87
$$ y = [277, -736, -917, 73, 595, -92, -1484, -903, 1288, 460, -1902, -1414, 1797, 673, -3025, -2215, 2575, 1949, -2764, -2413, 1830, 1224, -2481, -954, 2527, 1492, -2078, -1867, 1445, 1646, -137, 11, 892, 184, -160, 719, 653, 1527, 1647, 294, -1903, -114, 2793, 1553, -1994, -1008, 2448, 697, -3154, -558, 3695, 574, -4046, -1377, 2710, 104, -3314, -237, 2725, -268, -3419, -710, 1429, -267, -1124, 348, 367, -383, -363, 42, -572, 366, 1913, 343, -2605, -756, 2579, 366, -2469, 375, 2749, -2072, -4845, 445, 4309, -436, -3993, 18, 1923, -2203, -3134, 1979, 3078, -1411, -3326, 165, 1290, -47, 776, 1696, -92, -785, 966, 1250, 393, 1771, 2932, 90, -2388, 1372, 4078, -4, -1932, 2167, 3066, -2649, -4094, 2787, 3986, -2462, -3524, 1782, 1372, -4207, -3111, 2484, 1672, -3127, -2492, 394, -1143, -1730]
3464a730K333P42k846L4J819j007j56L537N79m661j715N063J163m376M43N619
3480D841k434o963K258O911j500n688J826L738l401l519L807M296l524l776J901
3495a227J232j586O42K808j569k582J361J429k615R22M492j387n335J167N309
3510C061j660m419L404M771m353n692M287N600m318l753M267K709n783k548N902
3525A475J929l649j080J464p36k117K844K139k560j097J652r37k487L234M042
3540D116l252n108L530L609l530k540N860K521p259l157O660K914n119j598M794
3555B441n02n302P67N373n83l542N80J483j672j014L131L41k659N86J970k990
3571a592j599M505K590n001k078M628J186n612N41O841k44p158n06O065l65m317
$$ y = [-1730, 603, 1345, -1501, -1467, 352, -655, -811, 2726, 3305, -1356, -3071, 1992, 3155, -1221, -778, 4841, 2407, -4556, -2298, 4613, 3113, -2575, -749, 2989, -412, -3931, -124, 4172, 648, -3128, -1227, 5, -1581, -939, 1869, 300, -2282, -921, 508, -2107, -1185, 3307, 1920, -3415, -2248, 3061, 1401, -3018, 386, 5157, 804, -4888, -601, 4999, 681, -3072, 1195, 3904, -1879, -4427, 1475, 3404, -245, -1325, 139, -597, -2714, 130, 2269, -291, -1388, 264, -673, -3160, 74, 4116, 864, -4244, -714, 2895, -635, -3175, 2685, 5206, -2053, -5210, 1450, 4364, -755, -2353, 2441, 1939, -3363, -2596, 2777, 2194, -1348, -768, 715, -957, -1971, 1160, 1501, -1158, -572, 1398, -1592, -3191, 1314, 3904, -1097, -3175, 1453, 2639, -2973, -2432, 4409, 4165, -2993, -3499, 2566, 2201, -2116]
3587b116J956M147l094m447K026M248j666j890J551m31l035J343K828p19j960
3602a259J725K17m061L28O008K17n592j12N050j500m840L378N564l674n798K937
3618a412M772k254l811L734K943m433k626L517J947k434J2J430j464j741J726
3633i4R60j362N1K295j961l856K063M715j442m142K384L386m517k721N071L946
3649D776m493l929L653K395l332p95M379O39m556j074K947J050j323Q14O5k421
3665a205m30K447m92j136J353J468l816k430M987K217l698k191M002J100m816
3680b640p07N289J554n142j197M233J68l133M37L493m06l153j5J854j19k93J140
3697A363n16j721M58Q91j146MK768l77l850n56L863R58l655J46L361j243m456
$$ y = [-2116, -160, 3987, 893, -3554, -1528, 2720, 1054, -836, 715, 284, -2751, -1408, 1420, 701, -1259, 466, 683, -3378, -3050, 2958, 3175, -2417, -2529, 2521, 1021, -3819, -441, 5123, 1449, -4349, -1412, 3360, 1106, -2705, 1029, 3972, -461, -3087, 430, 2377, -57, -45, 1385, -79, -1820, -94, 866, -496, -445, 1850, -111, -3967, -1904, 2811, 1369, -2773, -389, 2997, -1520, -4241, 830, 4776, 283, -3646, 7, 2402, -930, -1725, 2654, 3293, -1263, -2337, 610, 1660, 337, 1151, 1216, -1205, -1635, 812, 320, -816, 537, 2005, -1811, -4241, 746, 2963, -735, -2926, 1076, 2176, -2640, -3347, 1942, 3496, -1646, -2843, 1390, 1558, -1575, -1138, 2355, 1949, -1204, -1219, 635, 516, 223, 1363, 847, -874, -416, 475, -671, -667, 2101, 1724, -2126, -2682, 1181, 2139, -1516, -1370, 1991, 748, -3708]
3714c708J525N041p31m180M97L011r05k443J895K484j425k480K79J671j03L37
3730G65M09j049r89J369j53j652J480J919j767k975J161L250j210k789J619K507
3746A895k053l197K133L346j508l076K069K098j812j593K235J136q88j288J51
3761c52L67K90O70l67o73P11L12j428m30J882J446k490k228K305K062k307j543
3778a773K528J029l072j616K866K070k229j645J331J308j241j123J594J015q23
3793B19j109L31Q81L42l94n92j18J892k42j779k59K336m7k513R1K275J69k286
3811h03p57K843M31k901r36K729N13j929m82J474P35j435j006J001J265o95r77
3828i30M61O67Q34r51p52P88J404j424j318J430J699j214k120O98K213l89k389
$$ y = [-3708, -2183, 2858, 2127, -2053, -1556, 1455, 550, -1893, 2, 2486, 1061, -1419, -1140, 531, 428, 765, 1174, 125, -864, 505, 352, -1300, 180, 2099, 332, -2643, -1482, 1768, 558, -2231, -612, 1895, -158, -3355, -1222, 2124, 616, -2460, -391, 1707, -105, -1698, 537, 1673, 785, -503, -352, 15, 305, 975, 608, -65, 646, 958, -470, -900, 982, 2428, -62, -2290, 15, 2077, -230, -1773, 755, 1784, -1288, -2904, -38, 2032, -197, -1842, -511, 797, -444, -1567, 27, 1042, 219, -890, -559, 322, 664, 270, -322, -440, 1452, 1210, -569, -828, 1508, 1461, -1052, -961, 1314, 1483, -803, -1560, 1283, 1714, -1187, -2123, 606, 1119, -810, -1292, 182, 917, -518, -1524, -523, 742, 47, -930, -469, 198, 1032, 81, -671, 117, 1521, 97, -1221, 209, 1908, 694, -1426, -728, 1485, 1096, -1293]
3845a293N77K259q27k188M45K136K20k443l16J758O77j561p45J255O85j092o93
3862a146N61J800o50j442l33J940N55j605r91J613J187j485j027J080J578j609
3878B6j192J076J695q77j935O55J386k65j687J39J922l20j584j24J413N56j051
3895a67j382R24J247k04j673O95J388j18j473k66K102n6j725q41K287P12j574
3912a24j314J736J060j675r32J390J430j217j302L78J586m99j273K15J479Oj340
3929c96m56J578P32j028j480J073J757j152j619L74K003n16j767J09K149l15k045
3946i99n7K067J91j940q18J897L25j218p61R70P95q57j169N94J247r9j239l39
3964a410J636O55j158j055J573P64n44j400J355J486j265j677Q43K048m87j885
$$ y = [-1293, -716, 1543, 716, -1472, -1027, 1109, 1329, -1114, -1430, 328, 1005, -556, -1301, -46, 639, -453, -1146, -585, 1215, 565, -877, -1210, 730, 1285, -320, -1311, 302, 1489, 4, -1023, 57, 1635, 26, -1166, -90, 1605, 728, -1207, -552, 834, 569, -1118, -979, 943, 623, -961, -1085, 328, 884, -167, -1549, -625, 622, 418, -1255, -560, 828, 710, -763, -1029, 1073, 1017, -708, -1549, 738, 1450, -124, -1438, 298, 1358, -317, -1249, 141, 1571, 354, -948, -570, 1016, 517, -756, -541, 938, 944, -396, -852, 726, 1458, 430, -1050, 23, 1780, 628, -991, -617, 1386, 870, -897, -788, 1361, 1046, -999, -1056, 1011, 1202, -738, -1556, 341, 666, -552, -1313, -343, 452, -405, -1574, -980, 267, 168, -1071, -1410, 226, 881, -277, -1332, 241, 1005, 461, -939, 416, 1902, 637, -1040, -197, 1851, 1364, -521]
3980e21M59J887o19j923M35J726k43j692q03J456L99n63r99N15N13k84q13q7J202
3999D5N95j915n73J468J659k001j294J986J488j964j310K059J666j719j528J743
4015D05J609j744j085J072J228m82j244K05N89l7k78m82J7R41p98r66l76K136
4033G10M10k229o20K037O15k205m73K495Q36k910n24K954N73k669k04K296L49
4050A441j996j77J740K11q74l21R9J75J57L5o99k07R73J18j840L67J817j25k445
4069a551J23K557n35k484K70L234o02l065L72L169o90k469Q24K515q27k299J211
4086b47J533m29q28L55K27j016R51J51p42J63J269r90j823R10K573j160k502J003
4104f02K222j542k219J915K488j844l341K324K224j832j531J721J380j824j273
$$ y = [-521, -62, 1825, 1206, -717, -282, 1444, 1201, -491, -1294, 162, 561, -2, -1001, -486, 27, -257, -1070, -1157, 45, 640, -1275, -1848, -380, 1279, -722, -2016, -30, 1458, -506, -1816, 243, 1909, 190, -1338, 405, 2014, 270, -815, 257, 1485, 1003, -241, -36, 553, 516, 238, -244, -227, 714, -84, -1050, -1426, 710, 1120, -1109, -1729, 308, 923, -1282, -1755, 740, 1576, -1334, -1858, 1096, 1669, -1000, -1204, 1092, 1441, -555, -732, 1008, 1219, 345, 24, 123, 298, 455, 490, -209, -416, 557, 675, -1165, -798, 1019, 894, -1551, -1428, 1129, 594, -1890, -1620, 1614, 1012, -2053, -1681, 1488, 798, -1671, -847, 1668, 841, -1458, -247, 1286, 857, 29, 384, 611, -405, 546, 697, -45, 118, 1387, 397, -1426, -516, 2057, 897, -1605, -602, 1620, 78, -2141, -226, 2262, 418, -2923, -599, 1625, -207, -1738, -17, 1363, -461, -1734]
4119a734J703J198j451M14K81n71m93J329J60j326P51J647j991k265K573K221
4135B446k120k284K152J824k672j947L627J936l837j720K954J120k706k62L140
4150A651l39k410J10J592P6o91Q69R8j841J82J539l13j281J742Q66k912j391L442
4168I89J605l685r02L238N75m184K4M414j88m145M1L311l25k420Q97K753j311
4185F87k204R50J413q73l4J126q18j327J219J123k154K36K700j77l843J96L914
4202B134j68m006J039L555j902l870J733M611j627l973J617K564k410j274K397
4217D20J337k530o34J622M4o73P94J102j936m33J855L82k247Q39K443j206l321
4234b142J682L428j915l215K236K967l507k255L002K448l150k089L163O87k732
$$ y = [-1734, -31, 1167, -284, 130, 411, -160, -653, 676, 836, -490, 261, 1908, -83, -2348, 225, 2446, 326, -1958, 194, 2018, -654, -2601, 1026, 2962, -875, -2595, 359, 1479, -1227, -1489, 1651, 1312, -1098, -988, 604, 680, -11, 858, 956, -885, -703, 836, 523, -758, 984, 1850, -1062, -2453, 989, 2594, -1091, -1993, 1245, 1820, -2364, -2340, 2074, 1886, -2259, -2218, 1093, 768, -1652, -755, 1998, 687, -1517, -567, 846, -27, -61, 1065, 247, -1080, 139, 1262, -892, -656, 2044, 1867, -1976, -1780, 2134, 1966, -2040, -1001, 2554, 652, -3218, -1485, 3126, 1499, -2474, -857, 1707, -703, -1977, 420, 1757, -773, -1407, 215, 259, -414, 380, 1482, -454, -887, 968, 1350, -897, -58, 2385, 1179, -2142, -460, 2968, 1053, -2162, 74, 3041, -466, -2721, 281, 2729, -421, -2510, 653, 1340, -1392]
4249a392n43K767J4k029M68J165r29j028K218R1j947O64K153j510k097K337K250
4266B652k665k358L147K309l872j338L732J521m523q34M000M61l641l16L070n78
4282G67k307N39K030r96j380J404J38j103K41J535r33j627J794J632k261j363
4298a890L223P48l491m75M014K32m169j66M228k60m159J240L312j599k692J466
4314d38K176j292j821J094J263j590l47J355m39q82R87P46j710m93K199N09k873
4331a556P06L106q43l576J232L398j433l307K186K571j897k791K634J997k575
4346a48j686K081J115j813k97R02K34j568R50P24j021j10J020k67j808Q54K204
4363A366j456j837J572K377k218k031K513K485k872j996K678J681k442j093K366
$$ y = [-1392, -1935, 832, 846, -1183, -715, 450, -479, -1507, 711, 802, -1145, -481, 1672, 162, -1935, 402, 2652, -13, -2371, 776, 3085, -787, -2125, 1607, 3128, -1395, -2229, 1771, 2232, -1409, -1725, 1345, 767, -1540, -1001, 1029, 33, -1347, 57, 195, -908, -667, 868, -65, -1692, 102, 1734, -527, -1890, 1333, 2081, -1410, -1885, 2129, 2361, -1808, -1974, 2254, 1994, -2165, -925, 2387, 788, -1904, -438, 1738, 446, -1375, -281, 982, -608, -955, 400, -39, -921, 66, 812, -898, -1391, 808, 1317, -1556, -850, 2256, 1413, -2163, -931, 2467, 1034, -2273, -87, 2484, 587, -2204, 430, 2427, -148, -1834, 247, 1362, -451, -748, 154, 388, -1180, -230, 494, -527, -637, 383, 116, -1692, -838, 1366, -90, -1927, -355, 2022, -196, -2227, 286, 2771, -101, -2097, 581, 2262, -180, -1273, 1093]
4378A093N52j972q22J805L79j470P7Q67m67k85N04k0j183P86P92j371o10J404
4396E9J441k145r46K386P44k731r49L290P88k977l70K608L08k471n6K733l47k050
4414f85J15J281j5q93L69L05n91J6M16m75j21P32J04j667j06J904Lk252L11K451
4434A202k58k788J127K183o44k413P62K271p67j876Q31J346k20j382K91J285p97
4451A53k45L9K03J53k04L0j006O14J085p16j441J037J533j521j372J445J712j407
4469I2j905J266J983j425j378J211J433q68j472R35J170o93r58K33O79J85l53
4486A35j75O6O24n9j193L69O55M26j187j006J579O84j640m69J751O31j994m07
4504a210J534O80j731n79J310Q18o84p60N65P17j13j266Q59M14q2k68l00K83O82
$$ y = [1093, 1645, -327, -1149, 656, 1035, -435, -358, 509, 42, -243, 261, 241, -942, -156, 636, -735, -1345, 59, 1500, -645, -1591, 795, 1539, -1192, -2141, 1149, 1937, -1040, -1410, 1198, 1506, -965, -1021, 1712, 1365, -685, -570, 711, 696, -197, 172, 477, -114, -98, 318, -157, -278, 454, 558, -1109, -1215, 689, 692, -1560, -1249, 1202, 944, -1844, -717, 1466, 822, -1591, -829, 1442, 675, -1201, -370, 976, 756, -626, -335, 950, 153, -92, -53, 150, 303, 99, 129, -877, -263, 822, 106, -1335, -298, 1235, -286, -1658, -213, 1499, 92, -1813, -547, 1436, 11, -1367, -156, 1277, 409, -1063, -128, 1042, 349, -609, -376, 303, 488, 135, -40, 26, 650, 591, -602, -233, 422, 848, -339, -1345, 234, 918, -722, -1191, 560, 1191, -803, -1210, 324, 1004, -727, -1306, 4, 822, 138, -622, -57, 660, 547, -719, 140, 554, 472, 204, -96, 187, 869]
4523H69l13j104L03J147l74j447N07J151O1j688p8J450N1j232l67J298M45j482
4541h03KJ033K06p46o91J332M38p19n30J71J211l30q34j6J045r5m86n91R00N47
4561A044p61j317R38J045p35j341M32J402p04j250M87J173n16o44l94J742k59
4578C42j080J33J032L18j043k58L57L49J23r33N21J293n29r45k72J561J58p94
4596C33j014J051O18r00p81P30J137j361r33M92J580q93p82L00Q43m07r89nR51
4615c0L69j138k21R75O37m48o50P37M34j86q75P6J196j18j045o18J562N62j461
4634b42n18J463M04j204p34R52P16j189m78O55Q99m89r42K47P51n81m18L14N70
4653A76kq8j056Q33O79l90p06K48J200m73j106P5J597k04j773J86J427O3j323
$$ y = [869, 556, -548, -245, 902, 528, -919, -412, 739, 800, -888, -966, 484, 535, -697, -1064, 234, 679, -803, -801, 232, 438, -308, -999, 333, 771, 52, -478, -307, 904, 574, -260, -276, 769, 674, 188, -403, 497, 1044, 283, -1034, -96, 949, 214, -1127, -695, 707, 3, -1247, -760, 413, -103, -747, -1141, 601, 342, -738, -605, 427, 745, -298, -556, -199, 150, 273, -660, -139, 1154, 625, -320, -592, 969, 1127, 333, -681, 370, 988, 88, -693, 37, 1174, -187, -1120, -628, 952, 59, -723, -423, 420, 13, -976, -981, -30, 339, -799, -1020, -45, 592, 144, -506, 231, 665, 479, -396, -320, 876, 758, -287, -905, 657, 1219, -242, -760, 703, 1107, -97, -831, 121, 837, -352, -830, -175, 724, 235, -707, -460, 291, -290, -708, -394, 176, 174, 86, -970, -137, 542, 152, -554, -306, 894, 421, -685, -610, 987, 783, -990, -804, 623, 686, -637]
4672f37j88J784J15j543k69J470k58q59m37Q76K86m25l44m1P66R3n52l83J11J171
4692G36p64q63J213P87j023j281J095J205o53j480O44J511o57j384P32J343r56
4709B05q98O60N74k97p55n8N99r1l96K7J02Q15P1r36n80J180L90p12p78J351J024
4730A497k075p23J484J222j405j016J435O58j635m52J358O10j009q31Q17M32n16
4747a49J04K42k90N2k61k60J89N77L54j419j68J265N55j102n64K041j41k013j40
4766a128K073P97k500O5J734k3k011K95J940k91j358k46Q66o3l13M28K58q06L73
4785I0l24o01L13J386l13j395m70J805j10j595P26J867n48k408O59K366k96j741
4803e89N77J262j030j501R62J553n33j249L26N50l05j41O50l48l11K63l18p39
$$ y = [-637, -825, 959, 1074, -469, -738, 732, 474, -385, -822, 54, 340, -85, -429, -470, 296, 389, -163, -546, -435, 736, -28, -891, 322, 1109, 86, -1195, -100, 1105, 452, -1028, -384, 1127, 470, -914, -182, 1161, 205, -693, -33, 541, 244, -511, -569, 30, -61, -457, -430, -328, 487, 558, -378, -958, 222, 612, -100, -878, 473, 1497, -578, -1301, 183, 1405, 0, -1016, 419, 1077, -558, -1010, 348, 958, -51, -882, -65, 367, -149, -45, 197, -93, -41, -302, -562, -373, 204, 558, -861, -1029, 236, 791, -311, -875, 1166, 1025, -988, -1128, 945, 1742, -758, -693, 1041, 1018, -993, -698, 1242, 951, -407, -653, 213, 150, -163, 265, 523, -283, 90, -234, -835, -522, 864, 551, -844, -1314, 491, 381, -1214, -488, 1379, 831, -1577, -918, 1448, 1152, -589, -12, 1250, 220, -1281, -319, 1234, 701, -548, -222, 328, 23, -118, 532, 184, -127, 136, -182, -921]
4821i21N83J331n18j888M36J818p63j543J578J678j832k186J911J762j162j218
4837i34J271N24j367j013J825R50q21n39N70n10n33P93P26n16m92L25j88j324
4855a253J266J702j651j535J127J177j874o67K618P27k222j577K310R64j910J02
4871f96J946j55k045j75J997K34r26j50K38q14j33J402j44q30P84K86j476q60
4889a517K280P56j936j187K194K30k734J97K778M94l322K46K416k36k053Q68K280
4906A754j121k280Q63J388n55o6P02j61j524Q02J068o82l70J044k67j822L9K551
4924A363Rk343J23K126r28k620J807K526j175k738J082J998j487j088J574J085
4940A314j665r99J191M11m59K94Q26j061n64J052K13p08M62R53j167j660Q13K585
$$ y = [-921, -338, 993, 475, -1413, -977, 841, 78, -1465, 113, 1791, -41, -2227, -316, 1446, 284, -934, 337, 861, -506, -1519, 306, 1256, 435, -104, 466, -44, -577, 216, 942, 426, -66, 259, 71, -1253, 13, 1715, 64, -1471, -344, 833, -1041, -1708, 910, 1637, -585, -2162, 148, 1112, -798, -696, 1250, 1095, -950, -1125, 872, 1106, 180, 30, 268, -546, -679, 723, 579, -251, 533, 819, -657, -1517, 763, 1519, -417, -1604, 590, 820, -1914, -1717, 1061, 1555, -1767, -1521, 895, 659, -1394, -526, 1754, 633, -1647, -784, 604, 49, -17, 685, 524, -1000, -198, 870, 188, -182, 862, 595, -1227, -1188, 1363, 1372, -971, -848, 1278, 350, -2270, -463, 2063, 888, -1850, -768, 1230, -257, -1345, 229, 1314, -351, -1350, -159, 252, -207, 87, 913, -148, -712, 340, 553, -155, 307, 1260, 93, -1567, -754, 1831]
4958A831j048j947J290J797k269j880K544J633j941j426J373Q56j715l84K189
4973I03L09k119m10J193J06k66R72J70j530k09J176j46p48J166R93j900j415K003
4991B48J595j775j151K184L17k583n88K847N36k457l04J844l32j815P66J841r07
5008B66j292M13P01k50j75J044j89p98J36N38n06o76J919M17k037q94K086O14
5026A317j981N6K254r99k209N94K274l07j847M83J480j369j312J377J273q95j144
5043i55O37k16L5P00M08p04p26R25M45j281O55J701q60j963L14K040n98j557J351
5062C51J163j546j792J922J366j449q37J220L45j436q2R96M49p55l20L18m21J54
5080c54M79L59j021j79J348p68p71J134J450j539j617J369J179j068r81J520J048
$$ y = [1831, 783, -1164, 126, 1923, -346, -2226, 318, 1951, 10, -1416, -43, 813, -902, -1286, 903, 1212, -907, -1317, -124, -18, -284, 688, 858, -672, -881, 295, 149, -599, 567, 1560, -340, -1755, 248, 1843, 68, -1083, 1101, 1418, -1165, -1753, 1094, 1630, -827, -1131, 713, 381, -1434, -668, 1173, 266, -1026, -613, 88, -162, -337, 707, 518, -280, -144, 394, -112, -788, 1131, 1548, -489, -1383, 703, 1317, -664, -608, 1646, 647, -1562, -968, 1306, 999, -848, -365, 1115, -254, -1566, -189, 1084, 189, -955, -318, -534, -499, 201, 609, -95, -821, 104, 549, -732, -77, 1624, 764, -1199, -885, 1155, 557, -1000, 351, 1514, -32, -1824, 98, 1464, 15, -822, 398, 743, -693, -775, 221, 670, -85, -405, -87, -508, -354, 125, 484, -537, -716, 632, -136, -907, 227, 1677, 138, -1479, -110, 1069, 1, -980, 540, 1588]
5097A588j854j219J658J078j170n28J037m8j231O7R85K78p55K08k50l54M24M30
5115C44n69k74N22J77j041l7J463P11j735m44J542K81j457k34J782Kj779k85J668
5134F37M5r04k50J132k04j119N06O81k70m81J41k10JK97N9k50k4L93J6j029R8
5155g35J436J32j936M16J453k65j300M63J755j297p02J66J298m67l25j05P80m50
5173C17p48K91J15M39j94l84j54J37J68k37m18P34J76n39q12R87N71l58q99N80
5193b28J191j083p51Q65J177r73j185R29R35n52l91M23K02r6m80O6J60J66l5o79
5213c39N52j82K27m62k33O44M2p07n50J165J67j021m19J043O75r48m30Q67O39
5232G30p48p80R21M70l50m50K42L77J06n03k65Q12K9n15l30L87L13k79o37J49
$$ y = [1588, -266, -1485, 173, 1251, 81, -447, 590, 542, -689, -622, 363, 641, -114, 94, -156, -510, -86, 344, -225, -499, 23, 200, -841, -878, 585, 1296, -439, -883, 659, 940, -517, -751, 1031, 1033, -746, -1031, 637, 682, -222, -472, 660, 456, -663, -157, 524, 254, -227, -86, -296, -295, 2, 61, -189, -213, 180, 196, -833, -735, 701, 833, -1103, -687, 766, 501, -799, -336, 1419, 122, -580, -414, 884, 417, 92, -13, 767, 317, -431, -140, -25, 414, 220, -164, -318, -181, -13, -250, -668, 66, 242, -297, -1109, -122, 449, 91, -808, -228, 963, -120, -871, -6, 1171, 198, -987, -58, 877, 325, -66, 357, 559, 463, -17, 49, 209, 375, 340, -339, 213, 31, 258, -204, -437, 207, 249, -458, -1008, 157, 324, -697, -1116, -73, 602, -346, -776, 91, 730, -18, -798, 123, 593, 243, -207, 35, 412, 518, 15, -250, 562, 591, 76, -254, 133, 446, 167, -470, -321]
5252c21Q10m83o23M4J134l77p79L3R06R5p46l06R51J68q06m41J167K1k94n32J027
5273F48k03m21l16K18O34l63j24j65K84O17j046m60P23L72l12q50O50O28m19j143
5293a048N58N80L09j272M43N86rm86J3K21L50l97j80M88L10j54m64K96L07j22
5313C29n09n0N00L53n97n69Q96K18p07l44N44M92m90o87M73P44o25o89K75R87
5333E44m04n15j81J306n14m40l80O39L01q03k5M65M87m57j45q9Q37j34q45k12
5353e65R06O8p74j17O76K83p68l01R40m0n17j21K53L43m61k97M27J94R4m58K00
5374c5L48k59k42k98Q37J50l67o54Q40K90l64n27J23R82l75r97L0J378l67j106
5394f13P1Q87Kj053K66P77l1q05K25J44M95m79k67K87j29N46m53p6K70M51n31
$$ y = [-321, 489, 6, -617, -573, 561, 184, -595, -562, 344, 439, -307, -613, 338, 506, -300, -741, 426, 447, 153, -379, 648, 445, 24, -292, -74, 560, 197, 73, -92, 192, 809, -237, -697, 26, 398, 86, -764, -114, 514, 95, -1048, -490, 90, 399, -873, -430, 156, 147, -339, -326, -105, 245, -152, -332, 156, 466, 312, -152, 144, 451, 329, -180, -230, 270, 623, 26, -543, 353, 571, -136, -480, 64, 556, 66, -621, -148, 596, -29, -718, -443, 544, 140, -375, -556, 750, 236, -204, -584, 55, 356, -447, -472, -7, 480, 23, -122, -211, 626, 492, -353, -565, 341, 409, -365, -482, 194, 477, -291, -592, 348, 308, -209, -330, -77, 266, -195, -492, -65, 129, 223, -235, -35, 313, 54, -188, -486, 351, 501, 134, -520, 320, 610, 246, -281, -158, 824, 449, -548, -518, 860, 493, -613, -542, 345, 347, -706, -440, 337, 306, -499, -274, -130, 365, -114, -381, -94, -223, 323, -130, -206, 64, 515, -16]
5415a6n47K46J199n58p22N89M14l10p80N19O82o27m69N18L32Q0j091K84Q30o32
5435e9l19K62J57k70R2j39j7M16j19m94l6O40M42m17j095J218M01q03q21J002
5455D1P24j018l53Q85M54p47r31J289N88r68o37J067K18p35k24M38J74n42j35
5474d12L65l44L27L41p01k73Q05L77p39j53M26N94j045k55J273J59j474K21J029
5493E21J16j195L76O51J39j034j60Q76r6n74K9N41m63J51K61k87o25P67J98o87
5513d95Q2R75L11j535j3J367p8j211K60J274n44j189L28J533p64q24L41J052r59
5532h9q54J207J69m61J19R3J49m76J84P8m15J54K12m1q86M30J292p31j194M33
5552f27J970j329r37J047J033j313j202J637Q38r67j006J408J85p76m04J068r1
$$ y = [-16, -563, -317, 882, 324, -398, 191, 605, 295, -485, 34, 716, 89, -380, 138, 470, 550, -541, -257, 573, -59, -378, -116, 41, -229, -137, -276, -293, 123, 4, -490, -526, 114, 556, 139, -956, 262, 663, -140, -961, 41, 765, -253, -606, 279, 733, -14, -945, 344, 932, -36, -673, 394, 612, -123, -347, 91, 265, -277, -412, -47, -391, -64, 277, -424, -697, 108, 485, -254, -407, 19, 613, -432, -687, 586, 745, -729, -508, 521, 637, -558, -182, 469, 608, -426, -586, 290, 194, -380, -351, 190, -273, -122, 139, -148, -773, -6, 192, -495, -413, 562, 873, -662, -675, 692, 614, -597, -337, 937, 393, -796, -468, 1065, 301, -523, -182, 870, -89, -943, 264, 433, -28, 91, 184, 333, -143, 41, 119, -296, -142, 70, 29, -857, -427, 865, 134, -1060, -627, 1343, 14, -923, 124, 1157, -156, -1358, 279, 1117, 150, -856, 552, 737, -39, -443, 625, 534]
5569E34q29J50M79l94l30P28k69o16L04P93o71j132J267J204j520j033J688N49
5587I02j438m93J588L74j339n20J561k9j091l7J421m25j013O8J317l48o85J86
5605aK02m19K12M88p23n07R69O39j444n08J402M28j429M4J283L0j626j7J656L5
5625G14j662P43J107n58j394P09J090q05k21O08J60o74Q1O81q91m0N28L79r51
5644c96K9J016k7j380j54J494M2j693M77J748q25j804J072J469j121p63P49J175
5662A108j400n66Q79O78p51j23M02O4r07Q00R9q6l72Q04k67j212M06J529p02j163
5682g80P81P93r00j424J566J195j480p41J009N00o97p02J251N24j341o0M27L38
5700B59n71P31J39l74m66N90J29p90Q63K11p26o97O75J005j023l75N89L10j283
$$ y = [534, -295, -145, 334, -60, -390, 338, 69, -547, -243, 550, -121, -1253, 14, 1218, -302, -1335, 353, 902, -536, -1029, 559, 933, -406, -926, 635, 606, -485, -522, 899, 474, -539, -471, 846, 498, -187, -1, 201, -218, -6, 482, -241, -748, 221, 860, -584, -1092, 310, 738, -691, -647, 636, 666, -960, -977, 679, 714, -948, -205, 902, 344, -1050, -341, 749, -56, -277, 331, 491, -183, -102, 579, -312, -352, 176, 555, -396, -367, 649, 622, -758, -912, 582, 624, -1069, -592, 1156, 331, -1473, -401, 1068, -53, -816, -67, 1108, -292, -858, 21, 699, -52, -175, 227, 291, -616, 184, 283, 197, -175, 629, 362, -850, -444, 1085, 383, -780, 1, 794, -106, -1530, 36, 1231, -249, -990, 19, 519, -178, -880, 371, 895, -446, -506, -79, 259, -312, 419, 558, 184, -282, 308, 437, -353, 510, 721, -5, -702, -27, 978, -45, -420, 169, 479, -804]
5719h04k77J626L75j281k24Q26J52j273N4J258J32j066J40P95p30K36L68O6m13
5738d0m43R41l83o41J262k80p53j85R05N78j381l40J442k84j261K12J319l00j107
5757g39K96J203p54r91Q01R76m69r35N15L15n89N80J43k86m97J72M34l94M7R60
5777G88o39o50J67J235o37q62O70J161j028j262O83J149o60q84Q63N71r62o76
5795i73J170K99p17l38O51k40J19J58K1l27J14K49l60%N29O16p09n99M06N32n24
5816G7o63R43N36q30p64J052L33q28k20N27M14r55Q1K22K48k40o1l10L05j15J60
5837h8l52J25M39P5k35l95O87L23r00nP33Op31j8R71J42j087j32P41L87j037j72
5859e23R70o0l20k03P08k91m56K22O6j12j58Lk78L70m0J76j61P4M86j62q36L82
$$ y = [-804, -1081, 545, 920, -361, -585, 241, 393, -880, -826, 432, 564, -502, -362, 433, -297, -61, 307, 373, -40, -483, 458, 75, -566, 696, 416, -337, -522, 383, 961, -420, -760, 682, 398, -863, -651, 668, 368, -739, -443, 760, 6, -985, -184, 792, 323, -612, -97, 218, -371, 209, 352, 66, -431, -259, 175, -219, -172, 788, 149, -501, -334, 901, 264, -598, 72, 1233, 205, -1057, -374, 775, 115, -769, 94, 665, -297, -973, 197, 496, -221, -559, 92, -148, -29, 129, 150, -177, -63, 186, -174, -174, 355, 971, 262, -337, 69, 601, 77, -586, 357, 893, 63, -701, 351, 684, -144, -364, 163, 577, -378, -297, -75, 173, -67, -128, -438, -133, -248, -88, -440, -315, 124, 199, -36, -431, 256, 579, -321, -326, 407, 413, -318, -336, 635, 777, -310, -442, 299, 686, -351, -523, 447, 387, 67, -136, 572, 281, -175, 47, 113, 1, -157, -154, -432, -62, -102, 74, -87, -13, 473, 311, -525, -143]
5881a43O38J3r30M7Q34r0p11k60J094K6q12M1P39m91l49r0M91Kj6m33j25N61j98
5904a62j80M93j46k1m9j88J53P80p90j08N8M79o68l70J059L17l26p66M49P01l08
5925D07n58K08N7K35n04O2L56k02k94M6l4L11J30l94j63P90l21m95M0L01O23o68
5947f7m00O87j36J5p72P73K88m10qJ45K78n99j78N24L31k66m47J5N71j74k67r0
5969a87M02k16O1n53K17N64k24l91L88K48J03o06k51O48M15r64p0J015n88O8l46
5990b67M54L23p23J08O8O06o12l4l6N35o32K5J31L03p9l29N5J6L07m16o6J26L55
6013B18m04p4K72M31k87n97J94N11R0n12k79P28J02o13M42M2J17j76l83M67J55
6034D44k00l47L49J95Pn80j12L36J99m92l51N65K38l45l58K78J94J5o07K0M98
$$ y = [-143, 495, 508, -422, -375, 459, 369, -342, -602, 492, 518, -294, -253, 486, -5, -354, -444, 47, 49, 33, -400, -525, 36, -162, -342, 151, 5, -16, -65, -253, -100, 680, -110, -218, -160, 319, -349, -719, 340, 657, 331, -435, 14, 715, 407, -151, 57, 114, 349, -155, -93, 263, 61, -233, -187, -221, 90, 220, -174, -337, 453, 132, -363, -323, -22, 601, -67, -467, 220, 84, 99, -673, 100, 388, -22, -30, 115, 393, -206, -384, 140, 471, 205, -242, -227, 344, 170, -97, -187, 215, -1, 60, -493, -276, 288, 64, -327, 61, 309, 412, -194, -445, 203, 618, -346, -416, 599, 11, 79, -267, 187, 510, -213, -105, -37, 569, -43, -77, -113, 422, -210, -185, -54, 249, 170, -159, -104, -88, 219, -197, -263, -137, 218, -186, -260, 12, 443, 156, -441, -247, 264, 354, -158, -437, 291, 393, -220, 222, 264, 381, 205, -178, 289, 444, 244, -103, 246, 441, 448, -132, -244, 92, 291, -201, -552, 13, 251, -94, -452, -174, 20, 35, -572, -552, -54]
6055e4L36p30L76M82o00k17K30M66j84l48LL88J98l94kL75J96o4n44k24M26J27
6077B42k70j29N62q6n00m15O93L09q39K45R6J47p7l29K57K5J37l52l15Q80j88
6098I3P6m16K57J88r6l34K33L51o2p12K47O40m53j61J88O43k39r67J27Q20k38
6119A85n01j30O79m69q1J43K50P1l62k25J50L45k75J42M1L30J20l65m30L37L26
6140B81o5q67O01M49n37n67R19K29l39l68M9O20l00o18L98N22k95l76L96J66k53
6161D5j10J78K8k49N0j62L26q8J81k80n61Q79K40j65m86L32M29o83l36Q57l0p76
6183c81l14Q01L73o49QN18k89k68n12P83J11m5k69Q7m56M30J49k74l9M47om29
6205b24k88Q60J92n98j58M22L68q85j82R00K82q98n04J210l42m08L33N01l52p13
$$ y = [-54, 282, -448, -72, 410, -190, -407, -177, 289, 105, -243, -240, 148, 346, -48, -50, 325, 521, 457, -87, -311, 115, 242, -28, -157, 405, 319, -181, -596, 97, 406, -433, -188, -92, 55, -22, -351, -94, -69, 68, -284, -599, 281, 93, 169, -247, 10, 198, 102, -232, 1, 352, 290, -422, -175, 465, 12, -149, 39, 682, 443, -524, -397, 423, 185, -316, -446, 233, -236, -317, -174, 76, 147, -215, -440, -290, 55, -220, -78, -37, 293, 413, 48, -382, -45, 281, 216, -651, -50, 399, -138, -705, 214, 443, 104, -264, -215, 405, 105, -513, -115, 407, 112, -264, 132, 298, 45, -65, 113, 141, -108, -58, -220, 106, 18, 199, -81, -642, 237, 477, 312, -174, 158, 587, -96, -432, 425, 395, -381, -695, 106, 479, -170, -162, 356, 67, -201, -713, 70, 181, 136, -133, -46, -502, -72, 77, -197, -236, 211, 205, -224, -512, 348, 540, -58, -216, 206, 574, -311, -493, 407, 689, -209, -713, 497, 155, -253, 80, 581, 229, -484]
6225d84M1K90K54j63k5p4K2L3K13k77K83%J54q51L05J008l53p70K01J156n96j303
6247i36P78J146k94j024L54P2r5o57R50J56n18MO8J30l24K83q3J35o03L35K26
6268A03p43O38L46q5q46M02O57p5q54L65R00r51p02J028P73q24m92N42op25l7
6289e86Q50Q3j81j72k93K38j53J90M9k24k33O31k34l39M22O52r87l53O70O74j029
6310c25M0N63K02p86m65R65M16o46l45N94j24n10L9P55j24l98M59j89j57n28P95
6331B31J28o68K46N9Jn11R03J88o37n65J017k5j002N11Q13j39j310o5J322j14
6351C83p39L78O59q71l52O96L70j62o56K56Rk57K01O19j63n50K24j14m33K14P50
6372D62K15j297J63N25P0p73O53P73p53r05P03J040r52m79N94J21n71NO53K99
$$ y = [-484, -443, -153, 101, -62, -87, -161, -139, -106, 107, -170, 113, 113, 267, -584, -279, 729, 376, -394, -193, 963, 367, -936, -158, 988, 694, -330, 24, 96, 1, -656, 294, 450, -68, -64, 4, 134, -190, 93, 10, 145, -458, -123, 103, -640, -2, 344, 259, -587, -185, 472, 397, -457, -92, 808, -143, -845, 183, 956, 132, -360, 182, 176, -549, -586, 264, 347, 166, -6, -299, -61, -214, -24, 25, -199, -432, 199, -35, -374, 48, 700, -287, -640, 30, 704, -325, -285, 278, 480, -306, -771, 194, 610, -36, -381, 213, 89, -421, -382, 373, 249, -149, 310, 121, -36, -564, 231, 359, -309, -63, -4, -3, -514, 389, 577, -60, -625, 392, 367, -635, -124, 689, 550, -760, -825, 497, 383, -356, 22, 681, -190, -542, 154, 524, 362, -294, -38, -29, -286, -85, 534, 371, -179, 45, -69, -502, -288, 462, 677, -620, -457, 68, 138, -635, 18, 791, 38, -867, -164, 876, -76, -555, 39, 160, -411, -406, 247, 546]
6392E46m28j16L8l76O9K37K2n1J04L37k71p15P44N35l86p51K14N85o13l56P65
6413A33K31m34p35P93O27p65l18P95k42k34K7N38N3n89J61J18l09K08K74o4m91
6434b23K56M32j076j33R95O37j201m74O22N66j078P0R99m2q01k87N66M45q17N84
6454D0K82k22k88J46J55m9k9K18j38k76J74M07m07q6L08K1q09P0J083J45p84k99
6476c38R33k80q70J18R93j45r64K27N44n1o59P58j7l35l16L63K82l12n1M88p73
6497d05J55M10P2n73L33P26n91n63K76P68k93l26m2Q07o58o67N19N67n46n07K31
6518c07K19N7j56L28q4k06N2K82j41l18L08j10K52l53O77m05j96M58Oj91m36M79
6540B15L52o84l63Q55Q5q72J38J41L79l98k25N26j55j28k65L75L5m8m5j48J16
$$ y = [546, 118, 2, 40, -336, -267, -30, -8, -59, 45, 382, 111, -604, 140, 675, 289, -462, -248, 337, -276, -632, 133, 364, -70, -805, -12, 615, -150, -468, 327, 85, -149, -122, 416, 469, -120, 41, 159, -150, 58, 332, 268, -223, 33, 465, -611, -744, 251, 888, -313, -787, -165, 401, -677, -607, 392, 350, -451, -738, -172, 273, -544, 40, 322, 100, -188, -42, 113, 64, 35, 253, 115, -161, 13, 420, 13, -73, 235, 256, -553, -483, 600, 745, -39, -338, 595, 315, -555, -437, 556, 411, -553, -326, 218, 167, -492, 266, 249, -86, -402, -39, 243, -69, -120, 368, -405, -250, 160, 232, -341, -8, 718, 127, -436, -160, 608, 315, -11, -53, 754, 96, -571, -52, 515, -31, -538, -307, -88, -31, -187, 141, 57, -149, -97, 185, 44, -274, 34, -76, 176, -177, 500, 95, -101, 357, 363, 172, -264, 215, 567, -117, -480, 375, 460, -412, -274, -133, 246, -152, -377, 149, -6, -134, -399, -24, 11, -37, -82, -230, -114]
6561a14J90R5n96Q4M17K25l79K66O8K59n99k48P52l09j04m13M87K90l41j80M26
6582B76K23p27j41O42l01n9q2J01K54l12M7P2j45J25j11k46J33N27j33m68L62
6603C7K54j35n66J04M51l8k77j0N20j00l93O6L88P5p50J23L92k42r9r4L34J46
6625A86l43O8l08L61N14n22J37%J64m89M84k37K2J5k37L56L28l22l68K94K43j27
6647B19p68P62J97l77k53J74n1J77m96LM80Lj54k4P3L75l78j98j40O02P9n72J96
6670g1J63j66rj53M23ko8k71M84K27p51J58K05L0r3m68L16M59k36j95n3J87j1
6693A05Ml06K35J7k74L23k28PJ15l37n9L51K3k01J86K5J62j60k00N26j64k67K04
6716H7j36K93m46J01M61j50k19k36L4M30P2j59m49J48K43k72j42L25J76j63k90
$$ y = [-114, 76, 171, -425, -341, 76, 301, -78, 188, 256, 515, -84, -332, 420, 111, 7, -406, 81, 371, 30, -150, 276, 499, -228, -369, 273, -28, -87, -169, -68, 186, -126, -79, -7, -152, -27, -138, -384, -251, 276, 143, -325, 37, 291, 156, -410, -306, 145, 107, -170, -180, 340, 240, -153, -87, 301, 376, -374, -251, 141, -101, -200, -294, 40, 186, -157, -89, -397, -36, 478, -44, 93, 93, 257, -232, 252, 15, 37, 52, -185, 171, 499, 177, -191, 103, 346, 219, -549, 213, 410, 33, -220, -46, -97, 80, -416, -413, 67, 70, -84, -108, -35, 340, -38, -236, -376, 226, 305, -267, -71, 92, -74, -83, -236, 187, 185, 117, -154, 330, 557, -194, -36, 169, 199, 106, -362, -46, 413, 177, -18, -71, 116, 105, 109, -197, 38, 55, -219, 104, -124, -117, -2, -339, -398, -47, -24, -225, -39, -14, 148, -12, -212, 314, 150, -117, 87, -49, 244, -202, -101, 360, 210, -9, -245, -211, 219, 291, 132, -317, -169, 74, -198, -340, -15, 161, -2, -292]
6737b92L06N29m77l42j65O39j52r5K54J44k08k84PJ41P1n6Q0O3J7j37n29J04N10
6760A28J52n51K13L04j43k47J10Q7P6q5l90K86K27j57j00N24j22m08Q3j17N03
6781C73k71k05J20M46k02o01K62K27J50k93M3j4j86L33l78J85L56m11Jo3K9J27
6803B8k0k43R2L02j61n34K28L9K86l20M58M14n48l97K89L77o5k33oM44j92j60
6825G8K79k68o5J91l73q2K90j92k92J74K94O8l03M3L78j5o78J85N63j32k22j68
6847b47K99J49k57K76k16r7rQ7J80j57M52m21L9j77K07j1m48n8P42n7n16J85M44
6870C89m87m21J72O78j70m26R8K86l05j63L94J27l21j67M65r7j49P1J56n44L43
6891g1K27l82p9K91M50n33J00L07J54m69j82K47P2k32k91Q09q4k22j78K09L89
$$ y = [-292, 14, 543, 66, -276, -441, 198, 46, -49, 205, 349, 141, -143, -136, 5, 76, 20, 100, 163, 180, 43, -486, -382, 128, 280, -271, -58, 246, 103, -144, -34, 53, 129, 44, -346, -60, 167, 10, -90, 434, 312, -96, -13, -130, 373, 102, -103, 17, 463, 261, -340, -78, 149, 299, 6, 49, 35, -151, 182, -196, -11, 345, -66, -65, -128, -99, 28, 8, -235, -143, 159, -2, -536, -308, -269, 17, -303, 155, 569, 21, -376, -87, 290, 225, -8, -14, 430, 238, 78, 357, 89, 24, 215, -158, -240, 50, -142, -434, -260, 34, 102, -201, -158, 220, 205, -473, -288, 275, 143, -79, -247, 52, 201, -56, 220, 4, -93, -102, -15, 165, 8, 460, 39, 78, -99, 108, 97, -351, -409, 333, 276, -240, -55, 389, -98, -519, -347, 331, 161, -265, -167, 119, -186, -349, 45, 172, -149, -316, 149, 52, -97, -26, 130, -414, -71, 156, -226, -305, -14, 436, -97, 3, 310, 464, -5, -187, 60, 132, -100, -391, 418, 334, 112, -66, 143, 532]
6912E32q95M9N19k09MJ4M1M3l41M22j8m15K82J12q4k45J73L82l02k28L66J30o69
6935c37J06N45P1l44o15Q46J10p26K3O46l39k59JK05j47J3L59M0l97K60J73k61
6957b7l49M45K25k52j9O56p12l70M42l6K22n22M15L64l28j55r7M94k76l48K55
6978B7J25m12O7K90J86o87O2M13j69k68M35j75j51LK20K29o53M23M99m68k85N26
7000B37P4l19n00M68K84j87l18K62J83j23l01K45K73n92kO29j83l32J80M36m03
7021A1k51L24k91P9M0M59l68k36M82J06o67L04J90K69n45k95P12j19k02j45L89
7042B46k78j74K48M06m39j47j79L06k59L20j92L34m35K75k86K27j02M89j74m86
7062c00n6N36K63l73n30O57j2m38N1J70N04p14P6L73k36j40o0P81m41j92K96l04
$$ y = [532, -363, -314, 205, -4, 0, 14, 55, 98, -243, 179, 161, -254, 28, 140, 56, -189, -16, 366, 64, -164, 202, 332, -337, -231, 314, 385, 41, -574, 272, 382, -344, -321, 325, -14, -273, -272, -67, -214, -201, 158, 198, -199, 61, 234, -27, -376, 69, 294, 42, 23, 679, -33, -403, 39, 3, 225, -297, 118, 482, 154, -1, -98, 396, 120, -228, 27, 152, -260, -193, 97, 283, -404, -342, 71, -98, -366, 69, -106, -257, -254, -34, 195, -458, -35, 464, -4, -289, 237, 311, -8, -508, -40, 244, 57, -261, 1, 184, 61, -240, 5, 278, -314, -316, 313, 130, -202, -22, 414, 11, -240, 84, -207, -128, -88, 371, 3, -233, 249, 355, -312, -8, 182, 451, -94, -389, 323, 204, 2, -143, 246, -32, -206, 42, 448, 9, -138, -317, -11, -270, 50, -142, 192, -243, 32, -254, -27, -129, 360, 186, -300, -356, 180, 443, 70, -460, 197, 185, -253, -202, -32, 472, -242, -166, 207, -29, -169, -229, 552, 111, -81, 215, -89]
7084h9RK61R8l92K37l22K88m13O9O72k48n01j84Q38j26o53M77N64m85m74K46M06
7106B78m04J02N5M3k60k38N01J58M6k18m1J38j42J61J57k10l27N44l54k10K66
7127D5L55l05m41J92J72j65j21K54L89p16m68O28N34l60j80M17j50j82m8K56n6
7148E0N3j61K72p73N74K57j30j94J33O5m09j66K35M56k11n30L67K79k04R2j48
7169i3R2j51o3J05L93l74K80k6Qj5l50O27j90k09M0o0J31L93l31M1l90L45k59
7192e6r4J98K0n4j54L0J04J31l16K24K94k99j96PL71j58j78K01J58k75k2Q9j61
7215a36J37Ok7j1p7J89k62J69J12R5l22q3K80R3j2l75M0N22o97L00O4Q5l5k60
7239b05K63L54p47L64j62N50p31L87j4j2J03mj05j37K50N1j92j32K26n8j50JO6
$$ y = [-89, -80, 181, 279, -113, 124, -198, 90, -323, -254, 418, 170, -331, -515, 323, 197, -456, 21, 585, 100, -374, -128, 278, -126, -24, 31, 74, -186, -424, 77, 235, 281, 63, 22, 160, 18, 179, 336, 126, -201, 343, -11, -221, 45, 400, 95, -346, -154, 18, -147, -268, -14, 375, -341, -809, -181, 353, -7, -187, 230, 80, -102, -150, 106, 50, 103, -58, 214, -559, 15, 272, 142, -52, 81, 146, -263, -429, -194, 262, 51, -479, -112, 167, -37, 55, -93, -1, -152, -215, -110, 283, -91, 189, 163, 171, 156, -194, 433, 243, 34, 74, 14, 145, 538, 207, 248, -142, 203, -56, -150, 48, 68, 14, -140, -110, -6, 125, -191, 33, 327, 28, -168, -161, 210, 52, -126, 75, 233, -42, -64, 25, -136, 1, 7, -20, -31, -108, 81, -181, -12, 100, 195, -127, -210, 70, 163, 151, -224, -184, 338, -359, -59, 5, 90, 55, -205, 58, 412, -335, 29, -133, 417, -314, 73, 59, 47, 150, 146, 41, -96, 154, 205, 13, -119, 107, 49, -101, -100, -34]
7262c4J9J1m1m8L51m31J21M33l19q7k61J43K67k78j30L75J03r5k98J85j19PJ87
7285F1k0N8k01l9K0K1K94k4k12j47L96k22j93K13Rk6j04L2J31L69m64qM21q25
7309d60M82l74L20K00j95r2qL56k51j10N21m99R5J12k02J55OJ57k08j93L56O5
7331B33l03n7N58l86k76lN76m06o8J56Rj06K58j24k14R7j13K77j01j2n6j67N11
7354B83j69j2l6j8P9j27j34L7K13m7j43J72O0L14o25j40N16l08J27j39L41m12
7376a68J77K80n48K96J7j78J50qK84n12R5l1K00k09J19m2R9J68L1m33L47j31J45
7399A48j92K62N9j95J29j1L23k56k05j77Q9m26L72j20l7K27J16l39K55l62l0N24
7421A54j01kk0L4k45M09j26k2j18Q3O4J84l13J29k19P1k84L69J11k02NK12k92
$$ y = [-34, -15, -4, -45, -93, 258, -173, -52, 381, 62, -25, -286, -143, 124, -154, -284, 91, 194, 99, -199, -14, -133, -126, 61, 41, 99, -102, -141, -121, -100, 194, 170, -42, -189, 207, -15, -208, 5, 14, -12, -116, -84, 47, 416, -48, -56, 365, -460, 22, -352, -32, 168, -27, -119, -127, 229, -22, -132, 389, -110, -15, 97, -105, 50, 56, 213, 5, -188, 168, 233, -70, -127, 431, 45, -231, -234, 342, -64, -132, 24, 33, -73, 185, 61, -153, -56, -169, 108, 7, -5, -61, -228, 283, 114, 102, 66, 48, 127, 0, -134, -97, 116, 69, -74, 98, 158, 472, -153, -293, 223, -85, 42, -97, 244, -168, 9, 289, -259, 37, 54, -124, 26, 18, 302, -210, -115, -146, 54, -155, -36, -78, 21, 189, 220, -213, 134, 3, 148, -44, 218, 277, 82, 211, 200, 523, 267, 62, -115, -26, -452, -80, -200, -237, -10, 106, -233, 22, -340, -370, 154, 53, 51, 31, 65, -180, 229, 103, 81, -37, 46, 110, 294, -19, 110, -109, -38, -322, 47, 158, -44, -39, 173, -119]
7444a19k84J59N92l77q3n9K4j61N7M54m11M21j76Ln7K45l50K50O5l58M05k52l75
7467c87O05j44P3j89n0N7k1J01k46M50j38p1j42O0K02n29N45p0j57J62o5j85J28
7490a1L4k92N21P9k28j79l26L71J20j52J73n5J84k04J57j03k78J50j14J79l94
7511c68L52j56M5J26n9J38j07l87L73J95l36L3K72P2l02P2K95k50r9m3K65j66
7533c5j87l8lK12k81M30L38j94l21J24Q4r7O0k51K60k11K20K45n62k6M93j8n30
7556b88J52J75Qj13k10M5L11n53L25L70j12l06J52L79k81k81L24l01K71l7k72
7577b42J22K94k56L2J56rN8m6k08J11P9j50l44P08k09k26j84J48L58j44j96J38
7599a0O4k13j65K21M06j97J7q8O6j22L17j17r8K1P4j54q9r7L85p1k42J12J76k3
$$ y = [-119, -403, -244, 348, -29, -112, -171, -147, -308, -251, 203, -208, 213, 37, 40, -17, 228, -122, 128, 193, -165, 240, -12, -387, 218, 74, 147, -42, -92, -35, -56, 45, -201, 249, 111, 40, -102, -42, 160, -369, 176, 106, -51, 111, 46, -139, -11, 23, -269, 252, 331, 103, -76, -402, -31, 89, -63, 110, 55, 239, 35, 192, 89, -189, -39, -153, 26, -368, -16, -172, -127, -1, -60, 78, -29, -416, -43, 152, -184, -151, 121, 193, -109, -37, 258, 8, -91, -134, 131, -35, -222, -260, -263, -51, -332, 98, 436, 242, -79, 45, 129, 32, 92, -159, 101, -110, 110, 355, -207, -233, 260, 242, -288, -136, 39, 47, -66, -276, -231, 80, -473, -148, 222, 110, -196, -44, 335, 54, -227, 97, -204, 67, 30, -242, -120, 174, -82, -50, 106, 97, 155, 109, -99, 12, 91, -59, -403, 305, 96, -130, -314, -166, 192, 48, -148, -10, 54, -159, -324, -103, 303, 106, 123, 35, 101, -21, 296, 179, 81, 102, 176, 22, -67, -164, 221, 150, -92, 20, 196, 173]
7623A73m17K36K55j30j13K13m2l29m91Q69m2m15Q7K4J79j27n4J96Q1J5j21r4j23
7646a70R2M04l18R7P7k13j18J80L52l92M9j52J14n8N9j84P75o64j32K22K24L0
7668B74k46K5M14m21j84K04pk11K66l7k5k14N85l59j91j94L18j02o8J31K00q8
7690G0l41K50K19l71LJ12L24q2o88M60K92j65m00K30J79J43l96K43l35M8M98p9
7712B14n61K35j28M05k86K50J9k39q2J21K79l80j23L78Q7o16K26K38J53l40n6
7733b06J77R0n9j34J44K00k86k47N21j58K2j84Q9r2J04K16j88J75q6P0j41j45
7755a18k22M72j09j31J74K18o24J48J72J25k82R9N34n53J55p7J78j51k68M46k07
7776b1r9P8om9K5J02j0J02m01N44l0m92J40O7J58j84J20R0k13l4J48K70Jk98l32
$$ y = [173, -244, -8, 247, 117, 4, 217, 175, -154, -645, 224, 182, -233, -146, -122, 57, -70, -124, 72, 153, 168, 47, -47, -170, -78, 326, 8, 105, 182, -31, -149, 31, 383, -9, 40, -112, 2, -56, 3, -181, 594, -70, -202, 20, 244, 274, 28, 53, 467, 46, -138, 66, 59, -152, 114, 77, 52, -162, 423, 64, -127, -321, -3, -105, -173, -42, 158, 70, -271, -21, 198, -173, -170, -58, 266, 184, -504, -44, 248, 83, -317, -87, 92, 235, -161, 82, -253, -205, 293, 214, -347, -112, -240, 165, -121, 129, 148, -91, -173, -52, 227, -153, -276, 102, 189, -427, -201, 37, 190, -150, -206, -29, 61, 2, -132, 12, 212, -74, -321, 200, 42, 64, -120, -31, -123, -19, 197, 9, 184, 98, 168, 27, -118, -340, 132, 23, -108, 66, 284, -340, -192, -20, 105, -177, -78, 456, -97, 58, -19, 159, 8, -260, 186, -21, -120, -42, -48, -97, -72, 30, 20, 122, -279, 265, 235, -257, -117, -50, 108, -76, 44, 134, -79, -113, 35, 305, 306, 8, -324]
7801c24M02j00L87l58j16P0J14j35k25K21L42K6n27K10L67m91L65k63L09r8m00
7822b24N3L72k92m37M70K64m32L9J45K21n04L12L5J96J9r5Oj51M0j65o0J9O9N17
7846D17n2p72O19k63O1j45M50J21n36j22j01K49j42R1L73j11k40k20O27L7p5k16
7868E0R2N3l07J68k24K4p5K2J81q6J70j30M6k16J10J93m09K58K84j3J81l42o1
7891c1p3J4o7K29Ql90L59J39pj37j28J75l33m8K01K92k24k65K05P6J9m2K46m49
7915b31J90L13n41J95j12J36N8j25K64j33j70J25j05N01m67r8M70k84R3J2k06
7936a15R7j52N55m49K22k1r1K4j12L74l56j81J04M64j07j94j68J11J23k25M3l9
7958i3L1j33J95J98m24K88j35%J22Mm58N44J6j37k58K32J01j71K06%k02J32J41
$$ y = [-324, 78, -22, 365, 7, -109, -39, 75, -60, -285, -64, 278, 304, -223, -13, 354, -137, 228, -35, 274, 176, -224, -171, 201, -91, -528, -58, 206, -226, -187, -42, 179, -325, -13, 22, 218, 237, 142, 148, -3, 37, -128, -188, -169, -100, 417, 365, -407, 212, -51, 10, -135, 315, 436, -100, -222, -323, -74, -216, -125, 248, 137, -103, -323, 304, 341, 266, 50, 142, 195, -112, 56, -168, -144, -219, -197, -16, -102, 68, -62, -16, -232, -122, 71, -338, -80, 204, 191, 372, 30, -31, -104, -90, -157, 72, 80, -310, 49, 188, 181, 44, -84, 91, -242, -290, -89, 203, -21, -286, -81, -5, 14, -28, 218, -231, -41, 272, -269, -74, -186, -50, 8, -117, 147, 14, -156, -31, -136, 365, -102, -200, 270, -14, 79, 91, -115, -18, -170, 385, -64, 158, 137, 46, 70, -42, 332, -24, -205, -101, 363, 256, 62, -106, 5, 128, -97, -54, -93, -62, -195, 0, 198, -226, 62, -73, -73, 49, 53, -405, 139, 155, 18, -240, -8, 93, -78, 128, 128, -74, 58, 199]
7981A99l06J53K19j37j20q1P9p5M6j8r9K98k46k47N05j90j21l28N22l21L00j60
8003a28K63p4l6P9K5k44l2J82j49K94m0O6k39k28J50k51J85J5R7M03k86q1N8M8
8027G7k74K70k16K78l37MM03Km30L5J98L2km8J59k15N5j04J75r1k45L22k05o1
8051b18N06k56n1j01K83l50K22k50L85l50J02m1J79k3j2L06j13L7j80K2J17l57
8073a43L1k60M25Lj0j81J23r8k6J96k5p9J21k78r3J63K4K40k9l6L9l52K19K5O5
8098F4J38q9j07p9J02j39j18L72K9j09k97j21M48O%q6Rn2Kk02L94l92K40j31K76
8123A58r3j93m8L80n6k89k05J73J15K66n57P0K84j02J61j35K01k77rM74l66j02
8145a50J20J98j87J65j82J83Jq6j34J17j07O3L06l00P4J91l31J84j04J17j04O3
$$ y = [199, -107, 46, 265, 128, 8, -73, 6, -69, -23, -41, -140, 158, -88, -335, 170, -20, -141, -469, 53, -268, 32, -128, 135, 61, 25, 104, 129, -115, -147, 35, -114, 180, 140, 206, -33, -261, -111, -362, -177, -162, -65, 338, 52, -29, 29, 77, -197, 73, -143, 135, -202, -198, 205, 207, -223, -188, 10, 42, 40, -8, 151, -64, -9, -113, 62, -29, -274, 48, -157, -218, 288, 32, -19, -120, 163, -187, 35, -215, 170, -180, -78, -119, 60, 37, 25, 331, 218, 255, 75, 97, 214, -143, -112, -372, 53, 56, 46, -135, -12, -110, -136, 60, 35, -44, 77, -201, -294, -131, -107, 133, 104, 68, 107, -245, -26, -1, 64, 202, 113, 6, -73, 29, -110, -228, 144, 173, 64, -233, -354, 94, 100, 100, 14, 23, -29, -27, -229, 165, -227, 13, -118, 158, 65, -128, -176, 204, 148, -141, -346, -173, -58, 208, -349, -279, 5, -97, 64, -71, 130, -147, -156, 318, -48, -150, -30, 168, -19, 146, -36, 147, 148, 62, -72, 45, -62, 1, 307, 7, 81, 272, -59, 125, 21, 138, 34, 97]
8167I7p4j91L98m76K12K9K31o5k65mJ15L49k79k52K63n6j63L55R8k01m12K08M0
8190d3K20
$$ y = [97, 23, -168, 230, -246, -34, -5, 226, 161, -104, -108, 7, 356, 77, -175, 88, 32, -131, 224, 322, 121, -291, -83, -43, 177]
8191A77
$$ Imaginary data points
##PAGE= N=2
##DATA TABLE= (X++(I..I)), XYDATA
0@%%%%%%%%%%%%qJ6j6J6j6J6j9K7l2L3l8M5n3O2p0P8q7J00j14J26j39J55j75J95
36A02k16K40k65K93l23L59m00M41m87N44o05O74p56Q49r60J096j266J482j768
55i66K165k757L735n617J0475m3174j13992J02092Q6964n9243l6173O5512j8036
68i015j03892J1960J22188K4676p0847j5634K0914k7160k121O5031J9548n6220
80b0572r950L5365k3160k7319O9820N5857o9015n3735P1117L9007p9096k0154
92c1835R9549J8259j09040l1206Q0994L969p3209K1916Q0496l0456q9568J1734
104d8397O6383L526j1119K6403j3643o1599m42N9182J1240j9141J6392j3096p6551
117f0862m166J08754M0836q4987l4407N8233q700o5232M7774J02648m5560j25478
$$ y = [0, 0, 0, 0, 0, 0, 0, 0, 0, 0, 0, 0, 0, -8, 8, -8, 8, -8, 8, -11, 16, -16, 17, -21, 24, -29, 33, -37, 41, -46, 54, -60, 66, -73, 82, -93, 102, -114, 126, -139, 154, -169, 190, -210, 231, -256, 288, -317, 357, -399, 450, -510, 586, -680, 802, -966, 1199, -1558, 2177, -3440, 7035, -36139, -150131, -48039, 38925, -20318, -56491, 9021, -9015, -112907, -100947, 21241, 45917, -24930, -40564, -19650, -46810, -48931, 16100, 35648, -20572, -30522, 4843, -18317, -45636, 24184, 80041, 11026, -42709, 28408, 67415, -11681, -31835, 67714, 85973, -23067, -54273, 26721, 30690, -42519, -20603, 59893, 29437, -60131, -48397, 17986, 21512, 10393, 36796, 23153, -38446, -38888, 20294, 31534, 12393, 28785, 15689, -60862, -65028, 43726, 84562, -425, -34832, 23401, 14701, -50531, -2757, 99891, 54331, -71147]
129g1147R554R0216j0897n4778L4500L7148o2625m7808N8349N1367k8746j9223
141a4090K0421r729k1835K7649K4320l2825j2252M0183o475n7808J2299O4191
153C4049j6500n7425L4574O0545n0671o8696N4678P6546m1322o1920L1021K7956
165B2835n0889j8665O5776K7139n9695l5960K7369K0031L969K3216O039l9232
177h067j8138L0434J3736j0310K0454J3628n6072m4447N6995O0875m2293m9829
189c3034L6832K6362n2095j3643P3748K4761p6293l5190N7759K6686m5716j3944
201b3767L5692k949l6721N933L1621m403j8053Q206Q951l601J0425Q315k4802
214e153j3924L6937K0432m1057k4602L4387R328m2336K155N7064l492o9317q678
$$ y = [-71147, -61593, 28623, 17726, -37052, -2552, 34596, -28029, -75837, -17488, 33879, 5133, -14090, 6331, -3398, -25233, 2416, 26736, -6089, -18341, 21842, 15367, -42441, -30142, 34049, 17549, -39876, -5302, 55243, 4572, -64124, -9446, 67100, 25778, -36142, -5121, 22835, -28054, -46719, 19057, 46196, -13499, -49459, -22090, -2059, 1910, 25126, 31165, -8067, -26205, 4229, 17965, 7655, 28109, 41737, -14335, -58782, -1787, 59088, 16795, -33034, 3798, 30160, -21935, -35578, 38170, 62931, -13362, -48552, 9207, 35893, -9823, -23767, 11925, 8976, -27745, -21812, 9809, 5406, -12647, -4441, 4510, 909, 11334, 19649, -5153, -19077, 17860, 38292, -2765, -27367, 7020, 16348, -25988, -23833, 33231, 29739, -39578, -48256]
227d8256O4591J7981m3436q130K7335j2485l3961J7707L9628p778l7178j0663
239c4645J2493J4347J4919L245j8206r004J6450Q386r211J3421K3486k4085m2211
252c0615J9156N1976j0031m9561M847L8851j1464l1964K2291L6723k3894m0501
264b4186J8785M0951r359l3741j862J5960j413q465K669J243o938o161j045P450
278f112J6883L464k5323j7746K5164K9094j6198k7229R811J5885k0918j4048L1813
291D540K1914l4628l4118K4989L8496o914k3617M795J3115r534r006J5604J6442
304B2078j0516k5860o818J9300K0127p163k2004l679J6842N914j1472L935J8966
317A9650p245l0664J437L6772R041l6147j9309K3223J5428j6912q243J8786M982
$$ y = [-48256, 16335, 34316, -9120, -17250, 10085, -2400, -36361, -18654, 20974, 13196, -23982, -34645, -22152, -7805, 7114, 10359, -7847, -16851, -401, 7985, -1226, 12195, 35681, 11596, -30615, -11459, 40517, 30486, -19075, -14228, 24623, 13159, -18805, 3486, 40209, 16315, -24186, -5401, 35550, 26191, -7550, -9412, 6548, 5135, -3330, -661, 582, -6356, -12517, -13562, -6112, 10771, 14235, -11088, -28834, -3670, 25424, 9226, -18003, -8192, 7693, -13225, -27273, 4540, 26454, -8174, -42292, -17303, 21193, 14279, -9338, -4543, 8572, -962, -9968, 5636, 22078, 11562, -14298, -21116, -1816, 18311, 11148, -10856, -14535, 2307, 8221, -3251, 684, 19650, 12405, -18259, -16822, 19950, 28991, -7156, -26465, -3242, 12186, -4726, -12969, 5817, 10799]
330A0799k3443p762K7923K0817j7493k4879L589J9890N441j1281o157M615j885
343A74j1387N92K0152R738k1479k1814J3480K8836k81k2547m306J3777k556j4078
357a1699O647K0457o861l0650n654K9578J7854j7537j8785R169J4816m436p391
370d492J2656J0648j6735k1919J0360K8605L75k7966j2635J7672J2949j0131o035
383f648J3398L587j9471q415K3866K0659j8083k7928M330K2538K440j5754j904
396g385J0797m003j4924N962K5063M358k5101j4256J8831K0846p161j7040J126
409b887Q338o734r277J0328J5407r941k4703r80K5942J3213j6806j5503Q172J1647
423F216o526o424J1776Q061j8655j8835J4010K6554l390k5326o218J8962R068
$$ y = [10799, -12644, -20406, 7517, 28334, 10841, -14038, -10449, 9441, 14882, 3601, -2556, 2059, 174, -11213, -10621, 9531, 19269, -2210, -24024, -10544, 18292, 18011, -4536, -8842, 4935, 2379, -11699, -5052, 15405, 8544, -22106, -27760, 1818, 19672, 2135, -16650, -7481, 7335, 2899, -4492, 8164, 18812, 2077, -19842, -9482, 19123, 19498, -8468, -21103, -3431, 9518, -613, -6648, 6750, 10337, -9134, -17549, 6317, 26976, 8893, -19035, -14705, 7833, 10273, -5481, -7385, 3412, -591, -15515, -9553, 15510, 19868, -5233, -19489, -658, 20188, 13027, -4013, -2887, 5451, -1283, -10560, -232, 15175, 5234, -19469, -20449, 5493, 18706, 1900, -13603, -5431, 6216, -310, -6734, 5042, 13103, -5552, -24387, -10377, 16177, 12787, -12539, -18757, 205, 9273]
436I273r910j136J3277l03j8962n044K3264J5752j9007k4442O419K1892P4j5285
450d138N91J2019n839j6035Q008K5723L14k8641j0945K1613J5403j2954j3698
463h579N944N381j0693n416J4731J2263j3295j9586M842K2318P649j4600j2014
476a1055O420Q815n588o108J0276P190j6688j7288J5172K6923n588k7067j028
489a5614K1896M328j3910L194J4700p170k1981L004K5349O131k1979j4871R203
502g720J3593l59o573N63L862l938q935M964J9271K892k4547j5386J9735K0405
516A7827j3266j8895J0621J3523j5358j1437K2919J8851k1792k4085J6897K5578
528B1383p653j8326L041R125o463o540Q208P469o890j0939k801Q301J3881Q03
$$ y = [9273, -637, -1773, 11504, 11201, -7761, -12805, 10459, 26211, 7204, -17238, -10819, 11073, 11147, -4138, -3547, 8472, 2633, -13402, -5394, 20329, 20643, -7998, -18943, 2670, 18073, 5119, -8579, -2635, 2746, -7947, -13363, 1368, 13631, 336, -19250, -14408, 7910, 15559, 959, -11055, -4635, 4180, -1408, -7516, 2760, 9950, -6738, -24026, -8854, 18069, 12481, -14586, -15614, 6282, 10610, -3300, -106, 14594, 7424, -14557, -11553, 13796, 19927, -2052, -16923, -7720, 5873, 5514, -1059, -496, 3366, -572, -9507, -4543, 14728, 17620, -6927, -22313, -2578, 17827, 4561, -14334, -3713, 9810, -5548, -16985, 5934, 24785, 2993, -21092, -4195, 21383, 13730, -4596, -1555, 7570, 1107, -5433, 2775, 10244, 3354, -7585, -10386, -2085, 11796, 12599]
542A2599j7778r975J5663J3451j3060r487J4374M158k5238o553L2007J4170l2589
555h258k0264K4574J8797j7005r416J8273L078k3543m137K4048R197j6820j3288
568a4764K514N964N925K536p444o475O070M702q003L707K0456l844k9607Q62L6732
583A9331O129l3320n717K9762J081k7708P942L2403r386l4732O278L3269l06k3570
597A456l26J0643o923o101J0169J655j3104l921J954n944L638J6615o825k8574
611b5588K135L2856n5k9177N141K7282j3696k9989K1594L6946k0057l8817J6523
624a4902L4622j1927k2343J5514J6425j9933j1878K2308J2140j6793r994N222
636a539j339K21J2402m048k2763O44K2012l852j8750J3568K0139k5116k4662L2476
$$ y = [12599, -5179, -15154, 509, 13960, 900, -8587, 5787, 9945, -15293, -21846, 10161, 24331, -8258, -28522, -3948, 14849, -2156, -11572, 6701, 9779, -13764, -17901, 6147, 15344, -1476, -14764, -12250, -6286, -361, 2175, -5269, -11744, -5674, -972, -8975, -5268, 15188, 11344, -18263, -17401, 19331, 25460, -7860, -13577, 16185, 17266, -10442, -2500, 29903, 20517, -14215, -7937, 25332, 25026, 1456, 1130, 11773, 4850, -1251, 8918, 10573, -2531, -6452, -4498, -10442, -6804, 9811, 2986, -25588, -23453, 9403, 9348, -19829, -14688, 12594, -1102, -31091, -9497, 27449, 7392, -31425, -14902, 19720, 7793, -14550, 964, 17389, -2544, -14422, 7886, 20026, 3233, -6761, -1539, -2878, -2657, 9745, 5697, -17066, -16422, 5590, 1738, -17012, -3444, 16695, -8421, -33083, -607]
650f07L4124k9517l2112K6159K5266k5869j3773L4411J1235l7311j1765L5583
662A5824J3565k3765n625J4444o356j0619J4149P625j8351o399J2823o851j5105
675a4641J6502J5792k9358k2691L2424K3643l3515k0661L4941J3329l7549n995
687b7779M4517L607m6004l928M3418N072l1937K143K3410r743j7503J8973J7949
700B2195j5942j2660J0178k80p566J5901J0159k8095j7263K6725J5002k6989o161
713a4796L0651n577m0832Q309M9456m853m6982L567L8867r517l0702J8995K8400
726B4986k4188k8330K3275K4057j7238j2768J4639R81j4010J0274J5093j6223
738E48j3669J9716O785k3863R50K9038r853l7864J5261M3027j5534m1822J6734
$$ y = [-607, 33517, 4000, -28112, -1953, 23313, -2556, -16329, 18082, 29317, -7994, -19759, 15824, 29389, 5624, -1, 14443, 8087, -2532, 11617, 19242, 891, -5508, 7315, 464, -14641, 1861, 17653, -11705, -34396, -1972, 21671, -11844, -32505, 2436, 15765, -21784, -27779, 16738, 20345, -25659, -29587, 13831, 18903, -13034, -10891, 12519, 2776, -14727, 4246, 22195, 6253, -6407, 3771, 3491, -4075, 11826, 21985, -6110, -23373, 3352, 18354, -8635, -14796, 15855, 10278, -30554, -22245, 27211, 22358, -24624, -21057, 17810, 8293, -22409, -3414, 24986, 798, -27532, -4257, 19800, 2562, -10206, 4433, 5414, -8596, 1678, 16771, 548, -13121, 6595, 13380, -10483, -9533, 19505, 9652, -28212, -12951, 30076, 14542, -27280, -10546]
751a0546L7299k0909k8466L0550K7091l5762k7942L3863K5361k5668j5765J8787
763G893L48j9993Q092K1433j0301j7963P766L866j3530P946K2538j6175l3155
776c1235J4978L0800j7456k5316K3498K0135l4188j9327M1487K3295l8293j9853
788c1475L5769J5077k9466l443L0413j666k8168O305K5536n969j7198P777P340
801A0832j0842L442J6518j0972k0729J3545J9589j7141j6253K2929Q160l4826
813a5748r081M0630J1248m2033j2643L6171N391l1219N579L3662j0704l6705R629
826a5823L3770m308k1343M718Q361j2184q32J7747l3j5606K514P868j1888j442
840h481K3433R14l2283l359L2830N19l1326L974K9519j1898l2081J5545L4070
$$ y = [-10546, 26753, 5844, -22622, 7928, 35019, -743, -28685, 5178, 30539, 4871, -10894, 7893, 8241, -11752, -3660, 17773, 7472, -10491, -2725, 1141, -12389, -4443, 18095, 1920, -31235, -16257, 14543, -2913, -28229, -4731, 15404, -18784, -38111, 3376, 26671, -11622, -31475, 4294, 19371, -10095, -13538, 16875, 15209, -12959, -6654, 18882, 12913, -4285, 3492, 10832, -10, 3432, 19950, 8978, -11751, 1794, 21383, 4242, -12011, 10918, 19078, -15748, -24829, 15801, 27049, -14984, -27627, 8544, 13935, -17284, -11705, 21957, 11253, -25452, -15823, 17947, 13639, -7704, -2986, 5375, -6809, -7641, 10106, 10073, -5533, -3019, 4849, -7039, -8481, 14952, 15866, -16417, -19776, 13054, 13573, -17753, -13779, 15740, 3842, -28239, -12694, 21376]
853B1376j6503l1809J5861K7657j3387j8992J4764J2177j5501n393J6994L188
865A0432j3608o55O934m612J781J4491m447k2667L639K5059l336k0799R785J7298
879A9295j9809k2283K5181K8303k4074k9573J6587K1047j6313j1857K1278Q297
891A6079k5246j1200K1538J2399j2136o203L279l167k095R193K463q958K72O542
905B760p214o721J6079J1207k0716j4100K2708J5279k2266j3104K2527R232k3240
918g569o402K4830M362k6119n015K3071P077j6553n330Q803k32m674N116M770
932F135n767m110r0k683L413J2651l04j9888n612J9327Q246j5321k127J7064m464
947F470k2458N931K8089l68k7298l956J9683K512j3497K524J2764n445j4530K650
$$ y = [21376, 4873, -26936, -11075, 16582, 3195, -15797, -1033, 11144, -4357, -9750, 7244, 10432, -3176, -3831, 3103, -1509, 272, 14763, 10316, -12351, -8712, 16347, 13011, -7788, 1997, 19295, -514, -22797, 2384, 30687, 6613, -22960, -6373, 14674, -1639, -13496, 7782, 16079, -9167, -20367, 1171, 13570, 1434, -4769, -1490, -4657, -6752, 2441, 4904, -4054, -3782, 2760, -4454, -11175, 4904, 16111, -4605, -18705, 4003, 19282, -2984, -16088, 6439, 15671, -7569, -13971, 10859, 15221, -10898, -15913, 7158, 14235, -2318, -7648, 1155, 923, -3751, 1365, 6135, 368, -3742, -3832, -6515, -3102, 9549, 9245, -10643, -16255, 3072, 11318, -4003, -6130, 10934, 6470, -15988, -10057, 18032, 17664, -9634, -13590, 6093, 8605, -4892, -2368, 10396, 4951, -9579, -6929]
961f929J4144K053q129n075J38M234M789k549o972J498O595l916q370Q280J0833
976A0624j0391j5479J1007J9052p422j8719N081J5527n404j2175Q117J2034j0207
989A645j4879O767J5845r02j1996m077M762M046k60m89O01Q90l503o657K761J2823
1005G377K765j4951r402J2230J1214q151p806R237N499j2457o426J6299J1048
1018A6476j3667j4346Q441J2908l948r549K875N840m596o663M311R158j029j1071
1032d860m557Q423R062l803j0418L64P271j66p092K424R754l708j3850P60J6680
1047F284M811j3673o934R517O769o074l817P809L029j0410o759J0116J0879m966
1061F581j3197p28R712L660o047k511N377P57q734k257J1335P194j0637j2956
$$ y = [-6929, 7215, 9268, 1139, -3936, -3798, 436, 5225, 2676, -4296, -2798, 3797, -119, -8489, -209, 10624, 233, -15246, -4239, 14813, 7391, -11328, -6247, 9280, 3876, -8299, -182, 11852, 1645, -13234, -6467, 9378, 8476, -3520, -7597, -2835, 1211, 951, 462, 1063, 1953, -1550, -8207, -5446, 7377, 10142, -4809, -14211, -1981, 9233, 1082, -6724, 2513, 8012, -4445, -10871, 5428, 16476, 2809, -11537, -3096, 9812, 5864, -3685, -810, 5030, 434, -6229, -1918, 7240, 6211, -4860, -9417, -994, 8068, 4265, -6153, -5789, 1482, 1316, -5776, -3352, 6402, 2694, -11156, -10396, 6284, 11095, -2578, -9512, 5, 6774, 700, -3117, 4692, 7721, -2689, -9448, 668, 11547, 6581, -6616, -7344, 2368, 6028, -19, -2530, 2847, 3604, -5130, -7387, 3948, 11142, 505, -12451]
1075a2451O198J2954j264j0347O53P802k363q504M144J2565j129j4726l762J3539
1089C309P300p732q816M594N971n097m445O965O426p369j0986L757J3662J428
1103H967j1475n308P132M488n141k898O810K777r995o631R919J1181o477j2384
1117i035J516J0661J600o986p3O782j855q707L06J1999L868j1172q626P018J0393
1132G689k693q356J632O096l125o784M162J0927k323j4063k881J3174O812r704
1146E63p971O677M914o392l870R031O002r714j0041P272J2587j616j0873j887
1160e318O869K008m667m67N930O76q751m617R165R509n547j2337J177J0747P84
1175E161q600R5P957k836j1110J716J3770J232j4122n555J0699O886o402m542
$$ y = [-12451, -6253, 6701, 5437, -4910, -4257, 3545, 1182, -7322, -3178, 9387, 8258, -6468, -10230, 3309, 10609, 2877, -5939, -1345, 4626, -471, -4916, 2049, 8475, 1106, -9880, -6123, 7539, 8967, -2508, -7816, -684, 3804, -1337, -4235, 2575, 5352, -4643, -11274, -1355, 9826, 3349, -9035, -7519, 3142, 4742, -2244, -2317, 4465, 2610, -6097, -5791, 6208, 10076, -1096, -9722, -2704, 7689, 4996, -3360, -1728, 4368, 1243, -5541, -1379, 9548, 7225, -6838, -9719, 3455, 10267, 563, -7408, -731, 4183, -2209, -6079, 2952, 8954, -760, -10801, -3529, 9058, 7442, -3431, -5318, 1551, 3559, -1108, -1575, 4355, 5031, -3720, -8337, 828, 10337, 4790, -7547, -6370, 4377, 5161, -3439, -3344, 4613, 1777, -9333, -7617, 6153, 7385, -6737, -12292, -1593, 5293, -1109, -5651]
1189e651M657K749m746k449O365O115l921q997n45R662O803o346p965L329P282
1204F342l654n519O911Q404r706j3315P916J6262m342j5746J082R893k308r095
1218f875N091R596o146j2236J788J1208K984p015m453K106L354J079j809o40L264
1233A296J055o468k281J0280P018j1217j0205J1017J2159r207j1093R171Q964
1246A0489j0629q255J2023Q945j3615j1576R598J0933n334p871K075K311k985
1259c891L88M051J578j817l117m722J348J1952M845j2791r007R975Q518r060l353
1274e103J4375K053k0283m778K1944Q504j7491q513J2923L565j2828n44J4434
1287H258o08j3609k073R510J492l469K56n40k476L998L151o792k245R779K558
$$ y = [-5651, -994, 1755, -2991, -5440, 925, 7040, 3119, -5878, -6423, 3239, 10042, 3696, -4269, -940, 6342, 2688, -2831, 4080, 12484, 2778, -10537, -2621, 13641, 9299, -6447, -5365, 4528, 2220, -6875, -1784, 7812, 1666, -10570, -8782, 2426, 5410, -1605, -6058, -3952, -598, 481, -1328, -1968, 1296, 2351, -4117, -6398, 3882, 10900, -317, -10522, 495, 12654, 3447, -7646, 1525, 10489, -140, -8395, 3628, 12573, -1042, -12618, -3020, 7913, 2579, -5292, -3217, -906, -3891, -3503, 548, 2126, 309, -2808, -7530, -6182, 5770, 10615, -2176, -11183, -1208, 7310, -1750, -5103, 9272, 11325, -8958, -13736, 8208, 16712, -779, -9292, 3631, 7196, -5632, -6176, 8258, 7650, -5959, -8032, 1478, 2970, -499, -243, -783, -3259, 739, 3890, -2902, -5147, 4632, 7190]
1302G190j1833j263J4389q21j8049K680K2109n64k2760j944J9085p35j5114O330
1316a300J4985j0328j8989O383J6984q67r511j77r07n292L562R737m01n861O15
1331a367k334p764P055J8691l391k1517j63J8366k971j3973J1085J7190j5265
1344C642k2244J3524K1676r663j6351J0430J0489j4087j0142J4345Q342j0672
1356g11m638P063j415p100M362N285m025J01Q146o764j3936Q563J9029o254j5712
1371h006R115J0557j6893j1196K5035J7363k2952k0112J5742J1760j3268j335
1383d190J8814j698k5220n422J9604P117p717j70j215j1618k242J4986M752p965
1397b184Q87L346j3218o515K1116J4440j8655j4195J6897P728j9438j560K7197
$$ y = [7190, -4643, -5906, 8483, 7662, -10387, -7707, 14402, 13838, -8922, -10866, 8219, 7484, -7630, -1300, 13685, 3357, -15632, -9249, 7735, 6868, -2643, -2820, -3727, -9019, -5457, 4280, 3879, -1982, -1367, -3701, -11465, -4410, 14281, 10890, -10627, -10790, 7576, 4605, -9368, 1717, 18907, 3642, -18602, -5078, 16598, 6935, -9416, 1014, 11503, -2584, -12726, 1619, 9961, -711, -5349, 1714, 299, -6801, -2439, 2846, -1179, -1078, 7068, 304, -13632, -5069, 13960, 7706, -8006, 1109, 11666, -5227, -16423, 8612, 25975, 3023, -17089, -1347, 10413, -2855, -4190, 14624, 12926, -12294, -17716, 1888, 9005, 1288, 1118, -97, -11715, -13957, 1029, 5781, -2184, -1297, 2049, -11169, -17684, 3432, 17872, -783, -14978, 1919, 9647, -9791, -11351, 15846]
1410A5846K643k7243n067K3344J635j8282M710J9148o955j9624M313J2390m334
1423B524m104R156j157j3867j344R868j642k649J1308R11k2241o880K3945R532
1437A3360j6747k462J5803r138k3686J2761L2044n227k8748M99J7671o285r305
1450i460J6958J2340j8958j6490J0665J1539l685J488M684j0881j0272R626R293
1463F847p846r66J1558p123j9439P308K3405o067k0529R298J7532j5869j8462
1476b0353J8403K0427j5610j7047J4717J0305j7931n845K0025P984j5958o566
1488g449P964r72m368J0643O237j1883p789O821L67o109J1405J2214j6571j9890
1502a9380J2687J9140r932j0581J4873N215k4037q553K7515J3197k1520j0832
$$ y = [15846, 18489, -8754, -13821, 9523, 11158, -7124, -2414, 16734, 9779, -9845, -5532, 6858, 2524, -1580, 7576, 6419, -7448, -8792, 1076, -566, -3215, 8093, 9004, -13237, -20117, 3828, 13360, -3387, -5849, 9954, 816, -22870, -10109, 21935, 16708, -12040, -11541, 6130, -155, -9460, 7498, 19838, 880, -15610, -4945, 6594, 2909, 4397, 9081, -1800, -12072, -2446, 6847, -999, -1965, 9593, 2470, -16969, -9661, 13744, 7677, -12852, -3554, 13978, -1891, -20353, -1950, 18477, 2867, -14180, 537, 10842, -7089, -12934, 7091, 15075, -883, -7449, 515, -457, -4825, 5818, 12055, 172, -7617, -796, -429, -6538, 4867, 17081, 510, -19380, -6693, 12447, 2515, -8066, 6807, 12022, -12015, -20568, 6947, 20144, -1376, -12208]
1514a2208J4413J891j3194M465J7113l693j6090P84Q894j844n99O506k672j0177
1528f411M172Q758p659o531J2982O186j7645o221J8403M498j9809r74K2159j6
1542A1892k4411o87K1570O0j6757M384J4160q771j5009Q464J4958m125q219K153
1556c38q72m844N915Q519m651p252M006R97q880L982J6655l697k1110O03J8421
1571G454m56j5389O200J4462j1047j7081J1119J7876p880j5183O169J0201p218
1584g73o020Q471M610p757k440M951L81j767K758k62n955K979Q945n180j1091
1599h150O012J1798p268j1196R183R937j2914j0874J4904J2678j4107j2964J1059
1612a902R012r012m745J0320K313j1480l556R350M903l516k205j228k423K895
$$ y = [-12208, 2205, 4096, -9098, -4633, 12480, 8787, -7303, -6519, 2375, 531, -68, 6438, 3766, -6411, -2239, 6519, -1140, -7671, 5311, 11497, -6148, -12369, 6034, 10532, -9277, -10251, 11908, 11892, -12519, -13206, 8364, 8424, -8333, -3949, 10211, 1440, -13569, -5105, 9853, 5728, -2491, -338, -1210, -6054, -139, 8380, 3729, -3523, 483, 1480, -7400, -3418, 13237, 9540, -11570, -10967, 7454, 6998, -8391, -2191, 12271, 1224, -15857, -4738, 13138, 5258, -9925, -3756, 6445, -773, -6793, 1678, 6288, -1469, -3909, 1042, 1423, -344, 2414, 2152, -3803, -824, 8121, 2941, -8150, -2138, 9660, 2392, -8804, 379, 10316, -2598, -13472, 1432, 14110, 3, -12961, -1902, 7110, -1902, -6647, 3673, 5986, -5494, -9050, 300, 5203, 1687, -518, -1746, -4169, -1274]
1626a274O327k274m953L542K642p463k145J2564M673j4634p559J3341O799j1752
1640b166m864J1568K631j3330k087J3840K653j2586l483Q635K902n506j145K658
1654b80k44j242P42O92R67J160k275m074K814Q594j210j0760m21J0795N43r579
1670c778J412R990l906j2236L791J3576j449j2715j459R198R80o158O76N676k478
1685A120o269M98N522L172k563m993k090M895M792k757m284K647M063m653m243
1700e143O996P126p453r874O064J0380l236r552K917P081m177o432M397P392m055
1715B431q207R20P537J819n160l100J720K650q77j791R65L735k478n448Q28Q673
1731D217K212q855m056P171N158n571l054N346K605p093l894P960O041o492p424
$$ y = [-1274, 5053, 2779, -2174, 1368, 4010, -3453, -5598, 6966, 11639, -2995, -10554, 2787, 9586, -2166, -7030, 4538, 7169, -6161, -8248, 5592, 8245, -4341, -7824, 811, 3713, -1793, -2938, -280, -524, -1766, -1024, -332, 635, 1795, -480, -4554, -1740, 6854, 5644, -5116, -5537, 5258, 5801, -3778, -2366, 7624, 3718, -8518, -4727, 8849, 7400, -5315, -6774, 2424, 3404, -2754, -2078, 3598, 1120, -5149, -4651, 871, 4043, 1480, -3513, -5603, -708, 4084, 1327, -2957, -310, 3753, -900, -5143, 1853, 8979, 1526, -8348, -2284, 8096, 4860, -4692, -1775, 5306, 1129, -5303, -906, 6486, 2431, -5776, -4856, 2681, 4500, -660, -3760, -2040, 610, -267, -2058, -1093, 2642, 164, -5284, -4456, 4217, 6429, -2426, -6482, 689, 5847, 276, -2778, 2568, 5173, -1920, -5814, 2146, 8187, 1695, -5729]
1746e729K874O899j076m430P9L419j681m392R54O038J453o461m794M211P158k336
1762B186o003P92N166j229m870K631O998j657q917n93Q895L675p274m165N059
1777F94L395m339k186M864K705n640n214M089P261j839p136j534N493J798l838
1792a427j568M327O37n638k167O389N627n579p000K772P331p83n399J101M159
1807B782j073n505J679P492R3p349l751O510M990l913m330K032L296k661l484
1822c192L262N115l315p144R7Q053K012o441l883M702L356m384k312N248L192
1837D366o209n039N839P533l136p401N70O204L31m539L35M808r74n851n31O384
1853B690L528n896n250K648N687j072n129N54M429j738n536J587P607O9q500k931
$$ y = [-5729, -2855, 4044, 2968, -1462, -1383, 2036, 355, -4037, -3083, 2955, 4408, -2053, -6847, -2636, 4522, 2186, -3817, -3025, 2141, 912, -3958, -1327, 5671, 4014, -4903, -5496, 3399, 7074, -200, -4365, 694, 4089, -250, -2436, 2428, 5133, -507, -5721, -1632, 5629, 3790, -3346, -4880, 613, 2411, -1427, -2995, 1332, 1969, -3669, -5836, 553, 6180, 601, -6399, -3627, 3704, 2921, -2478, -1377, 2782, 1709, -3796, -2117, 5375, 5468, -1881, -5632, 878, 5868, 1955, -2375, -343, 2953, 292, -3192, 70, 5185, 1870, -5274, -5177, 2876, 4888, -1553, -5436, -734, 2622, -1762, -4074, 1174, 4366, -1843, -6882, -1043, 6490, 3354, -4047, -3477, 2727, 3058, -1481, -1146, 3662, 2688, -3163, -3694, 2690, 6218, 322, -4928, -2280, 3407, 2335, -2794, -2240, 2189, 451, -5085, -3498, 4109, 4178, -4322, -7253]
1869g253P961M726n866l864M820K715m620k307N769M215n469n490L273O267j68
1884D709n217j142K910J264k231j106L121K144m821n086L932P341k304q561j45
1899e192P563K90o639K64P111j574q586J246R034J456q640k555O402L178l767
1914d09j704L128N78k667j393L075L080l49n115k516M571N295l285n911K378N426
1930D182l716n553N304O912n569r872M805R979l057q814K758O419k921n658M272
1945e29N818l356n876J550M652J047k040k233q91K426K386j640l315L054K834
1960C887n206m113P772N795q776q136P607Q506o955p207P153N351r211m976R989
1975A480O183q760o347N723N171l092j314K565q40k628N79J884M18K138P0n956
$$ y = [-7253, 708, 5434, -432, -4296, 524, 3239, -1381, -3688, 2081, 6296, 827, -4663, -1390, 4877, 4709, -508, -1650, 1260, 2524, 293, -813, 2308, 4452, -369, -5455, -1523, 5818, 3514, -5047, -5192, 2371, 2661, -3978, -3714, 3397, 1823, -6763, -5517, 3517, 4973, -3667, -6222, 180, 3358, -409, -2113, 1015, 1593, -1074, -2467, 608, 3688, 3339, -1776, -4292, 279, 5574, 2289, -3622, -1244, 4182, 466, -5087, 217, 7129, 1560, -8312, -3507, 6472, 3415, -5399, -2641, 3778, 857, -4801, -529, 5289, 1933, -3943, -2393, 2259, 3306, 1266, -967, -1858, 568, 2954, 1314, -2001, 1053, 3887, -1319, -5432, 2340, 8135, -641, -8777, -1170, 7336, 381, -6826, 327, 5678, -3533, -8509, 1480, 7663, -1097, -7444, -1721, 3450, 358, -956, 1609, 769, -1859, -1280, 604, 1022, 3160, 3230, -2726]
1991b726k206P392N090q131m742Q073L675j0301k538J2125J886j3219k804J2513
2005D087K558j1381j843R855Q28q937J145O345j490n640K426M339j427j060N88
2020C93k491j143O499L412q006l134P576J255q592J740J2525k858j5746J117J5752
2035H299p01j2555K010J0166n860j0443P049J1463n488j0401K842O126l340r30
2049a763M171q96n066J771L277l879L63P134j708j0132K584J1380l446j1657N377
2064b490J2529p594j2397P836J2060r339j0289J0445R043j1385q853R468P531
2077F565p770l285O434o40p328K615O874j893l049K731j972o472N568J0936m789
2092D525j1195N127Q541p667o485J3244P757j5589r920J4314R385j2485m920J1595
$$ y = [-2726, -4932, 2460, 7550, -581, -5323, 2750, 6425, -3876, -6414, 5711, 7597, -5622, -8426, 4087, 6645, -4736, -6579, 3276, 4104, -4833, -3688, 2657, 1167, -4473, -2047, 2292, 865, -195, 393, -2098, -3241, 3258, 6670, -1336, -4470, 3106, 4361, -4231, -2491, 10034, 7176, -8570, -7453, 8299, 7598, -4957, -2947, 7219, 1359, -9084, -2035, 9428, 3940, -6461, -3619, 2507, -833, -1763, 2408, 1512, -3554, -1783, 1494, -2385, -2022, 5112, 3404, -6728, -4144, 7236, 3790, -7867, -2490, 10039, 2445, -9952, -2116, 9944, 605, -9684, 761, 9804, -1581, -10434, -966, 6565, -1205, -4490, 1944, 1304, -6024, -3409, 3465, 1572, -1477, 1254, -718, -7190, -1622, 9314, 4525, -6670, -1543, 6998, -669, -7154, 6090, 13847, -1742, -11662, 2652, 12037, -448, -5368, 6227]
2106F227J189j3841r07J4003N22j1092K02O179l609l668N388J776o063N35N476
2121B317l784o383P300O944r454n720J1418M276j3230l651J6412L847j6364j902
2135g974J4204j34j3682M011J4411m757j4551L405J0592k698n144M961J361q537
2149d532o76P939K56m784L641J314r925j399J3429L687j3337k410J1903j658j2719
2164i271N956J5343o335j6211N068J4858n672j0799P450R296r586p953R016N566
2178F726p024k911N914n46o201L141L790n189j323Q049j114j0431J689J1239l072
2193B737j0317O061J0661r678j2039J1095J3526r962j1063R346O857j0708l661
2206g145J2980M285j2184n258Q139K421m759L029L062o067m155N647K418m276
$$ y = [6227, 7416, -6425, -7332, 6671, 7193, -3899, -3697, 2482, -1127, -4795, 593, 2369, -3694, -3159, 2317, -1467, -7850, -550, 6394, -3060, -8780, 2638, 6914, -6316, -9967, 6445, 10292, -6072, -7974, 6230, 6096, -7586, -3575, 10836, 6079, -8472, -5067, 5525, 2827, -2317, 2644, 4005, -4532, -5208, 2731, 2987, -1797, 1844, 3158, -6767, -8166, 5263, 8950, -4387, -6797, 5106, 3448, -9271, -3315, 12028, 5693, -10518, -5450, 9408, 3736, -7063, 387, 9683, 97, -7856, 1160, 6726, -298, -3209, 2705, 2159, -4042, -901, 2889, -2300, -3623, 4426, 3312, -7119, -5430, 5809, 2737, -7580, -1519, 9142, -536, -12575, -1480, 12046, 2084, -8979, 367, 7224, -3484, -7145, 5835, 10120, -2064, -7322, 817, 3238, -1521, 1508, 4570, -1497, -5652, -5, 2413, -1863]
2220a863K225N029p466q223R140R519q014q991R464O036j2075m682J4514N225
2234I838j3890m479J2698K400j1080j62J0923q56q528Q51O272k538l958M466J828
2249C785m371j42K688l373k539O985M422j0152n356R295L612r237n30J1982k108
2264D961j4604J014J4634Q10j1379K40Q827l676q110O072Q994m332p951K274L796
2279A570j736J192K897k439m643K866K191l902R72O320k475r430K087R996k146
2294C320r899L652R644n229j0228N798R870n600q250N688P353o197o523O157N498
2309E054l193l475K327L00k472K012K283j363l89J310l218l842N186O833n044
2324B309q063L963N910n031m592Q246M505j0052o847Q779P312o292m818M976K442
$$ y = [-1863, 362, 5391, -2075, -10298, -1158, 8361, 347, -8644, 820, 6856, -5219, -9901, 4613, 9838, -4052, -8531, 4167, 6567, -4513, -4675, 6248, 5392, -3136, -2285, 3987, 1449, -2509, 1957, 3785, -586, -728, 1960, -1413, -3952, 3033, 7455, -2697, -8053, 1242, 4854, -4383, -4913, 7069, 4961, -9643, -8629, 6005, 6815, -4564, -4324, 4503, 827, -7283, -1211, 7783, 3451, -4500, -2226, 1570, -166, 1026, 3923, 1484, -3159, -293, 1898, -2004, -1032, 5288, 2813, -6617, -4530, 5466, 3320, -6579, -2927, 6717, 1488, -8740, -2942, 6928, 1328, -6922, -1234, 6119, -78, -6601, -444, 5054, 1861, -1614, 713, 1013, -1459, 553, 2836, 1473, 1084, 2394, -824, -4666, 520, 7353, 2309, -5754, -1791, 4119, -912, -5504, 2742, 7247, -2805, -9652, -873, 6439, 147, -4671, 305, 2747]
2339B747o000j173N944K667m307k611J759J174Q34J196j714j859K072K214l722
2354g79j758N449J722o985j829P652J568q230k034Q210K104p969k173O499J581
2369C028o030j045O798K81n616j872M146K904j637j572l5J15P07k15K48J107J762
2386C074k343m465K237O520j002o390j96N591j098n260J949O276k348p647Q41
2401d261P111o8n399j013M262L42l428M1L305O28k629j850J864K850M56l194j518
2418b501L717K170k826k549K832L136l649l087M098M107m268n309L270N480j990
2433B631n119J139L799j441m178J926M250j083m976q81M149K213k249k516J253
2448a083K140n41k374J130L542j363m411L13N416J345m638k502M149J709l156
$$ y = [2747, -3253, -4426, 1518, 4185, -122, -2733, -974, 200, 1034, 2230, 516, -1343, 729, 2943, -779, -2537, 2912, 4634, -2351, -4180, 3472, 5040, -3190, -5224, 2986, 5090, -2879, -5052, 1447, 3028, -3002, -4047, 2751, 3032, -2584, -4456, -310, 2594, 957, -615, -650, -535, 172, -43, 205, 1312, 3074, 731, -3734, -1497, 5023, 4021, -2369, -2565, 3026, 1928, -3332, -1383, 4893, 2545, -5102, -4261, 2850, 2782, -2617, -3630, 632, 974, -2454, -2413, 892, 1520, -1109, -2959, -1095, 1755, 2211, -983, -2501, 1216, 3386, 560, -1989, 843, 3979, 330, -2757, 1341, 5448, 1180, -4129, -859, 4621, 2631, -2488, -1349, 2450, 1009, -3169, -1243, 3007, 1924, -3052, -3933, 216, 2429, 180, -2336, -1083, 1057, 516, -1858, -728, 2814, 1451, -2960, -2647, 2769, 4114, -524, -3026, 1123, 2832, -324]
2463c24k190L627K288m066l313L681M129k979m429J099L886o6l277j40K854J09
2479H89l212p53M343J928l564l283K455M130j047l666R13L899j279l392R52M770
2495D083n23n433p13M586K364l913k559K805J974k740k406K924K592k630m113
2510c702K028L678n2m292o14L189J100k368j416L197J908l672l017M171L783k678
2526A243m924J554M405r4l812N28L419o23l914K63M494J244n156j972L521K280
2542B456j968k529J380K461k120k703J967L766p62m281q68M478J861l495k415
2557b772K943K524l289k526L983K967l793m109L017M784k204m201P86L577k33
2572A454l095M44K738k62k941r38L218K125k289l298Q10L841N16l439l43L544
$$ y = [-324, -2514, 1113, 3401, -665, -3978, -297, 3832, 853, -3576, -2477, 1409, 1343, -1934, -2074, 780, 889, -2323, -3076, 1267, 3195, -369, -3652, -1197, 2933, 1886, -1780, -867, 3032, 1753, -1639, -687, 4083, 3560, -1873, -2586, 2000, 4364, 451, -2108, 697, 2671, -69, -2475, 449, 3041, 411, -3702, -1674, 2004, 1952, -2340, -2954, 235, 1335, -1033, -2449, 748, 2656, -1016, -4033, 138, 3921, 1243, -3681, -2127, 2278, 2184, -1628, -1100, 2319, 1696, -2218, -1955, 2539, 3783, -1373, -3345, 176, 2456, 488, -2041, -661, 1800, -320, -3023, -1056, 2710, 1948, -2333, -3201, 1277, 3138, -357, -2772, 171, 2695, -594, -3120, 863, 3830, 37, -4072, -1055, 3729, 1525, -2676, -1890, 1687, 1454, -1641, -1197, 1541, 1279, -1662, -2600, 618, 2743, 454, -2844, -2034, 1807, 2323, -1116, -1459, 2085]
2588B085K64m326j44N419J172n657k460M883L123m142j924L313J839m011j950
2603b516L825K381l120l221J145K625P3k250q44J076J071j493j669J718K508j614
2619c05m804J328N694p27n611L09O048J0n715M77N968k52n873R50N964L28n180
2636a391l26L906J082k162j58J002k07o90m66N46J329J018k567l854K525M852
2652D439j628n534J815M043l020m879L892O109m234p158K903O471k668m305K839
2667i15L970l722l730L266L695j806k220P80P00l64R03p5j604J200K361k705l167
2684c433L506L942m136m581N033M535o668m686O655N499o239m680N329L224o349
2699c049j767P123K420o368k331L830J592j453J211J077k642o52K054K32r47K963
$$ y = [2085, 2349, -1977, -2121, 3298, 4470, -1187, -3647, 1236, 4359, 217, -1707, 1606, 3445, -566, -2516, 1309, 3690, 570, -2651, -1506, 1119, 1192, -1058, -1902, -826, 245, -1248, -2917, -1199, 1309, -305, -5109, -3781, 1913, 1186, -4425, -4116, 1932, 1942, -3773, -3296, 2672, 2420, -3453, -2503, 3461, 3789, -1391, -1717, 2189, 3271, 1109, 951, 1953, 1746, 1056, 590, 1136, 2465, 3483, 916, -2938, -413, 4439, 2811, -2723, -908, 3135, 115, -4764, -872, 5237, 1003, -6155, -3252, 3219, 551, -3754, -915, 3055, -667, -4397, -1131, 2564, 758, -1462, -682, 18, -346, 557, 482, -1122, 78, 2439, -266, -3433, 73, 4015, -121, -4702, 331, 4866, -1802, -6488, 167, 5666, -573, -5253, 76, 3300, -3049, -4816, 2307, 4727, -1641, -3972, -142, 1450, -3, 1208, 2285, -357, -1009, 1045, 1277, 330, 3293]
2715C293J138n815l180O631M693o675l344O186J008q222p58R767J715j0193k496
2730f252Q132L14o379J409O227j853o260J481L959r84j146K606o89k638J041K674
2746A642k706o72N138R88p284j911Q431J137p396J350P954l246j0431K476J1230
2761F700j600q968J696N978m736n419O170O342n057n442K102J746j193J884L483
2776C686l572m051K830J757l102K008O375l534r063K732R138j967p707M629O336
2791F495p056p737P405R322o804o665N554L956p129k459P960K205n854j901L977
2806A269j937j670M329K123m348j318L819k478l907N586O588o309q502N423O723
2821E391o123m098Q927L583j1666n530J0926M901p814k604O507j458q287K307
$$ y = [3293, 4431, -1384, -4564, 2067, 6760, 85, -3259, 2927, 3935, -4287, -5045, 4722, 6437, -3756, -6252, 1880, 2194, -4185, -2776, 3451, 1598, -4662, -3181, 778, -206, -1352, 1254, 565, -2073, -1032, 1642, -1064, -1736, 3402, 4390, -2894, -4805, 3626, 4763, -2633, -1283, 6671, 3425, -7006, -4530, 6700, 5100, -3868, -2172, 3806, -930, -6349, -179, 6163, 1106, -4336, -2234, -488, -1681, 203, 3686, 114, -3937, -1107, 650, -2452, -444, 5931, 2397, -6666, -3934, 5204, 3237, -4470, 159, 6495, -561, -8298, -893, 8429, 1625, -5040, 514, 4470, -2659, -5118, 2842, 5047, -807, -2708, 1269, -668, -2338, 1991, 4114, -234, -1552, 2267, -211, -4118, 1468, 8056, 1747, -6755, -1332, 5391, -732, -4830, 4097, 7680, -3986, -9516, 1410, 6311, -1503, -4107, 2400, 942, -7345, -5038]
2835e038R069o91o183K86J673k209Q36N508o59n724J494L536l398k253P715L468
2851G430r267m204R036L022q848o93J0297n01j1253o2J0633q51q391K474O537
2866E359m543o422L813N599l247k202K591j051l959K149N002k722l024M129L24
2881A796o938R23R682K82j0266L14Q652j989q012M991R160n663j0385M481R037
2896F065m092n627M657L306o383k954N848K377m089m44J991k290j425L949J348
2911B237n010K86N157k185n706L608P680m670p382N230O953o184n905O856O695
2926G660p545n715O675M129o493k277O990N02n740q38M473p79j722J513N23m024
2942b668M09M078j190l476L111L042n544l711O775N208p306m369P025L279p486
$$ y = [-5038, 4031, 3340, -2843, -2557, -884, -3093, -2257, 3251, 2592, -3132, -1638, 1898, -1500, -3753, 3962, 7430, -1837, -6041, 2995, 6017, -2831, -3524, 6773, 6272, -4981, -5043, 5590, 4739, -3652, -1178, 5359, 816, -5606, -1793, 3806, 559, -1643, 948, -103, -4062, -1913, 3089, 367, -2657, 1472, 1796, -5142, -4219, 5463, 5745, -4521, -4207, 4445, 2456, -5556, -565, 8595, 2932, -7453, -2972, 6065, 1973, -3654, 1003, 4309, -2074, -5028, 820, 3197, -892, -1336, 655, -1635, -3060, 889, 2237, -2773, -2487, 2670, 485, -5221, -1613, 6067, 1397, -5985, -755, 6198, 14, -5891, 965, 7660, 115, -5600, 1075, 5204, -1289, -3566, 3424, 3926, -1814, -2652, 1821, 1042, -680, 833, 1356, -2668, -2259, 1819, 629, -2847, 264, 3306, -2238, -5949, 826, 6034, -1272, -5641, 1384, 4663, -2823]
2957b823j587Q261J629q678j053P272R95n934J18M658j409l621J621K388j866
2972b9o06J238q07j939K493K058m206j989N251J403n924r17O577O09p442M17P807
2989C994q43p788J394P853j418o262J172N779k008m837K765L623k035k702Q64
3004d49J483n97M88L95k399q89L308k75l374Q71L972k100n679L174O134k628o170
3021d735K505N784l199m972M098M822m063m383L390M389k620k947K045J424j054
3036D84o80Q61J5n67Q32r33j162J669J797k555k927L314K990l776l037L739K866
3053B930l923l250M627L294m462l542M144L334l640k019K873J744k572p79K146
3068I05R23j217q51k33R19J131m48j925o12K856K01k983k25L679m44m398m91N029
$$ y = [-2823, -4410, 3851, 5480, -3198, -4251, 3021, 4016, -1918, -1800, 2858, 1449, -2172, -551, 1837, -29, -635, 603, -204, -2143, 350, 2408, -1798, -3787, 1464, 2867, -3057, -3974, 2603, 3212, -4230, -3813, 3994, 3151, -4637, -3243, 4610, 3192, -3070, -1898, 3881, 1873, -2964, -199, 3424, 1389, -1313, -449, 1034, 437, 925, 1320, -1079, -1968, 1340, 1065, -2309, -1438, 2534, 434, -5245, -2071, 4063, 1435, -4735, -2230, 3554, 355, -4617, -519, 4303, 240, -4143, -753, 3636, 1016, -1931, 114, 1538, 484, -196, 665, 680, 113, 945, 12, -1150, 519, 2316, -239, -3166, 148, 3138, -638, -3675, 64, 2930, -993, -4243, 384, 3678, -784, -4326, -182, 3152, -488, -2507, 366, 2110, -462, -1241, 905, 1828, 611, -240, -473, 446, 1577, 1129, -796, -1408, 1448, 1649, -1334, -1559, 2120, 1676, -2722, -3213, 1816]
3086A816J005n001j287M165J583l994p77L762Q74l676r13L488J226k509j375J377
3102b36J640l72j077m74J278O85j300j594J864K260j906l509J405L889j361l604
3118b412Q25L434q94l770R69L997q65m148M03L714O42k956p84K506R35j851q21
3135a076J952L95n49k105R93K640j13k115j269K182J342k164j676K467J227k611
3151d80k165K795K344k293l183J287L106q38k684O50K397o67k556O36K519J45
3167A013k513p55K005J811r60k461J440J978j064j786P54K752n41k962o85L390
3183A416J333l299j147K111J785k551j472K267J720k439k339K053K556j099k706
3198a811O84K388n0k143j5J832J116k357j207K230J955j753k212J085K469l07
$$ y = [1816, 2821, -2180, -3467, 698, 2281, -1713, -2490, 1272, 2146, -1530, -2443, 1045, 2271, -238, -1613, -236, 1404, 1032, -45, -519, 759, 1444, 144, -1450, 414, 2674, 768, -2741, -1336, 2553, 1192, -2412, -1587, 1847, 953, -2817, -1848, 2149, 1284, -2864, -2461, 1253, 1895, -1061, -1845, 661, 1596, -255, -1076, 876, 1271, 722, -1383, -390, 2250, 2137, 22, -1247, 935, 2277, 113, -1563, 904, 2131, -480, -2645, 150, 2494, 201, -2982, -1695, 1411, 573, -2111, -1461, 936, 269, -2287, -1651, 868, 1013, -1500, -2255, -250, 1561, 601, -1860, -420, 1558, 494, -1292, -538, 2214, 1673, -1289, -1974, 1416, 2749, -550, -1697, 414, 2199, -352, -1824, 443, 2163, -276, -2615, -562, 1994, 895, -1811, -1127, 1261, 1211, -932, -947, 885, 2001, -356, -1563, 667, 2622, 869, -1343, -258, 2211, 1904]
3214A904k785N51K554r66k766N51K832j05k996q92K433J408k374j895J880J642
3230I76j685j839J470J847j067k265K42L029J74k605k26J508J877j789j603K493
3246E37J794k154k225K147L028j229l244J242K495k08k659M35K525n75k629j56
3262h76K294P44k138j538J643J370j207j774M95J706o63k040J38K174R96k940
3278a616j312K726K199k913j952K249K600k339j816K075K786k238k531K102K360
3293B380q65k417L99K140n30j454O16J278m0j487j227J285J917r32k212o00K863
3310A114M27k836m96L074L62l673q01M028J615m246j195L309J204l236j057L409
3326A002O58k436j620K449J188j498q94P58N60M26p26j169O62J875l73k544N56
$$ y = [1904, -881, -330, 2224, 1258, -1508, -957, 1875, 1770, -1226, -2118, 315, 1723, -651, -2546, -666, 976, -709, -2548, -1078, 769, -298, -2563, -2321, 708, 882, -1723, -1949, -441, 1436, -353, -1956, 537, 2331, 177, -2048, 99, 3127, 1898, -1346, -104, 2391, 2183, -476, -41, 2484, 1909, -720, -876, 1418, 2162, 24, -1514, 129, 1499, 292, -1482, -987, 719, 56, -1984, -1846, 328, 1324, -1616, -2928, -202, 1997, -916, -2868, -619, 1981, -358, -2174, -99, 2687, 449, -2082, 20, 2380, 1515, -902, -503, 1637, 1107, -347, 269, 1547, 1507, 20, -1207, 78, 1995, 1063, -1149, -1749, 1114, 1541, -1295, -1791, 1283, 1645, -2028, -2829, 1199, 2814, -1432, -2627, 682, 1886, -1350, -2407, 1002, 1660, -776, -2396, 53, 1241, -257, -1151, -393, 167, 593, -133, -1302, -640, 1235, 862, -1682, -1126]
3343a126L000m52l340M27M182jm923N57M144k35l715P54L713j135l934J078L484
3360B478k92k664O6J040l37m62M66K77k30k06p89j236J521K413j330l720J202
3377a803L765j844l683K757M078l184m523K844M519k423l849K766L268k553l159
3392c024K748L022k136j920J502P41j265j70J021m24L18N18j211k176J923L221
3408B688j981l236K545K340l678k583N179L556n295l491M056L053l612j835N007
3423B713R74n232r56L956J542k043m77Q07j459o94J604P59j111k6Q58k853j492
3440c130L672K556m314k371L894J359n346p92O538J218o408j258N787K51n051
3455c395J255N299j085m839P51L745o14j600J557Q83k593k91K125n3n63K098K51
$$ y = [-1126, 1874, 1422, -1918, -1491, 2691, 2690, -2233, -1676, 2468, 2233, -1482, -728, 2985, 1850, -2084, -1006, 2478, 2186, -478, -412, 628, 291, -171, 295, 572, 342, 136, -653, -1889, -368, 2045, 715, -3005, -1803, 1962, 118, -3565, -808, 3270, 86, -4437, -1593, 2926, 503, -3346, -580, 2688, 135, -3024, -276, 2746, 610, -1310, 192, 933, -332, -502, 519, 95, 413, 931, -280, -2456, -533, 2688, 707, -2529, 16, 2356, -1322, -3905, 1274, 4830, -465, -3956, 100, 3153, -459, -2294, 2713, 3687, -1545, -2501, 1455, 2997, 954, 477, 1284, -175, -869, 735, 1494, 383, 357, 1215, -1638, -3130, 542, 3098, -1216, -3587, 307, 1666, -3680, -4472, 2066, 3284, -3124, -4382, 1405, 1656, -3395, -2140, 3159, 2074, -2765, -2014, 1731, 1117, -483, 1074, 1957, -636, -927, 1198, 1145, 582, 2680, 2931]
3472B931m683j014M749J576m552j36M418k170o211K369P264j622o871J158N078
3487B284k668l628L839M165m156l806K768K922j891j80J984j188k267J221K092
3502A491j531j23L208j119n084J419N448j592m840K952M124m156n417M433N805
3517E018m314m937M147K880m795k073N416K348m754k092L050l9j678K000K500
3532B677k643k119J917Q09k474K363L520l733m287L254M429l406k621M046K482
3547D214o407k539O468L251n757k769N211J72n180N52N591q3m787Q5K763j443
3563f58p92K711N38l120N01K296k032j602L798K401n152k598N046J964m861p88
3579b348O364l45p611L64O669J15n334R42M252l032m392L026M690k275l158J781
$$ y = [2931, -1752, -2766, 1983, 3559, -993, -1129, 3289, 1119, -5092, -2723, 4541, 2919, -3952, -2794, 2284, -384, -4012, -173, 3992, -164, -3970, -1202, 1720, -171, -351, 1633, 445, -1822, -601, 1491, -40, -163, 3045, 1926, -3158, -1739, 3709, 2117, -2723, 229, 4353, 197, -5220, -787, 5018, 704, -4233, -86, 2794, -2001, -4074, 1342, 3690, -1064, -3156, -106, -145, -1823, 177, 2677, 34, -2085, -168, 641, -1833, 530, 4050, 317, -3970, -716, 3713, 307, -2314, 1732, 4214, -2193, -4732, 1736, 4987, -770, -3539, 1672, 1844, -3336, -2784, 2807, 2724, -2063, -1978, 785, -658, -1450, 1261, 1799, -1321, -820, 1476, -556, -2158, 1640, 4041, -1111, -3709, 1337, 3301, -1560, -2348, 4016, 3671, -3940, -3576, 3093, 3208, -2126, -1184, 3068, 36, -4356, -1330, 3360, 1085, -2073, -292]
3595b92J03j860J040L315j499k107R76J186k889M89N031k39o047J97M959k63m815
3612b715K377N122l435n915K604N807k213m071K753K684m053k759L709K470k384
3627a9j502J949r43j601J932J519j660o97K167j143l290K348M735k086m741K294
3643g38L599l140l167N019L940n497m306M316L246l519j608L786K64m345p46L559
3659F63J108j931l0N19j960l06K527N70j871N26J410k523j879L958K574l465k948
3676c058L791J523m191p81N394J007n451j474M743R50l504n7L616p33l992O10
3692a607K509j24j062N34J04j532J81J385p82o20K263k60l823R2M062J096l656
3709a240p95L759p25l961J572M844n90n070J08L652m21k412J413K205j989k322
$$ y = [-292, -189, -2049, -1009, 2306, 807, -1300, -324, 862, -2027, -1538, 3493, 3254, -2793, -2596, 2363, 2100, -2715, -338, 4784, 1349, -4566, -1962, 3845, 1632, -2439, 314, 2998, -1055, -3814, -105, 2365, -19, -1521, 428, -515, -2116, -184, 1335, -325, -1022, 1145, 2, -3288, -940, 3795, 1709, -3032, -738, 2861, -279, -3446, 1573, 5513, 16, -4290, 26, 3272, -247, -1855, 1931, 2195, -2150, -2896, 663, 1771, -160, -190, 329, -1631, -1937, 590, 1160, -711, -185, 1225, -1298, -3177, 781, 3355, -110, -3058, 733, 2256, -1935, -2716, 2678, 3685, -1766, -3240, 1503, 2453, -1051, -1108, 2508, 1775, -2217, -1607, 902, 778, -284, 250, 354, -1178, -997, 388, -394, -1014, 1249, 989, -2834, -2742, 1320, 2416, -1240, -2035, 1724, 999, -2962, -1390, 3454, 2864, -2206, -2098, 1554, 1133, -1279, 134, 2339, 350, -1972]
3725a972J130J761j15o37j9r87l03Q80O18j478P68J419j066k845J579L414j461
3742F86l049J562L093k088k837K322L224j697l271J570K753j928j713J910J687
3757B224j357k042Q72J063j29J30r87k0M1M14r64l20J671P09k214j994K609K348
3775B054k451j975K849P08k342j346K863K250k804j788K069J296j148r96J482
3790G21N22p65j115O59Q15K62o76r00K64J339m54j650K40J904j83k311j49K601
3808A124J14k579l11K518M05l061J3K308P51j810q34J724J067k037n54J611J059
3825A508j312j456P90J290J99q83q91J285K84p48j188J250J436j102k113Q44K422
3842A615p71k112L50K002o29j978M94K110O6k206l10J859M06j341o08J099R60
$$ y = [-1972, -842, 919, 804, 167, 148, -839, -1142, -262, 356, -1122, -354, 1065, -1, -2846, -1267, 2147, 686, -2363, -801, 2292, 204, -2633, -311, 2913, 1216, -2055, -485, 2268, 340, -1373, 537, 2224, 867, -1175, -303, 760, 631, 761, -226, -246, -205, 209, -755, -1075, 596, 1305, -909, -2903, -294, 2054, -397, -2372, 477, 1185, -1157, -2503, 360, 2610, -194, -1982, 87, 1383, 235, -761, 721, 1243, 478, -637, 22, 837, 1099, 423, -477, -213, 1126, 672, -978, -738, 1166, 983, -1328, -1477, 1124, 1238, -1341, -1652, 866, 1271, -1790, -1777, 531, 1282, -528, -1362, 362, 1429, -608, -1162, 449, 1508, 196, -1260, -470, 820, 1019, 136, -755, 530, 814, 66, -1122, 128, 1564, 462, -1651, -807, 1615, 844, -1268, -918, 1084, 455, -1523, -1029, 1081, 1147, -1059, -1369, 490, 896, -445, -1053, 46, 1006]
3859A006p75o50O72R20n42j090l29J787J85j567p63J626Q51j338j215J294J335
3876A407j688j503J256J894j266j446M69J804n36j832L39J748j47j207m40J697
3892E49Q23j753r99J391J298q85j182K43J635l68j634O2J916J06j861l81J849
3909H09Q96k031o61J351J023j415j004J168J313j007j468R62R37k18j397p4J608
3926G92k75p59n45J092R19j428j167J068J648j220j608R66J442l05k050L77J651
3943E98m27j787L05J931J42j942l11J755P41j621o19J390P46r17q00O87J433k01
3961A103j839L12J443L80j104j159J429J162j070j413J336J566j541k016J220
3976a91J802q02k389P85J582n25j891N17J565k94j519j10J361O15j300n26Q47
$$ y = [1006, 231, -419, 253, 1173, 631, -459, -788, 999, 1184, -383, -1146, 480, 1331, -7, -1222, 72, 1407, -281, -1784, -528, 1366, 100, -1346, -877, 927, 391, -1441, -1102, 646, 499, -708, -1148, 549, 1372, -381, -1380, 11, 1309, 424, -758, -515, 1120, 752, -882, -820, 1096, 1202, -659, -1040, 809, 1705, -326, -987, 364, 1387, -28, -1032, 136, 1449, 442, -1026, -64, 873, 655, -742, -816, 792, 517, -242, -787, 305, 1224, -204, -1371, -303, 1345, 125, -1483, -517, 925, 620, -1430, -1053, 598, 171, -1616, -1311, 620, 762, -1180, -1491, 264, 1005, -616, -1235, 155, 901, -16, -816, -129, 1304, 1103, -736, -424, 1019, 1399, 295, -864, 565, 1727, 657, -756, 580, 2146, 605, -1411, -191, 1611, 809, -1580, -795, 787, 262, -1629, -1112, 453, 159, -1360, -1470, -109, 506, -794, -1320, -473]
3993d73M77L3j010j4J440L03j451n65J951J381k470j146K420J337j834j554J828
4010F53J677j754j556J227J613j518j676J124J375q81j221K78J030n38m18O2K00
4027c23L57m27q05O7J431P01k178k81J982J086k231k86K311L25k786l86K784Q39
4045B180k499n06J723Q84k148o70K128M15j830j55N90j09l0l54l09K6Q70l71r53
4064a118J32J949l14k269N9L046p40k206N71K718j77l481M29L435m70k784R12
4081c08K490j223k319J126J629j86j667L79N60p66L59P15j141k89J202o32j591
4098a662J016J945q12k602O95L078j371k638K228K431k143l178K444L037k092
4113C76j894J729J737k382j051K083J093j336l68L73n61l31J349K02j259j56J516
$$ y = [-473, 4, 37, -973, -987, 453, 756, -695, -1260, 691, 2072, -398, -1544, 876, 2213, 379, -1175, 653, 2330, 576, -980, 247, 1860, 342, -1334, -210, 1165, 284, -937, -659, 371, -167, -585, -523, -323, 34, -393, -1198, -1131, 300, 1001, -1177, -1458, 524, 1610, -621, -907, 1404, 1729, -1057, -1443, 1341, 2180, -319, -825, 898, 1782, -366, -1036, 1092, 1507, -323, -478, 112, 3, -27, -381, -690, -664, 206, -165, -1118, -986, 963, 649, -1620, -1561, 1485, 745, -1461, -890, 1828, 1651, -1830, -1401, 2034, 1564, -1220, -308, 2182, 959, -1360, -234, 1395, 1209, -458, -79, 481, -285, 74, 789, -352, -641, 561, -71, -1662, -646, 1299, 487, -2115, -1420, 1658, 287, -2351, -123, 2308, 165, -3013, -569, 2468, 376, -1518, 211, 1948, -434, -1485, 598, 1691, 355, -13, 360, -201, -532, 817, 1019, -240, -396, 1120]
4130A120j500j614K185K160k103k617K567J560k738j676L604K007l908j542K963
4145D68J820l208j91K390J05k802j04K634J9j748M92L63j332K99J869m51j694
4162a071R99R31k016j280L380J749l696j479L357O61l219n63M432J02m526N8L690
4179A509J52k987O79K873j664k121J177J503n75p92J243p80j282R59J284j324
4195a46r49K306J2l445J29L882om096L03L604q93l937K480L869j933m031K111
4212g40K636j882j892K597J574k586j384K415M43j427Q62N52j344p31J950L00
4228A343k312L48K507j210l224J845L323j855l635K256L064l178k452L385K357
4243B562l045k678L422J861l038j157L397R6k668M37J721m57j044J555K66j950
$$ y = [1120, -380, -1994, 191, 2351, 248, -2369, 198, 1758, -980, -2656, 948, 2955, -953, -2495, 468, 2288, -920, -1111, 1279, 1384, -1418, -1522, 1112, 1131, -617, -125, 238, -1094, -795, 1074, 623, -1071, -72, 859, -1157, -2437, 943, 2692, -1004, -2483, 874, 1535, -1684, -2247, 2185, 2287, -2239, -2181, 1509, 1661, -1326, -647, 2226, 562, -1559, -382, 1121, 546, -246, 997, 217, -1065, -106, 1178, -146, -1095, 1211, 1223, -2222, -2093, 1789, 1783, -2313, -2010, 1594, 701, -3236, -756, 3113, 1180, -2851, -740, 1896, 14, -1878, 719, 2293, -293, -1677, 738, 1181, -246, 616, 1168, -176, -907, 1043, 1343, -969, -621, 1886, 676, -2548, -703, 2620, 765, -2870, -614, 2450, -728, -3180, 205, 2562, -483, -3161, 261, 2122, -916, -2073, 1324, 1420, -1248, -811, 910, 453, -591, 964, 1230, -720]
4259g20J6K336r39k169J994J881k711k201L087K548l812j752L483J486m192j094
4275b759M076N46l564j55L091o9k645N22K266j066j610R22J005p42m59J586p20
4292B25j599J967J160k224j228K692J242l623n46M044N7l742k44L880l09l839
4308b087Q33L304j144l214J645K212j449j879J281J324j176o18J424K93j405P22
4324F6R30j377m51J895L13k286J9K750n33k922R93L098j432l444J647L092k081
4341B77k591J806K769k397k128K012J670j741j238K027Q6j443M81R93r96m01J151
4358C37J21j808J034K171j354k019J213K494j927k199K396K326k763k488K976
4373E10J959k550j579K278R72k918j46J960M57j278o76J290k5j128R27L12j075
$$ y = [-720, -704, 1632, 693, -1476, 518, 2399, -312, -2513, 574, 3122, -690, -2442, 1041, 2527, -1665, -2759, 1317, 1863, -1701, -1856, 1235, 1166, -1479, -957, 1309, 243, -1367, -445, 560, -182, -641, 945, 225, -1374, 593, 1753, -471, -1699, 993, 2235, -1388, -1934, 2110, 2167, -1575, -1819, 2061, 1752, -2087, -1254, 2050, 906, -2308, -663, 1549, 100, -1779, -498, 826, -350, -968, 456, 749, -656, 66, 996, -381, -832, 1063, 1376, -910, -891, 1859, 1326, -1596, -603, 2495, 1063, -2381, -734, 2358, 277, -2314, -508, 2261, -136, -2264, -252, 1418, -323, -1561, 466, 552, -891, -410, 583, -413, -814, 337, 458, -1350, -316, 1855, 501, -1518, -305, 2189, 262, -1937, 459, 2785, 22, -2466, 510, 2469, -81, -1660, 618, 1590, -1328, -1474, 486, 943, -335, -1011, 279, 254, -874, 53, 365, -710]
4390g10N37Q07r76q90J695J165j924j459K873Q99k823r85L137O04k688q37K547
4407I72N54k493j52K515J8k522R8J957n47r05K02M28m01k28L83j08m23J014k05
4426A57j094j96K021J68k003Q6J976r5k586P60K313l98k450P02K315n92k297P66
4444d47J526m13j636N26J315p20l78n5M35p1N2n33l81M79J238j000j252R63J328
4463I76q65j513J191J755j206k116J764J611j343j327J162J268j140r77O06J401
4479A247p53j213Q07M45l35n53K1M26J58p5q78L8J023K98j357o72J514N37j082
4498d04j016J866N95j403o40J538Q66j511o93J157J016j202j011Q68R59m98r64
$$ y = [-710, -173, 634, -342, -1232, 463, 1628, -296, -1755, 1118, 2017, -806, -1791, 1346, 1950, -738, -1575, 972, 1526, -967, -1119, 1396, 1414, -1108, -1010, 947, 400, -505, -303, 125, -276, -504, -121, -229, -652, 362, 157, -937, -1133, 888, 1056, -947, -861, 1115, 1020, -1566, -806, 1507, 1109, -1341, -639, 1676, 1084, -1213, -447, 1079, 666, -970, -444, 871, 151, -227, -282, 153, 82, 134, -399, -780, -301, 937, -63, -1315, -352, 976, 111, -1402, -211, 1544, 338, -1778, -14, 1597, 254, -1073, 89, 1357, 217, -760, -154, 1247, 494, -719, 88, 533, 198, -355, -334, 92, 250, 175, -703, -665, 358, 656, -701, -1373, 141, 678, -404, -1420, 446, 1041, -362, -1002, 536, 1402, -109, -802, 355, 1371, 169, -842, 26, 985, 487, -477]
$$ [...]
8191a86
##END NTUPLES=NMR FID
##END=
