##TITLE=1H_PP151_30
 D2O, 8 sc, 
 30.04.2021
##JCAMPDX= 6.0         $$ Bruker NMR JCAMP-DX V2.0
##DATA TYPE= NMR FID
##DATA CLASS= NTUPLES
##ORIGIN= UXNMR, Bruker Analytische Messtechnik GmbH
##OWNER= root
$$ XWIN-NMR		Version 3.5
$$ Fri Apr 30 15:38:15 2021 Russian Standard Time (UT+4h)  she@DPX200
##.OBSERVE FREQUENCY= 200.131506
##.OBSERVE NUCLEUS= ^1H
##.DELAY= (6, 6)
##.ACQUISITION MODE= SIMULTANEOUS
##.ACQUISITION SCHEME= undefined
##.AVERAGES= 8
##.DIGITISER RES= 18
##SPECTROMETER/DATA SYSTEM= spect
##.PULSE SEQUENCE= zg30
##.SOLVENT NAME= D2O
##.SHIFT REFERENCE= (INTERNAL, D2O, 0, 15.7039)
##AUDIT TRAIL= $$ (NUMBER, WHEN, WHO, WHERE, WHAT)
$$ ##TITLE= Audit trail, XWIN-NMR		Version 3.5
$$ ##JCAMPDX= 5.01
$$ ##ORIGIN= Bruker BioSpin GmbH
$$ ##OWNER= she
$$ F:/spectra/data/she/nmr/H-F/1/audita.txt
$$ ##AUDIT TRAIL=  $$ (NUMBER, WHEN, WHO, WHERE, WHAT)
(   1,<2021-04-30 15:36:31.42 +0400>,<she>,<DPX200>,
      <created by zg, POWCHK disabled, PULCHK disabled
       configuration hash MD5:
       00 E9 B6 7A A2 85 ED C7 34 08 36 98 17 FE 4E 26
       data hash MD5: 16K
       66 37 CF A9 09 E9 38 C4 9D 57 37 94 18 5E 24 7B>)
$$ ##END=
$$ 
$$ hash MD5
$$ 69 8C 68 34 9D 62 91 9C 73 5F 71 83 91 E4 DB 4F
##$RELAX= 
##$RELAX= 
##$RELAX= 
##$RELAX= 
##$RELAX= 
##$RELAX= 
$$ Bruker specific parameters
$$ --------------------------
##$DU= <F:/spectra>
##$EXPNO= 1
##$NAME= <H-F>
##$PROCNO= 1
##$TYPE= <nmr>
##$USER= <she>
##$AMP= (0..31)
100 100 100 100 100 100 100 100 100 100 100 100 100 100 100 100 100 100 
100 100 100 100 100 100 100 100 100 100 100 100 100 100 
##$AQSEQ= 0
##$AQ_mod= 1
##$AUNM= <au_zg>
##$AUTOPOS= <>
##$BF1= 200.13
##$BF2= 200.13
##$BF3= 200.13
##$BF4= 200.13
##$BF5= 200.13
##$BF6= 200.13
##$BF7= 200.13
##$BF8= 200.13
##$BYTORDA= 1
##$CFDGTYP= 0
##$CFRGTYP= 5
##$CHEMSTR= <none>
##$CNST= (0..31)
1 1 145 1 1 1 1 1 1 1 1 1 1 1 1 1 1 1 1 1 1 1 1 1 1 1 1 1 1 1 1 1 
##$CPDPRG= <>
##$CPDPRG1= <>
##$CPDPRG2= <>
##$CPDPRG3= <>
##$CPDPRG4= <mlev>
##$CPDPRG5= <mlev>
##$CPDPRG6= <mlev>
##$CPDPRG7= <mlev>
##$CPDPRG8= <mlev>
##$CPDPRGB= <>
##$CPDPRGT= <>
##$D= (0..31)
0 1.2 0 0 0 0 0 0 0 0.06 0 0.03 0 0 0 0 0.0002 0 0 0 0 0 0 0 0 0 0 0 0 
0 0 0 
##$DATE= 1619782590
##$DBL= (0..7)
120 120 120 120 120 120 120 120 
##$DBP= (0..7)
150 150 150 150 150 150 150 150 
##$DBP07= 0
##$DBPNAM0= <>
##$DBPNAM1= <>
##$DBPNAM2= <>
##$DBPNAM3= <>
##$DBPNAM4= <>
##$DBPNAM5= <>
##$DBPNAM6= <>
##$DBPNAM7= <>
##$DBPOAL= (0..7)
0.5 0.5 0.5 0.5 0.5 0.5 0.5 0.5 
##$DBPOFFS= (0..7)
0 0 0 0 0 0 0 0 
##$DE= 6
##$DECBNUC= <off>
##$DECIM= 32
##$DECNUC= <off>
##$DECSTAT= 4
##$DIGMOD= 1
##$DIGTYP= 9
##$DL= (0..7)
0 120 120 120 120 120 120 120 
##$DP= (0..7)
150 150 150 150 150 150 150 150 
##$DP07= 0
##$DPNAME0= <>
##$DPNAME1= <>
##$DPNAME2= <>
##$DPNAME3= <>
##$DPNAME4= <>
##$DPNAME5= <>
##$DPNAME6= <>
##$DPNAME7= <>
##$DPOAL= (0..7)
0.5 0.5 0.5 0.5 0.5 0.5 0.5 0.5 
##$DPOFFS= (0..7)
0 0 0 0 0 0 0 0 
##$DQDMODE= 0
##$DR= 18
##$DS= 0
##$DSLIST= <SSSSSSSSSSSSSSS>
$$ [...]
##$SUBNAM2= <"">
##$SUBNAM3= <"">
##$SUBNAM4= <"">
##$SUBNAM5= <"">
##$SUBNAM6= <"">
##$SUBNAM7= <"">
##$SUBNAM8= <"">
##$SUBNAM9= <"">
##$SW= 16.9725357007746
##$SWIBOX= (0..15)
0 0 2 0 0 0 0 0 0 0 0 0 0 0 0 0 
##$SW_h= 3396.73913043478
##$TD= 16384
##$TD0= 1
##$TE= 0
##$TE2= 300
##$TE3= 300
##$TEG= 300
##$TL= (0..7)
0 120 120 120 120 120 120 120 
##$TP= (0..7)
150 150 150 150 150 150 150 150 
##$TP07= 0
##$TPNAME0= <>
##$TPNAME1= <>
##$TPNAME2= <>
##$TPNAME3= <>
##$TPNAME4= <>
##$TPNAME5= <>
##$TPNAME6= <>
##$TPNAME7= <>
##$TPOAL= (0..7)
0.5 0.5 0.5 0.5 0.5 0.5 0.5 0.5 
##$TPOFFS= (0..7)
0 0 0 0 0 0 0 0 
##$TUNHIN= 0
##$TUNHOUT= 0
##$TUNXOUT= 0
##$USERA1= <user>
##$USERA2= <user>
##$USERA3= <user>
##$USERA4= <user>
##$USERA5= <user>
##$V9= 5
##$VALIST= <valist>
##$VCLIST= <CCCCCCCCCCCCCCC>
##$VD= 0
##$VDLIST= <DDDDDDDDDDDDDDD>
##$VPLIST= <PPPPPPPPPPPPPPP>
##$VTLIST= <TTTTTTTTTTTTTTT>
##$WBST= 1024
##$WBSW= 4
##$XGAIN= (0..3)
0 0 0 0 
##$XL= 0
##$YL= 0
##$YMAX_a= 497806
##$YMIN_a= -432348
##$ZGOPTNS= <>
##$ZL1= 120
##$ZL2= 120
##$ZL3= 120
##$ZL4= 120
##$ABSF1= 10
##$ABSF2= 0
##$ABSG= 5
##$ABSL= 3
##$ALPHA= 0
##$AQORDER= 0
##$ASSFAC= 0
##$ASSFACI= 0
##$ASSFACX= 0
##$ASSWID= 0
##$AUNMP= <proc_1d>
##$AZFE= 0.1
##$AZFW= 0.1
##$BCFW= 1
##$BC_mod= 2
##$BYTORDP= 1
##$COROFFS= 0
##$CY= 11.3945322036743
##$DATMOD= 1
##$DC= 2
##$DFILT= <>
##$DTYPP= 0
##$F1P= 15.9154993809931
##$F2P= -4.1035820241983
##$FCOR= 0.5
##$FTSIZE= 0
##$FT_mod= 4
##$GAMMA= 1
##$GB= 0.15
##$INTBC= 1
##$INTSCL= 1
##$ISEN= 128
##$LB= 0.24
##$LEV0= 0
##$LPBIN= 0
##$MAXI= 10000
##$MC2= 0
##$MEAN= 0
##$ME_mod= 0
##$MI= 1.114404
##$NCOEF= 0
##$NC_proc= 0
##$NLEV= 6
##$NOISF1= 3.799351
##$NOISF2= 2.8
##$NSP= 1
##$NTH_PI= 0
##$NZP= 0
##$OFFSET= 15.70392
##$PC= 1
##$PHC0= -11147.92
##$PHC1= 50.60103
##$PH_mod= 1
##$PKNL= yes
##$PPARMOD= 0
##$PSCAL= 0
##$PSIGN= 0
##$REVERSE= no
##$SF= 200.130013532006
##$SI= 16384
##$SIGF1= 3
##$SIGF2= 2
##$SINO= 400
##$SIOLD= 16384
##$SREGLST= <1H.CDCl3>
##$SSB= 0
##$STSI= 0
##$STSR= 0
##$SW_p= 3612.71676300578
##$SYMM= 0
##$S_DEV= 0
##$TDeff= 0
##$TDoff= 0
##$TI= <>
##$TILT= no
##$TM1= 0
##$TM2= 0
##$TOPLEV= 0
##$USERP1= <user>
##$USERP2= <user>
##$USERP3= <user>
##$USERP4= <user>
##$USERP5= <user>
##$WDW= 1
##$XDIM= 8192
##$YMAX_p= 0
##$YMIN_p= 0
$$ End of Bruker specific parameters
$$ ---------------------------------
##NTUPLES= NMR FID
##VAR_NAME=  TIME,          FID/REAL,        FID/IMAG
##SYMBOL=    X,             R,               I
##VAR_TYPE=  INDEPENDENT,   DEPENDENT,       DEPENDENT
##VAR_FORM=  AFFN,          ASDF,            ASDF
##VAR_DIM=   8192,          8192,            8192
##UNITS=     SECONDS,       ARBITRARY UNITS, ARBITRARY UNITS
##FACTOR=    0.0002944,     1,               1
##FIRST=     0,             0,               0
##LAST=      2.4114304,     0,               0
##MIN=       0,             -432348,         0
##MAX=       2.4114304,     497806,          0
$$ Real data points
##PAGE= N=1
##DATA TABLE= (X++(R..R)), XYDATA
0 0 0 0 0 0 0 0 0 0 0 8 0 8 -8 8 -8 16 -16 24 -25 32 -40 48 -53 64 -73 86 -98 114 -130 153 -175 197 -224
33 -224 254 -286 321 -362 402 -450 503 -558 622 -688 761 -841 931 -1026 1134 -1249 1374
50 1374 -1514 1670 -1840 2031 -2246 2487 -2764 3083 -3455 3897 -4429 5086 -5924 7028 -8564
65 -8564 10841 -14579 21798 -40912 204182 497806 99931 -227052 -401103 -198141 239851
76 239851 426882 140221 -187098 -345639 -194475 188539 374573 137415 -169006 -309537
86 -309537 -179571 159475 335905 132104 -155041 -281810 -163708 142200 311531 132450
96 132450 -144673 -264676 -153479 126616 291372 135440 -133572 -254057 -150474 108828
106 108828 272576 142348 -117090 -243221 -150991 89975 253865 149836 -96955 -228473
116 -228473 -149135 71821 233099 153326 -77323 -214398 -147964 55079 211031 151538 -62395
127 -62395 -203129 -147254 41535 191870 149115 -48294 -190497 -144568 32678 178347 148783
138 148783 -33727 -177439 -141343 27087 168521 148860 -20886 -166008 -140122 19518
148 19518 157808 146959 -11059 -157346 -141055 10514 147075 144116 -2550 -148951 -141169
159 -141169 3317 138046 141985 6936 -138858 -140542 -3539 129920 140099 15092 -128876
170 -128876 -140181 -10748 121189 135981 21496 -119274 -138843 -17656 112363 132903 27092
181 27092 -109692 -135566 -22754 105930 129498 32689 -99802 -132241 -27650 98732 125810
192 125810 36089 -91771 -129822 -33453 90485 120926 37946 -85238 -127649 -39338 82912
203 82912 117568 40949 -77901 -124024 -43533 76890 115113 44554 -69770 -119128 -46710
214 -46710 71082 112641 47750 -62282 -114682 -50326 64365 110027 49890 -55915 -110782
225 -110782 -53959 57378 106458 52132 -49832 -106249 -56872 50698 103509 54589 -43543
236 -43543 -101357 -58698 44748 99631 56139 -38163 -96713 -60561 38131 96003 57315 -33610
248 -33610 -92365 -61647 32263 92009 58724 -28560 -87359 -61649 27324 88777 60190 -23545
260 -23545 -82927 -62014 22747 84777 61156 -19558 -79343 -63186 16606 80582 62005 -15882
272 -15882 -76175 -64000 11144 75656 62569 -11305 -71719 -63675 6537 71521 63626 -6805
284 -6805 -67550 -63188 2406 66677 63497 -2640 -63612 -62370 -1629 61912 63580 1184 -59716
297 -59716 -61622 -4823 57748 62991 4495 -55939 -60930 -7584 53698 62377 8224 -52504 -60201
310 -60201 -10374 49387 61611 11400 -49101 -59600 -13078 45313 60279 14254 -45621 -58611
322 -58611 -15154 41651 58901 17177 -41483 -57245 -17056 38431 57531 19585 -37815 -55658
334 -55658 -18952 35179 55511 21331 -34292 -54310 -20387 31840 53712 23139 -31307 -53132
346 -53132 -21726 28602 51241 24140 -28584 -51344 -22730 25859 49569 25257 -25092 -49649
358 -49649 -23771 23950 47320 25951 -22037 -48186 -25061 21120 45869 26536 -18765 -46344
370 -46344 -26344 18329 43904 27703 -16198 -43851 -26491 15728 41528 28526 -13439 -42188
382 -42188 -27924 13250 40212 28170 -10500 -39815 -28783 10987 37414 27576 -9181 -36722
394 -36722 -28910 8861 35693 28400 -6334 -35817 -29287 6557 34002 28601 -4315 -33960 -28850
407 -28850 4626 33062 28932 -2485 -32229 -29766 2291 31588 29039 -856 -30206 -30190 453
420 453 29630 29017 759 -27768 -29361 -1433 27454 28932 2288 -26064 -29126 -2925 25756
433 25756 28584 3341 -24063 -28529 -4632 24267 27997 5001 -22328 -27844 -5652 22258 27710
446 27710 5864 -20652 -27266 -7272 20330 27264 7274 -19245 -26910 -8255 18855 26503 8219
459 8219 -16966 -25804 -9477 16447 26048 9625 -15472 -25260 -10626 14701 25255 10332 -13958
472 -13958 -24539 -11186 12870 24236 11523 -12173 -23666 -12096 11041 23589 12393 -10543
484 -10543 -23032 -12880 9520 22709 13483 -9020 -21763 -13627 7825 21721 13912 -7280 -20948
497 -20948 -13883 6257 20696 14246 -6029 -19844 -14230 4907 19591 14439 -4724 -18865 -14428
510 -14428 3923 18227 14712 -3583 -17816 -14223 2795 17237 14788 -2361 -16839 -14001 1852
523 1852 15804 14498 -1353 -15700 -14115 1151 15065 14413 -424 -14551 -14053 -43 14080
536 14080 14230 455 -13580 -13939 -627 12589 13922 1389 -12420 -13662 -1557 11653 13588
549 13588 2046 -11378 -13262 -2250 10909 13059 2583 -10235 -12716 -2592 9751 12746 3445
562 3445 -9239 -12504 -3497 8894 12246 3592 -8324 -12042 -3616 7646 11780 4115 -7239 -11584
576 -11584 -4163 6844 11549 4665 -6698 -11138 -4854 5858 10976 4925 -5817 -10455 -5359 4960
590 4960 10556 5614 -4809 -9949 -5526 4317 9809 5760 -3616 -9547 -6106 3370 9085 6012 -3320
605 -3320 -8819 -6109 2646 8693 6306 -2281 -8490 -6014 1643 7889 6227 -1587 -7705 -6309 1019
620 1019 7320 6531 -844 -7483 -6452 654 6966 6506 -274 -6412 -6346 -92 6078 6635 418 -5948
636 -5948 -6334 -667 5759 6238 1186 -5227 -6150 -1276 5020 6244 1584 -4583 -6054 -1635 4424 6000
652 6000 1769 -4077 -5908 -1946 3482 5646 2382 -3391 -5757 -2208 3199 5789 2578 -2733 -5334
667 -5334 -2516 2681 5442 2982 -2514 -5403 -2898 2100 4840 3055 -1854 -4779 -3247 1712 4782
682 4782 3249 -1434 -4386 -3374 1259 4334 3415 -980 -4268 -3455 672 4060 3503 -293 -4106 -3605
698 -3605 -86 3758 3473 258 -3576 -3626 -196 3448 3597 690 -3046 -3629 -510 3148 3699 986 -2530
715 -2530 -3555 -1096 2416 3547 1095 -2176 -3489 -1306 2291 3266 1606 -2002 -3343 -1616 1542
730 1542 3323 1553 -1434 -3372 -1779 1155 3123 1937 -1031 -3067 -2105 1040 2966 2193 -477 -2743
746 -2743 -2191 759 2884 2478 -393 -2709 -2184 46 2549 2279 230 -2546 -2457 127 2517 2521 388
763 388 -1941 -2528 -503 2016 2517 519 -1735 -2582 -745 1825 2359 891 -1555 -2535 -1078 1411 2433
780 2433 1272 -1154 -2272 -1130 1177 2605 1386 -1154 -2336 -1436 981 2400 1444 -583 -2366 -1675
796 -1675 518 2516 1432 -585 -2170 -1820 406 2550 1867 -76 -2503 -1940 64 2088 2097 90 -1909
813 -1909 -2232 -32 1978 2239 466 -1973 -1986 -617 1669 2227 519 -1768 -2128 -453 1577 2433 467
830 467 -1488 -2077 -668 1470 2245 521 -1261 -2327 -1026 1690 2307 862 -1624 -2291 -1045 1272
846 1272 2544 1016 -1347 -2423 -1379 977 2391 1274 -1372 -2470 -1616 1129 2312 1694 -946 -2417
862 -2417 -1584 860 2409 1888 -705 -2535 -1899 605 2694 1968 -551 -2400 -1796 447 2350 1835 -532
879 -532 -2328 -1896 204 2254 1834 -126 -2321 -1944 339 2417 2243 217 -2462 -2250 -101 2319 2307
896 2307 215 -2339 -2317 48 2258 2733 359 -2229 -2623 -526 2213 2499 536 -2246 -2675 -627 2147
913 2147 2697 741 -2158 -2599 -953 1985 3021 1043 -1943 -3119 -1010 1899 2968 1206 -1828 -3129
929 -3129 -1259 1872 3156 1365 -1916 -3094 -1362 1671 3038 1800 -1542 -3483 -1682 1568 3304
944 3304 1883 -1520 -3153 -1879 1477 3249 1819 -1110 -3355 -2135 1276 3180 2149 -1214 -3166
959 -3166 -2016 911 3183 2224 -835 -3281 -2167 678 3279 2427 -717 -3292 -2639 712 3276 2377
975 2377 -578 -3271 -2605 589 3142 2916 -637 -3131 -2825 503 3339 2926 -211 -3188 -2859 270
991 270 3394 3029 -154 -3044 -2977 -93 2951 3072 434 -2713 -3389 -257 3087 3286 320 -2644 -3290
1008 -3290 -583 2686 3095 488 -2818 -3391 -817 2808 3591 488 -2532 -3409 -1100 2847 3766 1125
1024 1125 -2539 -3456 -1223 2294 3815 1134 -2187 -3648 -1382 2210 3607 1533 -2079 -3657 -1690
1039 -1690 2299 3582 1935 -2048 -3436 -1762 1963 3569 1896 -1901 -3843 -2009 1474 3666 2088
1054 2088 -1479 -3603 -2048 1224 3619 2148 -1384 -3662 -2244 1125 3647 2488 -1052 -3580 -2429
1069 -2429 1137 3357 2667 -647 -3082 -2359 706 3195 2859 -556 -3218 -2668 291 3394 2980 -535
1085 -535 -3281 -2628 480 2936 2769 -283 -3100 -2784 443 3162 2962 -69 -3240 -3218 -345 2838 3007
1102 3007 189 -2989 -3170 -469 2669 3164 482 -2876 -3223 -406 2608 3344 564 -2852 -3494 -533
1118 -533 2463 3271 804 -2573 -3496 -639 2313 3261 888 -2436 -3286 -1026 2138 3238 1215 -2174
1134 -2174 -3523 -971 2358 3214 1097 -2105 -3407 -1225 2151 3286 1451 -1924 -3482 -1466 1923
1149 1923 3135 1418 -1780 -3349 -1365 1949 3466 1747 -1593 -3305 -1682 1781 3482 2066 -1568
1164 -1568 -3408 -1998 1545 3334 2009 -1318 -3247 -2011 1155 3178 1835 -1021 -3104 -2145 1244
1179 1244 2932 1953 -968 -3005 -2195 868 2962 2168 -708 -3060 -2251 915 3304 2217 -923 -3025
1195 -3025 -2182 589 3126 2253 -492 -2950 -2444 335 2886 2204 -597 -2831 -2390 263 2855 2343
1211 2343 -308 -2405 -2415 252 2743 2409 -177 -2416 -2062 29 2472 2447 -33 -2378 -2525 -51 2318
1228 2318 2422 256 -2250 -2537 -163 2164 2657 296 -2105 -2402 -402 2111 2599 559 -2130 -2456
1244 -2456 -434 2115 2514 712 -1956 -2522 -672 1932 2569 680 -1805 -2293 -830 1422 2594 854
1260 854 -1634 -2163 -394 1536 2268 930 -1657 -2392 -833 1525 2666 1021 -1587 -2539 -1005 1251
1276 1251 2312 878 -1370 -2396 -1114 1357 2465 1254 -1263 -2159 -1033 1244 2340 1225 -1271
1291 -1271 -2374 -1331 991 2138 1257 -1041 -2508 -1376 1107 2221 1531 -789 -2059 -1189 755 2251
1307 2251 1320 -714 -2127 -1421 710 1978 1466 -651 -2012 -1381 456 2200 1201 -637 -1894 -1503
1323 -1503 651 1754 1338 -481 -2083 -1439 454 1964 1389 -443 -1939 -1698 589 1900 1740 -478
1339 -478 -1936 -1574 272 1697 1552 -144 -2022 -1576 101 1815 1450 11 -1818 -1618 241 1504
1355 1504 1591 149 -1647 -1459 37 1446 1762 165 -1564 -1786 -112 1485 1563 124 -1406 -1725 -326
1372 -326 1584 1417 210 -1291 -1783 -720 1079 1753 372 -1227 -1651 -635 1157 1862 424 -1126
1388 -1126 -1866 -360 1329 1536 789 -1054 -1691 -915 1061 1808 651 -764 -1708 -816 696 1746 666
1405 666 -793 -1583 -793 1047 1671 837 -705 -1689 -940 433 1528 985 -615 -1641 -1126 684 1510
1422 1510 647 -556 -1455 -972 820 1315 711 -462 -1215 -1024 516 1555 968 -250 -1501 -1159 385
1439 385 1305 941 -250 -1330 -1222 171 1387 1094 -94 -1099 -1058 472 1269 1023 -226 -1234 -1185 -44
1457 -44 1200 1070 -50 -1227 -1196 13 1057 1021 -115 -1148 -856 145 922 1080 -115 -957 -1144 8
1475 8 1035 1026 190 -828 -1187 -319 604 1234 98 -833 -1213 -208 940 1147 239 -692 -995 -592 788
1494 788 1132 409 -718 -1053 -105 1135 960 429 -603 -1171 -324 550 988 356 -622 -1171 -338 700 1088
1513 1088 489 -312 -824 -479 421 880 674 -582 -1126 -603 484 884 528 -553 -1103 -685 283 736 633
1532 633 -369 -820 -705 52 1145 639 -222 -939 -962 -38 885 861 -200 -998 -893 117 817 655 26
1551 26 -653 -901 -256 599 868 60 -504 -683 -159 804 943 136 -426 -695 -179 657 684 75 -602 -826 -100
1572 -100 657 861 250 -380 -715 -261 409 738 287 -484 -902 -335 527 788 489 -443 -750 -684 393 922
1592 922 424 -279 -827 -390 188 805 345 -175 -951 -441 276 781 384 -247 -702 -832 177 526 266 -5
1612 -5 -677 -682 90 756 561 -44 -821 -429 78 680 570 161 -272 -720 26 637 700 163 -569 -748 -131 448
1634 448 476 276 -457 -733 118 156 728 315 -375 -660 -374 553 601 323 -643 -773 -312 196 626 169 -256
1655 -256 -761 -288 316 383 306 -271 -514 -184 300 635 390 -214 -576 -539 378 625 353 -161 -485 -338 241
1676 241 547 285 -360 -530 -241 131 473 436 -167 -693 -126 77 476 459 -160 -475 -302 -20 433 330 -223
1697 -223 -232 -349 -22 311 474 44 -524 -154 63 294 400 15 -168 -318 -150 376 469 50 -206 -371 78
1718 78 426 513 -1 -513 -704 -192 440 170 218 -201 -665 -49 228 396 55 -475 -598 19 502 457 578
1739 578 -137 -318 -1 279 668 293 52 -752 -27 -81 603 262 23 -341 -578 562 300 195 -125 -378
1759 -378 -658 407 549 257 -50 -593 -298 256 208 318 -361 -315 -19 -58 509 370 -124 -267 -430 197 531
1780 531 252 69 -254 -464 334 206 497 -195 -133 -187 14 664 813 38 -356 -32 -295 555 116 3 -143
1801 -143 -311 -283 473 484 -34 -407 -538 -59 224 460 -222 80 170 -86 235 477 165 -513 -329 -66 486
1822 486 430 511 -570 -480 -73 509 867 -8 -291 -117 273 249 485 220 -190 -428 -335 321 442 427 -336 -418
1844 -418 -154 117 669 248 -174 -211 -100 89 535 3 -106 -452 -179 281 613 447 -116 -142 -366 257 115
1865 115 411 264 -95 -429 445 331 325 -54 -224 -208 -42 580 434 -166 -247 -399 -26 466 560 -111 -538 -518
1887 -518 -122 343 324 116 -535 -284 35 446 332 -65 -648 -296 36 492 343 -28 -435 -238 136 309
1907 309 366 107 -365 -660 -210 525 469 65 -334 -397 9 437 478 62 -439 -538 -137 201 388 223 -416 -676
1929 -676 -69 366 467 411 -239 -451 -144 379 645 446 -293 -292 -306 340 599 155 -60 -582 -350 243 572
1950 572 72 -86 -600 -222 156 605 109 -387 -443 -367 369 184 249 -275 -187 -525 133 554 182 -108 -485
1971 -485 -588 339 458 378 -211 -758 -388 442 538 526 -228 -502 -464 134 865 523 56 -618 -621 73 421 225
1993 225 -668 -706 -232 -169 637 228 -168 -499 -577 -97 543 798 29 -409 -599 -39 400 608 -33 -429 -460
2014 -460 33 550 455 -83 -407 -586 -131 343 391 -230 -413 -717 -35 368 624 149 -61 -638 -276 415 515
2035 515 245 -279 -503 -28 378 416 146 -355 -678 -36 199 488 369 -550 -546 -186 433 768 187 -226 -660
2056 -660 -467 234 645 205 -216 -678 -389 195 877 254 -100 -673 -280 210 748 592 -246 -371 -367 190 336
2077 336 374 -319 -753 -405 -7 451 202 -393 -512 -691 -194 720 604 -188 359 -1221 508 170 580 -84
2097 -84 -336 -472 -377 531 464 100 -739 -390 8 335 244 368 -413 -417 -366 353 660 278 -420 -457 -55 354 526
2120 526 138 -203 -778 -217 500 529 40 -385 -544 -137 192 409 213 -481 -707 -327 248 628 355 -347
2140 -347 -711 -197 229 471 158 -165 -404 -451 385 634 412 -152 -485 -406 189 390 314 -194 -522 -212 355
2161 355 541 445 12 -426 -424 175 367 492 -171 -734 -484 287 671 530 -258 -569 -374 -26 718 516 -195
2182 -195 -441 -242 -55 528 549 -71 -443 -468 -139 293 570 157 -443 -635 -238 473 405 -41 -357 -555 -22
2203 -22 291 590 -82 -315 -473 100 311 302 111 -531 -648 -239 164 720 253 -364 -588 -291 211 627 184
2224 184 -237 -446 -298 196 296 329 -241 -437 -186 400 381 549 -223 -643 -316 233 567 443 -409 -577 -317
2245 -317 237 565 345 -161 -510 -697 50 117 -35 -117 -575 -379 4 528 308 -427 -550 -267 101 414 560
2266 560 -189 -474 -298 6 542 409 -134 -409 -265 112 553 283 -171 -371 -521 -47 268 379 -15 -477
2286 -477 -517 -32 591 488 103 -433 -468 -38 575 479 201 -558 -337 -339 474 469 237 -318 -492 -30 487 439 223
2309 223 -394 -365 -187 162 368 14 -320 -609 -24 516 349 184 -126 -386 -35 205 488 186 -206 -994
2329 -994 -245 208 544 76 -220 -381 -24 460 763 279 230 -612 -607 849 625 941 -633 -119 -516 -170
2349 -170 512 386 -710 -393 -14 69 521 554 -262 -544 -648 64 776 552 -1 -816 -188 0 482 447 -82
2370 -82 -555 -220 -47 276 327 -88 -537 -508 142 573 775 115 -399 -562 201 568 521 375 -323 -500 136
2391 136 573 546 -205 -800 -505 -322 404 538 103 -655 -530 229 514 339 38 -559 -530 -216 331 465 15
2412 15 -586 -473 -128 643 451 87 -421 -506 -37 523 595 71 -533 -616 179 284 498 100 -394 -694 -29
2433 -29 475 419 219 -347 -646 -116 381 433 124 -446 -450 -153 285 458 138 -345 -709 -62 491 618 286 -540
2455 -540 -552 -420 580 752 353 -255 -460 -201 314 675 221 -358 -791 -332 334 669 450 -191 -236 -298 386
2476 386 569 388 -131 -732 -260 303 492 261 -139 -399 -191 291 532 191 -476 -608 -333 247 498 400
2496 400 -72 -533 -189 164 712 362 -184 -503 -376 181 625 313 -64 -333 -397 270 530 585 -224 -451 -324
2517 -324 183 323 374 -219 -233 -384 -89 293 521 -61 -589 -696 214 242 414 121 -276 -534 46 585 268
2538 268 288 -394 -616 20 475 440 93 -554 -374 140 707 416 109 -513 -608 -122 581 593 96 -381 -503
2559 -503 -72 518 828 15 -617 -330 -309 51 352 236 -379 -537 -255 251 483 103 -315 -687 -322 232
2579 232 325 209 -360 -434 -244 423 674 235 -342 -381 -127 100 451 428 -373 -333 36 9 496 283 -285 -551
2601 -551 -126 -32 207 231 -124 -444 -377 168 612 284 -227 -495 -366 4 485 224 -81 -369 -329 131 343
2622 343 350 39 -450 -224 130 380 425 -68 -592 -286 -20 295 273 -65 -322 -548 -18 365 257 6 -277
2643 -277 -236 61 222 359 157 -407 -440 -117 271 401 157 -215 -195 64 166 421 -236 -310 -658 21 158
2664 158 249 97 -290 -438 145 270 521 -49 -84 -393 -139 251 405 179 -193 -446 -45 215 400 -40 -293
2685 -293 -163 -198 170 383 212 -187 -516 -153 210 251 -24 124 -354 29 82 300 217 -204 -207 -148 259 242 85
2708 85 -363 -369 -15 321 279 139 -199 -385 -245 173 283 18 -256 -216 -229 282 509 258 -49 -123 -274 59
2730 59 190 148 -61 -434 176 117 279 424 -171 -255 -261 77 193 223 -34 -552 -287 -6 100 136 -153 -143 -115
2753 -115 112 -63 87 -159 -151 -185 238 129 64 -8 -39 -294 6 138 79 -78 -373 -357 -138 248 -7 -21 113
2776 113 -257 142 180 231 -123 -101 -139 -215 403 -28 -17 -300 -273 186 158 218 -10 -380 -183 30 113 145 115 -220
2800 -220 82 -43 64 163 112 -132 -222 -49 -15 103 -105 49 -308 -193 181 168 203 -165 -300 -55 188 79
2822 79 -16 -45 -218 -75 159 83 90 -101 -186 -37 338 213 153 -147 -335 -75 83 285 -122 -54 -7 121 23 141
2846 141 -15 -153 -116 104 52 242 -30 -160 15 -231 -185 215 73 -94 -116 54 -36 248 44 251 -77 192
2868 192 -25 138 70 -157 -148 -147 40 53 236 -28 -196 147 135 153 220 -336 -318 -147 -295 228 143 135 -375 -329 -115
2893 -115 -28 269 11 74 -153 28 206 -5 -34 -202 101 150 115 120 -166 -239 -56 25 -50 204 89 -215 -136 29
2917 29 -17 316 -61 -186 -138 54 313 72 219 -251 -52 -24 61 262 69 -9 -207 -110 168 -103 199 -83
2939 -83 -36 192 433 293 -168 -44 -33 106 101 225 154 118 -94 199 -118 157 9 -133 -113 14 -62 1 165
2962 165 -87 -160 -87 267 -111 -53 -139 -20 72 -13 105 304 -51 15 -131 29 48 61 -284 -158 -201 -57 -74 -62
2986 -62 -88 -295 -3 -67 -86 10 20 81 -93 140 318 -116 -71 -125 59 -90 -62 59 176 344 186 223 -34 13
3010 13 101 -268 -205 49 255 125 -82 -79 40 466 221 120 -16 -168 70 41 -56 73 -53 -137 -266 219 49
3033 49 116 -94 -36 -27 126 253 67 -233 -200 -52 10 18 3 -104 59 289 20 -45 -95 52 210 97 8 152
3057 152 97 39 108 -143 -22 -8 -27 12 -217 66 -113 65 -256 2 148 -35 148 -86 -142 100 19 44 278
3080 278 65 -130 64 -46 202 -28 -49 151 -142 -2 -12 19 107 217 -180 30 48 -215 -80 173 -111 73
3102 73 26 -77 115 37 -98 19 -210 -32 102 67 187 -41 77 -19 -75 -77 184 7 -7 -46 263 32 -15 302
3126 302 -238 -193 -145 131 40 143 -126 -70 17 -11 -143 128 -55 49 78 215 -109 26 -192 250 -112 104
3148 104 -135 -122 -26 -48 65 223 -171 -16 -184 -153 -197 -224 36 -94 -47 163 100 123 183 -170 -214 -49 218 -192
3172 -192 -179 13 162 -53 151 91 184 322 -138 169 73 -78 -117 43 128 62 138 -171 20 65 -131 24 41
3195 41 183 -11 33 94 172 -73 317 241 -103 103 -44 60 66 21 -255 96 207 39 158 -16 -132 -22 -13
3218 -13 133 -51 -107 -103 93 58 334 -2 -45 78 4 319 -82 8 -225 167 -230 77 82 5 -114 -141 -64 -8 181
3243 181 -63 19 -52 94 -108 109 45 -24 -87 255 61 127 67 -116 -51 97 -7 -150 -75 32 2 -293 -25
3266 -25 288 110 122 -143 -62 -57 93 -159 -198 144 77 -76 -20 253 13 63 -174 174 -21 161 67 115 -120 -73
3290 -73 107 -17 70 -171 33 193 418 -160 -242 -216 -35 -34 9 80 23 92 -168 -2 82 -89 84 54 142 -51
3314 -51 32 -126 -22 31 -410 83 122 143 141 21 48 1 -76 -209 174 2 -294 -86 115 23 -46 47 -68 -4 108
3339 108 314 19 -19 69 -22 115 22 -41 -11 74 -142 -32 -85 -9 300 207 -40 -223 -62 127 -13 -60 -81 -205
3363 -205 -179 25 -5 -210 -90 61 -15 150 -94 -201 -75 71 138 -61 302 104 -132 93 145 -196 205 -88
3385 -88 14 -1 71 170 -47 98 21 -14 -21 137 -117 -87 8 197 161 130 -89 -122 54 -44 107 -144 -104 -46 -19 71
3411 71 138 -167 52 67 8 71 81 78 -198 -247 2 113 -67 -162 8 206 81 -44 -107 -11 -89 -55 210 83 -65
3436 -65 -96 -21 77 89 2 -186 2 35 -117 322 177 190 -9 -21 -241 -28 -213 -238 -123 -269 -132 -63 -121 169
3460 169 -79 96 155 -213 -21 45 19 -52 28 283 -130 126 -159 -269 87 -77 102 51 -72 25 -47 -95 190
3483 190 -8 -6 -32 -59 -207 54 283 207 -223 -10 -216 142 -169 68 -127 -128 265 -25 45 77 -149 148 147 -122
3507 -122 -91 65 -202 46 -13 -43 40 148 -168 21 -49 307 149 -133 -178 -192 141 44 -70 92 -359 -59 8
3530 8 45 -34 34 -89 -48 -48 165 143 61 33 -257 30 321 180 47 -43 -39 -163 234 -86 28 -143 -141 71 261
3555 261 98 -17 -22 3 -66 205 43 12 -23 -259 189 3 36 -182 -1 -55 28 135 343 148 -61 -106 1
3578 1 -49 -132 -91 47 -225 -145 22 -46 -117 -345 107 130 208 -3 -11 -189 -179 -96 152 23 -54 -97 -155 129 -51 -53
3604 -53 62 145 76 113 44 192 -96 -75 -179 74 135 454 -110 33 -91 -243 240 138 -42 -92 -83 15 244 185
3628 185 297 -320 -45 -36 158 35 100 -102 -278 28 204 205 61 -206 -150 -83 138 -8 82 19 15 -55 39 -80
3652 -80 48 -5 -290 -215 163 31 -58 -102 -21 71 212 100 -107 -283 -146 3 132 274 -8 -133 -171 -72 206
3675 206 93 245 -292 -89 -189 -150 262 103 37 -189 -65 103 168 55 -76 5 -10 83 -220 103 -77 -2
3697 -2 28 77 -29 167 -164 -118 3 102 196 62 -13 -237 -1 -33 297 -88 28 -59 -183 -32 172 88 175 -208
3721 -208 -4 -45 207 87 -327 -214 -84 128 322 168 49 -259 101 4 88 26 39 -133 -393 4 118 84
3743 84 103 -87 -19 276 213 312 33 -8 -302 -64 133 113 21 -201 -152 7 138 -58 -101 -150 -179 27 106 107 -28
3768 -28 -79 -339 71 277 -204 263 -1 -313 -12 3 130 152 -51 -156 -10 300 289 129 49 -43 -41 103 -14
3791 -14 6 -372 39 -103 175 135 158 -119 -65 -6 244 33 28 29 -188 -16 -75 62 -68 -81 -335 29 240 254
3815 254 54 47 9 85 77 198 73 94 -68 129 14 309 29 -119 -54 -23 187 226 232 -125 86 -280 -29 182
3839 182 130 -171 -195 -358 -148 34 107 -261 -265 113 -226 57 -70 -128 -178 3 279 301 156 -123 -255 -125 204
3862 204 99 205 101 -414 -112 27 198 43 -30 -60 -77 58 6 -75 214 -266 -22 -158 -7 224 -38 -27
3884 -27 73 36 141 -51 157 -237 -106 135 160 353 -136 -105 -181 -10 163 194 225 -252 -167 90 63 314 13
3907 13 6 74 71 73 39 44 -15 -239 198 46 363 91 -88 -253 -90 301 -47 51 -277 -415 141 -79 172 68
3931 68 -175 -168 94 -118 74 63 -267 69 103 98 -137 -19 -70 -191 -18 96 158 -42 -162 -203 40 217 93
3954 93 -20 43 -471 -113 -1 178 168 -203 -216 -71 -65 226 213 -67 -151 139 224 -145 49 -41 26 -24 48 230
3978 230 262 95 -21 68 -212 236 55 68 -78 -185 -17 274 -49 -140 -161 -83 -111 -65 153 223 -176 -177 53 113
4002 113 231 262 -387 -66 -181 61 93 3 -288 -275 -200 73 77 99 -420 -14 174 -19 236 -52 -185 -380 106
4025 106 381 161 -104 -137 89 -78 191 159 310 -25 -60 -3 193 43 -162 72 -60 -16 -178 89 61 -212
4047 -212 -153 90 -80 -39 233 -94 29 -64 162 0 -54 74 -22 60 -126 113 66 199 -267 -182 -97 132 6
4070 6 113 -309 -11 -50 126 -22 -44 -293 -85 -161 -35 105 -192 -28 -94 -135 -93 138 -61 -18 -6 84 4 -33
4094 -33 289 18 -100 20 240 90 -145 -20 -49 154 -83 43 107 84 -62 -45 -118 49 -16 158 -63 254
4116 254 -95 111 51 1 -48 -185 -122 -76 214 -356 -3 -125 65 253 -82 90 245 177 135 -13 -35 15 97
4139 97 12 -146 -123 86 161 110 -66 -228 -103 159 82 10 31 -252 283 75 109 -264 -20 -50 249 -119 -24 -125
4163 -125 187 89 -44 7 74 -115 -99 13 51 -33 20 14 221 -47 18 43 155 -93 -182 -120 111 4 41 256 -145
4188 -145 91 -38 -112 96 83 -53 51 75 -44 -32 -370 185 -295 76 111 43 -1 4 41 -33 -3 242 -73 -75 -85
4213 -85 39 202 177 99 81 136 -11 -246 -115 -159 5 -64 177 177 131 -134 -89 88 44 224 122 148 -178 -73
4237 -73 52 58 96 -11 -55 34 -102 -128 -31 50 -92 -128 -101 182 101 96 -38 -124 -187 -130 62 3 20 -170 -152 -43 181
4264 181 278 242 -89 39 -223 217 200 197 92 9 212 24 30 -27 -45 108 -154 174 90 121 -130 -36 -121 33 16
4289 16 112 -140 -302 -35 211 182 -111 -72 -23 -68 283 -33 46 92 8 316 -27 -32 124 -188 -27 93 -119 -36
4313 -36 22 71 22 -80 -12 7 -383 58 183 -9 231 291 -16 86 -39 -128 39 -42 -23 -93 -63 -42 -179 -203 -1
4338 -1 59 167 44 -153 -199 -3 -170 52 -73 272 81 -53 -63 -190 -19 -28 35 226 166 7 -32 35 -171 -240
4362 -240 6 -35 95 -36 -85 95 23 -51 20 -28 0 133 14 20 -219 -106 222 -106 31 -90 65 -213 -217 -13
4386 -13 -367 112 -27 67 -69 -92 310 -366 14 -71 -38 94 -90 -111 -353 -9 214 125 38 -42 89 -90 -78
4409 -78 114 202 -46 -147 -109 21 266 180 67 -34 -41 9 15 52 -104 -89 37 158 -76 44 -25 -20 -172 77 24
4434 24 -77 -214 -95 5 86 -39 210 -75 -107 -221 -109 244 136 -177 -41 -201 -97 176 20 -154 -22
4455 -22 128 165 153 135 -4 -217 45 -26 253 212 -71 -75 -77 118 -49 541 166 81 -111 16 150 129 76 -255
4479 -255 108 13 109 28 -118 15 210 27 7 -117 -50 44 -278 179 82 185 79 101 -84 52 23 105 71 49
4503 49 0 92 204 -30 -257 -82 -68 15 152 -37 179 174 -82 62 59 -23 -51 -83 -119 -144 -65 -13 115 -210 37
4528 37 -59 209 -14 -61 -55 -7 26 237 225 132 114 -375 -107 23 55 -18 64 -164 157 172 60 19 218 -34 100
4553 100 58 51 104 -199 -106 -67 16 -65 -267 75 -87 -299 -16 106 97 79 97 194 105 194 435 -75 -234 121 217
4578 217 -75 55 -90 -47 27 -222 -176 93 198 -65 78 -184 112 3 4 19 -174 84 198 242 -307 66
4600 66 39 -81 -138 225 204 -50 -164 122 -166 53 -146 23 -41 90 74 172 -89 -102 -329 -30 -21 71 -65 132
4624 132 -143 10 146 8 -73 -174 -258 -120 62 67 62 -91 17 -52 131 140 70 -303 239 -96 -16 -136 15 -113
4648 -113 131 -180 -18 45 137 165 -39 33 5 -2 54 -191 211 54 419 224 -9 -157 -268 -1 -321 -197 -174
4671 -174 -83 -167 -23 -114 -82 -61 -90 24 -74 -85 -24 -66 206 -216 -198 78 23 128 -11 -142 -171 73 145 103 259
4696 259 18 -63 134 225 -2 -139 157 -242 97 -79 -287 8 -136 35 125 231 -90 -131 22 -310 -32
4717 -32 46 -32 16 188 -110 54 -53 145 -431 -31 -73 -259 98 14 114 -182 -10 -192 122 91 147 63 -86
4740 -86 -117 -105 205 185 247 -91 105 113 -138 221 -11 -19 54 -108 -335 -207 224 -137 -82 39 274 156 -129 68
4764 68 6 176 47 -103 28 95 256 234 62 -14 64 -115 -116 -239 162 127 47 148 -132 -42 131 81 -223 82
4788 82 202 -122 39 148 -252 128 -35 85 70 -17 51 33 78 -50 -198 35 11 8 -114 99 82 208 -128
4811 -128 -94 -23 20 -27 297 -84 -53 62 -158 -241 4 286 236 -277 -185 -99 -52 285 -106 -123 -43 -227 -148 8
4835 8 -48 -231 -62 137 -262 170 -12 20 83 -28 52 -159 -116 -6 59 44 -77 61 -131 192 106 278 -44
4858 -44 -58 159 51 63 -148 379 -133 -71 46 -215 207 -120 102 -31 223 557 11 111 -133 108 -241
4879 -241 -114 -56 4 40 97 152 74 -153 151 67 31 93 -82 -92 124 -260 -240 179 -51 98 57 31 -78 -46 -89
4904 -89 -34 -50 -65 -32 -147 -27 -14 60 -81 -104 -49 57 101 -167 35 -43 -131 -77 -26 157 165 -469 -75 -139 32 -24
4930 -24 50 -84 -68 62 -63 144 57 -42 -154 112 188 -93 -129 115 -35 121 78 137 63 -65 -112 177 60 -113
4954 -113 349 -25 46 21 73 206 -50 -77 -184 -68 -55 -263 81 253 68 -82 144 -144 -142 -146 141 -124 -75
4977 -75 206 -273 10 187 213 51 -35 60 -62 141 55 83 7 218 96 -170 52 -53 -65 79 274 -12 -180
5000 -180 -10 -37 -176 102 -114 61 31 -121 -122 48 183 -238 102 28 17 -98 39 -54 8 -198 -65 -68 -53 -33
5024 -33 -8 1 50 163 -94 -257 129 -55 -194 248 -48 -498 193 188 175 814 262 -496 227 -49 -79 225 28
5047 28 65 -201 -76 46 15 125 18 -65 94 -102 44 -53 6 326 -18 1 85 -3 -225 -93 -127 -71 60 296
5071 296 4 8 -97 -155 -25 103 -170 -168 -80 -105 -66 136 -29 65 340 -162 92 -90 17 84 75 86 92 192 129
5096 129 244 -45 41 -82 -53 -129 -68 -273 -136 -65 -38 -43 58 145 -238 -41 -14 -162 -33 93 -152 75 126 -103
5120 -103 -121 -20 -282 -94 -7 38 -41 -247 140 193 23 56 158 170 49 77 -184 -27 -70 3 77 -84 10 -71
5144 -71 -43 -245 57 -202 67 131 203 106 -41 -37 -142 44 -127 -220 -146 52 96 237 41 -190 226 273 -134 -140
5168 -140 106 136 110 177 39 -75 146 186 199 -11 -85 187 -273 -89 143 43 78 228 166 115 93 -1 84 -40
5192 -40 -16 17 -5 -51 -10 -121 126 -37 181 -158 -32 320 115 -148 -135 34 226 77 -146 -75 -72 85 4 446
5216 446 -163 89 230 42 83 129 -155 -158 75 50 -99 -7 156 -180 -89 -109 -50 -3 37 -286 -263 -172 61 164
5240 164 21 -154 -106 159 -47 -112 73 -9 -190 88 -11 -123 34 -120 -65 -37 67 -401 -143 313 -119 -189
5262 -189 22 -280 196 -144 -42 -252 65 96 5 -16 67 173 17 140 245 162 -107 -89 -3 -64 54 103 -2
5285 -2 -88 17 37 310 10 -148 -1 -74 196 75 -200 -171 -6 -80 -272 -68 -51 16 109 177 -180 -10 125 -22
5309 -22 -76 37 189 -60 43 114 71 214 -212 92 16 81 18 -97 -169 5 -7 -209 88 -55 28 -217 -49
5332 -49 137 -3 -137 7 -138 -76 206 9 -41 65 77 151 236 -97 -68 95 140 -86 122 -74 67 -42 6
5355 6 -162 -65 84 -4 -77 30 -170 22 155 -242 -93 78 99 -33 96 150 67 69 21 147 -192 -134 -153 162
5379 162 -168 85 29 287 -18 -25 -66 -203 -125 128 88 86 -6 -10 167 27 165 -243 -138 -18 -175 -329 197 83
5403 83 302 158 -80 -37 82 -51 134 -62 -185 272 -27 -22 -62 -148 -114 -38 349 8 -123 61 31 202 26
5426 26 -157 255 -94 -51 -81 -153 175 56 -124 77 54 6 23 127 45 152 -100 224 88 161 -93 173 -157
5449 -157 -143 -24 -105 -3 -7 -79 -157 -64 -58 63 9 86 96 293 339 33 215 -135 5 68 -125 -39 48 -72 -87 108
5475 108 -70 74 -156 225 -78 -13 340 -5 23 -202 75 173 55 39 146 65 -115 55 89 -37 -76 -70 -126
5498 -126 103 -174 52 -119 -83 -114 58 324 24 108 -157 129 20 -99 -38 31 -126 125 144 -142 -221 41
5520 41 223 -173 -12 -14 -48 -150 -85 -68 88 82 -67 52 -126 62 -125 70 -14 -103 -92 91 -222 45 -18 -117
5544 -117 66 -14 106 220 -73 -118 -50 -26 -90 69 66 204 -201 -79 -49 -251 171 -113 -107 -7 9 63 -81 -370
5568 -370 -24 -43 116 156 -108 -105 187 70 18 24 -8 -160 75 -236 129 -73 140 -154 -71 121 116 -126 157 206
5592 206 146 -105 74 167 -119 98 -139 -26 94 144 -42 -154 -187 -51 -162 297 -23 -333 27 87 243 93
5614 93 -36 -61 91 17 110 124 -96 320 65 -17 101 155 69 35 -65 -144 -127 -4 19 59 -42 -140 -31 79 111
5639 111 79 -68 -96 -29 225 167 -61 -107 -48 -82 238 -48 133 -120 51 -27 69 15 258 61 -52 -97 -17 27
5663 27 219 -61 -224 -29 224 68 46 -107 -32 92 -39 143 -17 -93 -42 11 -33 102 -111 -12 -94 41 178
5686 178 72 76 -60 -185 -34 -117 -80 111 -242 61 -71 86 16 192 201 201 42 15 218 219 -296 70 -66 -102
5710 -102 152 102 -44 -30 30 184 -254 -145 94 -74 112 205 -61 -130 -172 17 56 106 38 128 11 -23 84 84
5734 84 173 -60 -162 58 75 -150 -7 -1 -14 -140 -206 -84 -94 -15 -151 -104 40 -12 -55 -92 -182 -322 116 135 -13
5759 -13 -178 162 155 113 274 -189 131 -79 20 -128 -20 -102 -33 -6 -105 16 97 -57 221 -81 93 -189 -90 -145
5783 -145 -1052 625 -49 35 557 -249 169 -125 71 -150 105 -100 265 -76 -57 18 22 -58 29 19 3 203 37
5806 37 -102 7 172 129 52 -151 -274 -88 -129 -12 -43 282 47 188 238 -76 86 -72 -85 -116 63 24 -154
5829 -154 83 -10 -191 87 33 -197 -118 26 148 -161 -108 126 175 214 94 66 -287 203 201 -280 -16 22 14 -178
5853 -178 -31 198 126 -90 -105 284 91 -187 -7 77 -73 -189 26 -48 -59 -251 -51 -130 93 -127 -150 282
5875 282 -143 17 170 198 170 -100 -15 18 164 -37 -170 71 138 52 -105 149 121 -120 157 -82 37 -104
5897 -104 -141 -12 -85 133 -22 -2 -310 144 252 -270 217 61 46 -245 184 -36 -201 -96 -26 115 14 32
5919 32 -302 -13 -1 -29 181 -91 -91 -6 202 142 -17 100 173 -110 -34 192 69 -123 -222 -256 -13 -77 -152 -273
5943 -273 65 144 -174 -109 187 36 100 -147 43 95 81 -173 -53 -101 -11 61 15 -182 10 -213 -138 231 163 -100
5967 -100 -190 240 -67 -29 144 -19 -16 -196 -131 -68 35 -98 -5 281 210 -35 179 62 201 58 -27 -125 133
5990 133 -210 -100 -48 -160 -57 0 131 -10 63 -68 41 22 25 79 67 32 169 -73 -316 132 -179 36 -46
6013 -46 -123 172 244 105 39 -147 -65 147 -20 -45 -75 139 103 123 32 -28 -122 103 -105 36 -121 21 -59 -9 -75
6038 -75 13 80 27 -190 108 255 -132 -114 178 70 20 -56 -19 63 -49 -104 -104 -92 -40 -26 -173 217 -247 -57 51
6063 51 207 92 -78 17 131 230 123 -58 20 -136 -142 -80 -155 70 -216 41 -114 72 -2 -79 139 77 -119 56
6087 56 75 69 147 79 210 48 -75 3 -118 -40 2 -92 -55 -134 -35 41 216 -159 167 144 119 -128 -24 188 -243
6112 -243 -9 46 142 113 109 112 46 -177 141 -221 141 28 -21 251 36 169 72 284 45 24 -103 32 -138 5
6136 5 -81 51 -175 -219 58 73 7 -71 210 -4 -24 331 -28 7 76 155 -49 -159 40 -21 15 -118 -73 -63 146
6161 146 160 107 57 -45 -83 -107 223 141 -20 138 -106 -19 -279 0 -85 217 181 -36 228 17 21 -70 -133 -126 105
6186 105 -153 -167 -83 -118 -58 90 16 276 -67 -109 -58 46 -136 -52 -288 27 -19 -79 205 -67 -74 -210 -81 3
6210 3 180 207 -51 5 -40 -50 47 -133 -123 8 -37 4 -106 5 17 -170 162 57 19 15 76 73 -17 -25 225 -274 166
6237 166 -254 195 -64 193 127 -64 40 157 124 122 -236 -236 -5 140 12 -70 -36 -96 51 187 39 -102 -96 -189
6261 -189 43 250 122 -149 134 -115 -80 21 145 18 -107 -5 13 -83 60 10 188 -327 131 29 276
6282 276 42 -118 -159 -45 155 38 -125 -50 193 50 243 136 55 -217 -107 36 73 -116 111 -249 64
6303 64 151 -255 19 190 153 -72 -54 111 -24 231 28 -77 -89 140 37 138 -128 -74 119 -56 6 256
6325 256 -111 39 -85 -125 85 -29 86 -38 -75 -72 304 -46 9 14 80 -21 -364 111 147 52 -116 21 357
6348 357 -34 -15 -35 -174 -75 -37 -159 -220 -77 -343 -76 -98 194 -196 -155 89 -33 26 95 -147 60 -134 -118
6371 -118 -19 196 129 -36 43 -108 150 87 -1 -12 -17 -9 166 -168 -84 24 -76 60 -75 -72 93 79 68 -87 215
6396 215 112 -27 -93 114 -111 -7 -5 -15 -138 84 -42 115 168 -15 67 -58 119 -34 85 286 64 3
6418 3 -66 156 -55 -175 1 -61 -232 -35 -17 -33 -83 -336 -204 -260 139 -67 138 -29 7 -239 49 92 63 34
6442 34 123 20 -81 223 48 116 -1 191 209 -9 129 66 4 213 -37 -31 -10 -34 61 -215 -186 -81 45 74
6466 74 -113 -52 213 159 -94 -83 -260 1 24 -59 119 -80 -62 -138 94 57 153 -247 -57 162 -42 49 -49 86
6490 86 -21 78 -139 -68 187 26 95 -8 99 32 90 97 -198 44 -144 -33 -49 112 2 -94 -89 -262 171 -187
6514 -187 126 133 -2 -176 -201 -59 121 105 -54 148 -143 -19 94 108 -75 -98 -104 -371 57 -27 110 98 8 -77
6538 -77 157 110 140 -5 -94 -19 -26 -109 -74 11 -151 -19 -406 73 -287 2 -36 110 -268 -107 -120 38 146 -243
6562 -243 128 -113 19 -353 156 -62 -224 -10 47 -149 136 -90 -60 240 -75 181 -101 -31 -40 50 -48 -164
6584 -164 121 -2 27 -41 -2 -11 160 -14 -33 -44 -121 80 -115 175 -131 -3 -162 -160 168 -227 -92 -50 -33 -106
6608 -106 139 259 -5 26 -30 74 51 156 -60 -230 13 39 -33 -164 30 -336 -90 -13 50 212 -60 240
6630 240 88 -93 -54 -66 246 133 -322 -183 9 -42 -188 -163 92 -22 225 -227 -122 281 -160 12 1 -225
6652 -225 67 26 11 35 -62 -39 -157 -143 -95 -184 142 96 66 16 -66 -184 32 -84 -52 16 -17 48 -19 -76 -108 105
6678 105 -191 -98 41 103 -24 -214 89 -53 -23 -42 229 -29 151 -164 104 79 11 84 1 149 24 104 -254
6701 -254 82 27 -189 -64 2 -9 -90 -91 -134 43 -105 134 54 37 83 117 -123 239 -3 -116 -75 -47 231 100
6725 100 200 -36 -16 -67 157 -181 -87 -24 -5 203 -45 202 144 29 -42 236 -15 -24 247 -40 77 -48 62
6748 62 197 -19 43 52 15 3 -88 61 178 -19 206 185 168 -47 18 226 -72 96 -33 1 202 182 30 -194
6772 -194 -117 15 -78 -19 40 22 -104 -36 -113 52 290 -88 -194 99 116 -9 -68 33 183 31 -218 -86 179
6795 179 -149 103 39 -83 281 -83 -140 -91 -86 100 59 24 21 9 -110 -105 37 -193 56 -135 -261 306 -107 -68
6819 -68 11 -111 -198 -202 -58 190 94 -143 -44 -116 -227 -124 88 27 -45 -24 -2 56 25 164 -85 -209 476 113 215
6844 215 283 -35 -190 -29 132 64 -37 -87 -4 36 107 -191 -33 -137 16 -159 320 -54 -105 71 87 -16 181
6867 181 418 -183 -57 118 21 62 18 1 219 -54 205 -116 -123 -108 -21 34 209 -309 39 -91 69 6 -23 46
6891 46 -19 90 -85 140 -139 130 59 87 117 -10 -195 30 21 49 -1 -184 -161 52 -301 -240 -151 -24 164 41
6915 41 -84 121 -118 53 -69 52 -197 -287 40 250 145 47 68 177 -71 111 189 -77 3 181 29 11
6937 11 10 133 -175 -83 209 -53 -108 -25 -177 97 57 120 -115 -74 22 -120 -26 308 -52 39 -13 -111 -118 -36 -53 -133
6963 -133 -69 -382 -50 -87 58 -111 -205 -6 84 -158 116 61 -172 -89 131 -145 171 13 -152 213 83 -125
6985 -125 1 236 137 -52 -6 55 131 166 -71 -25 134 119 72 1 -78 116 -147 63 7 301 -166 0 195 -114
7009 -114 -61 -71 161 -89 162 -133 138 116 -27 176 55 -2 23 -95 -257 -67 -102 -242 21 5 122 97 -264
7032 -264 76 113 -182 97 88 -92 313 -32 -6 -91 -80 -18 -27 47 38 196 3 221 76 32 -133 112 -3 -132
7056 -132 -28 126 7 -249 74 50 34 -76 124 -384 209 -228 91 67 -93 93 -119 -122 181 -117 -282 -313
7078 -313 80 57 -67 188 2 -176 -117 -104 -28 -6 22 74 230 -149 -303 46 46 46 -83 15 -50 187 166 -18 37
7103 37 110 -138 -195 -205 72 -215 -17 27 -33 -165 -85 -58 217 -61 76 202 74 64 255 -14 178 -9 1
7126 1 -15 183 132 -215 -75 97 96 -56 -133 181 175 153 83 46 4 -22 71 -11 174 41 114 -107 208 -105 -67 42
7152 42 266 -201 195 132 -230 -148 -229 13 4 1 -113 -66 133 8 80 -24 -128 93 213 127 -34 -61 -135 -28
7176 -28 -68 -241 -69 186 -196 -130 15 42 57 264 -76 220 123 215 49 264 53 132 -192 24 -48 -91 55
7199 55 1 72 130 224 26 61 120 151 123 77 103 247 126 103 29 -23 -53 188 -38 127 -181 -35 97 70 -78
7224 -78 -157 -99 175 50 72 10 81 88 -135 185 109 31 -174 158 -20 5 48 143 5 110 -177 -20 -129 -200 35
7249 35 224 -115 107 161 37 111 -264 -2 104 141 -132 -70 -145 -228 389 -196 -43 -83 -59 213 -191 -134 -166 66
7273 66 -32 184 -11 -24 -269 5 225 -4 51 -75 45 -142 -139 19 13 -75 48 44 -119 -312 -63 198 -34 -183
7297 -183 268 -36 19 30 -14 49 -13 191 55 -80 65 -27 175 -42 -141 140 119 -9 108 7 14 -204 -169 -271
7321 -271 -2 -92 -152 132 -2 80 -67 -197 248 210 -80 91 -167 -50 -76 -36 10 -211 -10 -45 25 -140 -84
7344 -84 60 -156 43 142 51 -83 116 -37 -224 82 -32 -163 -36 109 78 -124 228 179 55 -499 14 227
7366 227 -140 -15 -80 -96 88 -42 -122 -178 -48 154 17 41 118 58 11 -215 -53 -42 -137 35 41 116 44 80 24
7391 24 18 120 -32 9 -122 -23 222 270 -205 25 -205 190 104 241 -33 -198 -124 245 57 -238 23 -34 -238
7414 -238 94 99 43 -188 11 132 131 -78 -49 28 -65 -335 -59 69 -233 114 -32 -142 49 -180 140 -145 -209
7437 -209 -64 81 -6 -172 33 216 51 120 -16 64 198 66 60 111 -140 -361 -22 83 72 -86 189 24
7459 24 101 -249 -21 255 3 -131 36 -76 71 193 187 -13 90 -26 -50 0 12 119 65 -111 -160 175 -35
7482 -35 104 -51 -140 109 30 -332 229 118 -126 -183 -20 31 -105 8 -12 -254 287 30 107 41 141 -270 -169
7505 -169 -50 -106 -131 -64 -83 4 249 -67 11 51 -41 -225 233 70 -12 -55 237 107 -73 -129 24 165 168 386
7529 386 35 -219 -103 -38 86 131 131 -114 -122 49 -57 25 13 157 -121 271 -186 -113 201 83 285 -179 35
7552 35 -113 105 -55 -80 -55 -112 153 -52 -156 60 98 51 111 147 153 252 240 -51 -72 67 75 45 28 -165 -58 -190
7578 -190 -128 -98 -95 58 81 -15 -201 147 -209 154 -97 -69 -70 118 -150 -167 -112 -27 48 206 159 57 -165 -63 107
7603 107 -97 -136 -69 50 42 43 40 -67 -7 91 91 -117 212 -21 148 116 198 67 -197 72 201 -76 -104 -12 264
7628 264 -34 -27 104 28 -107 -32 -140 -2 -63 -46 -20 23 76 -21 18 137 -40 -5 134 160 17 76 47 -141 -93
7653 -93 -60 -214 80 203 54 140 -92 -135 -90 43 89 -112 27 -161 79 -12 40 -168 -123 123 141 -92 -175 -68
7677 -68 -76 149 -39 122 64 -111 122 91 140 219 85 151 82 129 -166 58 -60 55 -1 113 121 -73 118 -88
7701 -88 -203 -82 -95 198 -34 -65 -164 -273 178 215 -30 -173 2 -115 17 -8 -249 -22 104 16 117 100 -61
7724 -61 68 -113 -82 -222 -223 -263 79 166 118 84 -32 41 151 -63 -46 101 -62 54 -51 -87 157 82 -7 154
7748 154 -122 29 -10 -22 80 -85 184 -42 -21 49 3 38 21 7 -95 -61 -84 -35 101 203 -162 -42 57 -250
7772 -250 -9 -19 315 156 56 113 -66 -134 364 -15 117 2 120 -191 36 -27 181 -83 -324 -45 -93 -96
7794 -96 87 -19 3 -28 142 -22 -86 244 80 123 213 -75 96 320 129 -162 45 356 80 337 -136 -141 334
7817 334 266 8 -27 -41 -85 187 31 12 256 -112 0 127 23 -47 -237 132 185 116 221 63 272 72 184
7840 184 145 -3 146 66 131 118 154 -80 144 147 -39 85 -24 -161 -126 92 -29 -25 -150 -13 -34 -181 63 -147
7864 -147 -67 -51 -49 -91 -234 -195 -112 112 -78 29 -137 -100 -31 -133 -160 -90 123 -36 202 -34 -241 -88 -13 23
7888 23 50 -126 64 213 253 85 -14 82 -69 -175 49 -4 -144 213 97 -149 7 42 112 -27 177 -60 0
7911 0 -333 132 16 24 206 148 355 -54 -121 -23 -313 302 121 111 -9 11 -96 84 -52 59 268 -32 69
7934 69 197 -127 -93 5 90 -167 -250 51 -264 -306 -178 46 13 125 67 -5 -49 17 49 -111 -7 57 159 245 -219
7959 -219 57 66 -193 -134 -53 -26 0 -89 232 -76 105 137 -86 249 -92 26 1 322 -219 -185 -134 58 78 -14
7983 -14 -152 3 14 -314 -28 51 129 84 158 -10 -2 73 -190 24 89 7 -171 -246 -140 145 19 23 -197 -172 27
8008 27 119 -170 150 -10 42 -135 -120 37 244 175 19 -1 82 140 -287 73 -58 15 -111 116 -84 -298 -220
8031 -220 -71 249 -218 -117 104 -97 210 -104 56 214 27 152 -204 -181 -242 -12 156 55 -173 189 148
8052 148 -72 78 117 -204 47 0 -34 24 53 -225 -17 65 -60 139 -6 -53 13 -83 118 56 -223 93 -88
8075 -88 -241 -70 200 -137 -17 61 -384 53 -33 22 -71 -87 221 287 43 93 103 -59 -76 -59 -30 -115 295 89
8099 89 54 -5 184 98 -178 80 -45 -10 92 -57 -62 59 124 5 -69 -217 -12 -193 -237 79 -124 39 -152
8122 -152 -114 -8 38 -52 199 150 118 47 27 -111 -59 40 -129 -120 -45 -111 -18 -222 -125 -120 172 103 -179 55 -255 -63
8148 -63 131 50 -351 27 -93 29 65 -224 -160 176 -91 -68 49 39 172 79 119 136 -32 121 -160 -52 115
8171 115 47 -64 135 249 139 113 -48 -70 -42 -137 -81 11 73 -76 -293 -77 -25 -312 73 183
8191A83
$$ Imaginary data points
##PAGE= N=2
##DATA TABLE= (X++(I..I)), XYDATA
0 0 0 0 0 0 0 0 0 0 0 0 -8 0 -8 8 -8 16 -16 16 -24 32 -32 41 -50 57 -72 82 -96 112 -128 146 -169 192 -217 247
34 247 -280 313 -353 396 -442 494 -552 610 -679 753 -831 919 -1015 1118 -1233 1361 -1497
51 -1497 1649 -1819 2005 -2216 2452 -2717 3028 -3383 3800 -4300 4910 -5671 6661 -7994 9904
66 9904 -12892 18244 -30832 128304 -83373 -432348 -287469 3732 379583 359829 -47166
77 -47166 -358700 -282814 -14558 308916 325434 -25746 -315962 -260423 -12997 270433 296547
88 296547 -12365 -283651 -239778 -8334 245442 274051 -3840 -263608 -230590 -8317 225793
99 225793 256475 5494 -246686 -227434 -12780 209614 244989 20038 -225847 -224807 -21866
110 -21866 192869 235834 35847 -202752 -220646 -32760 173106 221748 47373 -180223 -215152
121 -215152 -44263 154227 207547 56046 -158700 -206814 -51451 140625 196914 63537
131 63537 -137594 -195862 -55698 130187 189377 69888 -120500 -186906 -61421 119588 181492
142 181492 72770 -107953 -181620 -68716 107713 173283 74716 -97261 -176729 -75981 96813
153 96813 167104 77661 -86356 -169953 -81204 87978 162454 81511 -75797 -162483 -85756
164 -85756 78151 157422 83976 -66101 -155977 -90708 67621 151272 85740 -57494 -148493
175 -148493 -93543 58400 145565 87521 -48867 -140343 -94800 49777 139799 88769 -41824
186 -41824 -133168 -95769 40987 133105 88696 -36364 -127264 -97677 32196 126189 88809
197 88809 -30954 -120571 -97184 25754 121291 90835 -24074 -113022 -95726 19822 116788
208 116788 93101 -17454 -106493 -94518 13437 110537 93252 -12426 -101359 -94176 6689
219 6689 103641 93176 -7859 -96106 -93153 1124 97376 93533 -2344 -90462 -92061 -4272 91421
232 91421 93369 2556 -84965 -90399 -8828 84474 92171 7161 -79889 -88891 -13007 78120 90944
245 90944 11724 -74566 -86772 -16440 72432 89560 16410 -69384 -84845 -19333 66407 87619
257 87619 19415 -64971 -83370 -22585 60836 85104 22588 -60668 -82264 -25909 55192 82695
269 82695 26174 -56081 -80439 -28620 50033 80724 29985 -50403 -78302 -30668 45560 78651
281 78651 33192 -45073 -76277 -33197 40425 75678 35597 -39598 -73875 -34858 35784 72210
293 72210 37724 -35256 -71482 -36800 31626 69413 39292 -30554 -69011 -38227 27819 66671
305 66671 41256 -25839 -66503 -40074 24098 63763 41866 -21821 -64215 -41385 20781 60790
317 60790 42716 -17881 -61098 -42111 17659 58422 43460 -13994 -58091 -42952 14239 55684
329 55684 43441 -10653 -55208 -43652 10756 52490 43251 -7862 -52364 -44313 7802 49681
341 49681 42929 -5216 -49209 -44033 5288 47380 42603 -2559 -46061 -43710 2850 44619 42144
354 42144 -709 -43023 -43353 548 42223 41520 1364 -40525 -43069 -1626 40068 41205 3898
367 3898 -37357 -42676 -4557 37430 41029 5600 -34419 -41675 -6480 34606 39785 7077 -32273
380 -32273 -40481 -8282 31728 39857 8574 -29123 -39242 -10050 29821 37345 10768 -26621 -37314
393 -37314 -12135 26774 37578 11208 -23939 -36922 -12978 24035 37851 12589 -22883 -36058
405 -36058 -14268 22560 36530 14041 -20986 -35071 -15837 19905 35754 15628 -19038 -34472
417 -34472 -16914 17560 34868 16697 -16712 -33058 -18128 15172 33450 17561 -14743 -31730
429 -31730 -18174 13241 31949 18219 -12845 -30478 -18740 11397 30300 18841 -10978 -29355
441 -29355 -19140 9631 29025 19465 -9335 -28155 -19265 7835 27604 20124 -7869 -26764 -19740
454 -19740 5815 26177 20371 -5932 -25504 -19951 4459 24797 20430 -4037 -23969 -20130 2896
467 2896 23104 20925 -2450 -22826 -20290 1336 21569 20764 -423 -21142 -20189 86 20053
480 20053 20809 525 -19734 -20585 -1443 18706 20427 2259 -18307 -20691 -2939 17244 20517
493 20517 3789 -16863 -20155 -4175 15809 20072 5001 -15175 -20108 -5085 14391 19678 5642
506 5642 -14060 -19600 -5747 13079 18840 6405 -12440 -18619 -6485 11831 18063 6900 -11259
519 -11259 -18098 -7113 10719 17651 7348 -10197 -17583 -7429 9441 17075 7860 -8876 -17065
532 -17065 -8013 8333 16297 8293 -7762 -16251 -8389 7397 15430 8561 -6572 -15159 -8674 6386
546 6386 14767 8636 -5325 -14488 -9058 5110 13972 9018 -4727 -13532 -9125 4010 13023 9129
560 9129 -3776 -12601 -9127 3492 12338 9048 -2700 -11925 -9373 2424 11530 9070 -2393 -11040
574 -11040 -9310 1730 10926 9202 -1482 -10404 -9165 836 10130 9445 -583 -9636 -9041 -141
588 -141 8885 9136 187 -8756 -8871 -523 8425 9015 1097 -7932 -8900 -1522 7163 8783 1614 -7256
604 -7256 -8721 -1909 6629 8415 1988 -6068 -8483 -2342 5966 8302 2731 -5473 -8126 -2592 4952
619 4952 8055 3269 -4528 -7880 -3113 4260 7785 3546 -4213 -7626 -3716 3630 7286 3876 -3403
634 -3403 -7180 -4089 2984 6807 4202 -2333 -6926 -4161 2450 6367 4346 -1771 -6193 -4450 1779
649 1779 6074 4228 -1616 -5686 -4471 1152 5642 4324 -635 -5211 -4663 591 4965 4653 -158 -5302
665 -5302 -4728 0 4725 4669 165 -4324 -4714 -329 4105 4514 515 -3784 -4627 -778 3805 4465 963
682 963 -3664 -4659 -1150 3372 4679 1343 -3027 -4735 -1547 2966 4292 1771 -2467 -4208 -1919 2293
698 2293 4345 2332 -2029 -3988 -2213 1971 4174 2218 -1698 -3877 -2302 1477 3926 2378 -1089
713 -1089 -3818 -2833 990 3365 2585 -410 -3293 -2629 580 3344 2783 -289 -2997 -3011 -19 2976 2837
730 2837 -134 -2852 -3102 -394 2634 2849 332 -2274 -2905 -615 2224 2699 1001 -2052 -2974 -831
746 -831 2088 2993 866 -2039 -2817 -1334 1678 3055 1482 -1407 -3119 -1389 1199 2761 1441 -1180
762 -1180 -2447 -1754 867 2530 1607 -668 -2568 -1831 585 2580 1726 -590 -2226 -1824 196 2149
778 2149 2114 -36 -2398 -2345 -43 2094 2159 -88 -2120 -2001 -148 1733 2048 447 -1818 -2437 -391
795 -391 1680 2359 784 -1733 -2152 -779 1527 2197 928 -1599 -2371 -1051 1348 2301 832 -1439 -2395
812 -2395 -1164 1058 2610 1516 -848 -2339 -1645 903 2314 1648 -665 -2475 -1426 541 2191 1917
828 1917 -363 -2194 -1632 698 2110 1894 -423 -2455 -1799 327 2269 1956 -383 -2340 -2030 29
844 29 2292 2050 -4 -1971 -2061 -12 2059 1985 -71 -2218 -2163 34 1958 2117 264 -1924 -2447 -369
862 -369 2214 2476 397 -1915 -2713 -452 1913 2393 541 -1826 -2191 -495 1712 2409 1002 -1592 -2464
879 -2464 -754 1550 2446 1013 -1671 -2481 -1151 1685 2537 1303 -1501 -2686 -1430 1398 2633 1545
895 1545 -1226 -2927 -1430 1263 2805 1793 -1240 -2800 -1690 968 2792 1846 -720 -2989 -1959
910 -1959 777 2737 2062 -648 -2997 -2184 457 2764 1911 -671 -2725 -2251 589 2556 2309 -198
926 -198 -2879 -2358 269 2959 2564 -146 -2619 -2635 281 2910 2697 -45 -2700 -2819 -153 2760 2882
943 2882 -44 -2453 -2988 -389 2934 2989 285 -2706 -2898 -630 2693 3067 298 -2399 -3413 -696
959 -696 2757 3159 745 -2345 -3099 -802 2633 3215 853 -2213 -3465 -1027 2324 3066 809 -2282
975 -2282 -3361 -1332 2243 3281 1135 -2193 -3116 -1697 2000 3817 1416 -1996 -3430 -1755 1993
990 1993 3571 1741 -1969 -3658 -1777 1651 3566 1838 -1560 -3588 -2069 1797 3838 2159 -1460
1005 -1460 -3576 -2121 1235 3354 2262 -1234 -3703 -2350 1180 3654 2434 -1086 -3409 -2544 806
1020 806 3635 2631 -890 -3601 -2412 761 3399 2920 -792 -3561 -2938 451 3276 2943 -416 -3334
1036 -3334 -2898 272 3205 2866 -220 -3352 -3088 72 3175 3389 136 -3317 -3226 -303 2779 3282 386
1053 386 -3088 -3028 -533 2786 3445 650 -2882 -3237 -710 2677 3278 894 -2649 -3207 -776 2217 3261
1070 3261 911 -2194 -3506 -1084 2417 3688 1391 -2394 -3459 -1098 2208 3392 1348 -2145 -3638
1085 -3638 -1401 1857 3377 1407 -2034 -3595 -1524 1650 3407 1467 -1696 -3270 -1655 1750 3470
1100 3470 2013 -1340 -3657 -1884 1821 3343 1965 -1269 -3447 -2062 1199 3305 2144 -1103 -3668
1115 -3668 -2158 1185 3337 2372 -963 -3134 -2437 1189 3338 2406 -813 -3174 -2589 918 3306 2343
1131 2343 -692 -3037 -2506 627 3189 2417 -494 -3235 -2821 554 3094 2683 -297 -3239 -2974 263
1147 263 2992 2969 -173 -3058 -3148 116 2981 2865 -213 -2887 -2685 -106 2846 3059 145 -2567 -2688
1164 -2688 -366 2853 2917 227 -2769 -2944 -319 2685 3339 404 -2423 -2923 -475 2662 2954 451
1180 451 -2467 -2856 -770 2046 3038 613 -2175 -3033 -884 2332 3082 760 -2130 -2900 -1156 1942
1196 1942 2942 916 -2183 -3028 -1182 2062 3242 1028 -1944 -2769 -1325 1793 3073 1316 -1804
1211 -1804 -2965 -1315 1565 2970 1262 -1483 -2766 -1412 1445 2768 1459 -1383 -2794 -1464 1229
1226 1229 2670 1584 -1303 -2819 -1511 1214 2877 1692 -1283 -2484 -1483 929 2522 1708 -863
1241 -863 -2709 -1695 782 2684 1749 -720 -2619 -1770 928 2486 1705 -643 -2432 -1795 544 2445
1257 2445 2026 -563 -2400 -1886 372 2336 1872 -274 -2282 -1746 348 2353 1932 -385 -1896 -1879 282
1274 282 2091 1660 -189 -2250 -1967 306 2178 1794 -153 -1903 -2115 50 2077 2076 -28 -2037 -2022
1291 -2022 193 2082 2167 169 -1949 -2148 -64 1824 1907 268 -1871 -2045 -68 1819 1908 483 -1551
1308 -1551 -2245 -352 1679 2032 234 -1723 -1993 -341 1708 2236 286 -1504 -1926 -536 1455 1885
1324 1885 477 -1513 -1935 -584 1529 2164 615 -1402 -1918 -595 1350 2194 876 -1437 -1929 -681
1340 -681 924 1981 715 -1045 -2194 -1067 1075 1902 713 -943 -1947 -873 1130 1964 859 -1013
1356 -1013 -1822 -935 698 1874 1164 -814 -1879 -790 764 1742 1119 -713 -1771 -1176 709 1881
1372 1881 1336 -324 -1710 -1397 694 1909 904 -713 -1767 -1096 301 1793 1325 -506 -1676 -1405
1388 -1405 351 1654 1604 -421 -1865 -1558 117 1280 1262 -397 -1518 -1182 -45 1189 1460 -244 -1369
1405 -1369 -1494 56 1366 1338 13 -1275 -1542 -10 1472 1490 108 -1310 -1514 -60 1421 1537 156
1422 156 -1288 -1330 -220 998 1262 323 -1443 -1385 -77 1119 1475 286 -1046 -1446 -449 1039 1443 518
1440 518 -1089 -1159 -260 1003 1356 387 -794 -1404 -181 852 1588 818 -616 -1407 -327 646 1172 501
1458 501 -775 -1333 -791 666 1383 756 -650 -1179 -587 601 1131 422 -51 -1132 -732 629 1281 871
1476 871 -617 -1086 -580 387 1193 627 -334 -1065 -852 361 908 647 -342 -1259 -692 157 1091 708 -19
1495 -19 -1045 -776 2 960 766 -267 -1062 -737 152 975 897 -12 -1129 -942 137 749 784 -96 -829 -834
1515 -834 33 753 1021 274 -737 -693 12 612 826 190 -819 -1104 -309 658 959 31 -659 -955 -323 450
1535 450 919 287 -875 -910 -221 671 769 632 -556 -727 -405 603 954 418 -389 -957 -368 417 1087 226
1555 226 -398 -792 -569 209 706 260 -245 -990 -621 329 781 541 -255 -732 -424 -41 618 446 -46 -970
1575 -970 -620 122 677 637 -171 -648 -490 -4 729 601 -142 -516 -518 -43 706 643 -109 -604 -625 156 627 663
1597 663 225 -270 -737 -133 623 934 312 -349 -720 -68 359 786 229 -366 -533 -218 245 966 300 -245
1617 -245 -579 -267 216 872 310 -87 -787 -327 303 901 504 -458 -766 -341 115 612 362 -26 -614 -323
1637 -323 180 492 409 -259 -377 -213 63 658 559 50 -642 -551 -74 446 520 -78 -546 -517 -66 376 608 -74
1659 -74 -570 -887 52 429 713 103 -465 -467 -43 454 515 139 -334 -392 -44 401 378 191 -553 -348 -24 415
1681 415 554 -44 -457 -396 -135 388 473 69 -585 -443 -269 309 492 21 -345 -615 -273 262 605 312 -75
1702 -75 -646 -179 389 475 238 -249 -423 -401 259 617 175 -54 -326 -156 -37 530 293 -340 -507 -178 0
1723 0 484 186 -318 -415 -231 54 352 288 -121 -662 -265 59 182 341 -13 -672 -563 21 132 361 158
1744 158 -305 -529 394 407 294 -13 -665 -529 -197 656 670 -336 -372 -639 -333 533 529 102 -355 -530 -136
1765 -136 22 86 86 -465 -333 77 513 465 154 -380 -333 25 330 233 242 -169 -540 -669 360 189 68 -509
1787 -509 -755 -221 212 277 417 -186 -259 -24 415 355 -311 33 -247 -478 128 410 384 -26 -621 -245 -121
1808 -121 608 604 187 -597 -235 -142 472 123 -53 -387 -228 267 360 112 -18 -742 -68 175 328 443 -96
1829 -96 -66 -258 -207 397 278 50 -321 -298 274 317 284 -185 -298 -283 -39 329 339 -245 -188 -541 -1 365 475
1852 475 222 -485 -239 -228 497 200 -36 -429 -561 131 -5 391 78 -339 -426 5 257 347 269 -355 -301 -99
1874 -99 222 747 56 -331 -393 -126 642 524 380 -401 -632 -422 318 559 225 -281 -533 -478 390 305 384 -152
1896 -152 -495 -133 23 422 -95 75 -607 -120 215 571 318 -294 -454 -471 178 759 417 -33 -609 -232
1916 -232 472 422 366 -196 -500 -255 96 521 572 -104 -764 -162 12 704 329 -145 -546 -296 152 535 591
1937 591 -73 -458 -358 -8 408 243 -41 -368 -450 19 638 333 -36 -392 -439 62 340 646 4 -503 -350
1958 -350 115 533 613 45 -297 -395 -90 314 331 -82 -380 -605 -50 367 485 93 -306 -640 -98 437 720
1979 720 61 -442 -783 -376 446 413 346 -246 -604 -273 383 617 69 137 -982 -348 138 561 356 -324 -348
2000 -348 -341 345 501 344 -188 -524 -363 358 635 260 -312 -690 -363 194 395 284 -393 -469 -234 271 858
2021 858 386 69 -544 -448 209 583 131 -113 -787 -652 90 580 307 -98 -476 -552 -127 519 333 -330 -409
2042 -409 -456 178 342 609 -131 -617 -494 19 727 405 -279 -644 -511 140 539 535 -116 -299 -548 -52 518
2063 518 340 -24 -451 -854 366 574 677 206 -402 -369 5 419 451 -227 -748 -402 -47 440 748 -75
2083 -75 -664 -739 47 337 222 114 -274 -795 -28 -85 634 119 -310 -809 152 208 326 11 -143 -846 -558
2104 -558 402 772 347 -74 -452 -246 186 446 175 -183 -353 -304 -43 544 57 34 -391 -471 139 540 462
2125 462 -169 -581 -320 -66 415 661 -28 -187 -689 -186 312 537 -67 -656 -493 -275 366 416 34 -393
2145 -393 -402 -278 263 362 223 -361 -325 -73 471 427 -36 -368 -511 -215 248 475 294 -370 -476 127 365 805
2167 805 224 -507 -426 -235 304 490 447 -166 -739 -517 425 372 250 -289 -696 -284 280 567 306 -87 -503
2188 -503 -305 27 519 329 -317 -534 -205 420 414 451 -93 -555 -403 475 597 530 -133 -656 -418 144 641
2209 641 158 -86 -269 -453 255 642 459 -28 -647 -302 224 442 377 -50 -489 -321 -93 421 527 32
2229 32 -615 -403 10 407 430 84 -433 -438 -167 545 455 109 -336 -445 -175 709 233 150 -287 -315 -353 430 448
2252 448 -84 -9 -537 -181 302 760 145 -419 -567 -159 398 883 164 -400 -755 -138 350 365 167 -331 -646
2273 -646 -488 475 279 148 -295 -432 -241 354 412 165 -549 -441 -358 355 684 318 -325 -613 -450 15 536
2294 536 410 -73 -602 -560 -120 614 578 -87 -332 -391 348 569 413 -199 -699 -499 265 550 301 -61 -573
2315 -573 -449 185 578 450 85 -334 -477 -1 445 398 142 -578 -520 179 452 489 -368 -264 -173 -183 -54 662
2337 662 -97 -167 -471 -697 505 604 -395 -530 -409 66 108 882 -85 -53 -789 175 1037 788 329 -1042 -646
2358 -646 -161 939 600 237 -456 -821 -249 381 427 372 -572 -483 -202 314 482 258 -654 -574 -317 490 550
2379 550 408 -648 -707 -173 406 544 210 -434 -740 -305 348 476 389 -565 -514 -240 202 473 172 -262 -534
2400 -534 -318 305 503 310 -342 -784 -385 299 880 291 -130 -861 -464 539 665 127 -365 -591 -317 230
2420 230 563 348 -90 -616 -359 220 694 375 -293 -614 -146 210 607 464 -243 -419 -496 180 624 486
2440 486 -418 -522 -465 42 586 448 -136 -517 -609 143 590 546 75 -409 -345 282 511 538 -342 -585 -280 247
2462 247 746 463 -178 -652 -569 68 492 251 102 -537 -504 56 654 494 -97 -459 -400 88 488 718 -56
2483 -56 -385 -512 -98 533 480 302 -370 -500 -63 552 607 299 -245 -594 -273 481 690 -127 -489 -478 -228
2504 -228 152 461 199 -283 -650 -427 125 586 143 -411 -709 -222 185 635 84 -540 -718 -330 496 727
2524 727 471 -426 -450 -140 124 697 476 -187 -711 -113 74 472 273 -401 -550 -167 359 793 251 -375
2544 -375 -571 -182 80 663 284 -98 -725 -264 166 398 477 -189 -449 -666 317 561 589 -252 -439 -216 -75
2565 -75 525 453 84 -476 -206 -1 410 428 -77 -438 -390 308 440 479 -121 -237 -428 164 455 476 -117 -428
2587 -428 -317 -34 456 248 115 -620 -356 -20 366 603 -124 -617 -381 -159 449 505 11 -422 -632 26
2607 26 471 544 2 -361 -363 -253 97 601 -9 -328 -491 -150 414 463 199 -508 -624 -330 171 292 387 -205
2629 -205 -412 35 459 466 216 -166 -428 -371 208 405 144 -233 -455 58 346 570 -10 -145 -247 -219 434
2650 434 579 232 -365 -291 -168 190 631 457 -341 -339 -505 189 432 424 -254 -268 -295 247 317 364 -139 -201 -132 -90
2674 -90 520 159 -385 -223 -48 47 486 272 -204 -464 -338 168 338 34 -97 -352 -296 49 41 306 -74 -178
2696 -178 -298 30 445 412 56 -261 -273 -111 317 -66 -106 -584 -134 -42 238 238 -99 -40 -56 -157 233 222 -121
2719 -121 -213 -376 -27 197 455 -2 -319 -364 140 303 186 70 -276 -255 -91 295 499 -106 -151 -245 -41 369
2741 369 275 38 -83 -310 198 199 294 84 -496 -400 5 319 362 246 -204 -130 -63 98 106 71 26 -278 -172 203
2765 203 280 162 -46 -15 -161 15 253 -10 -163 -279 -173 138 149 391 -198 -169 -274 -17 369 64 -56
2786 -56 -200 -559 182 160 -81 -177 -294 -322 -10 218 73 -3 -254 -168 -47 347 167 38 -175 -341 120 44
2808 44 127 -183 -578 -224 39 401 135 -213 -436 -310 66 246 298 -85 -208 -280 -26 203 239 -105 -339 -185
2830 -185 254 228 248 66 -417 -181 -30 211 109 -13 -298 -246 148 -16 318 -335 -175 6 -41 127 98 -28
2852 -28 -16 -316 -6 74 -12 135 -163 -178 -127 109 146 23 -115 -158 -38 121 390 188 -108 119 -153 -70 94
2875 94 -43 69 -171 20 281 103 146 -313 -105 -61 25 193 98 72 -281 -166 188 164 158 -29 -184 -70 90
2898 90 217 -107 29 -379 -19 196 20 224 -339 -212 150 116 96 -116 90 -236 -75 98 301 30 -40
2919 -40 -20 3 39 308 168 6 -112 -141 13 207 135 -128 -42 67 268 269 202 -368 -167 -234 112 113 -121 -161 -278
2944 -278 21 7 201 31 -55 -235 -71 242 -68 239 -58 -239 -181 2 238 121 30 52 21 -20 213 42
2966 42 59 -146 -173 84 271 103 43 -94 -161 -4 -77 183 -128 -144 -393 26 172 -76 -48 -301 61 126 -135
2989 -135 -22 23 -306 -182 -146 227 -83 14 -35 -140 -62 -162 -108 -32 -117 -113 100 108 85 -22 146 -189 -112 193 255
3014 255 130 -158 -114 -41 44 -57 -25 94 69 32 -82 -58 21 19 -36 -99 1 -17 10 103 -26 74 -14 -44 177 39
3040 39 23 107 -51 223 -47 -265 -99 -13 75 -170 355 -75 -25 308 155 150 -43 -36 -126 -20 -157 -198 -17 -37
3064 -37 76 17 -123 113 -86 -181 13 -206 -197 -6 253 -187 -232 127 -92 96 6 193 148 -96 114 258 112
3087 112 -162 -129 -239 -313 -177 128 138 179 95 -50 -26 38 50 -4 141 101 67 -16 -183 142 -57 -159 163 -105
3111 -105 33 -3 -187 25 -202 -134 -32 -27 -8 16 253 31 125 1 -78 -10 -71 162 -118 52 -193 7 -137
3134 -137 -5 4 188 -44 -85 27 -231 41 -71 -232 270 -6 -130 115 -12 -112 96 95 -42 87 106 55
3156 55 97 17 204 136 134 -166 -211 96 115 76 46 -110 -210 -141 -45 171 -27 16 235 86 -54 79 -260 190
3180 190 181 37 286 -46 -170 -79 -108 -128 -127 -230 -113 38 106 278 -166 67 128 -64 144 226 -68 7 15 -44 -81
3205 -81 128 24 -212 -80 -221 6 111 -171 -109 150 34 -8 -214 0 -164 -41 110 123 158 -201 -89 197
3227 197 402 -31 28 286 -69 12 -112 -56 -53 3 147 175 -146 369 -56 332 328 -226 14 31 328 -118 -207 -201
3251 -201 137 13 68 112 -16 15 -223 117 -77 -97 -69 8 -141 -80 278 170 -157 -154 42 127 144 -21 -101 132
3275 132 -196 -174 180 97 156 55 216 -84 197 334 -48 7 -169 -3 78 -53 4 37 42 82 201 331 17
3298 17 -197 106 78 180 -25 111 25 185 -47 84 -49 -324 -83 -66 22 -118 164 40 115 -17 -24 143 10
3321 10 -22 -174 -218 155 91 -183 -193 11 -147 49 79 16 -84 130 74 -62 15 23 -35 -72 -75 -307 119 -196 13
3346 13 -291 -133 32 127 -123 -94 59 -121 -94 15 -13 39 146 -18 -6 -82 127 -46 -20 173 78 -13 206 39
3370 39 89 -181 49 -109 -60 159 81 55 -152 181 55 -28 76 -84 9 126 -125 215 -50 -49 242 -137 -64
3393 -64 -166 -133 36 301 -139 33 -2 83 34 -48 123 165 137 -93 2 30 192 14 57 -46 259 244 -7 215
3417 215 -50 -63 -130 163 181 -34 -168 -259 -59 -24 185 221 132 0 -161 -36 33 -21 -266 -135 194 -107 100
3440 100 62 235 4 133 -125 -30 106 148 128 -223 174 -31 -118 -90 -176 -36 148 -5 5 -177 313 -92 -57
3463 -57 -21 -225 87 -182 111 31 69 -16 37 25 159 15 -5 20 68 48 269 110 126 -105 -24 -125 -52 174 131
3488 131 -74 -321 -155 89 165 129 82 -184 -59 250 299 -134 17 -22 179 -144 264 -19 80 -276 -25 103
3510 103 -184 -165 -94 -88 121 221 298 58 -36 -172 -207 138 171 126 -5 -236 16 101 35 4 137 185 -22 -63 296
3535 296 -123 -118 -115 -369 -232 291 258 172 -266 -8 -61 196 127 -294 -74 -288 -9 294 -29 -169 -182 -156 -71 139
3559 139 16 200 -125 -410 150 155 -129 140 -148 -115 89 -17 272 -79 -142 -32 -72 -3 -57 54 -7 -120 98
3582 98 234 -4 26 -230 -213 -213 119 77 218 -42 -441 17 -72 155 -134 -61 56 5 89 271 4 -5 -140 82
3606 82 148 180 31 -183 -225 2 159 231 290 -96 -4 -235 258 265 302 64 -144 169 337 -62 270 -28 -227
3629 -227 -94 153 177 -110 -143 -106 50 -93 153 90 38 -21 110 41 212 -43 -146 -145 -125 136 107 176 28 -148
3653 -148 -169 -2 172 36 -138 -68 -124 33 225 374 -118 -460 -153 -90 168 121 169 -122 -74 109 60 -4 -69
3676 -69 -279 -83 128 -99 325 -41 -447 -153 175 229 7 142 -429 292 242 -37 -92 -209 51 57 134 189 -74
3699 -74 -55 -117 144 -147 40 177 -39 19 -78 -215 433 -27 171 113 -153 20 119 252 -30 83 -93 -254
3721 -254 -75 80 -74 -351 -47 233 246 281 -64 -31 -13 -100 27 84 183 -167 -147 284 40 29 100 -142 -316
3744 -316 -56 -27 -44 2 -265 -23 9 302 120 102 235 -247 -153 71 321 202 -344 -327 -38 -59 47 47 -78
3767 -78 -116 -88 12 100 -80 182 -238 -56 82 113 145 -109 -235 -351 254 174 180 79 -96 -245 37 -245 174
3790 174 9 -158 -99 157 148 152 -26 208 122 243 213 -123 117 39 -74 -430 -22 286 5 -32 141 -43 262
3813 262 209 117 -142 -218 -101 196 10 249 30 -177 -85 -188 -18 86 -115 -177 -21 380 33 -208 -93 -165
3835 -165 9 21 145 -99 -360 -7 -7 76 207 -30 -174 -89 75 -149 56 -49 -57 -196 13 129 78 -112 -429
3858 -429 -333 -43 30 -20 -11 78 -113 -124 126 35 -150 -138 -220 -11 149 83 2 59 12 -251 271 -3 -7 -70 7 -177
3884 -177 109 255 72 19 88 -47 132 42 210 -171 -263 -106 32 -24 36 -167 -43 -183 147 405 171 19
3906 19 -275 -172 218 173 -58 35 -55 -305 -86 64 212 -111 -138 -67 121 -54 18 93 -53 109 72 16 236
3929 236 189 -252 0 105 89 52 43 -19 31 -303 136 126 -232 103 -108 -49 -126 43 55 -328 -233 -5 91 -40
3953 -40 117 -171 -140 158 347 173 235 -72 97 -16 -47 -33 -126 13 -205 -126 94 313 304 44 -67 -99 107
3976 107 -191 62 -103 -231 -240 122 -78 54 89 -38 264 35 -16 -86 44 28 -275 -103 -82 103 -119 -67 -205
3999 -205 44 -144 106 -304 -460 -21 238 -48 -27 1 -252 -183 16 257 -35 145 -62 -188 -207 56 302
4020 302 22 -279 -102 -71 207 -22 181 -178 -62 120 56 86 -102 -126 -4 91 258 -82 80 -41 161 -51
4042 -51 -12 2 -103 -19 -159 187 49 155 52 -111 -115 113 135 113 -35 100 105 228 17 183 161 -77 -140 20
4066 20 216 -172 -66 108 55 87 18 285 202 101 -333 -160 -39 -46 116 75 172 -61 -20 81 46 108 158 -107
4090 -107 -9 165 -9 -136 -104 -47 128 269 221 -148 -18 9 203 -78 -153 -99 6 64 -90 -39 62 -44 -246
4113 -246 -161 -109 -72 174 20 -105 -73 -69 136 161 10 1 10 -206 -53 116 96 -103 -185 -215 147 326 98 -21 -2
4138 -2 60 -13 -159 -104 -4 269 104 -136 -76 -58 -135 -22 109 -141 1 107 144 -139 -165 -115 -36 243 7 -74
4162 -74 12 62 20 -24 33 13 -107 38 -37 -52 -198 102 -118 -81 48 -108 -51 -146 -201 -57 -18 -70 -42 -9 -77 -52
4188 -52 -236 84 -275 155 107 30 62 112 -43 70 -302 192 140 203 -170 -18 38 194 -201 -243 80 -116 -354
4211 -354 -157 416 -148 -52 -81 65 172 -83 183 145 -314 100 -249 -93 -194 132 -322 20 -16 -132 104
4232 104 -2 27 -115 -95 -237 -44 -26 181 -357 76 -84 -24 193 -150 50 -58 94 309 -29 134 -54
4253 -54 -113 61 32 133 -81 36 -125 -279 -180 -63 60 -218 -251 -51 142 -13 -17 -20 -211 84 95 139 199 107
4277 107 21 41 -195 84 163 125 -132 53 240 254 148 84 -134 -4 -115 53 45 -120 10 -159 162 152 165
4300 165 -73 -29 31 81 -96 65 -96 -108 -50 -141 232 -47 184 19 14 129 30 96 -16 -56 -25 -41 94 130 -102
4325 -102 -103 103 342 117 -121 115 -111 -11 209 78 238 250 109 -183 65 86 117 84 19 91 -232 -168 -32
4348 -32 79 -156 -224 72 -78 169 145 -30 -235 -117 180 368 14 -48 -207 -87 -40 105 -68 -80 -138 96
4370 96 104 -3 44 -153 -106 31 247 126 -63 -249 -42 -307 132 141 86 37 34 -22 -223 64 215 180 -26 -143
4394 -143 16 109 170 -97 68 -236 70 307 99 23 -275 265 169 129 -34 1 -22 43 88 -204 179 88 -318
4417 -318 -96 75 114 181 -73 -132 -137 108 10 51 153 -34 -215 39 58 69 -20 -184 -229 -42 -144 51 -85 -226
4441 -226 -240 104 168 152 -57 78 -149 277 256 132 108 -48 112 -19 -155 -198 153 0 94 -155 166 -21
4463 -21 -53 -87 11 -77 99 122 140 -48 237 -155 233 10 135 -86 -131 -188 -126 140 117 -122 68 -11 128 117
4487 117 -152 2 -3 -2 38 116 -164 -363 -99 90 144 230 144 5 120 -231 -175 229 82 -68 -22 -170 -121 188
4511 188 -160 257 -233 129 -71 192 -93 39 -105 -104 0 -5 30 17 -16 -21 -14 -91 50 0 36 -207 -96 46 -65
4536 -65 96 39 -136 -158 152 163 -144 -82 -65 -260 234 34 58 -200 -142 -283 46 303 -66 28 -247 -122 87
4559 87 53 42 82 34 41 232 227 91 29 20 167 -33 229 -26 -64 -75 71 64 -55 -27 -134 165 324 109 164 -70
4585 -70 -78 -291 -69 8 7 186 88 -248 24 -59 160 -98 -44 -61 28 86 -6 131 -62 -95 171 55 113 -34 1
4610 1 44 150 151 -67 272 -142 -132 293 132 -32 -89 -159 75 -108 291 223 105 -137 -115 57 -138 -6 54 67
4634 67 -32 -55 -11 142 -104 23 -137 294 -38 258 223 81 -103 -131 160 28 192 63 -301 18 22 -41 -99
4657 -99 179 -148 -33 -3 142 316 21 -99 -218 205 136 24 -22 -163 -129 -154 -79 115 30 -49 99 -139 -155
4680 -155 180 144 -222 -251 -138 205 82 101 41 48 -182 65 239 -59 43 -168 19 68 199 -6 -196 -144 18
4703 18 176 1 161 35 72 -17 -103 134 -117 26 -163 -10 -14 254 -5 5 -116 -100 199 64 -56 -312 129
4726 129 218 6 247 -102 -140 -200 169 301 300 134 208 24 -3 124 41 222 323 69 -208 -226 -106 145 -105
4749 -105 -105 6 -67 -152 -201 -236 251 -3 94 93 84 67 -133 239 59 110 -90 239 60 -152 79 303 21 -97
4773 -97 -95 -210 119 -112 -4 17 -90 -151 69 341 68 -84 103 -99 0 -167 -86 -100 -310 79 -30 42 -1
4796 -1 169 -98 -126 187 -13 6 -91 -85 -42 88 130 223 93 -52 -107 126 -146 54 -232 -34 -76 -118 -146 109 55
4821 55 76 110 -37 68 -13 153 -324 -27 -111 73 78 17 58 -16 34 -156 205 166 -78 -215 180 -148 -4 135
4845 135 -98 10 -247 -17 -91 205 -149 107 70 -347 133 -73 -137 -36 -202 125 80 -2 159 -161 -315 -33
4867 -33 0 -63 -69 33 186 -134 -12 151 117 -102 -118 -320 69 225 -70 52 103 192 -7 76 -51 64 108 159
4891 159 -10 -25 48 98 69 -118 51 77 -164 -100 2 -10 59 31 88 -51 -22 -127 -153 200 -152 -68 -33 -96 34
4916 34 49 252 194 -112 137 203 73 164 10 -144 -34 138 145 235 73 -102 183 -72 -189 128 1 61 -188
4939 -188 -219 178 -213 -202 -1 -156 -97 259 -132 -31 -93 -304 36 -136 -81 34 112 37 -24 -19 37 -43 -112 118
4963 118 -28 172 -162 214 -30 -113 82 66 159 273 -70 39 -256 30 164 83 -49 -44 -231 -239 93 -6 -79
4986 -79 20 -70 14 158 72 82 -284 -29 -310 83 323 -172 246 -8 95 125 -108 28 14 27 73 69 -188 147
5010 147 -205 17 -70 -66 94 66 77 20 -203 -202 8 -25 -178 19 16 -59 144 -214 82 -27 -188 363 -206 -179
5034 -179 52 237 208 197 276 -226 769 -56 -289 -23 -202 819 318 216 174 -312 249 -52 6 -135 35
5055 35 299 -86 161 -56 -135 -81 -48 -102 65 -100 -190 98 95 23 -90 164 -194 240 119 103 16 -77 5 -84 -129
5080 -129 -43 -81 63 134 -152 -319 -229 25 186 20 -90 -104 -115 125 230 -49 54 -37 -53 -129 -166 42 20 -67
5104 -67 -257 -29 -43 -133 -46 252 136 55 -316 -22 235 -40 -44 48 -145 -80 -121 -212 20 -57 -294 164 127 -38
5128 -38 -67 -70 485 43 -12 66 148 -57 106 -66 -149 -145 -19 -143 -27 -158 66 -176 -55 179 -63 -22 -93 267
5152 267 46 -69 41 15 -40 36 257 -10 24 -23 -155 4 -66 -121 -115 242 104 -200 -33 -16 13 -165 128 191
5176 191 148 -124 -29 -305 -71 -271 -85 -89 247 26 -85 -17 -27 167 -45 -212 -235 -117 167 34 91 -36 -95
5199 -95 30 47 70 62 -42 -174 -23 -26 121 -142 -112 -36 180 -61 221 10 -143 176 107 -139 56 28 -49 -82
5223 -82 20 -80 -61 120 165 96 -387 115 -63 58 -269 -7 17 -33 -247 -111 -216 6 -50 -49 -242 52 -53
5246 -53 -245 72 94 -12 -63 70 180 -103 78 -20 -151 47 -18 -56 -34 197 -64 223 95 182 -259 113 -137
5269 -137 118 33 -143 66 -143 210 -154 39 137 -216 -76 37 52 -168 -25 -101 -69 47 -179 21 -46 184
5291 184 -148 -24 -176 -6 40 204 412 -103 19 199 -104 247 44 -116 74 56 -36 25 -7 32 72 100 -20
5314 -20 -252 -209 190 -70 15 120 -48 -64 21 -12 23 -95 138 -139 -41 89 15 237 -39 54 -149 -4 10 -73
5338 -73 174 164 26 258 -293 152 86 222 44 -106 -28 -111 34 -35 170 32 111 -142 91 -84 51 -255
5360 -255 -35 -141 219 -57 0 25 12 101 -121 -46 15 -157 -9 -179 -113 33 -81 10 119 -41 -121 95 -37
5383 -37 -192 -115 -152 -132 136 -112 23 -199 -185 110 73 -227 391 27 99 31 56 52 -89 99 60 83 181 23 -69
5408 -69 -236 -35 -21 92 189 -7 83 -150 6 -11 164 -99 -164 124 47 -57 181 -258 -80 21 49 167 -89
5431 -89 -6 -69 10 -183 -295 50 103 -62 363 86 -75 22 18 -38 -148 97 -141 -58 49 210 -181 -243 -53 51
5455 51 69 77 -47 -180 -46 209 186 -104 -256 -189 -15 22 -169 69 -2 125 -30 -63 41 -85 -122 -261 322
5478 322 -90 160 97 97 -146 176 114 -16 -14 21 162 110 65 -127 226 50 -80 6 -35 -81 15 -186 -135 -192 108
5503 108 -37 -239 -242 -202 -99 -77 95 -34 -229 29 -63 16 84 44 193 224 -216 89 186 -92 -44 -127 167 -41
5527 -41 73 74 -130 201 -15 -109 229 38 77 -18 -1 -356 94 -176 -242 7 -48 76 -7 -10 -4 -20 -58 -140 46 -218
5553 -218 -169 -151 -206 137 -98 -28 170 113 -233 -31 72 117 -197 126 118 -5 -88 163 163 -111 89 18 44 101 109
5578 109 98 86 -121 63 59 -143 -57 -69 -251 -45 -141 32 -165 146 75 196 -87 -119 -424 -42 31 150 42
5601 42 28 103 -33 19 -117 79 145 -135 -82 96 289 128 -101 11 35 8 -116 180 -36 -159 -172 119 57
5624 57 40 34 -94 -37 -195 -88 84 -92 -66 51 -28 71 -289 -80 -205 -149 -16 -33 357 34 177 -71 63
5647 63 357 -241 -29 6 -92 68 24 57 -87 277 29 -9 225 252 250 -120 -152 -161 90 -119 -67 -213 -35 207
5671 207 24 -112 -67 -3 -46 284 8 42 -126 -6 131 -68 -51 178 157 75 -93 -122 -43 103 -38 149 -34
5694 -34 54 -136 -44 278 147 -231 162 206 171 197 294 -37 -98 75 -21 -205 -36 -138 -221 35 -108 130 -71
5717 -71 11 -12 -108 -7 159 5 138 -65 18 77 198 236 -95 -185 31 103 106 169 -84 96 -12 -72 -174 -28
5741 -28 -126 40 -207 -145 -72 -41 -96 151 -183 298 119 -244 161 -69 36 21 -102 -232 -16 -181 -26 -49 -1
5764 -1 -65 -246 102 123 -16 127 -150 33 42 -53 -240 -185 -48 149 -442 -282 53 185 -126 -457 92 427 -496
5787 -496 -319 116 -29 -240 -30 -153 89 -142 -186 -214 -137 212 82 -270 -144 -362 -298 87 -52 207 6
5808 6 150 21 187 43 -235 77 97 -50 -172 -25 -171 -162 -183 -86 161 -135 52 -121 -222 -147 144 -7 102
5831 102 76 -56 -227 94 339 -112 90 -109 119 -257 232 53 19 187 -4 -81 -220 -21 125 -74 -113
5852 -113 201 -221 229 -49 -78 2 -152 -16 -77 101 79 -291 -46 -168 61 -113 240 64 -124 197 -235
5873 -235 244 20 17 68 142 -152 -63 251 5 28 152 123 -74 82 -62 -66 -13 24 159 -10 -74 116 87 230
5897 230 -149 255 -23 20 -42 136 -48 -170 144 -94 106 -1 62 76 -162 -6 103 -14 -28 264 504 124
5919 124 -9 -43 -41 -138 -29 197 -39 118 0 -64 68 -138 -3 -12 -55 31 -189 -53 174 -49 38 -90 -185 305
5943 305 23 7 -104 71 -97 -53 -32 -106 272 -161 209 72 -3 71 183 -53 18 138 96 103 222 211 85 -29
5967 -29 171 82 12 -87 -74 -81 -174 6 -29 85 76 69 -208 38 -279 56 -59 -15 -149 -19 148 -247 -58 -19 141
5992 141 73 97 5 79 165 -19 6 -127 -64 116 -86 181 96 180 -67 37 -2 125 70 35 148 -114 -177 47
6016 47 -159 110 -247 5 110 170 53 56 -11 -185 -122 46 85 154 -41 129 2 110 -72 -148 27 115 -45
6039 -45 32 301 -130 39 7 112 59 -184 -202 -87 -220 -68 -130 -152 -40 17 -103 -319 69 -151 -25 293 66
6062 66 -212 111 -174 -111 58 8 225 38 -171 45 83 229 -25 -46 106 -92 -211 0 22 225 -70 37
6084 37 -138 -11 -92 23 -63 385 -257 138 198 179 -294 -83 40 23 -175 -5 162 101 -134 158 284 -102
6106 -102 -156 -117 0 9 3 -22 63 -39 -135 174 -163 -3 -202 -187 -37 41 -78 -2 76 -203 186 16 -36 95 -72
6131 -72 -37 142 33 -31 -63 -15 -10 -65 -165 -94 87 -136 -5 214 59 62 -157 -187 35 210 255 -110 88 -123
6155 -123 -74 -20 145 -88 -127 -131 -49 -73 -64 -70 -19 111 58 -106 125 -36 -172 43 114 -93 -22 -130 239 -229 -20
6180 -20 79 14 6 -221 121 -142 23 87 128 -91 18 -83 -347 -227 -388 242 -304 -173 -98 111 190 94 -98
6203 -98 -131 -159 119 -13 155 46 -62 95 -40 -235 223 139 155 66 133 43 -97 -52 -59 -216 -82 22 -45 23
6227 23 -78 45 116 72 -76 -42 55 -103 -175 156 196 211 128 -48 -319 143 -22 136 49 102 -309 -9 36 75
6251 75 -195 -215 99 20 124 64 64 -246 44 97 5 -35 341 -41 58 -82 -298 142 -49 -85 171 -27 -26 -52 22
6276 22 -108 3 -111 -165 90 95 33 -17 134 -42 -8 198 -169 -177 -73 -62 -37 19 -91 28 -108 171 310 -187
6300 -187 -83 -111 -149 -101 -95 -111 131 69 -121 -9 161 192 -28 9 55 -64 25 154 -191 -76 -40 222 14 97
6324 97 -77 68 96 59 161 44 -79 94 -23 -38 19 45 -42 -118 43 -109 11 -35 51 51 -1 16 -205 -171 271
6349 271 -98 -98 231 21 -37 -6 -129 229 109 -256 5 121 16 -8 76 -1 -73 103 -10 -62 197 -75 394
6372 394 -112 -234 -268 -29 -51 -10 -231 172 -75 -91 61 -73 -242 -98 235 -72 -109 101 -82 -24 -56 123
6394 123 71 159 -217 221 36 -19 -55 36 -45 133 113 92 26 -38 150 21 -10 -339 161 -73 -143 -245 -67 107
6418 107 -77 264 133 -152 34 -48 -159 -22 187 60 -192 -78 109 83 -25 -124 257 3 -56 98 217
6439 217 20 -26 281 -282 -45 -103 -192 -93 98 60 -133 290 -85 -70 -38 -108 138 13 -142 -175 -7 15 106 -168
6463 -168 -47 -32 -194 49 -11 -127 37 108 44 112 259 -19 84 106 -91 3 256 156 217 -7 -72 73 343
6486 343 -72 -13 4 -301 -106 199 89 -181 -28 104 -61 139 36 -61 177 24 -88 -27 113 116 16 -156
6508 -156 -72 11 292 170 -199 93 -138 -89 179 119 96 -179 57 124 23 125 -11 -30 41 -25 137 162 8
6531 8 193 43 -281 4 -124 -74 51 -41 14 100 -111 31 -52 -93 55 45 -164 -10 -54 -24 -194 80 -284 -55
6555 -55 -6 140 -101 9 240 -115 121 -97 -54 64 3 172 -81 50 -72 -52 142 100 107 -73 -155 250 -66
6578 -66 -224 48 -258 -83 99 -47 147 -82 -144 -177 192 -61 20 -73 -161 -45 80 -104 -65 217 -103 -42 101
6601 101 187 42 61 74 -4 -24 97 -48 76 -159 -26 -19 -242 69 -98 184 23 -234 30 11 31 -146 -13
6624 -13 193 -77 -12 -27 88 206 -60 -135 61 -88 187 72 329 -65 -99 -110 -5 48 -116 112 -72 -262
6646 -262 -164 127 295 -4 -76 19 -79 125 25 44 -44 151 81 10 -38 93 169 -56 -32 -61 -99 -65 -21 8 -38 -202
6672 -202 10 208 87 154 -85 -178 46 -117 242 -124 206 -145 -88 -61 -145 152 -32 -19 -80 -22 95 9 -160
6695 -160 11 41 -35 -20 -79 -147 24 15 46 -96 -34 -289 134 35 -71 103 80 33 18 17 -117 164 234 -227 29
6720 29 -134 100 -133 36 22 -69 30 92 -12 -251 9 26 131 301 44 13 50 177 -148 127 -79 147 -67
6743 -67 -96 114 -234 -161 -224 146 -124 -34 214 261 25 54 59 23 -12 59 208 66 150 -341 65 125 -39 67 66
6768 66 -153 -170 -289 -55 -119 12 -124 3 -115 -47 66 -178 139 -204 -90 42 -125 45 83 66 -157 132
6790 132 199 -182 177 208 -182 -45 -271 77 135 31 -50 81 -77 51 -28 121 38 84 -58 -88 76 73 98 165
6814 165 -24 315 46 -86 112 126 121 -148 145 413 62 -175 25 114 -50 -141 65 74 -52 -53 -54 65 -74 2
6838 2 -70 -304 55 -21 31 -126 -121 -63 -14 -120 -6 207 54 -21 224 135 104 222 54 -65 83 97 -147 -172 25
6863 25 43 179 136 -56 234 54 31 -271 198 -259 -29 -155 252 -47 -42 25 141 -141 -63 110 -259 9 -115
6886 -115 -47 143 79 36 220 66 -17 -87 -210 -70 109 61 140 -31 31 117 -133 -234 -124 238 -33 -40 -150 -60
6910 -60 -62 1 -178 -27 -121 -61 69 -89 181 -140 75 -94 104 7 -39 -56 -63 -22 83 -83 -111 44 -288 64
6934 64 139 273 -69 60 -43 -56 146 -274 32 -238 12 -5 165 300 -101 -41 -109 -77 -59 63 218 -52 -25
6957 -25 -25 -33 -96 41 16 153 -139 69 88 -193 22 59 57 24 153 -57 13 -316 18 145 223 -7 22 -106 14
6982 14 -195 78 -107 -277 58 52 29 -33 -110 -12 -138 -37 163 -36 -23 93 -128 -81 -110 -44 24 -237 233 97
7006 97 325 -267 27 117 57 -92 -182 161 -191 -103 -109 -157 -131 153 -53 -36 99 -12 -48 -27 -3 -15 -32 -115 282
7031 282 391 141 89 -266 -82 -59 -42 61 -11 60 15 -3 -37 154 181 -28 217 53 247 -22 57 -168 -188 143
7055 143 203 107 56 -2 -116 58 227 86 -124 91 -127 46 18 -71 77 90 -61 -271 59 -187 -43 244
7077 244 154 111 31 273 -29 38 -122 -111 -51 -17 -25 -73 -195 81 175 23 24 -37 -232 -48 -51 -12 152 -10 25 35
7103 35 -69 5 -152 45 -216 -104 -131 78 55 75 38 -127 -248 -81 252 -130 -186 -3 -225 115 -85 -5 -110
7126 -110 -42 32 -140 20 49 78 -202 121 102 -86 44 -1 -203 -34 243 -14 176 -51 -257 210 64 130
7148 130 -13 -126 -162 64 79 142 -139 -61 28 -304 116 136 0 97 -108 8 141 -43 -22 131 32 78 74 328
7172 328 57 -109 -143 -217 272 -32 -72 151 -61 -249 -173 231 24 125 -118 13 -138 95 233 61 -10 168
7194 168 72 -96 -19 -177 13 33 1 187 11 -291 -46 162 118 175 147 -133 80 65 123 -127 51 10 -62 -191
7218 -191 -231 -47 -161 -56 -198 -56 52 144 -93 -54 -179 -39 -208 -61 183 -142 155 151 -20 169 24 -56
7240 -56 -155 163 190 -109 121 -14 -134 0 102 -79 148 253 -124 -43 -223 188 -93 227 -106 -23 47 144
7262 144 -110 -38 153 -63 -166 19 102 -91 -104 135 132 159 62 86 -21 74 282 -75 -8 -98 -3 -104 96 114
7286 114 -119 -138 56 -14 99 57 167 165 5 -117 -64 107 10 310 -73 34 73 -58 -131 -304 -12 52 54 -71
7310 -71 -212 -21 -38 -123 -21 -122 73 51 10 -7 -109 22 -87 -108 17 -51 -154 -102 225 -41 244 -152 -259
7333 -259 255 -34 172 -130 -100 -20 32 83 -93 -183 -60 -91 -265 -118 -68 -101 -203 -293 122 19 209 -29 200
7356 200 -53 160 -54 64 -51 176 -331 69 192 -244 85 119 5 181 -10 66 -23 -234 -142 4 55 -96
7378 -96 213 129 -203 -300 126 -143 94 -9 -8 -106 -160 87 132 4 2 -149 -25 5 -62 -87 13 101 89 123 21
7403 21 148 -122 -65 118 45 -197 213 -140 -73 -112 25 153 -187 -170 -32 -179 19 -71 98 42 -88 335 37
7426 37 -43 -238 -71 -180 -50 139 111 106 142 203 19 -107 -35 110 -35 260 221 -136 -152 362 341 52 -68 -155
7450 -155 57 -109 -264 -76 49 -29 71 -97 19 29 140 42 18 218 -160 -3 165 199 281 -80 -100 -208
7472 -208 -22 131 145 -201 -74 -86 24 94 -108 -52 185 111 104 59 147 -69 -11 144 -166 -275 -6 -219 -55
7495 -55 105 -42 -100 73 -9 -72 25 15 227 -181 144 -14 123 -60 -109 -30 161 133 8 -126 -22 47 127 114
7519 114 -177 -98 123 201 -153 -8 -208 70 108 -36 4 244 -26 54 54 -49 -13 -239 -311 -10 253 -83 77
7542 77 -292 72 -102 -199 -53 -243 -80 57 32 -165 171 -156 -13 -29 -35 27 -87 30 -188 -97 47 -112 71
7565 71 45 62 71 78 -67 177 31 -150 -70 82 -4 139 123 304 129 240 37 -67 -120 101 97 77 60 130 188 19
7591 19 119 -26 91 54 -115 -221 -46 196 54 -208 180 -31 61 -41 -110 -13 -165 -30 2 47 -75 109
7613 109 -92 -31 -207 156 -118 22 103 151 119 -193 141 14 42 -183 152 -89 -182 92 136 36 56 -240 -138
7636 -138 -133 -44 -44 -111 -188 124 126 78 -194 -103 -179 27 -46 77 -104 -279 -69 -62 36 -21 4 -106 -336 -90 -147 209
7662 209 -71 -70 23 29 134 230 265 -254 -152 33 41 -196 -8 95 -89 -60 -140 89 107 -39 -45 -61 162 47 124
7687 124 -195 -35 -150 -146 -102 -335 167 120 62 -240 -96 32 -43 -35 -98 -22 -395 50 -27 -75 51 9 160 -225
7711 -225 52 -25 -48 49 -202 141 12 99 -92 -154 -14 6 61 -132 -267 53 84 -167 27 -79 -292 -106 -34
7734 -34 156 -113 84 129 -32 249 220 -22 37 -85 195 -34 -108 85 30 -89 46 118 103 176 -49 49 -71
7757 -71 137 276 -39 1 -49 -160 167 65 101 61 -21 -93 84 9 47 -41 29 13 -206 16 -55 -83 36 -104 -321
7782 -321 361 58 -165 -59 93 -143 -10 57 -40 149 19 -76 178 125 -83 42 -68 92 239 -112 -102 274
7804 274 -90 -236 158 15 -110 -154 186 15 175 231 -110 119 -24 51 -53 33 121 11 -97 -45 -316 62
7826 62 -64 183 102 -50 82 16 206 85 51 -93 -75 68 -99 44 204 26 19 -159 -180 283 -297 -183 -86
7849 -86 -93 68 -49 -37 128 -162 -44 68 127 75 -223 46 -57 -42 52 -25 -51 -97 258 -141 -64 -154 160 -144
7873 -144 -166 -170 -58 129 -96 319 235 164 -38 -23 -183 91 182 72 -99 67 -56 -30 144 221 163 -12 291
7896 291 -10 19 42 81 33 -15 -227 20 15 -239 144 -40 68 74 48 -100 -67 -1 -221 -184 87 3 92 -22 -111
7921 -111 29 44 -4 -116 102 2 -152 -145 -48 -36 241 -97 -147 59 -50 -178 -32 181 -30 -51 135 -163 140
7944 140 -127 -316 -4 200 -41 22 -250 -65 -31 -105 154 175 12 -3 206 -123 -228 -12 -81 -48 113 54 -107
7967 -107 -33 87 -23 96 34 -149 -119 -147 -152 -132 -172 -97 76 84 135 -54 -86 21 -21 -2 80 40 105 -47 -280 -1
7993 -1 12 195 209 183 116 -36 189 292 -197 90 143 -108 -177 -162 -137 128 283 -59 -178 88 155 -149 -2 -263
8017 -263 -18 -58 -14 99 -78 -204 162 35 -60 -7 -109 -38 -215 -76 155 -414 -42 68 -305 -95 287 19
8039 19 -29 11 -14 -66 217 -28 -26 -192 186 93 -3 130 61 113 -94 -42 195 173 -33 -114 250 -5 -51 -77 25
8064 25 -170 -27 -122 -56 70 -256 -179 85 53 -10 -6 -157 380 256 -4 101 -83 13 28 67 62 -152 -12 97
8088 97 -93 0 -217 103 53 91 -353 -2 -101 -145 44 206 7 -121 -164 165 161 190 -242 -98 15 163 -127
8111 -127 -42 388 -20 -142 -1 197 -58 -103 -60 -56 29 -20 96 142 -117 -253 -215 132 191 -45 190 -48 -19 302
8135 302 130 84 -23 -175 131 16 -24 -34 59 -166 9 -82 -67 92 -153 93 3 -88 -48 -192 -89 163 -175
8158 -175 42 -40 -85 167 10 136 -113 -194 225 81 -104 172 -242 -56 217 6 -32 68 116 47 69 47 188
8181 188 -190 -85 267 -57 -9 -143 -18 193 0 -14
8191a4
##END NTUPLES=NMR FID
##END=
