##TITLE=1H_PR151S_K1
 D2O,8 sc, 
 29.03.2021
##JCAMPDX= 6.0         $$ Bruker NMR JCAMP-DX V2.0
##DATA TYPE= NMR FID
##DATA CLASS= NTUPLES
##ORIGIN= UXNMR, Bruker Analytische Messtechnik GmbH
##OWNER= root
$$ XWIN-NMR		Version 3.5
$$ Mon Mar 29 13:24:27 2021 Russian Standard Time (UT+4h)  she@DPX200
##.OBSERVE FREQUENCY= 200.131506
##.OBSERVE NUCLEUS= ^1H
##.DELAY= (6, 6)
##.ACQUISITION MODE= SIMULTANEOUS
##.ACQUISITION SCHEME= undefined
##.AVERAGES= 8
##.DIGITISER RES= 18
##SPECTROMETER/DATA SYSTEM= spect
##.PULSE SEQUENCE= zg30
##.SOLVENT NAME= D2O
##.SHIFT REFERENCE= (INTERNAL, D2O, 0, 15.7039)
##AUDIT TRAIL= $$ (NUMBER, WHEN, WHO, WHERE, WHAT)
$$ ##TITLE= Audit trail, XWIN-NMR		Version 3.5
$$ ##JCAMPDX= 5.01
$$ ##ORIGIN= Bruker BioSpin GmbH
$$ ##OWNER= she
$$ F:/spectra/data/she/nmr/H-F/1/audita.txt
$$ ##AUDIT TRAIL=  $$ (NUMBER, WHEN, WHO, WHERE, WHAT)
(   1,<2021-03-29 13:22:54.00 +0400>,<she>,<DPX200>,
      <created by zg, POWCHK disabled, PULCHK disabled
       configuration hash MD5:
       00 E9 B6 7A A2 85 ED C7 34 08 36 98 17 FE 4E 26
       data hash MD5: 16K
       E4 41 EB 44 C7 53 8C D9 23 81 66 FB 52 BB 14 9E>)
$$ ##END=
$$ 
$$ hash MD5
$$ CA 0A 7E 88 92 28 08 E3 98 F4 B8 D6 81 6C CB 2A
##$RELAX= 
##$RELAX= 
##$RELAX= 
##$RELAX= 
##$RELAX= 
##$RELAX= 
$$ Bruker specific parameters
$$ --------------------------
##$DU= <F:/spectra>
##$EXPNO= 1
##$NAME= <H-F>
##$PROCNO= 1
##$TYPE= <nmr>
##$USER= <she>
##$AMP= (0..31)
100 100 100 100 100 100 100 100 100 100 100 100 100 100 100 100 100 100 
100 100 100 100 100 100 100 100 100 100 100 100 100 100 
##$AQSEQ= 0
##$AQ_mod= 1
##$AUNM= <au_zg>
##$AUTOPOS= <>
##$BF1= 200.13
##$BF2= 200.13
##$BF3= 200.13
##$BF4= 200.13
##$BF5= 200.13
##$BF6= 200.13
##$BF7= 200.13
##$BF8= 200.13
##$BYTORDA= 1
##$CFDGTYP= 0
##$CFRGTYP= 5
##$CHEMSTR= <none>
##$CNST= (0..31)
1 1 145 1 1 1 1 1 1 1 1 1 1 1 1 1 1 1 1 1 1 1 1 1 1 1 1 1 1 1 1 1 
##$CPDPRG= <>
##$CPDPRG1= <>
##$CPDPRG2= <>
##$CPDPRG3= <>
##$CPDPRG4= <mlev>
##$CPDPRG5= <mlev>
##$CPDPRG6= <mlev>
##$CPDPRG7= <mlev>
##$CPDPRG8= <mlev>
##$CPDPRGB= <>
##$CPDPRGT= <>
##$D= (0..31)
0 1.2 0 0 0 0 0 0 0 0.06 0 0.03 0 0 0 0 0.0002 0 0 0 0 0 0 0 0 0 0 0 0 
0 0 0 
##$DATE= 1617009773
##$DBL= (0..7)
120 120 120 120 120 120 120 120 
##$DBP= (0..7)
150 150 150 150 150 150 150 150 
##$DBP07= 0
##$DBPNAM0= <>
##$DBPNAM1= <>
##$DBPNAM2= <>
##$DBPNAM3= <>
##$DBPNAM4= <>
##$DBPNAM5= <>
##$DBPNAM6= <>
##$DBPNAM7= <>
##$DBPOAL= (0..7)
0.5 0.5 0.5 0.5 0.5 0.5 0.5 0.5 
##$DBPOFFS= (0..7)
0 0 0 0 0 0 0 0 
##$DE= 6
##$DECBNUC= <off>
##$DECIM= 32
##$DECNUC= <off>
##$DECSTAT= 4
##$DIGMOD= 1
##$DIGTYP= 9
##$DL= (0..7)
0 120 120 120 120 120 120 120 
##$DP= (0..7)
150 150 150 150 150 150 150 150 
##$DP07= 0
##$DPNAME0= <>
##$DPNAME1= <>
##$DPNAME2= <>
##$DPNAME3= <>
##$DPNAME4= <>
##$DPNAME5= <>
##$DPNAME6= <>
##$DPNAME7= <>
##$DPOAL= (0..7)
0.5 0.5 0.5 0.5 0.5 0.5 0.5 0.5 
##$DPOFFS= (0..7)
0 0 0 0 0 0 0 0 
##$DQDMODE= 0
##$DR= 18
##$DS= 0
##$DSLIST= <SSSSSSSSSSSSSSS>
$$ [...]
##$SUBNAM2= <"">
##$SUBNAM3= <"">
##$SUBNAM4= <"">
##$SUBNAM5= <"">
##$SUBNAM6= <"">
##$SUBNAM7= <"">
##$SUBNAM8= <"">
##$SUBNAM9= <"">
##$SW= 16.9725357007746
##$SWIBOX= (0..15)
0 0 2 0 0 0 0 0 0 0 0 0 0 0 0 0 
##$SW_h= 3396.73913043478
##$TD= 16384
##$TD0= 1
##$TE= 0
##$TE2= 300
##$TE3= 300
##$TEG= 300
##$TL= (0..7)
0 120 120 120 120 120 120 120 
##$TP= (0..7)
150 150 150 150 150 150 150 150 
##$TP07= 0
##$TPNAME0= <>
##$TPNAME1= <>
##$TPNAME2= <>
##$TPNAME3= <>
##$TPNAME4= <>
##$TPNAME5= <>
##$TPNAME6= <>
##$TPNAME7= <>
##$TPOAL= (0..7)
0.5 0.5 0.5 0.5 0.5 0.5 0.5 0.5 
##$TPOFFS= (0..7)
0 0 0 0 0 0 0 0 
##$TUNHIN= 0
##$TUNHOUT= 0
##$TUNXOUT= 0
##$USERA1= <user>
##$USERA2= <user>
##$USERA3= <user>
##$USERA4= <user>
##$USERA5= <user>
##$V9= 5
##$VALIST= <valist>
##$VCLIST= <CCCCCCCCCCCCCCC>
##$VD= 0
##$VDLIST= <DDDDDDDDDDDDDDD>
##$VPLIST= <PPPPPPPPPPPPPPP>
##$VTLIST= <TTTTTTTTTTTTTTT>
##$WBST= 1024
##$WBSW= 4
##$XGAIN= (0..3)
0 0 0 0 
##$XL= 0
##$YL= 0
##$YMAX_a= 74127
##$YMIN_a= -56306
##$ZGOPTNS= <>
##$ZL1= 120
##$ZL2= 120
##$ZL3= 120
##$ZL4= 120
##$ABSF1= 10
##$ABSF2= 0
##$ABSG= 5
##$ABSL= 3
##$ALPHA= 0
##$AQORDER= 0
##$ASSFAC= 0
##$ASSFACI= 0
##$ASSFACX= 0
##$ASSWID= 0
##$AUNMP= <proc_1d>
##$AZFE= 0.1
##$AZFW= 0.1
##$BCFW= 1
##$BC_mod= 2
##$BYTORDP= 1
##$COROFFS= 0
##$CY= 11.3945322036743
##$DATMOD= 1
##$DC= 2
##$DFILT= <>
##$DTYPP= 0
##$F1P= 15.9154993809931
##$F2P= -4.1035820241983
##$FCOR= 0.5
##$FTSIZE= 0
##$FT_mod= 4
##$GAMMA= 1
##$GB= 0.15
##$INTBC= 1
##$INTSCL= 1
##$ISEN= 128
##$LB= 0.24
##$LEV0= 0
##$LPBIN= 0
##$MAXI= 10000
##$MC2= 0
##$MEAN= 0
##$ME_mod= 0
##$MI= 1.114404
##$NCOEF= 0
##$NC_proc= 0
##$NLEV= 6
##$NOISF1= 3.799351
##$NOISF2= 2.8
##$NSP= 1
##$NTH_PI= 0
##$NZP= 0
##$OFFSET= 15.70392
##$PC= 1
##$PHC0= -11124.61
##$PHC1= 14.40094
##$PH_mod= 1
##$PKNL= yes
##$PPARMOD= 0
##$PSCAL= 0
##$PSIGN= 0
##$REVERSE= no
##$SF= 200.130013532006
##$SI= 16384
##$SIGF1= 3
##$SIGF2= 2
##$SINO= 400
##$SIOLD= 16384
##$SREGLST= <1H.CDCl3>
##$SSB= 0
##$STSI= 0
##$STSR= 0
##$SW_p= 3612.71676300578
##$SYMM= 0
##$S_DEV= 0
##$TDeff= 0
##$TDoff= 0
##$TI= <>
##$TILT= no
##$TM1= 0
##$TM2= 0
##$TOPLEV= 0
##$USERP1= <user>
##$USERP2= <user>
##$USERP3= <user>
##$USERP4= <user>
##$USERP5= <user>
##$WDW= 1
##$XDIM= 8192
##$YMAX_p= 0
##$YMIN_p= 0
$$ End of Bruker specific parameters
$$ ---------------------------------
##NTUPLES= NMR FID
##VAR_NAME=  TIME,          FID/REAL,        FID/IMAG
##SYMBOL=    X,             R,               I
##VAR_TYPE=  INDEPENDENT,   DEPENDENT,       DEPENDENT
##VAR_FORM=  AFFN,          ASDF,            ASDF
##VAR_DIM=   8192,          8192,            8192
##UNITS=     SECONDS,       ARBITRARY UNITS, ARBITRARY UNITS
##FACTOR=    0.0002944,     1,               1
##FIRST=     0,             0,               0
##LAST=      2.4114304,     0,               0
##MIN=       0,             -56306,          0
##MAX=       2.4114304,     74127,           0
$$ Real data points
##PAGE= N=1
##DATA TABLE= (X++(R..R)), XYDATA
$$ plain form
0 0 0 0 0 0 0 0 0 0 0 0 0 0 0 0 0 0 0 8 -8 8 -8 8 -8 16 -16 16 -24 24 -26 32 -36 40 -48 53 -58 66 -74 83 -93
39 -93 105 -115 130 -143 158 -175 193 -213 235 -258 286 -313 347 -380 421 -466 515 -573 639 -717
59 -717 809 -921 1056 -1230 1461 -1780 2252 -3026 4508 -8353 41708 74127 -11028 -18880 -44180
74 -44180 -43263 44719 67178 -3145 -21018 -42704 -43531 39940 65979 1753 -20996 -40618 -42785
87 -42785 34832 63861 5414 -20044 -38661 -42368 29175 62685 9673 -20068 -36932 -40403 23560
100 23560 59336 13798 -19006 -36274 -38576 19111 55786 17861 -16993 -35530 -37188 15522
112 15522 52691 20751 -15167 -34676 -35807 12209 49501 23089 -13554 -34236 -34848 9027 46772
125 46772 25593 -11994 -33510 -33400 6370 43267 27382 -9598 -32950 -32494 4655 40428 28303
$$ packed form
0@%%%%%%%%%%%%%%%%%Qj6J6j6J6j6K4l2L2m0M8n0N8o8P6q8J01j11J24j40J57j76
39i3J98k20K45k73L01l33L68m06M48m93N44n99O60p27Q01q87R81j088J212j356
59g17J526j730J977k286K691l241M032n278P534j2861N0061L2419q5155p852k5300
74d4180R17Q7982K2459p0323j7873k1686q27Q3471K6039o4226k2749j9622k167
87d2785P7617K9029n8447k5458j8617l707P1543L3510n3012k9741j6864l471O3963
100B3560L5776m5538l2804j7268k302N7687L6675l7925l4854j8537j658N2710
112A5522L7169l1940l5918j9509j131M8016L7292k6412l6643k0682o12M3875L7745
125D6772k1179l7587k1516J10L9770L6897j5885l6980k3352M56L7149L5773j2125
$$ plain form
138 28303 -7696 -32448 -31656 2946 37709 29306 -5750 -31452 -31205 1446 35437 30191 -3744
151 -3744 -31016 -30603 157 33250 30594 -1958 -29907 -30331 -1296 30652 30666 -180 -29064 -29539
165 -29539 -2113 28726 31025 1577 -28158 -29398 -2890 26530 30495 3190 -27210 -29366 -3894
178 -3894 24787 30505 4835 -26298 -29197 -4837 22982 30245 6590 -24783 -29367 -5605 21482
191 21482 30003 8403 -23637 -29293 -6275 19851 29343 9976 -22438 -29091 -7272 18110 28966
204 28966 11425 -20616 -29048 -8279 16721 28082 12952 -19043 -29118 -8812 15362 27464
216 27464 14107 -17721 -29106 -9911 14294 26841 15109 -16178 -28413 -10644 13073 26068
228 26068 16030 -14868 -28413 -11211 11919 25324 16777 -12832 -28187 -12248 10856 24617
$$ packed form
138B8303l5999k4752P92L4602L4763q403l5056k5702K47L2651L3991n246l3935
151c744k7272M13L0760L3093k656l2552k7949m24K9035L1948J4l0846k8884m75
165b9539K7426L0839K299k9448k9735j240K6508K9420L965k7305l0400k156K5472
178c894K8681N718k5670l1133k899K4360K7819P263k3655l1373m584K3762K7087
191B1482Q521k1600l2040n656K3018K6126R492j9367l2414o653K1819K5382J0856
204B8966j7541l2041q432K0769K5000J1361j5130l1995j0075K0306K4174J2102
216B7464j3357l1828j1385J9195K4205J2547j1732l1287j2235J7769K3717J2995
228B6068j0038l0898j3545J7202K3130J3405q547k9609j5355J5939K3104J3761
$$ plain form
240 24617 17279 -11448 -27910 -13017 9815 23851 17693 -9924 -27237 -13688 9014 22957
252 22957 18444 -8460 -26998 -14342 7944 22435 18863 -7165 -26243 -15069 6820 21444
264 21444 19086 -5855 -25838 -15798 6171 20751 19280 -4378 -24898 -16316 5268 20183 19558
277 19558 -3038 -24080 -17141 4001 19055 19839 -1554 -23474 -17719 3113 18702 19781 -49
290 -49 -21991 -17978 2247 17765 19518 1019 -21198 -18632 1250 16968 19716 2369 -19920
303 -19920 -19022 243 16334 19339 3210 -18867 -19591 -587 15627 19231 3821 -17645 -19625
316 -19625 -1889 14856 19023 4831 -16594 -19970 -2780 14484 18813 5426 -15517 -19754 -3502
329 -3502 13728 18724 6196 -14397 -19777 -4479 13221 18500 6595 -13447 -19649 -5510 12628
$$ packed form
240B4617p338k8727j6462J4893K2832J4036o158k7617j7313J3549K2702J3943
252B2957m513k6904j8538J2656K2286J4491l572k6028j9078J1174K1889J4624
264B1444k358k4941j9983J0040K1969J4580j471k3658k0520Q582K1584J4915o25
277A9558k2596k1042O939K1142J5054P84k1393k1920N755K0832J5589J079j9830
290d9k1942M013K0225J5518J753j8499k2217K566J9882J5718K748j7347k2289
303a9920Q98J9265J6091L005j6129k2077p24J9004J6214L604j5410k1466j980
316a9625J7736J6745M167j4192k1425l376J7190J7264M329j3387k0943m237J6252
329c502J7230M996j2528k0593n380J5298J7700N279j1905k0042o202J4139J8138
$$ plain form
342 12628 18282 7044 -12120 -19869 -6264 12073 18031 7739 -11263 -19305 -7192 11544 17701
355 17701 7797 -10106 -19067 -7857 10703 17889 8508 -9056 -18825 -8534 9632 17601 8562
368 8562 -8321 -18167 -9523 8776 17290 9271 -7122 -18006 -10189 8179 17108 9780 -6339 -17235
382 -17235 -10707 7527 16982 9981 -5570 -17032 -11343 6456 16575 10423 -5013 -16262 -11539
395 -11539 5816 16378 10686 -3883 -15698 -12146 4985 16168 11038 -3345 -15266 -12670 4005
408 4005 15492 11055 -2872 -14562 -12941 3336 15294 11271 -2142 -14073 -13021 2361 15142
421 15142 11484 -1540 -13525 -13334 1439 14732 11917 -1236 -12852 -13496 747 14148 12165
434 12165 -419 -12501 -13548 -164 13569 12333 79 -11910 -13525 -1046 12934 12529 518
$$ packed form
342A2628N654j1238j9164p749J3605J8337N958j0292j9002q042J2113J8736O157
355A7701r904j7903q961J1210J8560P186r381j7564r769J0291J8166P969r039
368H562j6883r846Q644J8299Q514q019j6393j0884P817J8368Q929p328j6119j0896
382a7235O528J8234R455p001j5551j1462N689J7799J0119o152j5436j1249M723
395a1539J7355J0562n692j4569j1815L552J7131J1183n130j4383j1921K596J6675
408D005J1487m437j3927j1690J621J6277J1958m023j3413j1931J052J5382J2781
421A5142l658j3024j1985J91J4773J3293k815j3153j1616o44J4243J3401j983
434A2165j2584j2082j047J3384J3733j236j2254j1989j615J2479J3980m05j2011
$$ plain form
447 518 -11491 -13821 -1669 12541 12955 1349 -10928 -13617 -2171 11985 13129 1909 -10077
460 -10077 -13723 -3231 11472 13322 2425 -9594 -13374 -3782 10622 13159 2982 -9074 -13453
473 -13453 -4545 9789 13249 3591 -8905 -13038 -4996 9235 13383 4111 -8309 -12877 -4949 8248
487 8248 13517 4297 -7782 -12902 -5772 8068 13242 5083 -7318 -12288 -5928 7250 13180 5522
501 5522 -7239 -12512 -6197 6999 13031 5612 -6300 -12385 -6432 6321 12711 6007 -6245 -12351
515 -12351 -6856 5777 12473 6606 -5664 -12111 -6929 5044 12697 6742 -5197 -11825 -7438 4750
529 4750 12314 7064 -4626 -11653 -7599 3943 12018 7445 -4207 -11589 -7729 3700 11423 7957
543 7957 -3693 -11415 -7836 3316 11408 8286 -3115 -11272 -8496 2471 11215 8472 -2404 -10683
$$ packed form
447E18j2009k330J2152J4210M14j1606j2277k689J1446J4156J144j1220j1986
460a0077l646J0492J4703J850j0897j2019l780R592J4404K537j0177j2056m379
473a3453Q908J4334L460r658j2496m133Q042J4231M148r272j2420m568P928J3197
487H248N269r220j2079n120P130J3840N174q159j2401m970O360J3178N930p658
501E522j2761n273O315J3196O032p419j1912o085N953J2753O390o704j2252o106
515a2351N495J2633O696n867j2270o447N182J1973P653n955j1939o628M387J2188
529D750P564n250j1690p027M054J1542Q075m573j1652p382L860J1429P723l466
543G957j1650p722L579J1152Q092l122j1401q157K776J0967Q744k743j0876q279
$$ plain form
557 -10683 -8539 1980 10651 8605 -1953 -10628 -8659 1445 10110 9204 -1453 -10265 -8998 872
571 872 9962 9357 -946 -9784 -9111 428 9513 9428 -514 -9620 -9236 121 9394 9428 195 -9358 -9348
588 -9348 -224 8768 9308 567 -8774 -9686 -839 8509 9523 989 -8453 -9564 -1157 8418 9686 1393
604 1393 -8107 -9667 -1725 8128 9522 1878 -7587 -9644 -2103 7526 9601 2197 -7318 -9711 -2762
619 -2762 7348 9630 2699 -6802 -9775 -2978 6634 9478 2659 -6587 -9690 -3282 6497 9765 3204
634 3204 -6012 -9682 -3497 6327 9785 3620 -5917 -9561 -4143 5665 9661 3730 -5549 -9305 -4238
649 -4238 5441 9334 4070 -4803 -9405 -4998 4961 9306 4268 -4603 -9065 -4948 4331 9327 4610
664 4610 -4297 -8993 -5326 4023 9085 4831 -3748 -8706 -5330 3669 9251 4867 -3283 -8451 -5835
$$ packed form
557a0683K144J0519Q671k046j0558q675J969J0104Q665r06j0657q812J267R870
571H72R090o05j0303q838O73R539R085q5r942r106L84R357R273L4r233r553J0
588i348R124Q992N40q741r341r12Q847R348J014q534r442j111Q407R575J268q293
604A393r500j560P942R853J394p644r465k057P541R629K075p404r515k393O949
619b762J0110K282o931r501k973O797R612K844o819r246l103O408R779L268o561
634C204r216l670O185R824L458o165r537l644N418R808L996n931r279l756N067
649d238R679L893n264q873m602M407R959M345n038q871m462M117R279M996m717
664D610q907m696L667R349N062m254q579m958L376Q999N582m384q150n168K616
$$ plain form
679 -5835 3134 9174 5150 -3188 -8353 -5960 3003 8832 5379 -2901 -7922 -6142 2398 8634 5751
694 5751 -2471 -7964 -6093 1908 8359 6241 -2035 -7696 -6596 1570 8207 6243 -1933 -7709 -6465
709 -6465 1200 8183 6528 -1617 -7427 -6469 714 7851 6630 -1020 -7334 -6409 442 7419 6468 -698
725 -698 -6917 -6616 -4 7388 7015 -601 -6759 -6662 -280 7093 6906 -20 -6621 -6897 -840 6651 7311
742 7311 242 -6510 -6666 -838 6429 7305 389 -6210 -6881 -1175 6136 7517 947 -5873 -6929 -1717
758 -1717 5783 7464 1033 -5882 -6702 -1841 5261 7538 1521 -5568 -6716 -1886 5073 7603 1806
773 1806 -5474 -6917 -2203 4994 7489 2198 -5050 -6836 -2298 4337 7446 2346 -4950 -6995 -2613
788 -2613 4293 7234 2932 -4523 -6728 -2789 3824 7307 3186 -4201 -6655 -2893 3491 7246 3478
$$ packed form
679e835Q969O040m024q338n165K393Q963N829l453q280n021J780Q540O236k883
694E751q222n493J871Q001O451k118q276n661J100Q166O637j964q176n776J244
709f465P665O983j655q145n810R58P183P137j221p650o314R25O851O977r51p166
725f98o219L01O612P392l73p616o158R7O382P373j87o926o601k76O057P491O60
742G311p069o752j56N828P267Q76o916o599o71N706P311J381o570o820j056N212
758a717P500J681o431o915q20M861P102K277o017p089j148M830O959K530n797
773A806p280j443M714P197K495n291p248j786M538O635L109n100p296k045M382
788b613O906K941m302p455k205L939O613L483m121p387k454L762O384L755l768
$$ plain form
803 3478 -4146 -6882 -3203 3106 6963 3828 -3895 -6750 -3290 2978 6854 4017 -3543 -6826 -3490
818 -3490 2568 6760 4274 -2998 -6622 -3718 1951 6462 4582 -2683 -6647 -3995 1838 6227 4658
833 4658 -2353 -6798 -4079 1682 6107 5002 -1969 -6272 -4102 1530 6112 4941 -1385 -6459 -4491
848 -4491 1372 5954 4838 -1231 -6363 -4259 1138 5183 5159 -1048 -6135 -4502 737 5195 5369 -595
864 -595 -6137 -4786 635 5207 5223 -384 -5771 -4910 691 5029 5173 -24 -5791 -5033 375 4820 5143
881 5143 268 -5450 -5111 245 4564 5439 682 -5324 -5261 -171 4415 5248 889 -4975 -5479 -377 4247
898 4247 5259 1117 -4963 -5452 -474 4090 5354 1464 -4619 -5505 -649 4014 4954 1569 -3959 -5756
914 -5756 -912 3833 4805 1833 -3858 -5481 -1083 3963 4887 2100 -3640 -5666 -1553 3444 5062 2076
$$ packed form
803C478p624k736L679O309L857l135p723k855L460O268L876k837p560l283L336
818c490O058M192k486p272l624K904N669M511j880p265l964K652N833M389j569
833D658p011m445K719N761M425j105o971m303K170N632M582j171o326n074J968
848d491N863M582j116o069n132K104N397M045k4o207n087J633N239M458J74n964
864e95n542J351N421M572J6n607n387Q61N601M338J44n197n767P58N408M445L23
881E143m875n718L39N356M319Q75m757o006O3N090M586Q33m359n864n04N102M624
898D247J012m142o080m89M978M564J264l890o083q86M856M663R40l385n528j797
914e756M844M745R72k972n691j623M398N046R24k787n740k026M113M997J618k986
$$ plain form
930 2076 -3320 -5555 -1575 3505 5175 2453 -3347 -5843 -1761 3071 4858 2388 -2984 -5764 -2149
945 -2149 3233 4872 2877 -2505 -5656 -2450 2953 4753 2659 -2413 -5511 -2542 2713 4895 2888
960 2888 -2054 -5150 -2681 2681 4853 2985 -1855 -5276 -2983 2453 4742 2694 -1770 -5172 -3108
975 -3108 2098 4677 2938 -1464 -5218 -3352 2052 4628 3047 -1121 -4894 -3479 1681 4643 3188
990 3188 -1027 -4903 -3745 1697 4572 3058 -771 -4462 -3834 973 4624 3187 -659 -4084 -3991 1305
1006 1305 4519 3570 -224 -4158 -4172 753 4601 3423 -168 -4060 -4090 428 4108 3454 144 -3716
1022 -3716 -4256 296 4129 3423 -130 -3664 -4130 -143 4006 3359 273 -3229 -4182 -269 3882 3490
1038 3490 173 -3460 -3978 -420 3796 4065 355 -3074 -4263 -646 3976 3763 559 -3209 -4152 -1161
$$ packed form
930B076n396k235L980N080J670k722n800k496M082M832J787k470n372k780L615
945b149N382J639j995n382l151L206N403J800k094n072l098K969N255K182k007
960B888m942l096K469N362K172j868m840l421K293N436K289k048m464l402K064
975c108N206K579j739m402l754J866N404K576j581m168l773J415N160K962j455
990C188m215l876J158N442K875j514l829l691O28M807L651j437l846l425R3N296
1006A305L214r49l794l934j4M925L848j178l591l892l0M518L680o54l310l860
1022c716n40M552L833p06l553l534m66L987M149o47l086l502r53L913M151l92
1038C490l317l633n18L558M216K69l710l429j189L617M622k13l204l768r43K991
$$ plain form
1054 -1161 3425 3954 513 -2798 -4290 -1103 3339 4008 689 -2826 -3904 -1210 3374 4141 950 -2648
1070 -2648 -3991 -1696 3155 3960 1003 -2365 -3751 -1490 2807 4082 963 -2510 -3806 -1792 2646
1085 2646 4096 1094 -2259 -3797 -1910 2500 4120 1469 -1925 -3849 -2042 2371 4349 1454 -2168
1100 -2168 -3699 -2157 2061 3874 1834 -2060 -3682 -2302 1910 4296 1945 -2065 -3652 -2287 1613
1115 1613 4177 1836 -1789 -3561 -2525 1292 4127 1970 -1868 -3518 -2292 1238 4157 2172 -1618
1130 -1618 -3579 -2470 1344 3970 2325 -1318 -3326 -2440 739 3852 2564 -1372 -3484 -2678 777
1145 777 3423 2508 -1029 -3210 -2627 590 3568 2864 -1045 -3711 -2736 428 3324 2751 -912 -3310
1161 -3310 -2493 223 3263 3193 -712 -3449 -2495 374 3108 2891 -555 -3061 -2654 -43 2876 3048 -96
$$ packed form
1054a161M586N29l441l311j492L187M442O69l319l515j078K694M584P67l191l598
1070b648j343K295M851Q05k957l368j386K261M297J275l119l473j296K014M438
1085B646J450l002l353j538J887M410J620k651l394j924J807M413J978k895l622
1100b168j531J542M218J813k040l894j622J380M212K386k351m010j587J365L900
1115A613K564k341l625j772J036L817K835k157l838j650J226L530K919j985l790
1130a618j961J109L814K626j645l643k008Q86L179L113j288l936k112Q06L455
1145G77K646r15l537k181N83L217K978p04l909k666R75L164K896n73l663k398
1161c310Q17K716L040p0l905k737R54K869K734k17l446k506M07K611K919J72l144
$$ plain form
1178 -96 -2989 -2653 -120 2761 3014 -372 -3154 -2986 -400 2918 3276 126 -2875 -2725 -536 2864 3311
1195 3311 185 -2827 -2960 -413 2708 3091 412 -2672 -2852 -242 2482 3267 385 -2697 -2825 -588
1211 -588 2135 3186 681 -2898 -2997 -473 2132 3444 860 -2591 -3140 -766 2169 2948 953 -2363
1227 -2363 -3149 -898 1866 3219 1388 -2148 -3168 -862 1550 3182 1001 -2005 -3160 -1014 1786
1242 1786 2982 1448 -1838 -3021 -1266 1599 3077 1412 -1765 -3052 -1072 1353 3174 1580 -1612
1257 -1612 -3249 -1263 1440 2950 1651 -1613 -3152 -1474 1353 2950 1718 -1362 -3007 -1373 1216
1272 1216 2864 1798 -1365 -3079 -1630 980 2729 2012 -1047 -3001 -1598 1084 2434 1966 -933
1287 -933 -3007 -1879 1160 2567 1978 -847 -2975 -1793 568 2475 2084 -696 -2794 -1557 860 2554
$$ packed form
1178i6k893L36K533K881K53l386k782J68K586L318L58l150l001J50K189L400M47
1195C311l126l012j33K547L121L83k679l084j80K610K724P85k882l082j28K237
1211e88K723J051k505l579r9K524K605J312k584l451n49K374K935P79j995l316
1227b363p86K251K764J353j831l536j020K306K412J632k181l006j155K146K800
1242A786J196j534l286j183J755K865J478j665l177j287J980K425J821j594l192
1257a612j637J986K703J510j299l264j539J678K827J597j232l080j645J634K589
1272A216J648j066l163j714J449K610J749p17l059j954J403K682J350m68k899
1287i33k074J128L039J407n89k825k128J182K361J907l91k780k098J237K417J694
$$ plain form
1303 2554 2066 -362 -2595 -1953 606 2318 2099 -370 -2441 -2096 251 2631 2044 -196 -2502 -2269
1319 -2269 275 2185 2147 -166 -2492 -2366 336 2371 2158 -183 -2461 -2275 389 2264 2225 -116 -2348
1336 -2348 -2421 -32 2155 2370 13 -2316 -2497 73 2287 2292 239 -2118 -2579 -107 2221 2371 330
1353 330 -1950 -2658 -337 2031 2128 507 -1922 -2426 -344 1851 2484 511 -1771 -2390 -531 1877 2307
1370 2307 614 -2098 -2654 -484 1847 2388 692 -1669 -2303 -782 1592 2180 665 -1558 -2285 -1113
1386 -1113 1643 2264 788 -1341 -2531 -1058 1827 2558 1065 -1337 -2172 -896 1365 2222 1060 -1279
1402 -1279 -2205 -979 1261 2144 1059 -1081 -2032 -1008 1014 2016 771 -975 -2270 -1170 1331 1979
1418 1979 1070 -879 -2090 -1482 914 2286 1048 -799 -2150 -1314 772 2268 1256 -890 -2071 -1398
$$ packed form
1303B554m88k428k233O42K559J712k19k469k071L45K347K380n87k240k306K33
1319b269K544J910l8k313k326J26K702K035k13k341k278J86K664J875l9k341k232
1336b348p3K389K187K15k357k329j81K570K214Nk053k357m61K472K328J50k041
1353C30k280p08K321K368R7j621k429n04K082K195O33j973k282o19J859K408M30
1370B307j693k712n56K170K331N41j696k361o34J521K374N88j515k223p27J172
1386a113K756O21j476k129j190J473K885P31j493k402q35J276K261Q57j162k339
1402a279r26J226K240Q83j085k140r51J024K022J002j245j746j295J100K501O48
1418A979r09j949j211O08K396J372j238j847j351Q36K086J496j012k146j181O73
$$ plain form
1434 -1398 1024 2169 1361 -738 -1986 -1425 557 2094 1422 -698 -2054 -1589 748 2096 1292 -472
1450 -472 -1998 -1560 456 2031 1739 -735 -1931 -1526 573 2093 1610 -406 -1991 -1468 65 1954
1466 1954 1510 -246 -1819 -1754 348 2057 1867 -294 -1758 -1719 49 1789 1806 -263 -1528 -1514 -83
1483 -83 1834 1676 -215 -1650 -1672 116 1735 1686 196 -1708 -1617 -90 1456 1707 27 -1715 -1848 -293
1501 -293 1667 1744 281 -1409 -1909 -358 1433 1890 396 -1470 -1914 -463 1581 2062 317 -1444 -1939
1518 -1939 -394 1369 1919 384 -1302 -1811 -345 1263 1970 458 -1298 -1746 -559 1337 1983 536
1534 536 -1242 -1725 -459 953 1788 591 -1041 -1709 -677 1124 1848 828 -1031 -1885 -913 1239 1866
1551 1866 573 -1188 -1818 -932 894 1897 898 -867 -1756 -1112 940 1836 889 -834 -1826 -1140 836
$$ packed form
1434a398K422J145q08k099j248N61J982J537o72k120j356M65K337J348q04j764
1450d72j526M38K016J575k92k474j196M05K099J520m83k016j585N23J533J889
1466A954m44j756j573O5K102J709j90k161j464L9J768J740J7k069j265J4J431
1483h3J917j58j891j435k2J788J619m9j490j904R1J527J546K51j680j742j33J555
1501b93J960P7j463j690n00J551J791M57j494j866m44J451K044M81j745j761m95
1518a939J545J763N50j535j686n09J466J608P07j512j756m48J187J896O46j447
1534E36j778m83J266J412Q35j197j632o68J032J801P24j020j859q54R72K152O27
1551A866j293j761o30Q86J826J003r99j765q89O44K052Q96r47j723r92O86J976
$$ plain form
1568 836 1827 714 -567 -1650 -989 896 1723 807 -727 -1717 -1028 610 1653 1012 -720 -1727 -1219
1585 -1219 655 1765 913 -515 -1574 -1183 480 1816 961 -659 -1852 -1017 191 1717 1197 -398
1601 -398 -1522 -1409 372 1557 1249 -181 -1419 -1369 532 1675 874 -420 -1305 -1315 437 1823 1200
1618 1200 -271 -1651 -1377 195 1587 1192 -139 -1411 -1366 30 1542 1261 -28 -1428 -1245 -50
1634 -50 1356 1569 213 -1440 -1507 136 1487 1545 -200 -1394 -1283 -386 1246 1169 -219 -1330 -1137 -28
1652 -28 1298 1689 331 -1158 -1370 -185 1597 1187 242 -1199 -1472 -197 1244 1796 448 -1163 -1485
1669 -1485 -292 1148 1641 489 -857 -1594 -273 1300 1495 228 -1094 -1522 -414 863 1268 288
1685 288 -844 -1356 -623 778 1518 344 -923 -1307 -455 810 1458 612 -970 -1277 -408 620 1375 520
$$ packed form
1568H36R91j113j281j083O61J885Q27r16j534r90O89J638J043o41j732j007N08
1585a219J874J110q52j428j059L91J663J336q55j620j193Q35J208J526n20j595
1601c98j124J13J781J185l08j430j238N0J901J143q01j294q85j0J752J386o23
1618A200j471j380K74J572J392l95j331j272M5J396J512k81j289j400J83J195
1634e0J406K13j356j653o7J643J351N8j745j194J11Q97J632p7j388j111J93J109
1652b8J326L91j358j489k12J185J782m10r45j441k73J275J441N52j348j611l22
1669a485J193J440M93j152j346p37J321J573J95j267j322m28J108J277M05r80
1685B88j132n12P33J401P40j174j267l84Q52J265O48q46j582l07Q69J028P55q55
$$ plain form
1703 520 -629 -1385 -678 595 1576 763 -660 -1618 -700 703 1433 799 -814 -1381 -755 835 1416 821
1721 821 -564 -1184 -774 662 1338 643 -440 -1454 -830 557 1504 834 -786 -1062 -800 436 1292 763
1739 763 -549 -1495 -766 266 1564 711 -310 -1374 -1118 167 1446 1190 -416 -1237 -1064 157 1309
1756 1309 961 -216 -1218 -1017 134 1048 1182 -32 -1249 -1093 266 1196 749 -263 -1210 -1034 231
1773 231 1008 1102 -486 -1179 -1011 -71 1005 805 -270 -1018 -1247 161 1157 996 -69 -1243 -1011 -125
1791 -125 923 926 -75 -1156 -1040 17 1103 1128 132 -1140 -941 -71 791 1203 33 -943 -988 -280 826
1810 826 1401 250 -657 -897 -159 768 974 365 -855 -1372 -369 763 1113 310 -692 -1051 -58 650
1828 650 897 329 -598 -1066 -353 669 942 543 -590 -953 -369 935 1207 379 -536 -1064 -456 689 926
$$ packed form
1703E20j149p56P07J273R81q13j423r58R18J403P30o34j613n67O26J590N81n95
1721H21j385o20M10J436O76o95j083j014O24J387R47o70j620k76K62J236Q56n29
1739G63j312r46P29J032J298q53j021j064K56J285J279k56j606q21J73J221J152
1756A309l48j177j002K01J151R14J34j214j217J56J359R30m47j012r47J76J265
1773B31P77R4j588o93J68R40J076k00j075p48k29J408R96j61j065j174K32Q86
1791a25J048Lj001j081J16J057J086K5r96j272J99Q70Q62M12j170r76m5P08J106
1810H26N75j151r07k40P38R27K06o09j220n17J003J132L50q03j002l59R93P08
1828F50K47n68r27m68P13J022K73l99j133l63N84J304K72q28r15n28O08J145K37
$$ plain form
1847 926 416 -635 -888 -389 508 893 514 -638 -999 -623 496 786 456 -705 -927 -437 482 1013 501
1866 501 -622 -1190 -656 423 939 682 -495 -1101 -586 434 832 569 -334 -1150 -430 202 914 692 -463
1885 -463 -905 -564 373 982 632 -204 -1012 -672 187 844 635 -170 -972 -783 213 1049 813 -408 -1091 -777
1905 -777 476 832 616 -156 -1026 -944 80 1017 796 -81 -1034 -852 215 1061 747 -125 -951 -496 215
1924 215 670 970 -58 -1016 -854 87 863 806 108 -659 -1019 178 786 478 37 -847 -530 339 579 692
1944 692 76 -677 -660 -92 807 778 -53 -631 -543 128 722 799 -44 -782 -646 -311 868 777 21 -573 -951
1965 -951 -112 692 875 363 -757 -912 51 701 911 316 -421 -525 -154 347 1153 153 -568 -940 -10
1984 -10 554 709 187 -402 -710 -524 586 504 322 -412 -625 -526 683 632 168 -551 -691 -301 555 775 89
$$ packed form
1847I26n10j051k53M99Q97L85l79j152l61L76J119K90l30j161k22M90R19N31n12
1866E01j123n68N34J079N16k57j177o06N15J020L98k63r03q16P20O32P12k22j155
1885d63m42L41R37O09l50q36q08L40Q59O57k09q05q02J89R96Q36k36j221o83L14
1905g77J253L56k16p72q70Q2J024R37k21q77r53J82J067Q46l14q72q26M55P11
1924B15M55L00j028r58J62R41P76n7o98p67l60J197O08l08m41q84L17Q69K40J13
1944F92o16p53J7N68Q99k9q31n78Q8O71N94P7q43p38J36L35J179r1p56n94l78
1965i51Q39Q04J83n12j120j55R63O50K10n95p37j04L71N01Q06j000p21l72R30
1984a0N64J55n22n89l08J86J110q2j82p34k13R9J209n1m64p19j40L90Q56K20o86
$$ plain form
2005 89 -271 -786 -453 562 604 473 -172 -841 -447 346 873 433 -283 -860 -681 280 517 474 -234 -683 -411
2026 -411 486 806 295 -327 -752 -707 546 542 470 -161 -652 -268 398 375 373 -160 -338 -495 183 855 531 -262
2048 -262 -666 -710 36 586 523 -7 -900 -664 24 704 535 -51 -713 -496 245 539 598 31 -490 -430 -12
2069 -12 580 376 -7 -635 -525 -1 820 345 -115 -571 -509 249 635 473 214 -611 -419 60 559 654 -99
2090 -99 -490 -336 -69 504 362 -92 -466 -484 20 347 349 132 -464 -566 -57 471 645 165 -563 -452 154
2111 154 604 598 -37 -424 -540 -92 376 440 9 -443 -323 -19 316 572 -37 -631 -294 -109 320 620 -39
2132 -39 -293 -432 -84 212 648 95 -167 -409 -143 343 719 153 -301 -535 -159 462 365 100 -488 -578 -214
2153 -214 364 298 123 -316 -401 -380 374 471 144 -232 -488 -99 233 475 387 -85 -538 -57 270 446 200 -367
$$ packed form
2005H9l60n15L33J015M2j31o45o69L94P93N27m40p16n77J79R61K37m3p08m49K72
2026d11Q97L20n11o22m25M5J253mp2o31m91L84O66k3kn33j78j57O78O72l24p93
2048b62m04m4P46N50o3n30q93K36O88O80j69n86o62K17P41K94N9n67n21O0M18
2069a2N92k04l83o28J10N24Q21m75m60m56O2P58L86j62k59q25J92M79M99R5p53
2090i9l91J54K67N73j42m54l74j8N04L27Kk17n96j02N09N28J74m80p28J11O06
2111A54M50oo35l87j16M48M68O4m31m52J20L04L35K56o09n94L37J85M29L00o59
2132c9k54j39L48K96M36n53k62k42K66M86L76n66m54k34L76O21r7k65n88r0L64
2153b14N78o6j75m39q5K1P54R7l27l76k56L89L32K42q8m72m53M81L27J76k46n67
$$ plain form
2175 -367 -298 -179 338 595 478 -84 -545 -483 108 373 221 -84 -248 -285 212 554 188 26 -511 -293 107
2196 107 527 316 32 -286 -203 280 534 160 -29 -479 -252 354 342 644 103 -394 -287 114 301 212 -185
2217 -185 -185 -455 32 231 197 -40 -185 -317 20 565 549 -215 -473 -261 140 316 439 -18 -281 -211 133 296
2239 296 354 39 -501 -67 194 286 367 -67 -127 -60 37 353 202 -87 -304 -272 -218 329 324 0 -182 -302 9
2262 9 95 266 -21 -372 -230 114 313 320 119 -168 -374 3 117 333 -39 -209 -181 -270 200 539 108 -199
2284 -199 -90 -248 459 228 176 -344 -171 -46 184 580 221 -348 -244 -87 153 -33 19 -77 -86 -69 360 395
2306 395 23 -138 -255 -218 78 222 323 -151 -423 -96 -40 113 217 -277 -307 -190 -63 483 125 16 87
2327 87 -180 122 115 3 -403 -127 -194 156 237 26 143 -140 -58 194 119 103 -35 -216 -215 237 31 1 -48 -246
$$ packed form
2175c67O9J19N17K57j17n62m61O2N91K65j52l05j64l7M97L42l66j62n37K18M00
2196A07M20k11k84l18Q3M83K54l74j89m50K27O06j2L02n41m97J07M01J87q9l97
2217a85%k70M87J99l4k37j45j32L37N45j6p64k58K12M01J76J23m57k63P0L44J63
2239B96N8l15n40M34K61R2Q1m34o0O7R7L16j51k89k17L2N4N47nl24j82j20L11
2262IQ6J71k87l51J42L44J99Pk01k87k06L77J14K16l72j70K8q9M70L39m31l07
2284a99J09j58P07k31n2n20J73J25K30L96l59n69J04J57K40j86N2r6rJ7M29L5
2306C95l72j61j17L7K96J44J01m74k72L27N6J53J04m94l0J17J27N46l58j09P1
2327H7k67L02pj12m06K76o7L50Q1k11J17k83Q2K52p5j6j38j81JM52k06l0m9j98
$$ plain form
2351 -246 -316 31 258 293 -59 -181 -59 111 134 243 -198 -155 -126 -57 149 -2 114 -464 -326 344 29 129
2373 129 45 -419 101 197 160 32 -54 -45 -53 121 -30 166 236 -298 -24 13 -120 206 -128 -100 131 25 131 -177
2397 -177 104 -129 -439 -146 131 50 -3 -220 -201 73 253 19 -10 44 147 38 337 56 272 -122 -3 -162
2419 -162 214 105 -26 41 -97 82 200 46 -106 -163 0 -28 301 318 -44 -114 -161 -215 -80 209 71 51 -92
2442 -92 460 -55 15 230 -55 68 -166 -183 -5 239 -375 33 -106 80 -66 0 -329 -276 -39 100 77 -260
2464 -260 19 -94 -158 -21 2 216 -114 -353 200 79 107 102 -37 -32 -139 42 79 71 -200 -169 -166 319 113 -70
2488 -70 -325 59 -211 -43 153 98 -79 -70 -146 51 74 241 -90 -74 141 26 -70 -111 -73 -154 -55 210 76 -11
2512 -11 -180 -2 140 32 -53 70 -67 -281 -72 -205 156 93 287 -329 -107 319 -243 -251 98 -183 146 243
$$ packed form
2351b46p0L47K27L5l52j22J22J70K3J09m41M3K9O9K06j51J16n78J38O70l15J00
2373A29q4m64N20R6l7j28q6RqJ74j51J96P0n34K74L7j33L26l34K8K31j06J06l08
2397a77K81k33l10K93K77q1n3k17J9K74J80k34k9N4J03j09K99k81K16l94J19j59
2419a62L76j09j31O7j38J79J18j54j52n7J63k8L29J7l62p0m7n4J35K89j38k0j43
2442i2N52n15P0K15k85J23k34j7J78K44o14M08j39J86j46O6l29N3K37J39k3l37
2464b60K79j13o4J37K3K14l30k39N53j21K8nj39Nj07J81L7qk71L1LM85k06j83
2488g0k55L84k70J68J96n5j77Rp6J97K3J67l31J6K15j15r6m1L8q1R9K65j34q7
2512a1j69J78J42j08q5J23j37k14K09j33L61o3J94o16K22M26n62qL49k81L29R7
$$ plain form
2534 243 60 61 141 -54 98 193 92 68 69 -130 151 -74 192 211 -38 44 -273 -30 -130 76 -101 122 -68
2557 -68 121 19 196 97 52 -93 162 131 -121 86 -97 57 -120 -26 79 -323 113 167 8 -86 -111 70 -79
2580 -79 171 121 38 144 208 141 80 47 100 252 270 -339 -263 180 160 -5 -132 -58 -34 24 -294 -14 -19 -93 -24 94
2606 94 -209 -200 -224 -116 76 -190 124 21 -78 54 135 30 128 -48 -93 -173 228 -16 -78 -13 -292 3 -9 -94
2630 -94 -158 28 -146 83 17 30 18 -7 7 -43 94 -27 273 -106 138 6 61 226 45 -98 -255 319 40
2653 40 269 -4 -218 203 -113 3 262 -2 -295 -54 213 126 208 73 3 -39 69 1 48 105 -64 4 -18
2676 -18 -29 -47 38 -157 -169 -112 82 120 -11 -62 -103 -219 147 105 -65 -153 -72 33 -142 341 61 74 114 -40 -16
2701 -16 -13 -125 -30 -13 21 -97 -142 -104 -7 -326 -79 -88 128 -42 34 -84 -98 30 -57 102 -206 -195 -182 14 -158
$$ packed form
2534B43j83JQ0j95J52R5j01k4Jj99K81k25K66J9k49Q2l17K43j00K06j77K23j90
2557f8J89j02J77r9m5j45K55l1k52K07j83J54j77R4J05m02M36N4j59r4k5J81j49
2580g9K50n0q3J06O4o7o1l3N3J52J8o09P6M43k0j65j27P4K4N8l18K80np4O9J18
2606I4l03Rk4J08J92k66L14j03r9J32Q1j05R8j76m5q0M01k44o2O5k79K95j2q5
2630i4o4J86j74K29o6J3j2k5J4n0J37j21L00l79K44j32N5J65j81j43j57N74k79
2653D0K29k73k14M21l16J16K59k64k93K41K67q7Q2j35p0m2J08o8M7N7j69O8k2
2676a8j1j8Q5j95j2N7J94L8j31n1m1j16L66m2j70q8Q1J05j75M83k80J3M0j54K4
2701a6Lj12R5J7L4j18m5L8R7l19K47rK16j70P6j18j4J28q7J59l08J1J3J96j72
$$ plain form
2726 -158 -48 258 18 -175 -55 123 172 320 36 -10 57 -81 -9 -266 20 137 -123 11 -38 -188 -183 -379
2748 -379 180 119 -55 79 -183 -46 65 35 154 -26 -159 -148 18 330 -48 105 -141 86 -110 317 356
2769 356 40 -195 -95 112 164 -85 113 -325 -174 164 59 9 29 -242 94 -45 118 128 102 -167 -53 52
2791 52 118 33 -4 59 -103 -183 -101 -45 71 -146 17 -72 104 160 95 -110 -198 -165 6 211 -171 -59 -183 101
2815 101 -4 80 -158 -162 -280 -40 77 -85 -85 -101 -18 311 52 85 169 38 -161 47 168 145 -118 -17 -260
2838 -260 89 -140 -3 6 -202 -109 182 74 153 340 -160 -33 269 140 234 -15 41 -241 -174 319 157 119 -76
2861 -76 -179 122 66 75 213 -123 -179 14 162 130 211 -56 -15 -114 98 -51 178 -95 -37 -124 -29 -12 164 -16
2885 -16 -100 0 91 244 145 244 -69 -9 75 215 156 -56 -5 103 58 87 -231 -89 -221 76 -52 171 12 -122
$$ packed form
2726a58J10L06k40j93J20J78M9J48k84m6O7j38P2k57K86J17k60J34m9j50Nj96
2748c79N59o1j74J34k62J37J11l0J19j80j33J1J66L12l78J53k46K27j96M27L9
2769C56l16k35J00K07N2k49J98m38J51L38j05n0K0k71L36j39J63J0k6k69J14J05
2791E2O6q5l7O3j62q0Q2N6J16k17J63q9J76N6o5k05q8L3J71K05l82J12j24K84
2815A01j05Q4k38mj18K40J17j62%j6Q3L29k59L3Q4j31j99K08J21k3k63J01k43
2838b60L49k29J37Rk08R3K91j08P9J87n00J27L02j29R4k49N6k82O7M93j62l8j95
2861g6j03L01n6RJ38l36n6J93J48l2Q1k67M1r9K12j49K29k73N8q7R5J7J76j80
2885a6q4J00R1J53r9R9l13O0Q4J40n9k12N1J08m5K9l18J42j32K97j28K23j59j34
$$ plain form
2909 -122 -299 104 -26 145 96 -208 24 -138 328 103 -93 -23 -43 12 114 258 178 -61 -237 -270 -51 124
2931 124 162 146 -268 -257 139 356 18 -209 -323 -123 -186 169 252 -111 -275 27 41 186 140 -186 -32 -243
2953 -243 149 349 191 -23 -39 -23 -23 67 45 -218 -12 -57 191 370 303 41 -154 -144 -4 197 232 -26 -332
2976 -332 -310 57 53 272 -16 -304 -244 -91 411 217 141 -94 -64 -15 43 -73 94 -129 -418 8 42 195 3
2999 3 -161 -386 93 143 175 -227 -327 -107 -518 160 377 -280 227 -309 -159 259 338 -93 -251 -302 21 -74
3021 -74 350 -152 -86 -169 31 92 30 -32 -254 -364 -109 56 316 141 47 -250 -310 292 1 38 -73 -263 -221
3044 -221 -49 179 56 -172 -388 -287 68 288 217 -106 -269 72 147 268 26 -75 -391 14 355 187 16
3065 16 -195 -80 -29 84 338 -44 -158 -35 24 79 92 409 -96 -273 -68 147 -42 -94 -265 -330 -55 3 303
$$ packed form
2909a22j77M03j30J71m9l04K32j62M66k25j96P0k0N5J02J44q0k39j76l3K19J75
2931A24L8j6m14J1L96K17l38k27j14K00o3L55Q3l63j64L02J4J45m6l26J54k11
2953b43L92K00j58k14j6J6%R0k2k63K06m5K48J79o7k62j95J0J40K01L5k58l06
2976c32K2L67mK19k88k88O0J53N02j94p6k35L0M9N8j16J67k23k89M26L4J53j92
2999Cj64k25M79N0L2m02j00K20m11O78K17o57N07n36J50M18P9m31j58n1L23r5
3021g4M24n02O6q3K00O1o2o2k22j10K55J65K60j75r4k97o0O02k91L7j11j90M2
3044b21J72K28j23k28k16J01L55K20p1l23j63L41P5J21k42j01l16M05L41j68j71
3065A6k11J15N1J13K54l82j14J23N9N5J3L17n05j77K05K15j89n2j71o5K75N8L00
$$ plain form
3088 303 9 -6 -199 -139 238 303 141 0 -399 -108 122 0 81 -185 -65 -422 2 197 353 -227 -251 -131
3110 -131 -155 416 58 213 -271 -203 -92 286 149 -93 -176 120 -64 321 317 119 -224 -49 -158 333 141 66
3132 66 -217 -223 111 182 169 -126 -303 -184 -59 82 411 258 -180 -566 -138 166 -96 117 -155 -283 36 29
3154 29 136 89 153 -293 -81 286 165 268 -195 -250 78 -86 375 68 -239 7 133 -111 391 421 -104 -198
3176 -198 -7 -52 207 -100 -110 -207 39 234 159 149 -228 -239 -376 63 321 270 266 -275 61 -130 -10 272 -162
3199 -162 -227 -146 -122 169 123 -69 -290 -293 -261 256 86 -139 -424 -317 100 352 0 -98 -439 -108 -93 431 169
3222 169 -206 -97 -289 128 407 208 -164 -330 -217 -66 -100 237 54 141 -23 -136 130 11 37 -472 -104
3243 -104 179 138 169 -64 -166 -247 5 380 -16 -13 -176 -92 -1 -121 257 -57 -98 -257 57 122 393 1 -78
$$ packed form
3088C03k94j5j93O0L77O5j62j41l99K91K30j22Q1k66J20l57M24J95J56n80k4J20
3110a31k4N71l58J55m84O8J11L78j37k42q3K96j84L85mj98l43J75j09M91j92p5
3132F6k83oL34P1j3k95j77J19J25J41L29j53m38l86M28L04k62K13k72j28L19p
3154B9J07m7O4m46K12L67j21J03m63n5L28j64M61l07l07K46J26k44N02L0n25r4
3176a98J91m5K59l07j0r7K46J95p5j0l77j1j37M39K58n1mn41L36j91J20K82m34
3199a62o5Q1K4K91m6j92k21lL2N17j70k25k85J07M17K52l52r8l41L31J5N24k62
3222A69l75J09j92M17K79j99l72j66J13J51l4L37j83Q7j64j13K66j19K6n09L68
3243a04K83m1L1k33j02q1K52L75l96Lj63Q4R1j20L78l14m1j59L14O5K71l92p9
$$ plain form
3266 -78 -193 77 300 288 58 -424 -257 42 365 246 -127 -257 74 161 158 160 59 -267 -241 147 224 303 -135
3289 -135 -75 -50 -309 107 217 241 -290 -76 185 118 310 22 -212 -326 65 152 210 -18 160 -186 -34 194
3311 194 280 186 -104 -157 -198 246 212 298 -70 -422 -137 215 192 136 -189 -182 -98 205 314 -152 -202 -176 -121 253 107
3336 107 246 29 -115 -90 202 101 164 -9 13 -104 310 288 201 -6 -180 -123 -68 309 320 4 -178 -235 -237 229
3360 229 26 -122 68 -326 140 156 123 -194 -203 -260 -98 358 109 18 -149 -139 133 250 322 -12 -243 -123 240
3383 240 298 -109 -119 -120 -151 25 305 112 73 -485 -192 91 305 190 -77 -124 -90 16 259 95 -219 -180 -555
3406 -555 -264 323 315 99 -227 -45 -132 33 278 8 -230 -256 -209 342 390 -104 12 -94 41 168 338 -35
3428 -35 -444 -308 -370 40 32 284 -206 -360 75 108 189 -33 -407 -87 -5 247 216 142 -145 132 31 323 9
$$ packed form
3266g8j15K70K23j2k30m82J67K99L23j19l73j30L31Q7lKj01l26K6L88P7P9m38
3289a35O0K5k59M16J10K4n31K14K61o7J92k88k34j14L91Q7N8k28J78l46J52K28
3311A94Q6r4k90n3m1M44l4Q6l68l52K85L52k3n6l25PQ4L03J09m66n0K6N5L74j46
3336A07J39k17j44K5K92j01O3j73K2j17M14k2q7k07j74N7N5L77J1l16j82n7kM66
3360B29k03j48J90l94M66J6l3l17rn7J62M56k49r1j67J0K72J17P2l34k31J20L63
3383B40N8m07j0jl1J76K80j93l9n58K93K83K14j15k67m7L4J06K43j64l14L9l75
3406e55K91N87qk16l26J82q7J65K45k70k38k6M7N51M8m94J16j06J35J27J70l73
3428c5m09J36o2M10qK52m90j54M35L3Q1k22l74L20Q2K52l1p4k87K77j01K92l14
$$ plain form
3451 9 -21 84 -26 175 237 35 33 -47 -175 -125 191 190 128 -54 -288 -195 174 197 -236 -291 -263 -131 82 398 115
3476 115 -3 -162 -221 77 245 0 -103 -172 -54 116 4 326 4 -265 -176 96 406 112 100 -459 -107
3497 -107 277 71 -10 -206 -93 -137 79 32 200 191 -114 -305 -10 -63 235 -22 -277 -155 202 60 174 139
3519 139 -167 -98 4 196 162 -365 -374 -115 -119 149 291 -79 -203 -119 -49 255 405 -111 -277 -160 -142 200 336
3542 336 -223 -171 -247 113 99 296 36 -238 -275 112 416 53 -221 -265 -172 13 362 213 -150 -514 -20 -104
3564 -104 169 286 70 -116 -98 -75 256 487 -87 -280 -220 -120 225 177 -64 -186 -219 -125 172 307 91 151
3586 151 -223 -52 286 202 -40 -26 -47 -131 278 185 -63 -253 -152 -39 293 16 219 -362 -221 -111 160 463
3608 463 368 -122 -460 -30 299 355 221 -347 -210 -49 191 270 142 -252 -216 101 -108 344 248 -215 -357 -273
$$ packed form
3451Il0J05j10K01O2k02kq0j28N0L16jo2j82k34R3L69K3m33n5K8J32K13L16k83
3476A15j18j59n9K98J68k45j03o9J18J70j12L22l22k69Q9K72L10k94j2n59L52
3497a07L84k06q1j96J13m4K16m7J68rl05j91K95n3K98k57k55J22L57j42J14l5
3519A39l06O9J02J92l4n27rK59mK68J42l70j24Q4P0L04J50n16j66J17J8L42J36
3542C36n59N2p6L60j4J97k60k74l7L87L04l63k74m4R3J85L49j49l63l64M94q4
3564a04K73J17k16j86J8K3L31K31n74j93O0J00L45m8k41j22l3R4K97J35k16O0
3586A51l74J71L38q4k42J4k1q4M09r3k48j90J01J13L32k77K03n81J41J10K71L03
3608D63r5m90l38M30L29N6j34n68J37J61K40P9j28l94L6L17k09M52r6m63j42Q4
$$ plain form
3630 -273 -147 240 -195 -81 -411 -135 260 145 105 -193 -141 99 243 88 -57 -415 -345 -167 12 361 200
3651 200 121 -78 -99 35 391 124 -144 -68 -24 72 275 111 22 -175 -14 58 147 162 15 -383 -252 179 42
3674 42 296 113 -85 -147 119 81 44 -266 -64 -125 -34 563 13 -58 -211 -290 182 148 281 -26 -90 -374 172
3697 172 367 331 276 -29 -37 -160 146 64 -42 -381 -207 92 312 21 54 -225 44 -20 424 294 -36 -302
3719 -302 -339 40 279 491 93 -105 -68 -300 230 25 -175 -147 -294 87 -19 502 93 -134 -238 -118 332
3740 332 199 52 -163 -123 77 309 368 94 -106 -276 -302 261 96 -87 -19 -266 -130 272 98 189 -128 -64
3762 -64 -227 142 352 231 -110 -285 -57 185 337 265 -162 128 148 133 326 89 -109 -371 -100 -159 118 86
3784 86 -246 -358 -264 39 442 -81 -81 -231 -172 203 450 -23 -152 -316 -189 122 310 172 -254 -302 24 99
$$ packed form
3630b73J26L87m35J14l30K76L95j15m0k98N2K40J44j55j45l58P0J78J79L49j61
3651B00p9j99k1J34L56k67k68P6M4R6K03j64q9j97J61P2Q9J5j47l98J31M31j37
3674D2K54j83j98o2K66l8l7l10K02o1R1N97n50p1j53p9M72l4J33l07o4k84N46
3697A72J95l6n5l05qj23L06q2j06l39J74K99K20k91L3k79K69o4M44j30l30k66
3719c02l7L79K39K12l98j98L7k32N30k05k00K8j47L81j06N21m09k27j04J20M50
3740C32j33j47k15M0K00K32N9k74k00j70k6N63j65j83O8k47J36M02j74R1l17O4
3762f4j63L69K10j21l41j75K28K42J52p2m27K90K0j5J93k37j98k62K71n9K77l2
3784H6l32j12R4L03M03n23%j50N9L75K47m73j29j64J27L11J88j38m26m8L26P5
$$ plain form
3806 99 207 170 -131 -307 -134 198 226 -74 -80 -350 -145 -32 322 60 100 -188 -139 15 236 106 -14 14 -494
3829 -494 55 70 357 -76 -238 -165 148 360 40 21 -301 -169 -68 285 240 181 -195 -77 -94 121 274 -47
3851 -47 -365 -264 -149 588 117 -183 -186 -430 -76 109 480 23 -325 52 -57 226 12 -150 -438 -180 -155
3872 -155 74 122 233 -114 -41 142 343 612 -289 -54 -155 -176 209 99 123 -222 -237 -184 117 227 50 -84
3894 -84 -284 -179 48 270 151 -172 -201 -284 227 380 -44 98 -192 106 284 140 122 3 33 -76 13 304
3916 304 225 43 -100 -121 274 196 370 -128 -169 -223 -115 98 114 101 -268 -298 218 302 -64 108 -105 -138 135
3939 135 431 70 -68 -513 -248 161 158 92 -44 -456 -61 131 249 198 20 -161 -94 120 268 -113 -114 -193 -272
3962 -272 104 -85 61 56 -151 -203 232 162 55 -180 -244 -180 -33 198 143 -118 -286 2 -18 103 66 -148 -193
$$ packed form
3806I9J08l7l01j76J73L32K8l00ok70K05J13L54k62M0k88M9J54K21j30j20K8n08
3829d94N49J5K87m33j62P3L13K12l20j9l22J32J01L53m5n9l76J18j7K15J53l21
3851d7l18J01J15P37m71l00lk44L54J85L71m57l48L77j09K83k14j62k88K58K5
3872a55K29M8J11l47P3J83K01K69r01K35j01k1L85j10K4l45j5N3L01J10j77j34
3894h4k00J05K27K22j19l23k9q3N11J53m24J42k90K98J78j44j8j19L0j09Q9K91
3916C04p9j82j43k1L95p8J74m98m1n4J08K13J6j3l69l0N16Q4l66J72k13l3K73
3939A35K96l61j38m45K65M09lo6j36m12L95J92J18n1j78j81O7K14J48l81jp9p9
3962b72L76j89J46nk07n2M35p0j07k35o4O4J47K31n5k61j68K88k0J21l7k14m5
$$ plain form
3985 -193 -98 215 359 127 -12 -27 -281 -131 0 226 25 -337 -117 -134 469 230 -11 -206 72 103 297
4006 297 130 -125 -278 -116 510 79 92 -72 -313 -39 31 11 161 -113 -99 -271 -21 55 189 -144 -24 -324
4028 -324 59 339 164 45 -169 -217 -3 -130 362 136 -214 -365 73 151 176 54 -294 -314 12 176 176 -178
4050 -178 -198 -228 118 230 -1 204 -73 -281 -168 123 347 168 -156 -131 -144 -114 440 147 -127 -128 -42 181 337
4073 337 191 56 -216 -143 -117 13 154 -145 -252 78 262 208 188 -215 -46 68 159 186 3 -65 -243 -40
4095 -40 -125 38 151 12 -130 -157 -8 186 233 -188 -455 45 2 288 276 119 -184 -8 -48 215 69 -87
4117 -87 -79 -179 165 50 310 -11 -1 -211 102 271 149 -334 -114 -97 -41 136 179 -132 -245 -304 -119 118 69
4140 69 122 -127 -358 225 424 15 -38 -4 -76 -125 320 141 86 -175 74 -60 163 190 228 5 -165 144 286
$$ packed form
3985a93R5L13J44k32j39j5k54J50J31K26k01l62K20j7O03k39k41j95K78L1J94
4006B97j67k55j53J62O26m31J3j64k41K74P0k0J50k74J4j72K50P6J34l33J20l00
4028c24L83K80j75j19k14m8K14j27M92k26l50j51M38P8K5j22l48k0L26J64%l54
4050a78k0l0L46J12k31K05k77k08J13K91K24j79l24K5j3L0N54k93k74jQ6K23J56
4073C37j46j35k72P3K6J30J41k99j07L30J84n4k0m03J69J14R1K7j83o8j78K03
4095d0q5J63J13j39j42k7J49J94M7m21k67N00m3K86j2j57l03J76m0K63j46j56
4117h7Qj00L44j15K60l21J0k10L13J69j22m83K20J7N6J77M3l11j13n9J85K37m9
4140F9N3k49k31N83J99m09n3L4p2m9M45j79n5k61K49j34K23K7L8k23j70L09J42
$$ plain form
4163 286 133 -52 20 -149 -161 311 130 160 -145 -258 -108 158 116 -63 -150 -137 -140 120 -9 51 -130 67 -57
4186 -57 354 -110 -44 -152 -196 -126 -193 293 266 -304 -115 -50 100 125 70 -107 -291 187 86 236 -39 -91 -180 -19
4210 -19 54 163 -68 -208 -408 -194 214 526 235 -193 18 -46 54 219 30 -90 -159 -142 32 58 98 -26
4232 -26 -63 -231 -28 68 -47 -169 -29 8 53 232 172 -67 -214 112 147 276 0 -192 -221 -325 213 -38 104
4255 104 110 79 -46 -33 -104 183 66 -149 -22 27 363 91 -51 -16 -180 30 308 174 27 -1 -154 334 131
4278 131 440 11 -118 -268 61 20 158 -43 -92 -258 -162 307 252 82 -368 -19 131 432 282 -119 -20 -387
4300 -387 -195 491 350 -220 -98 -173 99 282 277 -33 -117 -237 -9 202 181 -39 39 78 135 115 110 24 -211 70
4324 70 196 132 159 73 140 -274 -46 -83 321 -256 -177 115 -37 88 99 148 -127 -160 37 97 259 146 -181 -101
$$ packed form
4163B86j53j85P2j69j2M72j81L0l05j13J50K66m2j79q7J3lK60j29O0j81J97j24
4186e7M11m64O6j08m4P0o7M86k7n70J89O5J50K5n5j77j84M78j01J50k75n2q9J61
4210a9P3J09k31j40k00K14M08L12k91m28K11o4J00J65j89j20o9J7J74K6M0j24
4232b6l7j68K03R6j15j22J40L7M5J79o0k39j47L26L5J29k76j92k9j04N38k51J42
4255A04Ol1j25J3p1K87j17k15J27M9L36k72j42L5j64K10K78j34j47k8j53M88k03
4278A31L09m29j29j50L29m1J38k01m9j66R6M69n5j70m50L49J50L01j50m01R9l67
4300c87J92O86j41n70J22p5K72J83nl10q4j20K28K11k1k20P8L9N7k0nq6k35K81
4324G0J26o4K7q6O7m14K28l7M04n77P9K92j52J25J1M9k75l3J97O0J62j13l27Q0
$$ plain form
4348 -101 -80 -97 376 -181 -62 -45 160 159 173 22 -217 24 -16 -53 183 155 -449 -88 -37 -108 93 -137 -188 77
4372 77 -177 -1 258 55 -17 -103 -127 305 255 -74 -292 -185 -116 -71 189 -170 -109 45 84 224 4 -99 25
4395 25 -258 95 159 306 61 -162 -105 -41 9 411 260 -166 -101 -358 229 44 36 -255 -23 -332 197 135 147
4418 147 7 -223 183 -53 111 274 311 -276 116 177 44 205 -130 -279 -271 68 79 290 -253 -30 -50 -88
4440 -88 311 397 0 -7 -309 -177 242 23 67 -28 -152 140 -60 62 219 -164 -194 -21 350 163 17 -38 -135
4463 -135 123 150 251 -23 -220 -54 -93 -144 348 -181 76 -117 -66 179 260 -22 -264 117 -199 183 20 6
4485 6 26 -327 -241 31 152 104 71 -100 -169 200 -33 -48 -128 -205 -53 22 244 -206 -58 176 -11 125 180 89
4509 89 -85 -274 -79 179 304 -125 -87 -230 -29 339 135 41 -203 -188 180 71 116 138 -64 -220 -106 177
$$ packed form
4348a01K1j7M73n57J19J7K05jJ4j51k39K41m0l7K36k8o04L61N1p1K01k30n1K65
4372G7k54J76K59k03p2q6k4M32n0l29k18J07O9M5K60l59O1J54L9J40k20j03J24
4395B5k83L53O4J47k45k23N7O4N0M02j51m26O5k57N87j85qk91K32l09N29o2J2
4418A47j40k30M06k36J64J63L7n87L92O1j33J61l35j49QL39J1K11n43K23k0l8
4440h8L99Q6l97pl02J32M19k19M4r5j24K92k00J22J57l83l0J73L71j87j46n5r7
4463a35K58K7J01k74j97J66l9n1M92n29K57j93N1K45Q1k82k42L81l16L82j63j4
4485FK0l53Q6K72J21m8l3j71o9L69k33j5q0p7J52P5K22m50J48K34j87J36N5r1
4509H9j74j89J95K58J25m29L8j43K01L68k04r4k44J5L68j09M5K2k02j56J14K83
$$ plain form
4531 177 290 58 107 -98 -80 -121 269 99 -298 -108 27 -35 271 -1 12 -21 -92 -139 327 118 -29 -271 -222
4554 -222 -28 62 66 -119 -82 -4 -169 286 -43 -109 -192 -45 -48 217 153 -17 -94 -20 -139 335 139 -211 -82 -16
4578 -16 30 10 -22 -99 -256 -191 -282 166 59 174 82 -63 17 236 19 -31 -374 49 90 -114 128 1 -17 -201
4602 -201 -114 218 147 -152 -147 94 -21 -35 -50 123 -136 -111 22 56 218 -265 -145 33 -131 281 267 -6 73
4625 73 86 62 331 234 -145 23 15 17 306 440 101 -45 -157 23 -56 157 128 -133 -129 73 100 344 -185 -298
4649 -298 -244 -85 -247 -111 92 -139 -246 -186 -76 124 -15 23 -265 -130 348 139 73 17 65 219 256 298 317
4672 317 -178 -98 73 -54 379 184 -217 -225 -159 -119 372 -135 -278 -368 -293 113 356 44 -181 -107 -226 -35 446
4695 446 143 -234 -117 -279 62 3 -238 12 -169 143 192 69 192 -28 -171 -171 -55 32 66 -267 -111 -183
$$ packed form
4531A77J13k32M9k05J8m1L90j70l97J90J35o2L06k72J3l3p1m7M66k09j47k42M9
4554b22J94R0Mj85L7P8j65M55l29o6q3J47lK65o4j70p7P4j19M74j96l50J29O6
4578a6M6k0l2p7j57O5r1M48j07J15r2j45Q0K19k17n0l43M23M1k04K42j27j8j84
4602b01Q7L32p1k99NK41j15j4j5J73k59K5J33L4J62m83J20J78j64M12j4k73P9
4625G3J3k4K69r7l79J68qKK89J34l39j46j12J80p9K13k9k61MK02K7K44n29j13
4649b98N4J59j62J36K03k31j07O0J10K00j39L8k88J35M78k09o6n6M8J54L7M2J9
4672C17m95Q0J71j27M33j95m01qO6M0M91n07j43r0P5M06K43l12k25P4j19J91M81
4695D46l03l77J17j62L41n9k41K50j81L12M9j23J23k20j43%J16Q7L4l33J56p2
$$ plain form
4717 -183 118 212 -10 -3 -30 -49 -103 251 40 -6 -259 -194 143 294 107 139 -131 72 107 182 179 -48 163 -261
4741 -261 -37 -10 -5 -121 -237 -24 187 9 70 -166 -205 -225 -83 -155 224 66 -221 -386 -105 -65 -23 69 -173
4764 -173 -75 -153 98 191 306 -92 -26 -26 209 -30 -155 92 -125 -71 104 278 85 -151 -258 -164 387 95 -57
4787 -57 -87 -117 -78 77 54 -28 170 -232 -41 197 151 226 -244 -121 58 77 175 67 40 97 -174 113 369 79
4811 79 -184 -255 -256 385 129 131 161 -323 -75 106 -127 208 535 -422 395 201 170 -563 -295 61 -69 3 203
4834 203 -11 -205 418 -272 189 197 174 49 -241 -47 115 237 -35 162 90 -108 91 170 -90 -309 -146 -181
4856 -181 -59 84 88 -287 -54 -81 -132 -41 317 48 39 -95 228 44 190 25 -51 -249 -23 127 40 348 -70
4879 -70 -47 -121 168 -82 -103 1 -162 103 225 107 -158 -292 -157 122 84 138 -186 6 -153 -94 162 227 -67
$$ packed form
4717a83L01R4k22Pk7j9n4L54k11m6k53O5L37J51j87L2k70K03L5P5lk27K11m24
4741b61K24K7Nj16j16K13K11j78O1k36l9k0J42p2L79j58k87j65K81M0M2R2k42
4764a73R8p8K51R3J15l98O6%K35k39j25K47k17N4J75J74j93k36j07R4N51k92j52
4787e7l0l0L9J55k3q2J98m02J91K38m6P5m70J23J79J9R8j08k7N7k71K87K56k90
4811G9k63p1jO41k56KL0m84K48J81k33L35L27r57Q17j94l1p33K68L56j30P2K00
4834B03k14j94O23o90M61Qk3j25k90J94J62J22k72J97p2j98J99P9k60k19J63l5
4856a81J22J43Ml75K33k7n1R1L58k69rj34L23j84J46j65p6j98K26J50q7L08m18
4879g0K3p4K89k50k1J04j63K65J22j18k65j34J35K79l8N4l24J92j59N9K56O5k94
$$ plain form
4902 -67 48 -41 12 3 11 -20 -95 -302 43 -31 297 -49 -225 -68 40 174 132 -12 72 -269 -88 19 89 50 -45
4927 -45 -140 95 21 78 -97 -318 -202 -155 -46 176 -55 70 -127 12 -156 -29 279 -79 -108 -202 -15 240
4949 240 -21 -101 44 -46 56 101 97 -177 -158 -139 -6 177 -219 -137 -108 -94 105 61 285 -97 -39 -117 155 30
4973 30 -84 -77 -393 6 223 25 -67 122 -263 -31 121 -15 82 7 -292 27 226 199 263 -235 -25 -174 41
4996 41 417 22 -43 -140 -10 -198 78 200 -267 -192 -285 -59 180 100 -219 -292 -520 119 101 -48 153 -387 -98
5019 -98 -95 246 206 -92 -116 -10 372 272 46 -10 29 -175 -169 7 173 19 -36 -15 -3 206 -1 29 -153 10
5043 10 -70 171 121 -6 29 -75 -227 98 69 -2 -30 -192 -72 199 171 -29 71 -137 -48 69 -31 -64 -101 -327
5067 -327 -55 124 219 -18 -157 -107 -19 -30 504 -26 -131 -172 -116 -14 118 -136 -110 -218 -251 -6 -178 205 -145
$$ packed form
4902f7J15q9N3rQl1p5k07L45p4L28l46j76J57J08J34m2j44Q4l41J81J07P0l9r5
4927d5r5K35p4N7j75k21J16M7J09K22k31J25j97J39j68J27L08l58k9r4J87K55
4949B40k61q0J45r0J02M5mk74J9J9J33J83l96Q2K9J4J99m4K24l82N8p8K72j25
4973C0j14Pl16L99K17j98r2J89l85K32J52j36R7p5k99L19J99k7O4m98K10j49K15
4996D1L76l95o5r7J30j88K76J22m67P5r3K26K39q0l19p3k28O39j8j49K01n40K89
5019i8LL41m0k98k4J06L82j00k26n6L9k04OJ76J66j54n5K1J2K09k07L0j82J63
5043A0q0K41n0j27L5j04j52L25k9p1k8j62J20K71k8k00J00k08Q9J17j00l3l7k26
5067c27K72J79R5k37j39N0Q8j1N34n30j05m1N6J02J32k54K6j08l3K45j72L83l50
$$ plain form
5090 -145 -66 11 46 52 144 -79 -218 -124 -44 257 98 -73 -83 111 -32 -198 170 233 80 -131 -33 -42 99 -30
5114 -30 -253 -9 -59 71 17 8 15 180 -42 84 217 -11 -160 -149 -41 -126 296 -124 -376 -339 73 -24 160 -109
5138 -109 -256 -15 318 154 464 112 -87 64 -75 303 52 -163 -211 -109 22 -70 103 -93 -73 -64 -109 -51
5160 -51 7 -25 -91 -340 60 -87 138 91 -100 -56 29 170 -56 -112 -2 -86 79 -27 18 -18 -157 -190 -6 -84
5184 -84 208 14 8 -136 34 -70 160 57 -271 -113 84 -215 56 -104 -141 49 -111 120 11 57 -144 37
5206 37 89 15 -18 -31 -42 -150 -223 -26 87 -197 -240 -60 118 -220 -115 -272 236 -204 -222 246 264 104 -10
5229 -10 56 -6 138 -21 37 -111 -312 90 277 147 58 -87 -123 -175 32 351 237 4 40 -18 185 64 63 -256
5253 -256 49 29 15 134 -187 -218 -74 2 82 -92 316 -242 -127 -143 201 -55 -13 -188 49 -363 -437 -127 -16
$$ packed form
5090a45P9P7L5OR2k23j39R4Q0L01j59j71j0J94j43j66L68O3j53k11R8rJ41j29
5114c0k23K44n0J30n4rPJ65k22J26J33k28j49J1J08q5M22m20k52L7M12r7J84k69
5138a09j47K41L33j64L10l52j99J51j39L78k51k15m8J02J31r2J73j96K0Rm5N8
5160e1N8l2o6k49M00j47K25m7j91M4Q5J41k26n6J10q4J65j06M5l6j39l3J84p8
5184h4K92j94oj44J70j04K30j03l28J58J97k99K71j60l7J90j60K31j09M6k01J81
5206C7N2p4l3j3j1j08p3J97J13k84m3J80J78l38J05j57N08m40j8M68J8j60j14
5229a0O6o2J44j59N8j48k01M02J87j30q9j45l6n2K07L19j14k33L6n8K03j21jl19
5253b56L05k0j4J19l21l1J44P6Q0j74M08n58J15j6L44k56M2j75K37m12p4L10J11
$$ plain form
5276 -16 101 -51 41 44 189 -163 -214 -125 -163 213 217 -212 -135 95 -127 -64 -27 8 -36 70 21 32 54 -73 258 -154
5302 -154 -287 -42 -41 32 -4 -189 -147 29 244 98 193 -159 -131 39 308 14 206 -189 -51 26 190 162 18
5325 18 -118 -43 -203 145 148 -146 -7 -236 1 101 133 -17 -249 -57 -46 -145 218 -61 -100 -95 4 26 172 11
5349 11 85 -88 -154 -47 173 -9 -17 -14 104 -49 96 185 -256 -195 40 275 61 -50 84 -33 -31 272 23 47
5373 47 -57 -260 123 -75 -30 -286 41 -27 -64 -152 144 38 32 -4 -6 205 -56 181 -54 -211 -123 65 211 102
5397 102 -190 -104 -77 -177 61 255 14 163 180 -130 -144 -62 -59 -385 201 -175 652 303 -27 -11 797 -165 2
5420 2 -701 157 233 -151 -149 113 188 92 95 -180 -118 -7 111 -12 -191 -255 18 103 62 -32 -200 -35 140 169 262
5445 262 5 -328 -63 133 82 91 -58 -92 -69 -178 47 316 245 -358 -267 -140 36 -28 57 -29 -81 90 277 121
$$ packed form
5276a6J17j52R2LJ45l52n1Q9l8L76Mm29P7K30k22O3L7L5m4J06m9J1K2j27L31m12
5302a54j33K45JP3l6j85M2J76K15j46R5l52K8J70K69k94J92l95J38P7J64k8j44
5325A8j36P5j60L48Lk94J39k29K37J00L2j50k32J92J1r9L63k79l9NR9K2J46j61
5349A1P4j73o6J07K20j82qLJ18j53J45Q9m41O1K35K35k14j11J34j17KL03k49K4
5373D7j04k03L83j98M5k56L27o8l7q8K96j06ol6kK11k61K37k35j57Q8J88J46j09
5397A02k92Q6K7j00K38J94k41J49J7l10j4Q2Ll26N86l76Q27l49l30J6Q08r62J67
5420Bp03Q58P6l84KK62P5r6Lk75O2J11J18j23j79o4K73Q5m1r4j68J65J75K9R3
5445B62k57l33K65J96n1Rj49l4K3j09K25K69p1o03R1J27J76o4Q5q6n2J71J87j56
$$ plain form
5469 121 -12 -184 -177 -121 -115 -41 57 -79 -276 23 -171 126 134 -10 -166 -51 -172 -46 170 1 -196 -30 15
5492 15 -97 290 -44 -336 -40 227 17 3 -158 34 227 36 72 2 -103 -199 76 154 -49 28 -87 -96 -49
5515 -49 -3 209 -226 -115 -95 192 -117 -26 -37 90 -72 21 121 -57 26 -127 -301 24 123 168 70 -244 -47
5538 -47 -5 -88 72 137 -55 -191 -7 78 166 234 -434 -27 -265 -65 239 112 174 -104 137 39 184 134 -80
5561 -80 -127 -71 134 -64 -69 -72 -109 -83 -44 -118 140 -173 6 -55 -70 -160 110 -80 -68 -73 129 -40 298 -215 -143 57
5587 57 -163 44 14 137 262 9 -59 46 -103 130 -22 -211 50 107 6 -64 -361 -56 137 46 46 -180 -169
5610 -169 -6 65 79 15 -70 -274 92 93 -22 62 26 -188 -183 -10 112 246 -247 98 -61 -56 189 -6 104 -225
5634 -225 -180 -34 136 -102 -114 -76 -219 -177 260 157 63 -298 -5 89 -67 12 -43 45 3 -55 169 234 102 -41
$$ packed form
5469A21j33j72PN6OP4R8j36j97K99j94K97Qj44j56J15j21J26K16j69j97J66M5
5492A5j12L87l34k92K96K67k10j4j61J92J93j91L6p0j05r6K75P8k03P7j15rM7
5515d9M6K12m35J11K0K87l09R1j1J27j62R3J00j78Q3j53j74L25R9M5r8l14J97
5538d7M2q3J60O5j92j36J84Q5Q8O8o68M07k38K00L04j27O2k78K41r8J45n0k14
5561h0m7N6K05j98nll7K6L9p4K58l13J79o1j5r0K70j90J2nK02j69L38n13P2K00
5587E7k20K07l0J23J25k53o8J05j49K33j52j89K61N7j01p0k97L05J93r1%k26J1
5610a69J63P1J4o4q5k04L66Jj15Q4l6k14NJ73J22J34m93L45j59NK45j95J10l29
5634b25M5J46J70k38j2L8j43M2M37j03r4l61K93R4j56P9n5Q8m2n8K24O5j32j43
$$ plain form
5658 -41 -94 -91 121 311 -20 -13 -227 -60 118 -118 65 -231 179 14 -124 18 -209 83 76 -123 70 -124 56
5681 56 -211 -174 -63 381 287 -33 -98 34 27 -144 37 -47 136 -89 -255 132 284 219 203 17 -57 69 91 159
5705 159 101 26 -194 305 279 42 -18 -112 -56 284 -107 -291 -130 795 93 469 342 -229 -80 -177 -125 -223 120
5728 120 -79 21 -49 312 -170 112 -95 -313 108 -98 205 104 -7 65 152 -215 236 -119 122 -70 134
5749 134 -40 96 32 194 -76 -153 -156 -113 110 36 121 -143 49 -137 10 85 142 -77 -86 -57 293 -204 87 33
5773 33 -141 -52 1120 284 -84 -113 -374 112 132 54 -155 -62 131 278 102 279 -39 -15 -279 116 -238 501
5795 501 71 -251 39 -38 -147 -318 8 -55 -133 104 -129 -86 226 117 -5 -14 -1 8 -18 -50 123 -163 52 360
5819 360 -112 81 168 86 -37 1 321 -118 1 -52 155 107 80 427 -55 64 -42 102 88 -194 29 -186
$$ packed form
5658d1n3LK12J90l31Pk14J67J78k36J83k96M10j65j38J42k27K92pj99J93j94J80
5681E6k67L7J11M44r4l20o5J32pj71J81q4J83k25j66L87J52o5j6j86p4J26K2O8
5705A59n8p5k20M99k6k37o0r4N6L40l91j84J61R25p02L76j27n71J49r7N2r8L43
5728A20j99J00p0L61m82K82k07k18M21k06L03j01j11P2Q7l67M51l55K41j92K04
5749A34j74J36o4J62k70p7lM3K23p4Q5k64J92j86J47P5N7k19rK9L50m97K91n4
5773C3j74Q9J172q36l68k9k61M86K0p8k09R3J93J47j76J77l18K4k64L95l54P39
5795E01m30l22K90p7j09j71L26o3p8K37k33M3L12j09j22rJ3Rk6l2J73k86K15L08
5819C60m72J93Q7q2j23L8L20m39J19n3K07m8k7L47m82J19j06J44j4k82K23k15
$$ plain form
5841 -186 127 93 -54 118 221 -134 15 -80 -143 -87 -64 107 -29 -100 110 85 -166 62 -119 -139 -83 262 79
5864 79 162 98 208 -55 -255 90 -347 101 -68 192 -201 -161 -173 -20 -18 283 74 -93 0 -98 24 92 78 -15
5888 -15 19 62 149 186 -146 -296 -50 237 4 -18 18 -70 24 -3 241 81 31 75 8 23 -114 15 6 -65 -173 -71
5914 -71 -31 14 31 -187 -102 -4 6 190 -382 -193 159 123 1 252 100 59 17 -81 -3 198 -28 129 93 -25
5938 -25 52 -44 88 -55 -55 28 233 -15 -79 -86 -174 156 15 19 -211 -187 -117 -117 169 147 -12 -213 -132 -80 125 37 -34
5965 -34 -130 -287 -70 -129 198 49 -88 153 118 -280 139 63 -15 -252 -228 212 31 104 -122 108 -413 -94 -15
5988 -15 -196 28 37 119 297 16 -154 149 206 -10 -24 65 71 182 -133 182 -168 310 117 -294 52 -69 -226
6011 -226 -124 -116 -286 -191 -188 136 -164 133 -7 -9 -13 -109 151 -75 42 -43 -26 76 1 170 -88 26 -82 -27 -149
$$ packed form
5841a86L13l4j47J72J03l55J49r5o3N6K3J71j36p1K10k5k51K28j81k0N6L45j83
5864G9Q3o4J10k63k00L45m37M48j69K60l93M0j2J53KL01k09j67R3r8J22O8j4r3
5888a5L4M3Q7L7l32j50K46K87k33k2L6q8R4k7K44j60n0M4o7J5j37J29rp1j08J02
5914g1M0M5J7k18Q5R8J0J84n72J89L52l6j22K51j52m1m2r8P8K01k26J57l6j18
5938b5P7r6J32j43%Q3K05k48o4pq8L30j41Mk30K4P0%K86k2j59k01Q1N2K05q8p1
5965c4r6j57K17n9L27j49j37K41l5l98M19p6p8k37K4M40j81P3k26K30n21L19P9
5988a5j81K24RQ2J78k81j70L03N7k16j4Q9OJ11l15L15l50M78j93m11L46j21j57
6011b26J02Qj70R5LL24l00K97j40kmr6K60k26J17q5J7J02p5J69k58J14j08N5j22
$$ plain form
6036 -149 75 68 68 177 8 81 101 29 -153 76 -43 -21 -16 75 -53 53 -244 -71 32 -100 -111 -84 191 258 59
6061 59 -113 62 12 98 31 -94 -166 77 -193 -35 282 274 73 -152 -41 -202 169 -221 -113 -18 59 -66 -68 -6
6085 -6 338 -41 -23 14 135 17 -133 94 -44 -97 221 131 129 -76 -247 -78 96 36 135 -2 -101 -329 73 192
6109 192 -22 81 69 -147 317 -38 -57 68 -233 -108 195 -141 -191 -235 -113 -155 16 197 140 -249 -134 -61
6131 -61 138 237 132 -115 -43 -38 174 14 -96 223 -141 -51 -48 -25 81 110 -172 -126 -108 18 33 86 -72 -211 -167
6156 -167 264 -8 -435 -111 8 222 145 -69 -75 -11 -37 -70 204 29 48 -332 -160 69 -45 157 101 -50 87
6179 87 -35 104 -54 129 96 -23 -307 -52 122 -154 23 -171 17 9 -45 44 -82 -102 144 28 102 -21 71
6202 71 -146 27 229 158 -89 -174 111 51 29 -99 -49 82 -139 -8 71 232 -28 -58 182 -24 228 90 -53
$$ packed form
6036a49K24p%J09j69P3K0p2j82K29j19K2NR1j28J06k97J73J03j32j1K7K75O7j99
6061E9j72J75n0Q6o7j25p2K43k70J58L17qk01k25J11j61L71l90J08R5P7j25kO2
6085fL44l79J8L7J21j18j50K27j38n3L18r0kk05j71J69J74o0R9j37r9k28M02J19
6109A92k14J03j2k16M64l55j9J25l01J25L03l36n0m4J22m2J71J81n7l89J15P3
6131f1J99R9j05k47P2NK12j60j10L19l64R0LK3J06K9k82M6J8J26J5N3j58j39M4
6156a67M31k72m27L24J19K14p7k14oO4k6l3K74j75J9l80J72K29j14K02n6j51J37
6179H7j22J39j58J83l3j19k84K55J74k76J77j94J88qn4Q9j26k0K46j16P4j23R2
6202G1k17J73K02p1k47q5K85o0k2j28N0J31k21J31P9J61k60l0K40k06K52j38j43
$$ plain form
6225 -53 150 76 58 246 218 11 179 -275 55 278 -116 67 -86 -201 -98 -20 120 -8 192 -98 -25 70
6247 70 -5 -18 23 -213 24 138 292 239 -373 183 -178 -50 -353 97 -105 417 39 -12 -742 -112 -430 -427 52
6270 52 30 49 -101 -129 -269 292 280 351 -176 -81 91 -463 -116 639 -79 -266 -892 -263 50 -447 239 487
6292 487 337 254 -291 -485 -184 -369 57 -194 177 -96 -36 -179 54 -125 1 -36 179 121 196 -45 -82 204
6314 204 9 -177 -285 -161 -169 -230 126 -197 -81 230 -87 -16 -12 26 84 230 170 -43 114 131 -229 56 44 -110
6338 -110 39 51 -153 -39 -238 36 30 -25 -214 -198 -103 146 220 -7 127 100 189 247 -87 -198 -72 -135 160 255
6362 255 -76 -29 -105 -146 -156 147 -56 -15 -86 129 -282 -95 -26 -42 65 -217 141 -8 168 -101 -98 -36 84 20
6386 20 112 84 -348 -221 59 56 209 320 -75 -182 -61 374 113 55 -248 87 169 -45 298 184 -60 -240
$$ packed form
6225e3K03p4j8J88k8k07J68m54L30K23l94J83j53j15J03P8J40j28K00k90P3R5
6247G0p5j3M1k36K37J14J54n3o12N56l61J28l03M50k02N22l78n1p30O30l18LM79
6270E2k2J9j50k8j40N61j2P1n27R5J72n54L47P55p18j87o26O29L13m97O86K48
6292D87j50q3n45j94L01j85M26k51L71k73O0j43K33j79J26l7K15n8P5k41l7K86
6314B04j95j86j08J24qo1L56l23J16L11l17P1ML8N8J46o0k13J57J7l60K85j2j54
6338a10J49J2k04J14j99K74on5j89J6R5K49P4k27J34k7Q9N8l34j11J26o3K95R5
6362B55l31M7p6m1j0L03k03M1p1K15m11J87O9j6J07k82L58j49J76k69LO2J20o4
6386B0R2k8m32J27K80lJ53J11l95j07J21M35k61n8l03L35Q2k14L43j14k44j80
$$ plain form
6408 -240 302 3 -102 74 35 -351 -44 70 28 90 4 -19 -124 83 69 -54 -27 98 -144 56 -148 -54 -109
6431 -109 -120 224 218 -10 33 121 267 140 -67 -81 -110 -100 -43 -78 201 -77 39 -57 33 -261 -285 116 398 146
6455 146 -46 81 -36 -99 174 -103 127 57 60 58 -3 -74 -82 23 -193 -81 49 246 -109 117 53 39 -40 21 -66
6480 -66 19 28 49 56 -41 -166 -31 -3 127 168 -25 -255 60 -3 142 123 193 -119 -292 -122 149 261 113 150 -167
6505 -167 156 1 -70 -76 -125 63 -3 -52 26 -170 -47 -30 -313 7 -62 130 -180 13 256 126 102 -23 -92 135
6529 135 -5 83 202 63 38 69 -162 -115 -44 71 -163 149 -40 31 -73 -186 32 -110 -367 189 -55 7
6551 7 -31 160 -127 -181 -123 10 108 -211 84 -42 -243 -24 344 -257 126 155 169 149 -75 -107 38 -224 -43
6574 -43 -234 -24 -74 121 110 114 37 -36 110 -40 -380 57 78 149 -110 -14 -36 -94 169 156 -140 126 196 -50 224
$$ packed form
6408b40N42k99j05J76l9l86L07J14m2O2q6k3j05K07j4j23K7J25k42K00k04R4n5
6431a09j1L44ok28M3Q8J46j27k07j4k9J0N7l5K79k78J16r6R0k94k4M01K82k52
6455A46j92J27j17o3K73k77K30p0Lko1p1qJ05k16J12J30J97l55K26o4j4p9O1q7
6480f6Q5RK1Pr7j25J35K8J30M1j93k30L15o3J45j9P0l12j73J70K71J12j48L7l17
6505a67L23j55p1om9J88o6m9P8j96J23J7k83L20o9J92l10J93K43j30k4j25o9K27
6529A35j40Q8J19j39k5L1k31M7P1J15k34L12j89P1j04j13K18j42k57N56k44O2
6551Gl8J91k87n4N8J33R8l19K95j26k01K19L68o01L83K9J4k0k24l2J45k62J81
6574d3j91K10n0J95j1Mp7p3J46j50l40M37K1P1k59R6k2n8K63j3k96K66P0k46K74
$$ plain form
6599 224 159 55 -114 63 -40 -144 31 -130 46 236 -113 204 217 33 -278 137 -132 59 -61 -37 -225
6620 -225 102 -28 -198 -8 -16 -120 -161 284 59 24 -207 3 56 -57 -146 -133 -50 68 -85 -17 369 316 65
6643 65 65 -107 -37 46 79 -75 -42 -123 18 -159 159 47 -190 31 -14 -14 -98 76 97 -51 -60 130 -2 -196 177
6668 177 60 48 -95 113 -35 -187 65 157 297 49 -120 109 56 -132 -22 -80 96 -400 -241 300 153
6689 153 175 -28 -371 72 -101 36 55 -223 44 -26 -25 -204 164 -172 28 -1 -148 152 -57 -116 -228 -3
6711 -3 33 253 -200 -65 -7 -187 -379 -132 249 134 -306 -41 76 117 18 173 -292 145 154 151 -38 -143 -127 -45
6735 -45 73 -165 -102 -58 -105 -77 39 154 23 -11 -176 99 13 -108 103 -16 157 -168 -77 74 -10 -42 79
6758 79 153 -88 -25 -40 21 -361 103 13 20 179 158 -238 -145 80 -49 -111 122 -363 -33 -30 22 170 -170 -67 -10
$$ packed form
6599B24o5j04j69J77j03j04J75j61J76J90l49L17J3j84l11M15k69J91j20K4j88
6620b25L27j30j70J90qj04m1M45k25l5k31K10N3j13q9J3Q3J18j53O8L86n3k51
6643F5%j72P0Q3L3j54L3q1J41j77L18j12k37K21m5%q4J74K1j48rJ90j32j94L73
6668A77j17j2j43K08j48j52K52R2J40k48j69K29n3j88J10n8J76m96J59N41j47
6689A53K2k03l43M43j73J37J9k78K67p0Jj79L68l36K00k9j47L00k09n9j12K25
6711cL6K20m53J35N8j80j92K47L81j15m40K65J17M1r9J55m65M37Rlj89j05J6Q2
6735d5J18k38O3M4m7K8J16J15j31l4j65K75q6j21K11j19J73l25R1J51q4l2J21
6758G9P4k41O3j5O1l82M64r0PJ59k1l96R3K25j29o2K33m85L30LN2J48l40J03N7
$$ plain form
6783 -10 38 -10 0 -93 -75 -147 147 -6 81 -228 -206 -71 226 92 69 162 -103 9 75 129 -62 -71 -37 -70 163 118
6809 118 -13 48 92 96 -109 -9 -5 -157 92 -15 42 16 94 20 -248 91 -95 190 77 97 -131 -17 -56 179
6833 179 35 -32 -45 64 -73 38 111 -42 -181 -32 -103 67 -213 -133 62 35 -144 86 198 81 33 152
6855 152 -52 59 -130 -76 -75 -67 -29 53 -43 32 -134 -15 102 188 -264 100 -93 102 -50 -176 68 -3 16 8 -162
6880 -162 4 -24 -34 -260 -71 -214 42 134 -69 -86 -71 -64 -222 191 196 -18 201 -80 5 196 79 398 -116
6903 -116 24 21 181 155 -38 70 -79 -89 236 91 -103 86 116 104 258 90 -165 -267 -327 147 45 214
6925 214 106 -13 -263 -162 -3 194 79 -130 14 -25 -76 -68 120 56 191 186 103 173 285 125 208 -23 130
6948 130 129 83 -295 101 -229 23 -130 257 -42 76 -68 112 -23 -73 110 -256 13 -84 338 83 190 137
$$ packed form
6783a0M8m8J0r3J8p2K94j53Q7l09K2J35K97j34k3R3k65J12O6N4j91rL4l3K33m5
6809A18j31O1M4Mk05J00Mj52K49j07N7k6P8p4k68L39j86K85j13K0k28J14l9K35
6833A79j44o7j3J09j37J11P3j53j39J49p1J70k80Q0J95k7j79K30J12j17m8J19
6855A52k04J11j89N4JQL8Q2r6P5j66J19J17Q6m52L64j93J95j52j26K44p1J9qj70
6880a62J66k8j0k26J89j43K56R2k03j7J5Pj58M13Nk14K19k81Q5J91j17L19n14
6903a16J40lJ60k6j93J08j49j0L25j45j94J89L0j2J54j68k55j02o0M74j02J69
6925B14j08j19k50J01J59J97j15k09J44l9n1QJ88o4J35nq3P0J12j60Q3k31J53
6948A30jm6l78L96l30K52j53L87k99J18j44J80j35n0J83l66K69r7M22k55J07n3
$$ plain form
6970 137 -227 -32 127 -140 -207 34 18 242 121 -5 -91 -241 -25 -268 112 -80 -247 -130 295 344 98
6991 98 79 -215 -16 -146 -108 -58 5 163 72 -111 -93 44 -48 51 -172 125 24 -38 54 106 21 60 309 -7 60
7016 60 19 -351 126 -192 91 -52 19 238 61 -163 20 -162 -91 -90 69 -68 104 105 126 -39 -215 80 -67
7039 -67 213 -258 -33 20 -149 -48 48 -99 249 -18 365 -128 39 -191 -67 59 304 79 -136 -32 -186
7060 -186 -277 -102 176 -124 -17 66 11 -23 89 -119 107 -164 194 187 -92 -141 188 -27 113 -21 -264 87
7082 87 -108 -194 -58 -105 282 168 26 -148 -115 -43 -30 182 55 -16 14 38 106 -179 1 -45 -91 3 13 -8 -48
7107 -48 228 -227 -190 113 -45 22 201 -139 199 -134 -91 -38 13 -86 -120 113 85 48 40 -330 -92 -60 89 -195
7131 -195 43 -39 -15 -64 175 20 -92 9 -182 -65 -298 -87 77 -165 -11 131 -9 1 2 160 2 -29
$$ packed form
6970A37l64J95J59k67o7K41j6K24j21j26q6j50K16k43L80j92j67J17M25M9k46
6991I8j9k94J99j30L8N0O3J58r1j83J8J37r2R9k23K97j01o2R2N2q5L9K49l16O7
7016F0m1l70M77l18K83j43P1K19j77k24J83j82P1JJ59j37J72JK1j65j76K95j47
7039f7K80m71K25N3j69J01R6j47L48k67L83m93J67k30J24J26K45k25k15J04j54
7060a86r1J75K78l00J07Q3n5l4J12k08K26k71L58pk79m9L29k15J40j34k43L51
7082H7j95q6J36m7L87j14j42j74L3P2J3K12j27p1L0K4O8k85J80m6m6R4J0k1m0
7107d8K76m55L7L03j58O7J79l40L38l33M3N3N1r9l4K33k8l7ql70K38L2J49k84
7131a95K38q2K4m9K39j55j12J01j91J17k33K11J64k42J54J42j40J0JJ58j58l1
$$ plain form
7153 -29 -17 -28 91 52 -260 -162 6 82 103 248 -170 11 -133 79 102 38 104 47 -64 -88 82 -10 60 -40 -173
7178 -173 340 -117 14 10 29 114 -12 87 -116 -188 7 -16 105 -112 -108 18 -88 -52 170 -41 -143 221 -118
7201 -118 44 130 23 33 102 -189 89 -160 14 50 45 -8 3 48 -106 -215 -203 121 -176 -44 90 18 173 -166
7225 -166 2 -26 -220 -42 123 -31 329 10 187 -238 -137 106 -147 93 240 -189 -24 -3 44 150 -35
7246 -35 69 -343 -44 -110 -1 87 218 -163 114 167 86 259 -192 -104 -132 -193 134 -177 216 -74 38 113 247
7269 247 4 -149 -136 -4 -159 327 -24 -218 14 -5 -150 151 137 49 -104 -256 36 -7 242 -80 -67 -129
7291 -129 66 67 -86 -16 -53 -134 14 -119 5 42 -4 204 -53 37 -124 -7 -182 -25 35 -2 58 -323 -34 -117
7315 -117 210 6 21 -85 -120 59 92 13 426 -61 -283 154 71 89 113 -173 -185 -39 19 -23 89 -225 -90
$$ packed form
7153b9J2j1J19l9l12R8J68P6K1J45m18J81j44K12K3o4O6n7j11k4J70r2P0j00j33
7178a73N13m57J31mJ9Q5j26R9k03p2J95k3J21k17MJ26j06L6K22k11j02L64l39
7201a18J62Q6j07J0O9k91K78k49J74L6nn3J1M5j54j09J2L24k97J32J34p2J55l39
7225a66J68k8j94J78J65j54L60l19J77m25J01K43k53K40J47m29J65K1M7J06j85
7246c5J04m12K99o6J09Q8J31l81K77N3q1J73m51Q8k8o1L27l11L93k90J12P5J34
7269B47k43j53J3J32j55M86l51j94K32j9j45L01j4q8j53j52K92m3K49l22J3o2
7291a29J95Jj53P0l7q1J48j33J24L7m6K08k57R0j61J17j75J57O0l7O0l81K89q3
7315a17L27k04J5j06l5J79L3p9M13m87k22M37q3J8K4k86j2J46N8m2J12l14J35
$$ plain form
7338 -90 43 21 -180 164 35 -469 -38 203 -270 59 -76 5 -286 -251 87 -135 58 297 -23 -25 -147 -194
7360 -194 51 -52 33 -10 -31 109 -236 8 -49 15 26 -128 -33 -148 33 -267 82 195 90 16 -88 -156 241
7383 241 180 196 -212 -191 74 -151 295 230 -192 -40 161 134 -254 17 -292 41 -188 24 302 -131 -134 -206 8
7406 8 -100 107 -152 193 -7 -143 -118 -81 181 -76 -92 -276 64 -196 -135 -293 -79 17 -56 6 -116 -166 -212 90
7430 90 -105 -233 6 74 -51 163 -75 13 -22 212 -127 -178 -154 11 124 -136 -55 -103 -35 -68 32 -206 163
7453 163 -16 -24 12 197 -43 -131 49 142 12 104 44 -59 20 7 30 14 -23 24 -156 45 164 -61 52 103 173
7478 173 110 -30 38 91 -115 -43 18 83 -35 -304 -110 -99 54 41 -73 -108 -161 -123 -40 -127 238 -26 -148 -198 108
7503 108 265 77 -50 140 -99 54 134 191 -150 -92 272 27 -60 50 -76 -2 83 14 204 9 -45 165 40
$$ packed form
7338i0J33k2k01L44j29n04M31K41m73L29j35Q1k91L5L38k22J93K39l20kj22m7
7360a94K45j03Q5m3k1J40l45K44n7O4J1j54R5j15J81l00L49J13j05p4j04o8L97
7383B41o1J6m08K1K65k25M46o5m22J52K01k7l88K71l09L33k29K12K78m33lp2K14
7406Hj08K07k59L45k00j36K5L7K62k57j6j84L40k60O1j58K14R6p3O2j22n0m6L02
7430I0j95j28K39O8j25K14k38Q8l5K34l39n1K4J65J13k60Q1m8O8l3J00k38L69
7453A63j79qL6J85k40q8J80R3j30R2o0j03P9j3K3j6l7M7j80K01J19k25J13N1P0
7478A73o3j40O8N3k06P2O1O5j18k69J94J1J53j3j14l5n3L8Q3q7L65k64j22n0L06
7503A08J57j88j27J90k39J53Q0N7l41N8L64k45q7J10j26P4Q5o9J90j95n4K10j25
$$ plain form
7526 40 9 -238 186 -90 25 75 -176 35 147 -95 -112 168 -59 74 53 -310 74 44 -60 44 -9 -126
7548 -126 -35 -322 -92 -35 -137 191 -86 -71 39 -52 67 -78 -3 -169 99 -184 -107 39 200 -166 -145 20
7570 20 218 46 -106 -106 -93 119 -13 120 -213 185 -103 -54 -49 -19 -85 -247 -90 -101 -93 -44 157 -92 -72 161 -143
7595 -143 11 -74 -49 140 118 82 15 -83 -77 -215 64 147 -72 -69 -71 69 -24 -47 337 160 97 -64 83 -213 24
7620 24 -58 -46 76 -11 -22 -73 -51 -308 -18 -148 74 73 -58 -130 -336 -21 -53 260 -76 -191 -215 173 219 273 -21
7645 -21 -62 16 -61 156 -102 93 110 -87 -139 -71 293 -163 -8 127 104 24 115 14 -259 121 14 46 207 45
7669 45 -15 -261 205 79 157 -43 -120 -6 -212 -8 -26 63 -244 83 192 -242 61 -3 -189 -52 34 -38 189
7692 189 -90 -423 119 -221 14 86 -72 120 -3 -78 116 -8 -137 30 -149 83 -80 17 191 92 135 -70
$$ packed form
7526D0l1k47M24k76J15N0k51K11J12k42j7K80k27J33k1l63L84l0j04J04n3j17
7548a26R1k87K30N7j02L28k77J5J10r1J19j45P5j66K68k83P7J46J61l66K1J65
7570B0J98j72j52%J3K12j32J33l33L98k88M9NL0o6j62J57j1QM9K01k49K0K33l04
7595a43J54q5K5J89k2l6o7r8Oj38K79Q3k19LkJ40r3k3L84j77o3j61J47k96K37
7620B4q2J2J22q7j1n1K2k57K90j30K22jj31p2k06L15l2L13l36j15k4L88M6N4k94
7645b1m1P8p7K17k58J95J7j97n2O8L64m56J55J35k3q0R1j01k73L80j07L2J61j62
7669D5o0k46M66j26P8k00p7J14k06K04j8Q9l07L27J09m34L03o4j86J37Q6p2K27
7692A89k79l33N42l40K35P2j58J92j23p5J94j24j29J67j79K32j63R7J74r9M3k05
$$ plain form
7714 -70 108 249 376 158 -84 4 168 -9 105 36 -9 -141 -54 -34 129 -159 -103 26 88 151 100 68 -284 -15
7738 -15 84 -96 218 46 -65 -295 -199 104 123 -54 22 -238 -139 136 31 -38 112 25 177 185 268 -99 -175 114
7762 114 -56 -28 -122 90 2 -2 168 -57 -45 -128 -197 69 -19 64 215 30 153 -220 -121 -31 -157 71 -148 18
7786 18 -138 -118 28 317 -68 65 -116 75 -257 -119 -282 23 30 -1 278 -50 43 -59 5 72 192 -6 -85
7809 -85 -105 -152 -121 -124 -175 46 -63 1 -31 -58 -115 63 -49 -85 253 28 246 -48 -35 -4 -234 201 101 229 -108
7834 -108 -166 110 -114 -186 -60 106 -104 60 73 10 350 8 -88 -15 -119 112 -131 -80 -242 7 164 45
7856 45 -194 -44 10 39 -128 -159 217 -27 -153 56 285 240 -113 33 -132 -66 213 105 7 127 -2 153
7878 153 -25 -79 39 -37 -225 -73 174 44 24 -9 -60 270 301 306 150 61 4 -23 170 -167 -57 110 -131 126
$$ packed form
7714g0J78J41J27k18k42Q8J64j77J14o9m5j32Q7K0J63k88N6J29O2O3n1l2l52K69
7738a5R9j80L14j72j11k30R6L03J9j77P6k60R9K75j05o9J50q7J52QQ3l67p6K89
7762A14j70K8r4K12q8mJ70k25J2q3o9K66q8Q3J51j85J23l73R9R0j26K28k19J66
7786A8j56K0J46K89l85J33j81J91l32J38j63L05Pl1K79l28R3j02O4O7J20j98p9
7809h5k0m7L1ln1K21j09O4l2k7n7J78j12l6L38k25K18k94J3L1k30M35j00J28l37
7834a08n8K76k24p2J26J66k10J64J3o3L40l42r6P3j04K31k43N1j62K49J57j19
7856D5k39J50N4K9j67l1L76k44j26K09K29m5l53J46j65O6K79j08r8J20j29J55
7878A53j78n4J18p6j88J52K47j30k0l3n1L30L1Nj56q9n7k7J93l37J10J67k41K57
$$ plain form
7902 126 11 198 288 -51 -173 -65 -46 47 -164 67 73 18 49 182 124 -118 25 -37 -74 -78 -232 -236 -54 2 73
7927 73 126 -253 -29 -202 19 46 151 60 120 -5 146 164 -101 22 65 -81 22 117 63 280 3 -91 113
7950 113 156 -145 49 -133 53 -35 151 143 -65 93 -261 -125 238 323 15 -112 -197 -124 -37 46 -120 90 -46
7973 -46 -290 50 -214 -50 -313 -268 -40 -171 -29 -71 -13 -144 -140 -128 -37 229 70 -80 -155 -135 -42 107 -52 40
7997 40 30 95 -66 226 90 184 150 -133 173 151 -43 259 -147 -259 84 121 -16 0 60 -36 -5 3 -160 -119 -46
8022 -46 -135 66 50 4 -167 -26 23 -278 99 148 -170 -49 -11 -42 273 -330 -75 158 40 -160 188 -3 189
8045 189 -67 42 410 -112 -23 -276 27 235 -56 181 -73 -49 -203 -162 6 -65 -27 -88 50 -121 -188 -107 78
8068 78 -53 -17 -245 -18 -65 -146 -159 97 157 52 406 -28 -63 92 61 -144 193 64 -121 -199 -239 30 -38 130
$$ packed form
7902A26j15J87R0l39j22J08J9R3k11K31On5L1J33n8k42J43o2l7mj54mJ82N6P1
7927G3N3l79K24j73K21K7J05r1O0j25J51J8k65J23M3j46J03R5n4K17k77r4K04
7950A13M3l01J94j82J86q8J86qk08J58l54J36L63Q5l08j27q5P3Q7Q3j66K10j36
7973d6k44L40k64J64k63M5K28j31J42m2N8j31MJ2R1K66j59j50p5K0R3J49j59R2
7997D0j0O5j61K92j36R4l4k83L06k2j94L02m06j12L43L7j37J6O0r6L1Qj63M1P3
8022d6q9K01j6m6j71J41M9l01L77M9l18J21L8l1L15o03K55K33j18k00L48j91J92
8045A89k56J09L68n22Q9k53L03K08k91K37k54K4j54M1J68p1L8o1J38j71o7Q1J85
8068G8j31L6k28K27m7q1j3K56O0j05L54m34l5J55l1k05L37j29j85p8m0K69o8J68
$$ plain form
8092 130 271 -43 -95 -30 -6 97 -277 -48 114 58 2 -160 -75 -155 36 182 150 148 123 65 110 136 -108 71 -55
8117 -55 -71 132 8 -225 60 97 109 -71 24 -21 17 -5 139 52 139 3 -51 116 -26 -135 58 -75 77 344
8141 344 -194 345 123 163 -12 -31 51 -133 101 151 83 39 47 -144 -84 -11 -46 34 157 -262 181 119 -146 51
8165 51 97 -238 -110 -79 -145 35 -183 49 65 228 191 147 14 -30 -114 -77 92 -9 67 -316 -4 29 -86 -222
8189 -222 -137 170
$$ packed form
8092A30J41l14n2O5K4J03l74K29J62n6n6j62Q5q0J91J46l2kk5n8M5K6k44J79j26
8117e5j6K03j24k33K85L7J2j80R5m5L8k2J44q7Q7j36n4J67j42j09J93j33J52K67
8141C44n38N39k22M0j75j9Q2j84K34N0o8m4Qj91O0P3l5Q0J23m19M43o2k65J97
8165E1M6l35J28L1o6J80k18K32J6J63l7m4j33m4q4L7J69j01P6l83L12L3j15j36
8189b22Q5L07
8191A70
$$ Imaginary data points
##PAGE= N=2
##DATA TABLE= (X++(I..I)), XYDATA
$$ plain form
0 0 0 0 0 0 0 0 0 0 0 0 0 0 0 0 0 0 0 7 -8 8 -8 8 -9 16 -16 16 -24 24 -27 32 -36 41 -49 56 -60 67 -77 88 -97
39 -97 108 -122 133 -148 165 -181 203 -222 246 -271 299 -328 362 -400 440 -488 539 -596 663 -741
59 -741 832 -940 1071 -1236 1448 -1731 2133 -2751 3838 -6339 28912 -26186 -56306 -17597
73 -17597 -16008 53362 62811 -25745 -51908 -22655 -13870 48623 62567 -21311 -50717 -24400 -13123
86 -13123 44234 61425 -16461 -48478 -25533 -13255 39604 60287 -10874 -47276 -27285 -12451
98 -12451 35391 57528 -5179 -45345 -29423 -11461 32351 54528 -623 -42169 -31308 -11884
110 -11884 30120 52114 3293 -38862 -32564 -11964 27422 49771 6390 -36514 -33234 -12357
122 -12357 24998 47264 9711 -33324 -34419 -12814 23312 44688 11737 -30670 -34846 -13469
$$ packed form
0@%%%%%%%%%%%%%%%%%Pj5J6j6J6j7K5l2L2m0M8n1N9o8P7r0J05j16J27j44J65j85
39i7K05k30K55k81L13l46L84m25M68n17N70o27O90p62Q40r28J027j135J259j404
59g41J573j772K011k307K684l179L864m884O589j0177L5251n5098l0120L8709
73a7597J589O9370R449q8556k6163K9253Q785O2493J3944q3878k9406K6317J1277
86a3123N7357J7191p7886l2017K2945J2278N2859K0683p1161l6402J9991J4834
98a2451M7842K2137o2707m0166J5922J7962M3812K2177n5151m1546J0861J9424
110a1884M2004K1994m8821m2155O298K0600L9386K2349m3381m2904L280K0877
122a2357L7355K2266l7553m3035j095K1605L6126K1376l2951m2407m176K1377
$$ plain form
134 -13469 21821 42589 13820 -27691 -35145 -14241 20472 40326 15244 -25153 -35270 -14887
146 -14887 19375 38643 16482 -22812 -35359 -15583 18011 37000 17288 -20297 -35000 -16402
158 -16402 16728 35238 18448 -17929 -34558 -17478 15553 34075 19337 -15859 -33931 -18153
170 -18153 14382 32797 19657 -13441 -33601 -19021 13614 31300 19895 -11467 -32569 -19790
182 -19790 12395 30435 20196 -9503 -32202 -20953 11259 29275 20455 -7340 -31076 -22161
194 -22161 10049 28449 20922 -5439 -29848 -22748 8448 27473 21099 -3886 -28672 -23717 7467
207 7467 26472 21198 -2160 -27414 -24247 5856 25895 21401 -904 -26101 -24847 4457 24992
220 24992 21674 766 -24890 -25453 3003 24197 21448 1927 -23638 -25912 1725 23242 21416
$$ packed form
134a3469L5290K0768k8769m1511p454K0904L4713J9854k5082m0397j0117K0383
146a4887L4262J9268k2161l9294j2547J9776L3594J8989j9712l7585j4703J8598
158a6402L3130J8510j6790l6377j6629J7080L3031J8522j4738l5196j8072J5778
170a8153L2535J8415j3140l3098k0160J4580L2635J7686j1405l1362k1102J2779
182a9790L2185J8040j0239k9699k2699J1249L2212J8016q820k7795k3736Q915
194b2161L2210J8400p527k6361k4409P100L1196J9025o374k4985k4786M955L1184
207G467J9005n274k3358k5254L167L0103K0039m494k2305k5197J254K9304K0535
220B4992l318k0908k5656n63K8456K1194k749j9521k5565k274K7637K1517j826
$$ plain form
233 21416 3083 -22302 -25973 260 22764 21025 3937 -21064 -26403 -810 21901 21337 4880
246 4880 -19723 -26104 -2194 21107 21203 5568 -18321 -26165 -3631 20032 21039 6396 -17118
259 -17118 -26191 -4402 19142 21217 7297 -16006 -25910 -6074 18508 21095 7719 -14476 -25771
272 -25771 -6954 17312 21257 8181 -13411 -25486 -8253 16277 21167 9196 -12104 -25070
284 -25070 -9528 15058 21030 9845 -10828 -24425 -10209 13845 20787 10416 -9888 -23737
296 -23737 -11328 12726 20612 10905 -8456 -23131 -12185 11481 20638 11345 -7436 -22157 -13255
309 -13255 10295 20141 11931 -6604 -21407 -14088 9255 19977 12308 -5715 -20626 -14191 8090
322 8090 19903 12982 -4957 -19864 -14616 6971 19583 13413 -4322 -19133 -15118 5850 19274
$$ packed form
233B1416j8333k5385l671K6233K2504j739j7088k5001n339K5593K2711n64j6457
246D880k4603o381K3910K3301R6j5635k3889p844K2534K3663J007j4643k3514
259a7118r073K1789K3544K075j3920k3303r904J9836K4582K587j3376k2195j1295
272b5771J8817K4266L945j3076k1592j2075J7233K4530M890j1971k1300j2966
284b5070J5542K4586N972j1185k0673j3597J4216K4054O942j0371k0304j3849
296b3737J2409K4054P886r707j9361j4675J0946K3666R157r293j8781j4721Q902
309a3255K3550R846q210j8535j4803P319K3343J0722p669j8023j4911O435K2281
322H090J1813o921j7939j4907N248K1587J2612o170j7735j4811M015K0968J3424
$$ plain form
335 19274 13232 -3701 -18335 -15365 4591 18720 13620 -3275 -17977 -15604 3479 18377 14103
348 14103 -2614 -16910 -15991 2272 18090 14396 -1777 -16170 -15889 1203 17181 15046 -974
361 -974 -15534 -16031 329 16395 15344 -622 -14596 -15993 -714 15961 15209 353 -14209 -15821
375 -15821 -1723 15225 15631 836 -13679 -15697 -2475 14499 16258 1674 -13005 -15588 -3528
388 -3528 13726 16478 2022 -12430 -15623 -4030 12909 16289 2595 -11803 -15260 -4626 12139
401 12139 16486 3543 -11244 -14915 -5458 11555 16526 4018 -10933 -15075 -5965 10385 16423
414 16423 4397 -10202 -14925 -6396 9545 16657 5360 -9705 -14800 -7126 9038 16277 6110
427 6110 -9224 -14465 -7072 7720 16098 6740 -8523 -14440 -7690 7079 15801 7417 -7952 -14318
$$ packed form
335A9274o042j6933j4634K970J9956J4129n100j6895j4702K373J9083J4898m274
348A4103j6717j4296R19J8263J5818l694j6173j4393K81J7092J5978k135j6020
361i74j4560m97J6360J6066j051j5966j3974j397J5279J6675p52j4856j4562j612
375a5821J4098J6948M06j4795j4515k018J3222J6974J759j4584j4679k583J2060
388c528J7254K752j4456j4452l193J1593J6939L380j3694j4398l457J0634J6765
401A2139M347j2943j4787l671R457J7013M971j2508j4951m142R110J6350O038
414A6423j2026j4599m723Q529J5941P112j1297j5065n095P674J6164P239j0167
427F110j5334n241P393J4792Q378r358j5263n917O750J4769Q722q384j5369o366
$$ plain form
441 -14318 -8155 6663 15696 8076 -7018 -14047 -8220 5631 15427 8418 -6694 -13697 -8952 4584
455 4584 14851 9120 -5577 -13337 -8944 4070 14393 9718 -5186 -13610 -9268 3368 14036
468 14036 10121 -4261 -12952 -9534 2898 13281 10233 -3803 -12848 -9971 2248 12967 10630
481 10630 -2888 -12466 -9985 1538 12610 10626 -2376 -12215 -10101 1410 12036 10869 -1704
494 -1704 -11930 -10304 673 11781 11165 -1055 -11653 -10331 264 11198 11041 -437 -11387
507 -11387 -10619 -12 10671 11170 -248 -10986 -10754 -453 10354 11495 325 -10718 -10835 -572
521 -572 9816 11203 995 -10390 -10727 -1161 9786 11340 1580 -9790 -11034 -1401 9237 11336
535 11336 2003 -9518 -11198 -1902 8821 11131 2310 -8748 -11335 -2585 8514 11205 2995 -8618
$$ packed form
441a4318O163J4818R033p620j5094p029N827J3851R796p009j5112p003M745J3536
455D584J0267n731j4697p760M393J3014J0323m675j4904q424M342J2636J0668
468A4036l915j4382q691L418J2432J0383l048j4036r045K877J2219J0719k337
481A0630j3518r578K481J1523J1072j984j3002r839K114J1511J0626j167j2573
494a704j0226J626J0977J1108o16j2220j0598J322J0595J0934j57j1478j0950
507a1387P68J0607J0683M99j1418j0738K32J0301J0807J141j1170j1043j17J0263
521e72J0388J387j0208j1385l37R566J0947J554r760j1370j244R633J0638K099
535A1336r333j1521j680R296J0723K310q821j1058k587Q750J1099K691q210j1613
$$ plain form
549 -8618 -11023 -2919 7995 11173 3750 -7873 -11140 -3505 7394 11220 3911 -7365 -11210 -4084
563 -4084 6822 11033 4388 -6676 -10988 -4717 6310 10998 4593 -6318 -10890 -4642 5964 10933
577 10933 5078 -5816 -10805 -4987 5462 10531 5297 -5140 -10745 -5591 4894 10588 5725 -4748
591 -4748 -10589 -5920 4475 10509 6116 -4413 -10287 -6185 4331 10342 6269 -3886 -10249 -6482
605 -6482 3498 10087 6822 -3566 -9966 -6612 3048 9881 6827 -3107 -9679 -6849 2879 9542 7046
620 7046 -2899 -9615 -6911 2375 9529 7150 -2409 -9108 -7258 1709 9419 7630 -1996 -9058 -7356
635 -7356 1345 9072 7415 -1278 -8791 -7446 1009 8697 7754 -1307 -8652 -7555 607 8637 7793 -786
651 -786 -8221 -7606 137 8556 8255 -301 -8115 -7784 -246 7780 8046 110 -7505 -7657 -1013 7532 8499
$$ packed form
549h618k405Q104J0914L178p423j1623l267P635J0899L826p309j1276l845P126
563d084J0906M211o645j1064m312O271J1027M688o405j0911m572O248J0606M969
577A0933n855j0894m989N818J0449N069n234j0437n605N154J0485N694m863j0473
591d748n841M669J0395O034m393j0529n874M102J0516O011m073j0155o363L767
605f482R980O589l265j0388o400L354R660O833l054r934o572K830R728O663k496
620G046r945o716K704R286P154k379r559o699J850Q967P710j789r626p062J702
635g356Q701P727j657q693p513J345Q455P688r43r061p345J097Q162Q030q44q579
651g86p435O15P743Q419l01q556p814L31P538Q026K66p936p615j52O644Q545R67
$$ plain form
668 8499 429 -7376 -7917 -849 7039 8415 614 -7294 -7833 -1557 6947 8351 1394 -7019 -7978 -1848
684 -1848 6444 8517 1391 -6695 -7981 -1830 6190 8549 1993 -6415 -7860 -2234 5794 8335 2358
699 2358 -6190 -7796 -2543 5625 8587 2855 -6043 -8023 -2835 4973 8373 2771 -5696 -8033 -2945
714 -2945 4821 8319 3316 -5067 -7808 -3097 4512 8175 3671 -4903 -7625 -3360 4181 8120 3833
729 3833 -4479 -7801 -3613 3686 8016 4246 -3975 -7808 -3805 3592 7697 4537 -3524 -7818 -4056
744 -4056 2952 7534 4832 -3388 -7838 -4392 2815 7425 4850 -2819 -7735 -4412 2365 7109 5299
759 5299 -2806 -7820 -4422 2457 7104 5360 -2427 -7686 -4865 2141 6901 5459 -1715 -7454 -5133
774 -5133 1965 7031 5259 -1390 -7259 -5451 1528 6469 5650 -1316 -7191 -5492 1206 6426 5914 -637
$$ packed form
668H499q070p805n41P068P888J376p801p908n39O276Q504J404o957q413r59O130
684a848Q292K073p126q086j286O151Q020K359o556q408j445N626Q028K541n977
699B358q548j606N253Q168K962n732q898j980N188P808L400n602q467k337N088
714b945P766L498n003q383k741M711P609L663m504q574k722M265P541L939m287
729C833q312l322M188P299M330l770q221l833M003P397M105l160q061m294L762
744d056P008M582k702q220m450L446P207M610k575p669m916L323O777M744j810
759E299q105n014L398O879M647j744p787n259K821P006M760j442p174n739K321
774e133P098N066j772o649n869J808O979M941q19o966n875J699O698N220n12o551
$$ plain form
790 -637 -6839 -5434 1169 6047 5965 -170 -6497 -5752 814 5910 5752 89 -6172 -5849 344 5900 5835
807 5835 302 -6091 -6098 55 5863 5989 966 -6034 -6142 -117 5623 5804 783 -5434 -6546 -541 5212
824 5212 5871 1225 -5109 -6497 -619 4927 6004 1496 -4987 -6639 -1157 4887 5983 1681 -4788
839 -4788 -6404 -1344 4762 5696 2031 -4176 -6473 -1558 4585 5613 2337 -3962 -6674 -1632 4247
854 4247 5811 2109 -3875 -6505 -1954 4110 5560 2397 -3391 -6604 -2426 3946 5676 2648 -3378
869 -3378 -6441 -2367 3692 5673 2532 -2997 -6431 -2883 3732 5753 2950 -2747 -6104 -3214 3230
884 3230 5685 2917 -2302 -6230 -3329 3113 5885 2955 -2196 -5972 -3337 2862 5811 3200 -1938
899 -1938 -5785 -3759 2389 5620 3356 -1681 -5412 -4218 2054 5499 3398 -1327 -5474 -4319 1861
$$ packed form
790f37o202J405O603M878q2o135o327P45O566N096j58n663o261L23O193N556o5
807E835n533o393pO153N808J26n023p000j08O025N740J81n021o217j112O005N753
824E212O59m646o334j388N878N546J077m508o483j652N482O044J096m302o469
839d788j616N060O106R34l665o207k297M915O143J028l276o299k712N042N879
854D247J564l702n984k630M551O064J450l163n788l213M178O372J730l028o026
869c378l063M074O059J981l141n529l434L548O615K021k803n697l357K890O444
884C230K455k768n219l928K901O442K772k930n151l776K635O199K949k611n138
899a938l847K026O148L231k264n037l731J194O272L445k101m725m147J155O180
$$ plain form
914 1861 5388 3502 -1264 -5142 -4172 1463 5443 3715 -959 -4962 -4371 1296 5401 3686 -858 -4548
930 -4548 -4481 985 5318 4017 -725 -4677 -4730 820 5012 4142 -611 -4449 -4793 376 5130 4168 -472
947 -472 -4235 -4576 94 5024 4290 -159 -4271 -4765 -331 4916 4366 217 -3934 -4600 -490 4714 4664
964 4664 278 -3790 -4723 -664 4281 4270 364 -3517 -4502 -900 4176 4759 487 -3409 -4622 -1235
980 -1235 3915 4658 671 -3588 -4476 -1452 3725 4629 768 -3290 -4451 -1905 3615 4749 1012 -3449
996 -3449 -4351 -1774 3371 4775 1313 -2945 -4371 -1863 3182 4703 1302 -2857 -4532 -1996 2996
1011 2996 4958 1473 -2571 -4223 -2062 2616 4989 1788 -2733 -4189 -2217 2615 4952 2020 -2769
1026 -2769 -4111 -2302 2165 4772 2142 -2327 -3984 -2200 1924 4622 2255 -2201 -4375 -2483 1546
$$ packed form
914A861L527j886m766l878R70N635L980j728m674m003N91N667M105j715m544l690
930d548O7N466M333j301m742l952n3N550M192q70m753l838l44N169M754r62m640
947d72l763l41M670M930p34m449m112m94M434N247n50m149m151o66M110N204n0
964D664m386m068r33M059M945j1l906l881r85L602N076N83m272l896j213L387
980a235N150P43l987m259q88L024N177R04l861m058j161K546N520J134l737m461
996c449r02K577N145J404l462m258j426K508N045J521l401m159j675K536M992
1011B996J962l485m044j652K161M678K373l201m521j456J972M832K337k932m789
1026b769j342J809M467K607k630m469j657J784M124K698k367m456k174J892M029
$$ plain form
1041 1546 4893 2226 -1884 -4088 -2632 1213 4466 2683 -1935 -4013 -2567 1033 4479 2728 -1425
1056 -1425 -3936 -2717 1027 4228 3019 -1531 -3969 -2862 1089 4271 3209 -1286 -3725 -2713 622
1071 622 3927 3269 -1226 -3890 -2853 458 3958 3329 -1256 -3904 -2802 294 3607 3507 -821 -3758
1087 -3758 -2996 476 3703 3630 -511 -3630 -3066 135 3847 3503 -283 -3575 -3047 -160 3223 3695 50
1104 50 -3603 -2888 -145 3237 3726 -53 -3476 -3225 1 3106 3339 115 -3436 -3242 -346 2759 3609
1121 3609 541 -3420 -3434 -133 2649 3456 725 -3354 -3328 -402 2849 3572 950 -2896 -3512 -576 2734
1138 2734 3678 849 -3076 -3408 -772 2267 3222 1021 -2943 -3456 -662 2256 3489 1621 -2743 -3403
1154 -3403 -773 2269 3492 1257 -2478 -3699 -1203 2050 3596 1367 -2396 -3547 -1077 1865 3268
$$ packed form
1041A546L347k667m110k204J456L845L253j783m618k078J446L600L446j751m153
1056a425k511J219L744L201j209m550k438J107L951L182j062m495k439J012L335
1071F22L305o58m495k664J037L311L500o29m585k648J102L096L313j00m328k937
1087c758P62L472L227p3m141l119N64L201L712l44l786l292N28K887L383M72l645
1104E0l653P15K743L382M89l779l423K51L226L105K33l224l551J94K896L105Q50
1121C609l068l961j4L301K782Q07k731m079K6K926L251P23k622l846o16K936L310
1138B734R44k829l925l32K636L039R55k201l964n13K794K918J233j868m364o60
1154c403K630L042J223k235l735j221K496L253J546k229l763j151K470K942J403
$$ plain form
1169 3268 1706 -1949 -3759 -1167 1902 3312 1854 -1983 -3547 -1419 1625 3241 1848 -1740 -3623
1184 -3623 -1390 1704 3185 2069 -1672 -3630 -1458 1556 3202 2018 -1548 -3444 -1814 1430 2978
1199 2978 2126 -1154 -3525 -2006 1423 3086 2120 -940 -3581 -2054 1286 3088 2187 -851 -3564 -2082
1215 -2082 1565 2876 2078 -945 -3348 -2255 906 3142 2378 -839 -3540 -2295 910 2861 2459 -314
1231 -314 -3213 -2387 682 3028 2299 -297 -2972 -2654 556 2705 2395 -257 -2988 -2615 370 2714
1247 2714 2386 -121 -2675 -2508 183 2605 2479 121 -2755 -2706 171 2628 2471 308 -2324 -2706 171
1264 171 2833 2431 33 -2500 -2755 -218 2368 2697 375 -2445 -2713 -341 2388 2203 578 -2355
1280 -2355 -2701 -192 2215 2616 282 -2177 -2581 -366 2136 2645 631 -1969 -2998 -836 2255 2635
$$ packed form
1169C268j562l655j810K592L069J410j458l837j564K128L044J616j393l588j883
1184c623K233L094J481j116l741j958K172L014J646j184l566j896J630L244J548
1199B978q52l280k371J519L429J663r66l060k641J527L340J802r01l038k713J482
1215b082L647J311p98l023k403J093L161K236p64l217k701J245L205J951m02k773
1231c14k899Q26L069K346p29k596k675L18L210K149l10k652k731L73K985K344
1247B714l28k507k554J67K691K422j26k358k876M9K877K457j57k163k632l82K877
1264A71K662m02k398k533k55K537K586L29k322k820k68K372K729j85j625k933
1280b355l46K509K407M01k334k459m04K215K502N09k014k600j029K162L091L80
$$ plain form
1296 2635 566 -1809 -2744 -840 2164 2554 728 -1675 -2667 -670 1887 2626 753 -1568 -2749 -974
1312 -974 1939 2592 768 -1590 -2539 -869 1812 2521 1026 -1421 -2647 -1350 1642 2553 1170 -1341
1328 -1341 -2596 -1339 1756 2423 1346 -1367 -2657 -1295 1597 2612 1174 -1220 -2463 -1490 1119
1343 1119 2597 1075 -1133 -2421 -1655 881 2540 1337 -884 -2318 -1598 986 2461 1516 -1110 -2487
1359 -2487 -1619 1041 2660 1572 -973 -2373 -1863 799 2404 1687 -722 -2134 -1777 797 2472 1687
1375 1687 -483 -2234 -1841 425 2495 2118 -547 -2302 -1832 392 2464 1801 -260 -2102 -1915 115
1391 115 2292 2059 -515 -2321 -2001 54 2147 1974 -116 -1925 -1952 175 2170 2085 -285 -1654 -1876
1408 -1876 -77 2072 2023 -54 -2042 -2100 98 1942 1927 251 -2022 -1820 12 1846 2209 156 -1974
$$ packed form
1296B635k069k375r35J904L004L90j826k403r92J997K557P39j873k321j181J775
1312i74K913O53j824k358r49J670K681P09j495k447j226J297K992R11j383k511
1328a341j255J257L095O67j077k713j290J362K892J015j438k394j243R73K609
1343A119J478j522k208j288P66K536J659j203k221j434P20K584J475r45k626j377
1359b487Q68K660J619j088k545j400N10K662J605p17k409j412L57K574J675p85
1375A687k170j751L93K266K070l77k665j755M70K224K072o63k061j842J87K030
1391A15K177k33k574j806L20K055K093j73k090j809k7K127J995q5k370j369k22
1408a876J799K149m9k077j988n8K198J844j5j676k273K02J832J834L63k053k130
$$ plain form
1425 -1974 -2108 -345 2030 2144 313 -1820 -2023 -414 1749 1967 343 -1674 -2085 -334 1507 2009
1441 2009 430 -1741 -1867 -767 1428 1943 570 -1487 -1850 -459 1479 2153 536 -1512 -1717 -605
1457 -605 1560 2062 863 -1564 -2245 -721 1222 2070 734 -1375 -1862 -848 1016 1951 774 -1049
1473 -1049 -2135 -836 1089 1945 1086 -1093 -1926 -1180 1030 2050 973 -1207 -2086 -921 1141 1989
1489 1989 1288 -877 -1950 -842 949 1862 840 -932 -1982 -1082 770 1909 1327 -650 -1863 -1161
1505 -1161 730 1719 1234 -864 -1993 -1111 870 1793 1153 -576 -2053 -1162 464 1840 1275 -401 -1717
1522 -1717 -1253 484 1539 1736 -629 -1616 -1606 333 1958 1543 -442 -1652 -1194 617 1600 1380 -197
1539 -197 -1757 -1244 434 1815 1440 -323 -1620 -1469 273 1892 1610 -213 -1819 -1570 106 1549
$$ packed form
1425a974j34J763K375J14j831k133k03J609K163K18j624k017m11J751J841N02
1441B009j579k171j26J100K195N15j373k057l63J391J938O74j617k048k05J112
1457f05K165N02j199k427o81J524J943Q48j336k109m87J014J864R35j177j823
1473a049j086J299J925Q56q59k179q33P46K210J020j077k180q79J165K062Q48
1489A989p01k165j073J108J791R13j022j772j050R00J852J139n82j977j213P02
1505a161J891R89m85k098j129Q82J981R23o40j729j477Q91J626J376n65j676j316
1522a717M64J737J055J97k365r87J0J939J625m15j985j210M58J811R83k20j577
1539a97j560N13J678J381l75j763j297J51J742J619k82j823j606K49J676J443
$$ plain form
1555 1549 1442 -216 -1565 -1410 4 1615 1459 -565 -1290 -1531 -207 1615 1687 47 -1484 -1376 16
1572 16 1246 1604 142 -1394 -1635 -170 1499 1709 118 -1472 -1622 -460 1518 1757 378 -1330 -1625
1589 -1625 -275 1380 1810 393 -1417 -1532 -456 1060 1390 477 -1061 -1582 -477 990 1604 420
1605 420 -1185 -1492 -601 1130 1793 478 -950 -1683 -648 1105 1534 583 -1032 -1597 -648 947 1437
1622 1437 730 -990 -1605 -690 834 1648 880 -1029 -1566 -904 844 1537 720 -970 -1505 -770 826 1381
1640 1381 799 -768 -1575 -737 636 1559 870 -707 -1517 -1026 511 1601 852 -834 -1606 -713 284 1536
1658 1536 1016 -452 -1634 -832 762 1397 782 -439 -1401 -1063 551 1491 1079 -525 -1457 -953 569
1675 569 1508 980 -311 -1232 -838 320 1499 1153 -386 -1453 -1104 219 1643 985 -322 -1220 -1221 152
$$ packed form
1555A549j07j658j349J55J414J611j56k024p25k41J324J822P2j640j531J08J392
1572A6J230L58j462j536k41J465J669K10j591j590j50J162J978K39j379j708k95
1589a625J350J655M30j417j810j15J076J516L30r13j538n21J105J467O14j184
1605D20j605l07Q91J731O63j315j428p33J035J753M29r51j615n65R49J595M90
1622A437p07j720o15R15J524Q14p68j909n37O62J748O93q17j690n35P35J596N55
1640A381n82j567q07Q38J373R23o89j577q10M91J537J090p49j686p72Q93R97J252
1658A536n20j468j182Q02J594O35o15j221r62L38J614R40m12j604r32N04J522
1675E69R39n28j291r21L94J158J179l46j539j067L49J323J424o58j307q98jJ373
$$ plain form
1693 152 1216 1174 -53 -1236 -1346 -139 1272 1303 -43 -1330 -959 223 1038 1207 -377 -1351 -1217 -10
1711 -10 1258 1274 -90 -1240 -1152 -201 1387 1427 62 -1407 -1309 -49 1400 1281 -94 -1269 -1183 -231 1464
1730 1464 1341 125 -1085 -1304 -154 663 1258 177 -1173 -1308 69 1129 1150 84 -999 -1273 -165
1747 -165 1120 1458 509 -832 -1106 -228 969 1270 538 -1065 -1204 -256 558 1092 468 -897 -1231 -425
1765 -425 840 1299 359 -793 -1489 -366 481 1357 524 -760 -1200 -409 774 1072 573 -712 -1090 -670
1783 -670 733 1146 678 -585 -1016 -539 750 1172 546 -383 -1110 -676 306 1133 799 -503 -1151 -777 746
1802 746 1159 689 -384 -1166 -628 336 1144 760 -234 -802 -565 623 1005 941 -36 -1349 -821 290 1268
1821 1268 878 -211 -1108 -742 236 1168 797 -227 -1237 -734 263 1315 815 -130 -976 -858 411 1036
$$ packed form
1693A52J064m2j227j183j10J207J411L1j346j287L71J182Q15J69j584r74J34J207
1711a0J268J6j364j150Q8R51J588M0j365j469R8J260J449j19j375j175Q6R52J695
1730A464j23j216j210k19J150Q17N95j081j350j35J377J060K1j066j083k74J108
1747a65J285L38r49j341k74Q78J197L01p32j603j39R48Q14N34o24j365l34Q06
1765d25J265M59r40j152o96J123Q47Q76q33j284m40P91J183K98m99j285l78M20
1783f70J403M13m68j263m31M77J289M22o26r29p27M34R82Q27l34j302o48L74J523
1802G46M13m70j073p82N38R64Q08l84r94n68K37J188L82o4r77j313N28J111R78
1821A268l90j089q97L66R78R32l71j024j010N03R97J052n00r45q46J18J269O25
$$ plain form
1839 1036 956 79 -1055 -942 247 1229 712 -56 -985 -1069 392 1186 799 -33 -1064 -702 144 713 821
1858 821 -10 -1040 -1019 -51 746 737 -69 -797 -947 10 906 620 13 -638 -1000 -117 1058 757 -96 -698
1878 -698 -988 -219 734 1001 195 -762 -812 -48 917 988 152 -637 -1181 -132 1030 780 377 -386 -864 136
1898 136 909 938 166 -458 -890 -482 735 882 244 -547 -986 -302 683 947 597 -746 -824 -281 549 825
1918 825 382 -619 -1105 -548 730 1101 333 -339 -680 -240 492 830 385 -337 -947 -474 674 931 421
1937 421 -355 -909 -410 309 822 737 -341 -833 -604 433 847 363 -30 -898 -414 243 809 560 -305 -801
1957 -801 -509 408 958 593 -23 -651 -632 342 913 556 -133 -891 -502 262 1105 433 -219 -976 -662 165
1977 165 833 556 -195 -715 -657 228 622 825 -359 -742 -457 124 922 517 -59 -509 -756 75 574 401
$$ packed form
1839A036q0q77j134J13J189R82n17p68r29q4J461P94l87q32j031L62Q46N69J08
1858H21q31j030K1R68P97rq06p28j50R57Q96k86o07o51l62Q83J175l01q53o02
1878f98k90P69R53K67q06r57n0P64R65P1q36p89n44J049J162k50m03p63m78J000
1898A36P73K9p72o24m32M08J217J47o38p91m39O84R85K64l50j343p8N43Q30K76
1918H25m43j001m86N57J278L71p68o72l41M40P32L38m45p22o10M73J148K57n10
1937D21p76n54M99P19N13q5j078m92K29J037M14m84l93q68M84O57N66k49q65m96
1957h01K92R17N50l65o16o28J9R74N71l57o89p58L89P64Q43o72o52p57L14Q27
1977A65O68k77p51n20N8Q85L94K03j184l83K85N81P98m05n76m50k47Q31M99j73
$$ plain form
1997 401 -47 -515 -514 -58 732 678 -32 -384 -605 64 714 932 8 -839 -590 -169 704 401 -105 -540 -613
2018 -613 -172 627 573 282 -752 -596 -273 803 630 -73 -609 -573 -277 451 542 190 -526 -504 -73 416 699
2039 699 36 -408 -863 -109 608 762 85 -481 -703 124 185 651 188 -584 -671 -115 534 909 186 -443 -725
2060 -725 -422 190 671 139 -402 -504 -251 365 727 431 -565 -922 -217 516 771 218 -309 -693 -346 93
2080 93 592 151 -370 -606 -77 562 727 329 -123 -628 -154 405 458 253 -508 -536 -538 235 717 291 -413 -782
2102 -782 -108 238 656 482 -95 -597 -287 314 704 484 -267 -725 -473 131 406 490 -332 -533 -338 182
2122 182 508 361 -349 -357 -408 200 512 252 -77 -460 -409 127 443 177 -231 -717 -340 123 719 218 -60
2143 -60 -449 -392 -54 463 396 -166 -761 -661 187 517 231 60 -605 -590 49 282 340 -34 -451 -432 -61 352
$$ packed form
1997D01m48m68JM56P90n4p10l52k21O69O50K18r24q47K49M21Q73l03n06m35p3
2018f13M41P99n4k91j034J56L23J076j73p03n36L6K96P28R1l52p16K2M31M89K83
2039F99o63m44m55P54P17J54o77n66k22Q27O1M66m63p72q7N56O49L75p23o29k82
2060g25L03O12M81n32n41j02K53O16L62k96r96l57P05P33K55n53n27l84L47M39
2080I3M99m41n21k36N29O39J65l98m52n05M74N59N3k05p61k8kP73M82m26p04l69
2102g82O74L46M18j74n77n02L10O01L90k20p51m58K52O04K75Q4q22k01J95N20
2122A82L26j47p10qn1O08L12k60l29l83N1N36L16k66m08m86L77M63N96n01k78
2143f0l89N7L38N17o7n62n95J00Q48L30k86j71o65J5O39K33N8l74m17J9L71M13
$$ plain form
2165 352 220 166 -382 -388 68 279 263 127 -500 -375 -85 393 258 74 -427 -320 -64 380 619 164 -246
2186 -246 -538 13 242 622 130 -212 -217 -63 286 372 342 -231 -476 162 247 293 220 -201 -354 -106 425 304
2208 304 288 -157 -228 -114 309 262 105 -50 -291 -150 71 337 218 -110 -416 45 131 493 218 -181 -296
2229 -296 -336 247 408 72 -125 -464 -165 193 633 -31 -105 -625 -220 166 497 -86 -324 -497 -124 159 475
2250 475 230 -38 -439 -92 -92 233 382 -63 -54 -209 100 389 190 -315 -329 -355 75 156 84 -109 -253 -72 159
2273 159 191 105 95 -249 -212 -97 403 -41 -162 -194 -168 159 367 99 37 -545 -21 131 298 291 -23 -29 -186 96
2297 96 111 113 -17 -318 -225 129 262 413 -34 -316 -355 -16 135 203 -70 17 -298 -77 211 366 45 -211 -49
2320 -49 19 226 257 -173 -149 -233 241 127 227 -106 -382 -260 -213 338 399 45 -384 -281 168 62 135 82 -290
$$ packed form
2165C52j32n4n48oM56K11j6j36o27J25K90M78j35j84n01J07K56M44K39m55m10
2186b46k92N51K29L80m92l42nJ54L49Q6l0n73k45O38Q5M6p3m21j53K48N31j21
2208C04j6m45p1J14M23m7j57j55k41J41K21K66j19l28l06M61Q6L62k75l99j15
2229b96m0N83J61l36j97l39K99L58M40o64p4n20M05L86L31n83k38j73L73K83L16
2250D75k45k68m01L47%L25J49m45Rj55L09K89j99n05j4k6M30Q1p2j93j44J81K31
2273A59L2q6j0l44L7J15N00m44j21l2K6L27K08k68o2n82N24J52J67pl14oj57K82
2297I6J5Kj30l01R3L54J33J51m47k82l9L39J51O8k73Q7l15K21K88J55l21k56J62
2320d9O8K07L1m30K4q4M74j14J00l33k76J22M7N51O1l54m29J03M49j06P3n3l72
$$ plain form
2343 -290 -338 97 293 99 59 96 -208 100 204 123 15 -91 -325 39 203 -128 130 -191 -209 -26 150 518
2365 518 241 -157 -189 -39 310 168 -77 -150 -417 -158 222 208 79 39 -113 18 241 166 347 50 -59 -11
2387 -11 288 61 10 -401 -351 -111 27 100 -93 -58 -176 -229 94 105 34 -73 -178 -290 34 147 120 -185 -224
2410 -224 -111 54 440 -44 -246 -303 -353 90 237 -32 -171 -166 -174 63 126 122 -48 38 -65 46 178 255 -44 -116
2434 -116 -122 195 161 196 -14 -150 68 56 67 69 11 55 -184 -13 80 58 33 -180 -56 192 33 53 -146 -91 -213
2459 -213 216 202 201 -29 -110 -105 -95 540 -166 -39 -205 -8 9 -140 108 -181 -83 75 127 -39 215 93 -185
2482 -185 62 1 131 3 -132 -434 -143 156 18 3 -289 242 -91 -105 143 -177 16 41 -38 -107 176 220
2504 220 7 160 -118 -45 111 -296 -46 -255 -52 36 -79 -57 61 -223 -147 126 132 75 -42 -47 -108 259 63
$$ packed form
2343b90m8M35J96j94m0L7l04L08J04q1j08j06k34L64J64l31K58l21j8J83J76L68
2365E18k77l98l2J50L49j42k45p3k67K59L80j4j29m0j52J31K23p5J81k97j09M8
2387a1K99k27n1m11N0K40J38P3j93L5j18n3L23J1p1j07j05j12L24J13k7l05l9
2410b24J13J65L86m84k02n7n0M43J47k69j39NqK37O3mj70Q6j03J11J32P7k99p2
2434a16oL17l4L5k10j36K18j2J1Kn8M4k39J71R3k2k5k13J24K48j59K0j99N5j22
2459b13M29j4jk30q1NJ0O35p06J27j66J97J7j49K48k89R8J58N2j66K54j22k78
2482a85K47o1J30j28j35l02K91K99j38j5k92N31l33j4K48l20J93K5p9o9K83M4
2504B20k13J53k78P3J56m07K50k09K03Q8j15K2J18k84P6K73On7j17no1L67j96
$$ plain form
2527 63 -123 27 -196 104 -28 -61 -111 -120 -52 -22 -10 -66 15 57 -226 -226 31 -71 54 75 67 80 110 180 142 -244 -39
2554 -39 -165 2 135 32 -21 -301 -138 -2 -66 35 -68 -86 168 -11 135 255 61 -114 -199 -12 59 124
2576 124 55 -236 137 254 135 -75 6 151 79 -6 35 89 6 -162 118 167 82 -99 83 -62 126 124 116 -150
2600 -150 -286 -3 -94 -74 83 -80 -135 -215 100 -153 14 77 -2 -179 111 92 72 222 124 142 45 147 179 133
2624 133 66 40 39 -160 -36 143 92 -47 146 -27 9 34 -50 11 -90 127 50 34 -32 26 -66 180 -279 254 25
2649 25 -114 -182 -67 295 -234 -89 -143 -31 55 -13 -158 -22 -214 14 278 3 -91 -70 -127 57 87 -254 9
2672 9 -189 -32 30 65 5 110 -126 -160 -168 -286 243 -5 48 -89 106 93 26 -29 70 -88 -1 -75 -1 -269 -187 192
2698 192 -25 206 49 -294 -91 -57 124 19 135 84 -285 94 -119 161 38 -158 100 -293 159 23 -58
$$ packed form
2527F3j86J50k23L00j32l3n0rO8L0J2n6Q1M2k83%K57j02J25K1qJ3L0P0l8l86K05
2554c9j26J67J33j03n3k80J63J36o4J01j03j8K54j79J46J20j94j75q5J87P1O5
2576A24o9k91L73J17j19k10Q1J45p2q5M1N4q3j68K80M9q5j81J82j45J88kqk66
2600a50j36K83r1K0J57j63n5q0L15k53J67O3p9j77K90j9k0J50r8J8r7J02L2m6
2624A33o7k6jj99J24J79n1j39J93j73L6K5q4O1j01K17p7j6o6N8r2K46m59N33k29
2649B5j39o8J15L62n29J45n4J12Q6o8j45J36j92K28K64k75r4K1n7J84L0l41K63
2672Ij98J57O2L5o0J05k36l4qj18N29k48N3j37J95j3o7n5R9j58Q7p4P4k68Q2L79
2698A92k17K31j57l43K03L4J81j05J16n1l69L79k13K80j23j96K58l93M52j36q1
$$ plain form
2719 -58 67 329 50 -24 -5 169 54 -49 -135 22 122 160 32 -15 203 -253 121 163 71 68 -186 -111 -50 109
2743 109 -28 -200 -134 202 222 110 175 -154 137 -231 63 20 -7 -2 -75 213 36 77 -351 -119 -38 -317 -16
2766 -16 -75 -68 -38 -124 65 318 15 116 -317 -240 65 175 375 73 -85 -246 -20 111 141 -27 160 -243 56
2789 56 410 139 278 -241 14 210 42 151 4 11 -276 17 147 297 20 -75 -128 -135 19 212 179 -160 -158
2812 -158 47 26 177 -185 -109 -64 95 11 62 418 206 -162 32 65 114 116 -155 -247 -54 -69 -35 86 6 -244
2836 -244 -163 -93 106 -106 -221 -112 -49 84 24 107 -290 -111 -124 67 105 130 56 -78 160 -43 82 328 -112
2859 -112 -183 -19 219 -117 119 36 -302 -179 -17 -6 -61 -215 32 -74 -121 106 129 -280 -29 -196 -59 141
2881 141 -159 -105 -89 -98 81 78 127 -32 -7 -67 -63 253 7 -46 118 -226 147 220 32 -128 64 13 29 129 118
$$ packed form
2719e8J25K62k79p4J9J74j15j03q6J57J00L8j28m7K18m56L74M2r2lk54P5O1J59
2743A09j37j72O6L36K0j12O5l29K91l68K94m3k7Np3K88j77M1m28K32Q1k79L01
2766a6n9PL0q6J89K53l03J01m33P7L05J10K00l02j58j61K26J31L0j68J87m03K99
2789E6L54k71J39n19K55J96j68J09j47Pk87K93J30J50k77r5n3pJ54J93l3l39K
2812a58K05k1J51l62P6M5J59q4N1L56k12l68J94L3M9Kk71r2J93j5L4J21q0k50
2836b44Q1P0J99k12j15J09O3J33o0Q3l97J79j3J91L8K5p4j34K38k03J25K46m40
2859a12p1J64K38l36K36q3l38J23J62J1n5j54K47j06m7K27K3m09K51j67J37K00
2881A41l00N4J6rJ79lM9j59K5o0ML16k46n3J64l44L73P3j88j60J92n1J6J00j1
$$ plain form
2906 118 64 -80 33 47 160 -28 -41 -101 -43 -39 158 231 107 -207 -373 -9 155 82 -17 -165 -15 -277 63
$$ packed form
2906A18n4j44J13J4J13j88j3o0N8MJ97P3j24l14j66L64J64p3r9j48J50k62L40
$$ [...]
8191d5
##END NTUPLES=NMR FID
##END=
