##TITLE=1H_PR1452
 D2O,8 sc, 
 12.03.2021
##JCAMPDX= 6.0         $$ Bruker NMR JCAMP-DX V2.0
##DATA TYPE= NMR FID
##DATA CLASS= NTUPLES
##ORIGIN= UXNMR, Bruker Analytische Messtechnik GmbH
##OWNER= root
$$ XWIN-NMR		Version 3.5
$$ Fri Mar 12 13:05:21 2021 Russian Standard Time (UT+4h)  she@DPX200
##.OBSERVE FREQUENCY= 200.131506
##.OBSERVE NUCLEUS= ^1H
##.DELAY= (6, 6)
##.ACQUISITION MODE= SIMULTANEOUS
##.ACQUISITION SCHEME= undefined
##.AVERAGES= 8
##.DIGITISER RES= 18
##SPECTROMETER/DATA SYSTEM= spect
##.PULSE SEQUENCE= zg30
##.SOLVENT NAME= CDCl3
##.SHIFT REFERENCE= (INTERNAL, CDCl3, 0, 15.7039)
##AUDIT TRAIL= $$ (NUMBER, WHEN, WHO, WHERE, WHAT)
$$ ##TITLE= Audit trail, XWIN-NMR		Version 3.5
$$ ##JCAMPDX= 5.01
$$ ##ORIGIN= Bruker BioSpin GmbH
$$ ##OWNER= she
$$ F:/spectra/data/she/nmr/H-F/1/audita.txt
$$ ##AUDIT TRAIL=  $$ (NUMBER, WHEN, WHO, WHERE, WHAT)
(   1,<2021-03-12 13:04:18.42 +0400>,<she>,<DPX200>,
      <created by zg, POWCHK disabled, PULCHK disabled
       configuration hash MD5:
       00 E9 B6 7A A2 85 ED C7 34 08 36 98 17 FE 4E 26
       data hash MD5: 16K
       7E 3D A8 58 FA 22 C3 45 2D 87 09 39 48 BE 22 16>)
$$ ##END=
$$ 
$$ hash MD5
$$ EE B1 EE 28 95 5F C4 1A BD 7E D7 7E 4A 0C 32 7A
##$RELAX= 
##$RELAX= 
##$RELAX= 
##$RELAX= 
##$RELAX= 
##$RELAX= 
$$ Bruker specific parameters
$$ --------------------------
##$DU= <F:/spectra>
##$EXPNO= 1
##$NAME= <H-F>
##$PROCNO= 1
##$TYPE= <nmr>
##$USER= <she>
##$AMP= (0..31)
100 100 100 100 100 100 100 100 100 100 100 100 100 100 100 100 100 100 
100 100 100 100 100 100 100 100 100 100 100 100 100 100 
##$AQSEQ= 0
##$AQ_mod= 1
##$AUNM= <au_zg>
##$AUTOPOS= <>
##$BF1= 200.13
##$BF2= 200.13
##$BF3= 200.13
##$BF4= 200.13
##$BF5= 200.13
##$BF6= 200.13
##$BF7= 200.13
##$BF8= 200.13
##$BYTORDA= 1
##$CFDGTYP= 0
##$CFRGTYP= 5
##$CHEMSTR= <none>
##$CNST= (0..31)
1 1 145 1 1 1 1 1 1 1 1 1 1 1 1 1 1 1 1 1 1 1 1 1 1 1 1 1 1 1 1 1 
##$CPDPRG= <>
##$CPDPRG1= <>
##$CPDPRG2= <>
##$CPDPRG3= <>
##$CPDPRG4= <mlev>
##$CPDPRG5= <mlev>
##$CPDPRG6= <mlev>
##$CPDPRG7= <mlev>
##$CPDPRG8= <mlev>
##$CPDPRGB= <>
##$CPDPRGT= <>
##$D= (0..31)
0 1.2 0 0 0 0 0 0 0 0.06 0 0.03 0 0 0 0 0.0002 0 0 0 0 0 0 0 0 0 0 0 0 
0 0 0 
##$DATE= 1615539857
##$DBL= (0..7)
120 120 120 120 120 120 120 120 
##$DBP= (0..7)
150 150 150 150 150 150 150 150 
##$DBP07= 0
##$DBPNAM0= <>
##$DBPNAM1= <>
##$DBPNAM2= <>
##$DBPNAM3= <>
##$DBPNAM4= <>
##$DBPNAM5= <>
##$DBPNAM6= <>
##$DBPNAM7= <>
##$DBPOAL= (0..7)
0.5 0.5 0.5 0.5 0.5 0.5 0.5 0.5 
##$DBPOFFS= (0..7)
0 0 0 0 0 0 0 0 
##$DE= 6
##$DECBNUC= <off>
##$DECIM= 32
##$DECNUC= <off>
##$DECSTAT= 4
##$DIGMOD= 1
##$DIGTYP= 9
##$DL= (0..7)
0 120 120 120 120 120 120 120 
##$DP= (0..7)
150 150 150 150 150 150 150 150 
##$DP07= 0
##$DPNAME0= <>
##$DPNAME1= <>
##$DPNAME2= <>
##$DPNAME3= <>
##$DPNAME4= <>
##$DPNAME5= <>
##$DPNAME6= <>
##$DPNAME7= <>
##$DPOAL= (0..7)
0.5 0.5 0.5 0.5 0.5 0.5 0.5 0.5 
##$DPOFFS= (0..7)
0 0 0 0 0 0 0 0 
##$DQDMODE= 0
##$DR= 18
##$DS= 0
##$DSLIST= <SSSSSSSSSSSSSSS>
$$ [...]
##$SUBNAM2= <"">
##$SUBNAM3= <"">
##$SUBNAM4= <"">
##$SUBNAM5= <"">
##$SUBNAM6= <"">
##$SUBNAM7= <"">
##$SUBNAM8= <"">
##$SUBNAM9= <"">
##$SW= 16.9725357007746
##$SWIBOX= (0..15)
0 0 2 0 0 0 0 0 0 0 0 0 0 0 0 0 
##$SW_h= 3396.73913043478
##$TD= 16384
##$TD0= 1
##$TE= 0
##$TE2= 300
##$TE3= 300
##$TEG= 300
##$TL= (0..7)
0 120 120 120 120 120 120 120 
##$TP= (0..7)
150 150 150 150 150 150 150 150 
##$TP07= 0
##$TPNAME0= <>
##$TPNAME1= <>
##$TPNAME2= <>
##$TPNAME3= <>
##$TPNAME4= <>
##$TPNAME5= <>
##$TPNAME6= <>
##$TPNAME7= <>
##$TPOAL= (0..7)
0.5 0.5 0.5 0.5 0.5 0.5 0.5 0.5 
##$TPOFFS= (0..7)
0 0 0 0 0 0 0 0 
##$TUNHIN= 0
##$TUNHOUT= 0
##$TUNXOUT= 0
##$USERA1= <user>
##$USERA2= <user>
##$USERA3= <user>
##$USERA4= <user>
##$USERA5= <user>
##$V9= 5
##$VALIST= <valist>
##$VCLIST= <CCCCCCCCCCCCCCC>
##$VD= 0
##$VDLIST= <DDDDDDDDDDDDDDD>
##$VPLIST= <PPPPPPPPPPPPPPP>
##$VTLIST= <TTTTTTTTTTTTTTT>
##$WBST= 1024
##$WBSW= 4
##$XGAIN= (0..3)
0 0 0 0 
##$XL= 0
##$YL= 0
##$YMAX_a= 143989
##$YMIN_a= -139976
##$ZGOPTNS= <>
##$ZL1= 120
##$ZL2= 120
##$ZL3= 120
##$ZL4= 120
##$ABSF1= 10
##$ABSF2= 0
##$ABSG= 5
##$ABSL= 3
##$ALPHA= 0
##$AQORDER= 0
##$ASSFAC= 0
##$ASSFACI= 0
##$ASSFACX= 0
##$ASSWID= 0
##$AUNMP= <proc_1d>
##$AZFE= 0.1
##$AZFW= 0.1
##$BCFW= 1
##$BC_mod= 2
##$BYTORDP= 1
##$COROFFS= 0
##$CY= 11.3945322036743
##$DATMOD= 1
##$DC= 2
##$DFILT= <>
##$DTYPP= 0
##$F1P= 15.9154993809931
##$F2P= -4.1035820241983
##$FCOR= 0.5
##$FTSIZE= 0
##$FT_mod= 4
##$GAMMA= 1
##$GB= 0.15
##$INTBC= 1
##$INTSCL= 1
##$ISEN= 128
##$LB= 0.24
##$LEV0= 0
##$LPBIN= 0
##$MAXI= 10000
##$MC2= 0
##$MEAN= 0
##$ME_mod= 0
##$MI= 1.114404
##$NCOEF= 0
##$NC_proc= 0
##$NLEV= 6
##$NOISF1= 3.799351
##$NOISF2= 2.8
##$NSP= 1
##$NTH_PI= 0
##$NZP= 0
##$OFFSET= 15.70392
##$PC= 1
##$PHC0= -11122.97
##$PHC1= 9.80094
##$PH_mod= 1
##$PKNL= yes
##$PPARMOD= 0
##$PSCAL= 0
##$PSIGN= 0
##$REVERSE= no
##$SF= 200.130013532006
##$SI= 16384
##$SIGF1= 3
##$SIGF2= 2
##$SINO= 400
##$SIOLD= 16384
##$SREGLST= <1H.CDCl3>
##$SSB= 0
##$STSI= 0
##$STSR= 0
##$SW_p= 3612.71676300578
##$SYMM= 0
##$S_DEV= 0
##$TDeff= 0
##$TDoff= 0
##$TI= <>
##$TILT= no
##$TM1= 0
##$TM2= 0
##$TOPLEV= 0
##$USERP1= <user>
##$USERP2= <user>
##$USERP3= <user>
##$USERP4= <user>
##$USERP5= <user>
##$WDW= 1
##$XDIM= 8192
##$YMAX_p= 0
##$YMIN_p= 0
$$ End of Bruker specific parameters
$$ ---------------------------------
##NTUPLES= NMR FID
##VAR_NAME=  TIME,          FID/REAL,        FID/IMAG
##SYMBOL=    X,             R,               I
##VAR_TYPE=  INDEPENDENT,   DEPENDENT,       DEPENDENT
##VAR_FORM=  AFFN,          ASDF,            ASDF
##VAR_DIM=   8192,          8192,            8192
##UNITS=     SECONDS,       ARBITRARY UNITS, ARBITRARY UNITS
##FACTOR=    0.0002944,     1,               1
##FIRST=     0,             0,               0
##LAST=      2.4114304,     0,               0
##MIN=       0,             -139976,         0
##MAX=       2.4114304,     143989,          0
$$ Real data points
##PAGE= N=1
##DATA TABLE= (X++(R..R)), XYDATA
$$ plain form
0 0 0 0 0 0 0 0 0 0 0 0 0 0 -3 8 -8 8 -8 8 -16 16 -20 24 -27 32 -40 46 -52 60 -70 80 -91 105 -116 132 -149
35 -149 167 -188 211 -235 261 -290 322 -359 395 -438 484 -533 586 -647 713 -784 864 -953
53 -953 1050 -1163 1289 -1433 1599 -1793 2023 -2303 2648 -3088 3668 -4474 5664 -7600 11258
68 11258 -20530 92428 138230 -67639 13828 -91701 -100116 128558 79148 -16948 10911 -124861
80 -124861 -55706 113180 43197 28883 -778 -139976 -24039 88241 31424 54073 -19131
91 -19131 -127570 -9273 56665 42418 64501 -40140 -103605 -6335 29672 56886 64366 -51617
103 -51617 -81684 -11207 14708 67489 56569 -52030 -64311 -21633 10209 73280 45774 -45132
115 -45132 -53833 -31629 11836 72487 37095 -34843 -49162 -37940 15826 66690 31797 -23798
$$ packed form
0@%%%%%%%%%%%%lJ1j6J6j6J6k4L2l6M4n1N9p2Q6r8J12j30J50j71J96k21K48k81
35a49L16l55L99m46M96n51O12o81P54q33R22j017J119j233J360j497J648j817
53i53K003k213K452k722L032l392L816m326M951n736O756q142J0138j3264J8858
68A1258l1788J12958M5802k05869Q1467j05529q415K28674m9410r6096K7859j35772
80a24861O9155J68886o9983j4314k9661j39198J15937J12280n6817K2649p3204
91a9131j08439J18297O5938j4247K2083j04641o3465R7270L6007K7214P480j15983
103e1617l0067P0477K5915N2781j0920j08599j2281M2678L1842O3071k7506r0906
115d5132q701K2204M3465O0651l5392p1938j4319J1222N3766N0864l4893n5595
$$ plain form
127 -23798 -49004 -40782 18696 59126 30798 -16276 -50325 -38818 18275 51410 33316 -13445
139 -13445 -49945 -34926 13906 46688 35833 -13529 -47148 -31553 8608 44865 36690 -13792
151 -13792 -41896 -31403 4802 44749 34500 -12662 -36237 -33416 3139 44400 29974 -8690
163 -8690 -32163 -36323 3792 42139 26236 -3397 -30632 -37882 5644 37440 24490 1546 -31089
176 -31089 -36839 7067 32198 24770 5396 -32787 -33792 6824 26185 26749 6590 -33904 -29529
189 -29529 5251 21992 29714 5957 -33133 -25432 1361 19716 31927 3645 -30547 -22059 -3179
202 -3179 19352 32552 1208 -26870 -20791 -6577 20473 31437 -344 -22260 -20975 -8987 21953
215 21953 28940 -572 -18145 -22364 -9541 22504 25473 989 -15039 -24047 -8979 21913 22571
$$ packed form
127b3798k5206Q222N9478M0430k8328m7074l4049J1507N7093L3135j8094m6761
139a3445l6500J5019M8832L2782j0855m9362l3619J5595M0161L6257q175n0482
151a3792k8104J0493L6205L9947j0249m7162k3575K821L6555M1261j4426l8664
163h690k3473m160M0115L8347j5903k9633k7235p250M3526L1796j2950k2944l2635
176c1089n750M3906K5131p428j9374l8183j005M0616J9361N64k0159m0494M375
189b9529L4780J6741P722k3757l9090P701K6793J8355J2211k8282l4192Q488J8880
202c179K2531J3200l1344k8078O079J4214K7050J0964l1781k1916J285J1988L0940
215B1953O987k9512j7573m219J2823L2045K969k4484j6028r008J5068L0892O58
$$ plain form
228 22571 3480 -13412 -25136 -7675 20066 20303 5780 -13140 -25023 -5954 17613 18938 7742
241 7742 -13323 -24348 -5430 14722 18661 9122 -13421 -22246 -5592 12431 18876 9349 -12978
254 -12978 -20612 -6514 10939 19059 9187 -12069 -19226 -7501 9841 18819 8685 -11167 -18151
267 -18151 -7964 9501 18162 8691 -9921 -17558 -8195 8163 17193 8831 -8477 -16950 -8336 7761
281 7761 16814 9285 -8074 -16129 -8357 6397 15941 9552 -7452 -15145 -8577 5277 15737 9640
295 9640 -6703 -14016 -9121 4662 15505 9250 -5643 -12930 -9356 4022 15011 8723 -4648
308 -4648 -12421 -9602 3664 13881 8048 -3592 -11746 -10213 3834 12959 7745 -2238 -11573 -10408
322 -10408 3709 11660 7928 -1240 -11511 -9899 3500 10553 8266 -563 -11234 -9407 2829 9393
$$ packed form
228B2571j9091j6892j1724J7461K7741K37j4523j8920j1883J9069K3567J325j1196
241G742k1065j1025J8918K0152L939r539k2543q825J6654J8023O445r527k2327
254a2978p634J4098J7453Q120r872k1256p157J1725J7342Q978j0134j9852o984
267a8151J0187J7465Q661r471j8612p637R363J6358R030q362j7308q473Q614J6097
281G761R053p529j7359q055P772J4754R544o389j7004p693O568J3854J0460o097
295I640j6343p313M895J3783J0843o255j4893p287L574J3378J0989o288j3371
308d648p773K819J3266J0217n833j1640q154J533J4047R125n214r983r335J165
322a0408J4117P951l732r168j0271J612J3399P053k287q829j0671J827J2236O564
$$ plain form
336 9393 8994 -368 -11258 -8731 2148 8918 9073 -111 -10626 -8018 1204 8209 9353 -390 -9614
351 -9614 -7500 289 7693 9229 -284 -8984 -7407 -627 7659 9036 -441 -7910 -7037 -1160 7591
366 7591 8688 -269 -7222 -7144 -1428 7396 8243 200 -6344 -7177 -1589 7131 7463 614 -5855 -7547
382 -7547 -1535 6631 6971 1011 -5443 -7499 -1738 6384 6834 1536 -5133 -7405 -1527 5707 6522 1502
398 1502 -4641 -6946 -1764 5288 6406 1879 -4536 -6791 -1447 4628 5991 2119 -4598 -6404 -1524
413 -1524 4125 5827 2127 -4125 -6110 -1769 3848 5801 2315 -3748 -6033 -1820 3403 5739 2162
428 2162 -3654 -5577 -1874 3119 5518 2347 -3598 -5191 -2134 2625 5555 2435 -3007 -4900 -2433
443 -2433 2599 5341 2457 -2539 -4682 -2452 2306 5081 2203 -2595 -4745 -2597 2227 4823 2134
$$ packed form
336I393l99r362j0890K527J0879O770J55r184j0515K608R222P005J144r743r224
351i614K114P789P404J536r513q700J577O780Q286J377r477p469Q73N877Q751
366G591J097q957o953P8N716Q824Q47q043o544q33N588Q720L32o849o469j692
382g547O012Q166L40n960o454k056N761Q122M50n298o669k272N878P234Q15n020
398A502o143k305N182P052J118m527o415k255N344O075J363l872o717j806M880
413a524N649J702l700o252j985M341N617J953l486o063k285M213N223K336l577
428B162n816j923L703M993K399l171n945j593L057M759K930l120n442j893K467
443b433N032K742k884m996k143K230M758K775k878m798k150K148M824K596k689
$$ plain form
458 2134 -2288 -4086 -2797 1740 4881 2211 -1894 -4023 -2743 1947 4378 2494 -1618 -4232 -2729
473 -2729 1883 4249 2500 -1272 -4123 -2781 1412 3837 2509 -1121 -4106 -2614 1402 3371 2221
488 2221 -1212 -4077 -2431 1091 3355 2517 -929 -3628 -2311 867 3442 2274 -860 -3283 -2420 843
504 843 3378 2682 -680 -3303 -2334 745 2751 2734 -695 -3161 -2229 400 3038 2341 -607 -2736 -2189
521 -2189 250 2680 2458 -385 -2589 -2124 53 2706 2279 -434 -2606 -2345 129 2631 2206 -168
537 -168 -2333 -2060 185 2339 2121 -161 -2338 -2098 -112 2078 2221 98 -2028 -2317 13 1820 2098
554 2098 113 -1730 -2112 -188 1731 2049 207 -1878 -2122 -279 1667 2028 234 -1569 -1948 -287
570 -287 1428 1742 388 -1564 -1797 -481 1445 1757 335 -1555 -1735 -396 1441 1688 418 -1369 -1569
$$ packed form
458B134m422j798J289M537L141k670m105k129J280M690K431j884m112k614J503
473b729M612K366j749l772k851J342M193K425j328l630k985J492M016J969j150
488B221l433k865J646L522K264q38l446k699J317L178K575j168l134k423Q63L263
504H43K535o96l362k623R69L079K006j7l429k466R32K629K638o97k948k129N47
521b189K439K430k22k843k204M65K177K653m27k713k172K61K474K502m25k374
537a68k165K73K245K154k18k282k177K40J986K190J43k123k126k89K330J807K78
554B098j985j843l82J924J919L18j842k085k44J843J946L61j794j803l79J661
570b87J715L14j354j952k33J316J926L12j422j890j80J339J837K47j270j787k00
$$ plain form
587 -1569 -373 1089 1841 521 -1167 -1641 -910 980 1708 464 -1240 -1544 -479 1125 1748 393 -1114
604 -1114 -1777 -440 1013 1389 399 -927 -1632 -554 1200 1606 489 -1134 -1592 -571 792 1579 532
621 532 -970 -1522 -452 877 1330 301 -780 -1263 -451 677 1554 715 -770 -1347 -645 525 1483 592
639 592 -642 -1456 -576 883 1248 683 -763 -1187 -820 451 1167 615 -818 -997 -752 669 1078 483
657 483 -625 -1038 -680 352 1272 522 -580 -1158 -582 689 1256 439 -372 -1153 -685 639 1032 549 -390
676 -390 -1052 -717 183 1032 832 -237 -934 -656 184 901 770 -434 -944 -747 376 987 513 -278 -809
695 -809 -557 440 791 999 -354 -720 -709 243 905 959 -399 -948 -475 46 745 675 -48 -835 -664 253 702
716 702 668 -78 -909 -806 203 1074 510 -150 -661 -519 155 937 872 -180 -783 -589 109 566 714 -73
$$ packed form
587a569J196J462P52j320j688m74P31J890P28j244j704l04J065J604O23j355j507
604a114o63J337J453L76r90j326p05J078J754M06j117j623m58J021J363P87j047
621E32j502n52J070J329M53j029j081m83Q12J128Q77q39j485n77P02J170R58q91
639E92j234q14Q80J459L65n65j446m24L67J271P16n52j433j79K45J421M09n95
657D83j108m13L58J032R20p50j102n78N76J271N67q17q11p81M68J324L93m83r39
676c90o62L35R00Q49k00j069o97K78Q40P17j31j204n10J97J123O11m74p91n31
695h09K52R97L51K08j353l66J1R52O62N4j358n49M73N21O99p0p23p87J71R17M49
716G02l4p46q31J03J009Q71n64o60n11J42O74P82o5j052o03J94O98M57J48p87
$$ plain form
736 -73 -830 -484 43 529 608 79 -485 -909 -116 615 580 -125 -391 -443 -258 612 604 64 -657 -633 -314 460 474
759 474 -46 -572 -472 -78 370 436 324 -386 -699 -137 510 514 -27 -254 -728 -65 257 526 130 -303 -579
780 -579 33 645 534 192 -509 -584 -97 112 231 173 -417 -520 2 59 446 161 -554 -476 -361 427 394 175
802 175 -221 -558 -333 303 661 268 -138 -214 -189 270 577 185 -70 -320 -410 222 430 350 -247 -162 -199 -11
824 -11 404 241 23 -441 -229 148 337 234 -281 -228 -304 181 689 70 -14 -363 -76 261 191 172 -72 -309
846 -309 -449 105 -58 453 -170 -215 -167 282 348 225 73 -395 -61 -60 313 -2 -42 -306 -297 -212 106 285 -122
869 -122 -289 -418 -165 198 212 140 -151 -265 -23 45 258 -12 -370 -253 -53 135 238 -178 -53 -606 15
890 15 348 52 -105 -113 -458 -3 346 92 257 -178 -147 -117 310 162 104 -167 -211 -195 102 363 326 -108 -103 -38
$$ packed form
736g3p57L46N27M86P9n29n64m24P93P31l5p05k66n2J85Q70qn40p21K4L19P74J4
759D74n20n26J00L94M48O6j12p10l13N62O47Mn41k27m74O63L22K69l96m33k76
780e79O12O12j11l42p01p5M87K09J19n8n90j03N22N7L87k85p15P8J15P88l3k19
802A75l96l37K25O36L58l93m06p6K5M59L07l92k55k50r0O32K08q0n97Q5l7J88
824a1M15j63k18m64K12L77J89j03n15N3p6M85N08o19q4l49K87L37p0j9k44k37
846c09j40N54j63N11o23m5M8M49O6j23j52m68L34JL73l15m0k64RQ5L18J79m07
869a22j67j29K53L63J4p2k91j14K42O8K13k70l58J17K00J88J03m16J25n53O21
890A5L33k96j57ql45M55L49k54J65m35L1L0M27j48n8k71m4J6K97K61l7m34NO5
$$ plain form
914 -38 97 74 79 13 -120 -134 -63 152 297 -44 -68 -51 84 189 -18 39 -214 -133 -123 55 238 -25 -198 65
938 65 275 83 -27 71 -292 -185 114 72 -61 -78 -21 64 150 97 89 108 -188 -90 -145 163 144 -173 -141 105 24 182
964 182 251 43 -257 -418 33 57 109 -164 -40 -62 9 65 -77 -318 -154 -90 98 34 -32 14 -186 -26 -38 -81
988 -81 6 -153 -119 31 -7 334 186 110 -35 -303 -148 -153 228 169 -39 -48 69 110 104 75 -205 -146 103 183 210 -147
1014 -147 143 -263 -159 109 169 132 99 -177 -17 70 112 252 97 53 -68 93 108 94 -39 -175 -318 71 126
1037 126 -91 -157 -79 -53 -19 -92 18 -218 15 -91 200 27 62 47 -1 -221 83 309 84 -187 84 -16 12
1060 12 -130 -90 6 91 -65 50 43 -43 -118 -354 -21 0 68 24 121 34 -181 -15 130 -91 43 -317 -196 -169 173
1085 173 92 -28 42 5 110 171 300 46 -136 -19 -106 151 103 -268 -237 152 -100 102 153 -74 -148 22 -167
$$ packed form
914c8J35k3No6j33j4P1K15J45l41k4J7J35J05k07N7k53Q1J0J78J83k63j73K63
938F5K10j92j10R8l63J07K99m2j33j7N7Q5Q6n3qJ9k96R8n5L08j9l17L2K46q1J58
964A82O9k08l00j61M51K4N2k73J24k2P1N6j42k41J64O4J88o4o6M6k00J60j2m3
988h1Q7j59L4J50l8L41j48p6j45k68J55nL81n9k08rJ17M1ok9k80N9K49Q0K7l57
1014a47K90m06J04K68O0l7l3k76J60Q7M2J40j55m4j21J61J5j4j33j36j43L89N5
1037A26k17o6P8K6L4p3J10k36K33j06K91j73L5j5m8k20L04K26k25k71K71j00K8
1060A2j42M0R6Q5j56J15pq6p5k36L33K1O8m4R7q7k15J66J45k21J34l60J21K7L42
1085A73q1j20P0l7J05O1J29k54j82J17q7K57m8l71L1L89k52K02N1k27p4J70j89
$$ plain form
1108 -167 46 66 216 74 -83 102 102 251 167 -137 -97 -125 386 169 32 162 -10 -155 5 164 56 64 16
1131 16 -102 171 -117 -13 -56 -119 -202 154 58 -72 107 -81 195 166 200 99 123 -13 -86 118 110 -3 -234 -103
1155 -103 -198 187 231 -11 -140 -283 -106 -130 -83 151 -58 -31 -106 45 189 -90 -163 -517 -222 -179 33 104 -90
1178 -90 -164 183 -5 25 145 -113 -146 -127 40 153 42 47 -69 -69 120 -33 -30 113 -43 -143 -83 31 167 -42
1202 -42 196 71 -31 295 -69 61 -161 -131 -216 84 178 -28 61 -50 -56 6 50 -140 -74 -217 -192 69 102 -9
1226 -9 3 -154 27 52 -39 23 -219 -130 120 135 -159 -26 -143 -147 -34 -156 37 -11 -52 -178 129 -28 199 -228
1250 -228 -3 -102 -210 178 -4 8 -121 -6 33 -287 77 125 157 86 -189 120 36 -20 -89 -15 -143 -50 226 100
1274 100 193 87 -131 -94 142 -9 37 15 -75 -59 -71 -102 -127 -12 137 71 161 -179 -98 2 113 -221 248 220
$$ packed form
1108a67K13K0J50j42j57J85%J49q4l04M0k8N11k17j37J30j72j45J60J59j08Qm8
1131A6j18K73k88J04m3o3q3L56r6j30J79j88K76k9L4j01K4j36p3K04qj13k31J31
1155a03r5L85M4k42j29j43J77k4M7K34k09K7p5J51J44k79p3l54K95M3K12P1j94
1178i0p4L47j88L0J20k58l3J9J67J13j11Nj16%J89j53LJ43j56j00O0J14J36k09
1202d2K38j25j02L26l64J30k22L0q5L00R4k06Q9j11oO2M4j90O6j43K5K61L3j11
1226iJ2j57J81K5r1O2k42Q9K50J5k94J33j17mJ13j22J93m8m1j26L07j57K27m27
1250b28K25r9j08L88j82J2j29J15L9l20L64M8L2p1k75L09q4n6o9P4j28R3K76j26
1274A00R3j06k18L7K36j51M6k2r0J6j2l1k5J15J49o6R0l40Q1J00J11l34M69k8
$$ plain form
1298 220 65 -138 74 61 152 -142 42 -333 -219 -180 259 261 -6 -93 -170 -98 196 93 -43 -215 -116 139 134 110
1322 110 -179 -211 -286 143 95 376 65 -147 -83 -2 -16 127 -233 2 -48 205 70 90 140 -105 96 47 100 110
1346 110 -70 -115 15 48 105 59 -159 -66 -293 35 234 85 29 -127 -474 -70 67 53 -137 -195 -112 265 510
1369 510 -72 304 -109 -247 243 253 79 61 -264 -271 -153 -180 116 156 129 -218 -113 -40 -140 -38 -116 -147 180
1392 180 94 92 -243 -180 -136 262 61 265 165 -91 -194 26 185 104 -117 -136 49 123 203 219 27 205 224 -63
1416 -63 65 235 149 -34 -189 -164 25 230 49 -93 44 115 -64 -141 133 -181 -66 -133 -130 -29 -127 5 -70
1439 -70 -51 39 89 -80 -221 -98 -7 4 74 -110 -177 -191 -39 95 -82 76 -311 -100 -5 -134 75 -64 -35 -88
1463 -88 123 230 50 -227 14 -202 -40 26 -6 126 86 -86 -62 -29 196 105 -149 -289 -134 -150 -57 -95 128
$$ packed form
1298B20j55k03K12j3R1k94J84l75J14L9M39Kk67q7p7P2K94j03j36j72R9K55nk4
1322A10k89l2p5M29m8K81l11k12O4Q1j4J43l60K35n0K53j35K0N0k45K01m9N3J0
1346A10j80m5J30L3N7m6k18R3k27L28J99j49n6j56l47M04J37j4j90n8Q3L77K45
1369E10n82L76m13j38M90J0j74j8l25pJ18k7K96M0k7l47J05P3j00J02p8l1L27
1392A80q6kl35O3M4L98k01K04j00k56j03K20J59q1k21j9J85P4Q0J6j92J78J9k87
1416f3J28J70q6j83j55K5J89K05j81j42J37P1j79p7K74l14J15o7LJ01r8J32p5
1439g0J9R0N0j69j41J23R1J1P0j84o7j4J52J34j77J58l87K11R5j29K09j39K9n3
1463h8K11J07j80k77K41k16J62O6l2J32m0j72K4L3K25r1k54j40J55j6R3l8K23
$$ plain form
1486 128 -82 -50 65 150 183 -10 -29 -71 90 63 105 -23 -349 -3 -134 172 268 -65 -61 -317 177 -57 26 -59
1510 -59 61 -200 18 177 -74 -221 0 -53 89 -2 58 -48 -147 -125 0 138 63 118 -327 -214 -111 56 -18
1533 -18 -75 47 -23 255 -30 22 82 -27 225 98 143 196 143 -43 -131 -27 -22 -115 -88 -13 -196 -93 69 129 189
1558 189 -179 43 135 263 -53 27 -145 -188 107 72 134 -90 -91 -164 234 33 0 -25 -88 4 61 28 129 -89 -153
1583 -153 -153 35 181 304 -91 -201 -119 -87 300 205 -160 75 86 -118 241 119 8 -218 -88 114 -126 226
1605 226 -98 -28 -85 78 -10 -38 -52 -283 74 60 26 184 189 -63 -115 -76 -46 162 -78 9 -87 -10 291 -72 -212
1630 -212 99 -395 -10 150 -39 -151 26 0 -371 -53 -52 -33 -226 38 19 204 -125 -16 83 -43 -238 187
1652 187 -42 -86 -84 -38 -160 69 239 -103 62 -40 51 76 127 206 -51 -297 48 -113 -64 231 -114 55 20
$$ packed form
1486A28k10L2J15Q5L3j93j9m2J61k7M2j28l26L46j31L06R6l33Mk56M94k34Q3q5
1510e9J20k61K18J59k51j47K21n3J42r1O0j06r9K2J25J38p5N5m45J13J03J67p4
1533a8n7J22p0K78k85N2O0j09K52j27M5N3n3j86q8J04Nr3K7P5j83J03J62O0O0
1558A89l68K22R2J28l16Q0j72m3K95l5O2k24jp3L98k01l3k5o3R2N7l3J01k18o4
1583a53%J88J46J23l95j10Q2L2L87r5l65K35J1k04L59j22j11k26J30K02k40L52
1605B26l24P0n7J63q8k8j4k31L57j4l4J58Nk52n2L9L0K08k40Q7r6P7L01l63j40
1630b12L11m94L85J60j89j12J77k6l71L18JJ9j93K64j9J85l29J09R9j26j95M25
1652A87k29m4KM6j22K29J70l42J65j02R1K5N1P9k57k46L45j61M9K95l45J69l5
$$ plain form
1675 20 -187 232 -116 -19 87 51 -120 50 22 -163 190 -140 -66 153 340 162 -103 41 147 229 -199 -103
1697 -103 16 -89 -69 116 -114 -301 96 34 117 168 126 -145 32 112 78 135 -61 -105 230 38 1 163 -11
1720 -11 139 46 -79 -46 8 56 37 101 -189 101 -27 -144 -23 -242 141 -197 249 137 72 -228 -38 2 -248
1743 -248 -17 -39 -211 4 -45 -29 70 -64 61 -192 -60 -183 -31 69 -193 147 -90 94 -2 59 1 -91 2
1766 2 125 -112 -195 -222 -4 94 -70 103 132 -73 -35 -39 -111 206 285 38 -59 68 70 -45 -252 -98 -42 86 -97
1791 -97 -221 44 10 11 35 170 55 28 22 -390 -40 101 -91 -71 13 8 -143 -11 -1 -18 135 -186 -97 22 -24
1816 -24 243 -226 131 -206 -59 128 -204 61 -12 215 -248 52 1 -85 -29 -63 92 -78 228 -266 -40 -72
1838 -72 -74 28 54 258 -51 -16 120 -37 187 -70 -150 -225 -125 65 -45 -139 -50 21 145 76 253 51 -108 36
$$ packed form
1675B0k07M19l48R7J06l6j71J70k8j85L53l30P4K19J87j78k65J44J06Q2m28R6
1697a03J19j05K0J85k30j87L97o2Q3N1m2k71J77Q0l4N7j96m4L35j92l7J62j74
1720a1J50r3j25L3N4M8j9O4k90K90j28j17J21k19L83l38M46j12o5l00J90M0k50
1743b48K31k2j72K15m9J6R9j34J25k53J32j23J52J00k62L40k37J84r6O1n8r2R3
1766BJ23k37q3k7K18R8j64J73K9k05L8mp2L17P9k47r7J27Kj15k07J54N6J28j83
1791i7j24K65l4JK4J35j15k7om12L50J41j92K0Q4nj51J32J0j7J53l21Q9J19m6
1816b4K67m69L57l37J47J87l32K65p3K27m63L00n1q6N6l4J55j70L06m94K26l2
1838g2kJ02K6K04l09L5J36j57K24k57q0p5J00J90j10r4Q9P1J24o9J77k02j59J44
$$ plain form
1862 36 -199 181 32 -47 17 -36 36 77 -204 31 55 -74 -46 47 145 -84 -151 -73 -80 -131 51 -85 71 105 127 194
1888 194 136 -59 -305 159 335 100 176 -308 -37 145 -54 -27 -69 -297 48 144 56 -34 170 -105 108 -85
1910 -85 103 125 -168 -102 53 -13 -23 -5 280 -208 -176 35 -61 14 79 106 -201 195 100 33 153 -125 -59 76 -280
1935 -280 -28 -76 263 -28 -49 100 54 224 -92 -286 -141 33 145 108 -62 -137 26 -36 -228 -109 -9 -116
1957 -116 -307 174 23 -204 -127 183 -188 19 76 -17 279 -33 -103 -121 -159 65 66 68 -20 -61 69 105 276 -59
1981 -59 218 31 -15 194 40 -48 8 90 -118 93 -95 100 -354 -9 138 101 81 125 -145 -26 260 167 81
2004 81 -130 -77 -69 88 148 38 -83 160 160 -276 -110 147 -33 -222 -125 296 -55 260 -103 -62 -133 102 -111
2027 -111 -123 -44 -104 14 127 75 32 -81 -28 -3 74 -137 50 163 -100 -68 76 99 -29 116 -204 6 172
$$ packed form
1862C6k35L80j49p9O4n3P2M1k81K35K4j29K8R3R8k29o7P8pn1J82j36J56L4K2O7
1888A94n8j95k46M64J76k35P6m84K71J82j99K7m2k28L45R6q8r0K04k75K13j93
1910h5J88K2k93O6J55o6j0J8K85m88L2K11r6P5O5K7l07L96r5o7J20k78O6J35l56
1935b80K52m8L39k91k1J49m6J70l16j94J45J74J12l7j70p5J63o2j92J19J00j07
1957a16j91M81j51k27P7L10l71K07N7r3K96l12p0j8l8K24JKq8m1J30L6J71l35
1981e9K77j87m6K09j54q8N6Q2k08K11j88J95m54L45J47l7k0M4k70J19K86r3q6
2004H1k11N3QJ57O0j10j21K43%m36J66K57j80j89R7M21l51L15l63M1p1K35k13
2027a11j2P9o0J18J13n2m3j13N3K5P7k11J87J13k63L2J44K3j28J45l20K10J66
$$ plain form
2050 172 304 91 49 135 79 262 -64 351 34 -59 -171 105 188 70 -15 111 -161 -133 -109 -146 -79 52 11 -75
2074 -75 159 -81 111 38 -130 -103 13 31 -6 13 -60 151 187 -36 41 13 32 40 -250 179 118 -65 -66 47 -87
2099 -87 155 -145 88 -67 -89 194 41 -90 -80 -14 -81 110 66 50 27 43 -179 92 -61 155 -72 5 124
2122 124 262 97 -119 199 -14 -77 -95 38 25 2 -53 -148 -110 120 213 -37 -267 -56 -198 28 168 -102 -107
2145 -107 -45 -77 49 7 133 -79 93 169 -52 -78 -67 -155 -75 81 138 210 -101 -82 -218 -164 -243 2 25 -77 -53
2170 -53 351 110 60 26 97 -152 36 -35 -64 9 -61 -133 273 148 -188 -165 -197 76 131 38 32 -25 14 -101 26 84
2196 84 75 -102 -83 -99 28 112 -8 -79 -68 -94 324 237 71 56 -133 -34 -35 123 -195 52 -158 -63 15 9 -16 -122
2222 -122 -88 -255 19 51 12 264 34 121 2 -109 89 52 143 11 85 62 -77 -90 84 -236 41 39 -298 83
$$ packed form
2050A72J32k13m2Q6n6J83l26M15l17r3j12K76Q3j18q5J26k72K8K4l7O7J31m1q6
2074g5K34k40J92p3j68K7J16J8l7J9p3K11L6k23P7k8J9Qk90M29o1j83jJ13j34
2099h7K42l00K33j55k2K83j53j31J0O6o7J91m4j6k3J6k22K71j53K16k27P7J19
2122A24J38j65k16L18k13o3j8J33j3k3n5r5L8K30R3k50k30K11j42K26J40k70n
2145a07O2l2J26m2J26k12J72P6k21k6J1q8Q0J56N7P2l11J9j36N4p9K45K3j02K4
2170e3M04k41n0l4P1k49J88p1k9P3p0p2M06j25l36K3l2K73N5r3on7L9j15J27N8
2196H4rj77J9j6J27Q4j20p1J1k6M18q7j66j5j89R9jJ58l18K47k10R5P8ok5j06
2222a22L4j67K74L2l9K52k30Q7j19j11J98l7R1j32P4k3j39j3J74l20K77kl37L81
$$ plain form
2246 83 -142 -5 91 -199 19 304 154 -80 -129 191 -69 16 14 -129 -7 -23 136 91 86 -167 165 -73 -200
2269 -200 -39 -260 -58 -1 -201 27 20 90 134 212 39 39 -63 119 119 100 104 182 272 41 -63 58 87 -65 66
2294 66 -269 -227 49 131 -61 102 80 210 -41 -215 -143 169 136 41 47 72 113 -19 -52 4 46 -207 63 -11 -19 144
2320 144 -264 30 98 -89 139 -70 -35 -23 0 27 -119 0 4 -102 89 181 133 -45 75 -24 145 -240 -148 34
2344 34 25 121 77 -47 170 101 -125 41 198 -73 -50 132 140 -147 -29 -112 -31 6 -147 206 -2 246 71 -97
2368 -97 8 11 -93 170 -197 -103 -80 71 33 -54 61 127 217 -47 -19 126 -169 -79 -60 163 -208 15 -27 1 -15
2393 -15 -162 -96 -108 -28 71 140 281 18 -15 99 98 -6 -251 56 140 49 -153 176 257 21 -78 -154 -177 276 -60
2418 -60 74 -4 -162 -243 3 -45 220 -85 -107 -124 -102 -23 133 151 119 57 46 -32 272 7 70 -111 -2 -57 30
$$ packed form
2246H3k25J37R6k90K18K85j50k34m9L20k60Q5kj43J22j6J59m5nk53L32k38j27
2269b00J61k21K02N7k00K28pP0M4P8j73%j02J82%j9MP8R0k31j04J21K9j52J31
2294F6l35M2K76Q2j92J63k2J30k51j74P2L12l3r5OK5M1j32l3N6M2k53K70p4qJ63
2320A44m08K94O8j87K28k09L5J2K3K7j46J19Mj06J91R2m8j78J20r9J69l85R2J82
2344C4rR6m4j24K17o9k26J66J57k71K3J82Qk87J18q3Q1L7j53L53k08K48j75j68
2368i7J05Lj04K63l67R4K3J51l8q7J15O6R0k64K8J45k95R0J9K23l71K23m2K8j6
2393a5j47O6j2Q0R9O9J41k63l3J14jj04k45L07Q4r1k02L29Q1k36r9p6k3M53l36
2418f0J34p8j58q1K46m8K65l05k2j7K2P9J56J8l2o2j1p8L04k65O3j81J09n5Q7
$$ plain form
2443 30 272 205 14 -194 -73 34 75 55 27 -56 -24 -61 161 -82 -43 3 30 -44 154 -19 -147 -79 -102 -59 -13
2468 -13 3 -147 -85 6 207 53 63 164 -77 30 -19 -10 214 83 -76 -14 10 -130 -66 170 -230 17 60 109
2492 109 -22 -272 -239 -82 -154 179 58 149 -88 145 126 -116 82 -58 -57 -95 51 -93 13 6 71 42 -34 7
2516 7 -79 -104 -70 -15 -160 163 25 267 -215 273 135 145 8 -67 81 -117 89 -34 59 -60 120 -41 -214
2539 -214 265 -102 -29 -47 171 -57 -62 130 -92 -169 -136 212 -293 -11 -88 155 27 -16 -211 59 -84 135 -121
2562 -121 17 -47 -155 142 140 -32 106 24 -22 -250 22 -111 235 258 -13 196 89 -150 10 82 -168 188
2584 188 -75 -32 -80 191 56 -112 -29 63 -116 17 -128 58 -306 101 -166 105 -36 34 -21 -53 1 -66 200
2607 200 -87 -136 -95 257 -121 61 -15 245 91 140 37 8 -59 -148 -68 53 1 -129 -63 -83 128 9 -99 40
$$ packed form
2443C0K42o7j91k08J21J07M1k0k8q3L2l7K22k43L9M6K7p4J98j73j28O8k3M3M6
2468a3J6j50O2R1K01j54J0J01k41J07m9RK24j31j59O2K4j40O4K36m00K47M3M9
2492A09j31k50L3J57p2L33j21R1k37K33j9k42J98j40Jl8J46j44J06pO5k9p6M1
2516Gq6k5L4N5j45L23j38K42m82M88j38J0j37p5J48j98K06j23R3j19J80j61j73
2539b14M79l67P3j8K18k28nJ92k22p7L3L48n05K82p7K43j28m3j95K70j43K19k56
2562a21J38o4j08K97kj72J38q2m6k28K72j33L46K3k71K09j07k39J60P2k50L56
2584A88k63M3m8K71j35j68Q3R2j79J33j45J86l64M07k67K71j41P0n5l2N4o7K66
2607B00k87m9M1L52l78J82p6K60j54M9j03k9o7q9Q0J21n2j30O6k0K11j19j08J39
$$ plain form
2631 40 18 4 116 -75 86 -92 -71 -231 -196 -102 -36 -109 144 132 91 -6 205 -101 -83 17 192 -27 317 -5
2655 -5 -92 259 -143 14 10 148 94 -43 -14 191 -4 -60 -155 -74 -75 -30 -242 37 161 308 -202 -170 -99 105 95
2680 95 -236 -137 169 106 70 220 2 171 -100 73 -53 243 274 66 -167 -163 226 -149 60 42 -44 94 -4
2703 -4 -98 166 -51 79 -221 114 -76 45 129 7 -60 -117 -213 155 -125 -244 -77 -202 -27 152 142 -128 -83
2726 -83 -93 -39 -12 -84 41 -37 -78 23 173 -32 165 -191 -213 -232 -14 -74 6 -132 137 -69 -207 -29 227 -211
2750 -211 -122 152 101 -32 -73 241 -6 29 76 152 44 85 31 94 -299 164 63 33 106 195 154 111 -155 -82 -203
2775 -203 28 131 -4 -108 58 123 202 70 -125 42 -63 -243 -90 60 130 112 -97 -78 -84 -24 150 -28 -112
2798 -112 159 -47 -304 -212 -7 -19 85 -129 21 20 98 254 -21 25 186 184 193 -9 312 -117 -105 -64 -273 41
$$ packed form
2631D0k2j4J12j91J61j78K1j60L5R4O6p3K53j2m1r7K11l06J8J00J75k19L44l22
2655eq7L51m02J57mJ38n4j37K9K05j95n6r5Q1jM5k12K79J24J47n10L2P1K04j0
2680I5l31R9L06o3l6J50k18J69k71J73j26K96L1k08k33ML89l75K09j8q6J38r8
2703dr4K64k17J30l00L35j90J21Q4j22o7n7r6L68k80j19J67j25J75J79j0k70M5
2726h3j0N4K7p2J25p8m1J01J50k05J97l56k2j9K18o0Q0j38K69k06j38J78K56m38
2750b11Q9K74n1j33m1L14k47L5M7P6j08M1n4O3l93M63j01l0P3Q9m1m3k66P3j21
2775b03K31J03j35j04J66O5P9j32j95J67j05j80J53J50P0j8k09J9oO0J74j78q4
2798a12K71k06k57R2K05j2J04k14J50jP8J56k75M6J61kRk02L21m29J2M1k09L14
$$ plain form
2822 41 -71 -203 88 87 -31 -44 -95 -218 -1 -55 98 118 -109 -159 -271 -11 -84 71 -72 223 241 -33 22 -197
2846 -197 -130 -110 92 -126 -100 -25 -319 143 37 146 123 -214 -26 24 164 -56 -128 -36 -173 -77 -19 93 93 -142
2870 -142 -10 -30 12 150 124 -30 29 256 -145 -255 -122 74 56 259 79 -8 29 34 46 116 23 -147 -88 30
2894 30 105 137 150 36 41 155 -172 -84 229 45 -63 132 34 -271 29 -194 -73 -157 78 105 35 46 -46 -42 108
2919 108 -52 15 82 -126 21 -66 143 -245 100 -107 -25 145 -363 277 176 -129 -148 1 -53 199 -92 120
2941 120 -8 48 44 -61 149 -56 -72 80 72 -186 87 -69 -200 94 137 -34 -88 -35 -161 -173 62 -45 -46 -35
2965 -35 53 -68 -192 -183 -94 -93 135 36 -61 155 147 60 -27 -83 63 -158 126 52 -3 -93 -46 -77 -35 -357 -110 -119 -145 -1
2993 -1 141 190 273 100 -89 209 155 -34 -81 79 66 2 -104 -49 45 -3 -86 136 -26 19 15 125 89 -305 52
$$ packed form
2822D1j12j32K91jj18j3n1j23K17n4J53K0k27n0j12K60p3J55j43K95J8k74N5k19
2846a97O7K0K02k18K6P5k94M62j06J09k3l37J88N0J40k20p2R2j37R6N8J12%k35
2870a42J32k0M2J38k6j54N9K27m01j10J33J96j8K03j80q7L7NJ2P0r3j70N9J18
2894C0P5L2J3j14NJ14l27Q8L13j84j08J95r8l05L00k23J21q4K35K7p0J1r2MJ50
2919A08j60O7O7k08J47q7K09l88L45k07Q2J70n08O40j01l05j9J49n4K52k91K12
2941A20j28N6mj05K10k05j6J52qk58K73j56j31K94M3j71n4N3j26j2K35j07jJ1
2965c5Q8j21j24RQ9JK28r9r7K16qq7q7n6J46k21K84p4n5r0M7l1M2l22K47rk6J44
2993aJ42M9Q3j73j89K98n4j89m7J60j3o4j06N5R4m8q3K22j62M5mJ10l6l94L57
$$ plain form
3018 52 -46 71 17 -73 87 118 62 -37 -174 -119 75 190 41 48 274 -252 320 4 84 53 -329 -45 35 48 84
3043 84 -278 -177 -112 12 159 -116 -23 9 27 -114 278 -159 50 8 -302 85 -53 35 -15 95 1 -223 166
3066 166 -82 -62 23 -230 -7 -26 -100 -92 -21 59 -270 -2 -48 160 2 -69 181 -146 175 -57 19 195 6 -19
3090 -19 -84 48 13 89 -75 -18 38 123 214 -148 4 91 -17 102 124 -20 -119 123 157 14 69 -306 181 -32
3114 -32 -126 136 263 127 -47 109 6 -387 15 -76 -192 150 167 -229 34 -332 269 -50 -94 -88 131 114 49
3137 49 -3 46 4 -95 -159 37 -13 -200 -93 -30 133 -161 222 210 178 145 45 26 -24 120 264 -480 47 -123
3161 -123 72 11 -25 40 1 28 138 -45 -111 100 -94 134 -259 -176 114 -70 308 156 157 215 -221 173 -90
3184 -90 163 -50 31 -44 141 -88 55 -109 222 -164 45 -58 -49 -121 -147 -18 3 247 146 -137 139 416 61
$$ packed form
3018E2r8J17n4r0J60L1n6r9j37N5J94J15j49PK26n26N72l16Q0l1l82K84Q0J3L6
3043H4l62J01O5J24J47k75R3L2J8j41L92m37K09m2l10L87j38Q8n0J10r4k24L89
3066A66k48K0Q5k53K23j9p4QP1Q0l29K68m6K08j58p1K50l27L21k32P6J76j89k5
3090a9o5J32l5P6j64N7N6Q5R1l62J52Q7j08J19K2j44r9K42L4j43N5l75M87k13
3114c2r4K62J27j36j74J56j03l93M02r1j16L42J7l96K63l66O01l19m4OK19j7o5
3137D9n2M9m2r9o4J96n0j87J07O3J63k94L83j2l2l3j00j9n0J44J44p44N27j70
3161a23J95o1l6O5l9K7J10j83o6K11j94K28l93Q3K90j84L78j52JN8m36L94k63
3184i0K53k13Q1p5J85k29J43j64L31l86K09j03Rp2k6J29K1K44j01k83K76K77l55
$$ plain form
3207 61 -72 -135 -142 2 118 95 47 -4 145 106 -189 -64 55 -160 -14 23 -141 32 -38 24 147 -157 5 97
3231 97 71 4 86 -46 333 101 -169 -6 -49 -1 121 204 -64 341 -112 110 -213 -72 -208 60 258 88
3253 88 95 91 -155 -6 27 85 -134 11 147 -72 -121 64 226 -6 141 -41 18 -21 61 95 30 191 -182 271
3277 271 46 -147 -60 5 60 178 -116 144 -91 11 57 -42 171 -182 -11 -25 -87 80 -112 -47 60 -117 19
3300 19 21 -31 22 111 282 -141 -86 -36 -26 175 -67 -64 -67 195 307 256 75 -50 160 -31 -94 -120 -3 34 -235 51
3326 51 -94 -73 109 30 -190 -75 62 -50 110 133 -99 -54 89 141 165 175 -196 200 -78 -42 -63 81 -105
3349 -105 -149 113 15 96 54 130 21 -221 88 112 -91 -47 18 -80 53 -121 -4 44 -1 57 41 -237 46 -11 42
3374 42 85 -52 44 -48 35 18 33 1 -133 -2 -40 -9 -176 -151 -145 1 -165 117 -56 -175 -2 25 88 -34 -152
$$ packed form
3207F1j33o3pJ44J16k3m8n1J49l9k95J25J19k15J46L7j64J73p0O2J23l04J62R2
3231I7k6o7Q2j32L79k32k70J63m3M8J22Q3k68M05m53K22l23J41j36K68J98j70
3253H8Pmk46J49L3N8k19J45J36k19m9J85J62k32J47j82N9l9Q2L4o5J61l73M53
3277B71k25j93Q7O5N5J18k94K60k35J02M6r9K13l53J71j4o2J67j92O5J07j77J36
3300A9Kn2N3Q9J71m23N5N0J0K01k42LlK62J12n1j81j25K10j91o3k6J17L7k69K86
3326E1j45K1J82p9k20J15J37j12J60K3k32M5J43N2K4J0l71L96k78L6k1J44j86
3349a05m4K62r8Q1m2P6j09k42L09K4k03M4O5r8J33j74J17M8m5N8j6k78K83n7N3
3374D2M3j37R6r2Q3j7J5l2j34J31l8L1j67K5OJ46j66K82j73j19J73K7O3j22j18
$$ plain form
3399 -152 -74 51 -50 81 -92 38 136 -40 -4 280 -115 -69 -4 44 186 150 163 -87 -46 293 -186 -293 -77
3422 -77 -134 169 -175 -61 231 108 -33 -194 -119 31 112 -184 24 -113 34 -224 51 262 -77 161 -87
3443 -87 233 77 13 103 79 274 -57 -131 -147 61 79 -62 -17 -120 -132 145 -143 -152 95 -147 28 46 -1 229
3467 229 168 184 -103 -163 173 64 -52 64 -182 -161 145 275 3 -124 -247 30 -32 -62 -31 -184 -206 -225 111
3490 111 78 64 91 138 -26 52 -15 33 -63 159 268 -3 42 256 -176 -16 -52 -87 96 114 -86 34 -16 154
3514 154 -90 66 -179 5 72 197 -240 4 169 -40 1 130 157 69 -84 148 99 -31 -93 -11 -141 -63 -144
3537 -144 49 -66 187 -48 -48 -166 4 108 -13 119 -81 -63 201 -83 -5 -88 59 -29 -164 -319 -15 -101
3559 -101 -241 51 -52 74 -74 -179 141 20 -86 -138 30 -183 202 54 -46 123 17 -54 -116 -36 -128 170
$$ packed form
3399a52P8J25j01J31j73J30R8j76L6K84l95M6O5M8J42l6J3k50M1L39m79j07K16
3422g7n7L03l44J14K92j23j41j61P5J50Q1k96K08j37J47k58K75K11l39K38k48
3443h7L20j56o4R0k4J95l31p4j6K08J8j41M5j03j2K77k88rK47k42J75J8m7K30
3467B29o1J6k87o0L36j09j16J16k46K1L06J30k72j27j23K77o2l0L1j53k2j9L36
3490A11l3j4K7M7j64P8o7M8r6K22J09k71M5K14m32J60l6l5J83J8k00J20n0J70
3514A54k44J56k45J84O7J25m37K44J65k09M1J29K7q8j53K32m9j30o2Q2j30P8q1
3537a44J93j15K53k35%j18J70J04j21J32k00J8K64k84P8q3J47q8j35j55L04q6
3559a01j40K92j03J26j48j05L20j21j06n2J68k13L85j48j00J69j06p1o2Q0r2K98
$$ plain form
3581 170 72 -136 56 80 -34 -128 65 -73 -50 105 77 -219 -52 36 -150 -239 -77 -113 -120 -151 23 2 -141 56
3605 56 131 117 -186 -55 194 19 188 -17 59 -66 108 42 -139 174 -161 68 -2 195 -15 136 191 -20
3627 -20 76 -10 111 81 22 248 160 158 29 53 123 120 147 16 79 -52 214 -24 -30 -20 8 -103 199 -76 128 -30
3653 -30 -160 39 167 4 18 89 148 -38 79 -101 -26 -6 -98 149 -122 -176 -344 140 178 149 330 132 23
3676 23 33 303 -164 100 -132 0 -87 16 214 96 1 -17 165 -171 147 -193 175 -109 7 158 -138 6
3698 6 46 -26 133 281 33 203 -14 55 28 116 111 -137 -22 282 -150 26 -137 -213 -60 242 74 89 51 -94
3722 -94 -110 75 -26 -51 -68 34 -151 12 -24 -8 372 276 78 46 26 -88 76 -20 187 107 -19 -114 94 60
3746 60 -110 -14 -89 74 90 221 -59 -104 70 -28 -305 -70 -42 116 -273 -60 -51 7 -22 -73 94 -14 103 -145
$$ packed form
3581A70r8k08J92K4j14r4J93j38K3J55k8k96J67Q8j86q9J62l6pl1J74k1j43J97
3605E6P5j4l03J31K49j75J69k05P6j25J74o6j81L13l35K29p0J97k10J51N5k11
3627b0R6q6J21l0n9K26q8kj29K4P0lK7j31O3j31K66k38oJ0K8j11L02k75K04j58
3653c0j30J99J28j63J4P1N9j86J17j80P5K0r2K47k71n4j68M84L8k9J81j98j09
3676B3J0K70m67K64k32J32q7J03J98j18r5j8J82l36L18l40L68k84J16J51k96J44
3698FM0p2J59J48k48J70k17O9k7Q8nk48J15L04m32J76j63p6J53L02j68J5l8j45
3722i4j6J85j01k5j7J02j85J63l6J6L80r6j98l2k0j14J64r6K07q0j26r5K08l4
3746F0j70R6p5J63J6J31k80m5J74r8k77K35K8J58l89K13RN8k9n1J67j08J17k48
$$ plain form
3770 -145 -139 6 22 164 -156 66 -7 93 24 210 -105 -159 -47 139 78 65 -27 -27 40 31 183 -136 63 -195 103
3795 103 32 77 -11 -51 -57 -161 -291 207 206 -41 -52 -55 106 -72 104 246 13 54 2 51 30 -100 -25 4 112 -71
3821 -71 59 30 -396 2 -105 180 -67 136 149 -158 -46 -101 -10 -11 -160 -30 245 278 -152 52 87 30 -6 96
3845 96 61 65 -135 33 23 -31 122 -112 156 57 -79 -38 -180 -131 246 -197 -45 142 141 -88 -240 175 47 38
3869 38 157 56 26 -146 16 53 96 88 -36 135 -44 152 278 -123 -101 -42 -89 190 51 142 88 149 142 -87 40
3894 40 79 103 179 6 41 -16 -38 -8 104 -27 46 34 143 -88 -56 60 9 161 -77 -107 -3 150 13 34 12
3919 12 -127 84 6 157 316 -23 74 128 45 117 -13 75 138 48 -31 139 131 14 32 56 133 -84 215 -98 -99 -199
3945 -199 -65 192 2 29 81 56 169 24 -241 155 105 -3 159 83 94 -88 48 -98 -33 400 161 138 -227
$$ packed form
3770a45OJ45J6J42l20K22p3J00o9J86l15n4J12J86o1j3r2%O7rJ52l19J99k58K98
3795A03p1M5q8m0oj04j30M98jk47j1lJ61j78J76J42k33M1n2M9k1j30P5K9J08j83
3821g1J30k9m26L98j07K85k47K03J3l07J12n5R1jj49J30K75L3m30K04L5n7l6J02
3845I6l5Mk00J68j0n4J53k34K68r9j36M1j42M9L77m43J52J87jk29j52M15j28r
3869C8J19j01l0j72J62L7M3qj24J71j79J96J26m01K2N9m7K79j39R1n4O1pk29J27
3894D0L9K4P6j73L5n7k2L0J12j31P3j2J09k31L2J16n1J52k38l0J04J53j37K1k2
3919A2j39K11p8J51J59l39R7N4q3P2j30Q8O3r0p9J70qj17J8K4P7k17K99l13jj00
3945a99J34K57j90K7N2k5J13j45k65L96n0j08J62p6J1j82J36j46O5M33k39k3l65
$$ plain form
3968 -227 91 125 18 64 -36 -79 -98 -160 -70 0 308 154 77 -119 -43 -166 83 -127 130 155 -114 59 -10 -157
3992 -157 -56 -11 -59 -38 -10 46 111 220 -252 -162 -117 126 186 -14 -262 -35 -11 152 28 172 136 -281 -97 34
4016 34 29 -34 -9 72 51 165 68 -35 -71 173 -173 -212 63 -105 -50 -115 -100 24 46 -41 -289 -129 -8 -133 -34
4041 -34 19 -56 37 24 2 186 -92 7 -282 186 108 -138 -227 -207 176 5 90 -19 119 15 -34 86 50 -244
4065 -244 -11 -4 -47 46 -103 20 -2 -98 232 1 73 -92 44 129 30 151 -26 -85 8 179 -20 -193 -40 6
4089 6 43 13 -297 87 -115 -9 -10 34 -115 117 121 114 -36 69 49 162 56 -84 -59 -19 149 -16 128 -291 -206
4114 -206 100 -50 98 117 77 24 7 -43 -14 66 229 -33 -11 105 -90 -195 -141 87 -226 127 -85 50 -173
4137 -173 -5 -35 -251 -233 -67 -153 -145 50 -132 167 -140 -52 27 -78 -65 134 -65 145 8 94 34 115 -338 -88
$$ packed form
3968b27L18L4j07M6j00m3j9o2R0P0L08j54p7j96P6j23K49k10K57K5k69J73o9j47
3992a57J01M5m8K1K8N6O5J09m72R0M5K43O0k00k48K27K4J63j24J44l6m17J84J31
4016C4no3K5Q1k1J14r7j03l6K44l46l9K75j68N5o5J5J24K2q7k48J60J21j25R9
4041c4N3p5R3j3k2J84k78R9k89M68p8k46q9K0L83j71Q5j09J38j04m9J20l6k94
4065b44K33Pm3R3j49J23k2r6L30k31P2j65J36Q5r9J21j77n9R3J71j99j73J53M6
4089FL7l0l10L84k02J06jM4j49K32Mpj50J05k0J13j06j40K5M0J68j65J44m19Q5
4114b06L06j50J48J9m0n3j7n0K9Q0J63k62K2J16j95j05N4K28l13L53k12J35k23
4137a73J68l0k16J8J66q6QJ95j82K99l07Q8P9j05J3J99j99K10j37Q6o0Q1m53K50
$$ plain form
4161 -88 69 -16 -28 64 -118 -96 33 -10 -11 -102 191 69 -131 60 66 50 174 -67 184 11 121 -48 27 70 381
4186 381 133 66 -85 -146 101 90 -205 73 73 62 91 48 399 -26 -183 78 -265 91 -85 -227 -76 -83 -12 169
4210 169 -46 124 21 8 -93 -19 -15 -141 -34 -223 -189 -60 -82 -56 47 -39 190 29 23 -118 50 365 -35
4233 -35 -182 75 8 -51 -102 150 -135 111 -42 165 -196 281 65 -138 -205 -117 79 1 43 -121 248 -102 -116
4256 -116 -62 141 69 43 180 -232 -136 41 1 94 -206 52 -136 40 9 -131 42 155 -100 154 185 267 -4
4279 -4 19 -41 -45 -163 -133 141 119 -31 -247 90 151 -10 180 51 -21 -37 -27 119 37 29 54 225 130 16 96 159
4305 159 -132 10 264 -38 93 127 140 157 -227 -191 182 -186 23 -48 45 -122 -82 -61 5 79 99 88 42 0 68
4330 68 -61 -210 -49 101 -43 426 -47 114 -87 156 267 196 -78 30 90 -47 -15 25 103 -71 61 266
$$ packed form
4161h8J57q5j2R2j82K2J29m3jr1K93j22k00J91Oj6J24k41K51j73J10j69P5M3L11
4186C81k48o7j51o1K47j1k95K78%j1K9m3L51m25j57K61l43L56j76j42J51pP1J81
4210A69k15J70j03j3j01P4Mj26J07j89L4J29k2K6J03q6K29j61oj41J68L15m00
4233c5j47K57o7n9n1K52k85K46j53K07l61M77k16k03o7Q8J96p8M2j64L69l50j4
4256a16N4K03p2k6J37m12R6J77m0R3l00K58j88J76l1j40J73J13k55K54L1Q2k71
4279dK3o0mj18L0K74k2j50k16L37O1j61J90j29p2j6J0J46q2qK5J71r5j14Q0O3
4305A59k91J42K54l02J31L4J3J7l84L6L73l68K09p1R3j67M0K1O6P4K0j1m6m2O8
4330F8j29j49J61J50j44M69m73J61k01K43J11p1k74J08O0j37L2M0P8j74J32K05
$$ plain form
4352 266 192 32 -301 -56 0 -111 -46 187 98 114 -7 41 -47 71 -66 76 -179 -280 216 -166 -31 -41 -81
4375 -81 64 43 -86 25 -251 42 -195 68 -164 -47 -65 194 60 -353 146 110 -85 -185 -25 124 32 -52
4397 -52 198 -23 32 -16 -180 91 72 78 61 -164 42 64 116 41 -28 -145 98 80 16 74 -166 58 83 -136 139
4422 139 131 95 -87 132 89 30 -21 270 -154 -162 75 -123 -29 65 -152 -106 186 193 -41 185 100 -211 40 -36 200
4447 200 -133 -113 -158 57 -89 136 61 102 11 71 194 181 -33 -26 -180 -29 91 -84 -16 75 -129 369 63 32
4471 32 38 51 50 -67 -69 -187 -55 176 -12 46 -202 77 -9 -115 -29 -56 -93 318 119 -107 -41 -57 45 40 42 100 -164
4498 -164 -22 -20 -107 -162 33 -208 -88 67 257 171 92 146 -30 113 97 75 -281 106 -66 68 9 -48 -95 -175
4522 -175 23 30 71 7 30 -117 53 15 -55 -133 -56 -151 119 14 228 37 -133 -180 -71 182 97 21 -23 -41 -25
$$ packed form
4352B66p4j60l33K45N6j11O5K33q9J6j21M8q8J18j37J42k55j01M96l82J35j0m0
4375h1J45k1j29J11k76K93k37K63k32J17j8K59j34m13M99l6j95j00J60J49r2q4
4397e2K50k21N5m8j64K71j9Oj7k25K06K2N2p5o9j17K43j8o4N8k40K24K5k19K75
4422A39ql6j82K19m3n9n1K91m24qK37j98R4R4k17M6K92Pk34K26q5l11K51p6K36
4447B00l33K0m5K15j46K25p5M1r1O0J23j3k14Pj54J51J20j75O8R1k04M98l06l1
4471C2OJ3jj17kj18J32K31j88N8k48K79q6j06Q6k7l7M11j99k26O6j6J02nKN8k64
4498a64J42Kq7n5J95k41J20J55J90q6p9N4j76J43j6k2l56L87j72J34n9n7m7q0
4522a75J98PM1o4K3j47J70l8p0p8P7r5K70j05K14j91j70m7J09K53q5p6m4j8J6
$$ plain form
4547 -25 71 -152 -167 99 25 -130 -12 -141 34 -61 155 39 -110 227 86 88 -39 176 -68 -67 95 -98 71
4570 71 104 122 -40 187 43 -104 -36 -102 -53 -123 159 -207 113 -86 2 -107 92 -114 -49 205 102 -185 85
4593 85 4 -62 70 192 95 110 70 158 -91 -298 165 139 -52 -115 82 69 -120 -63 17 -93 -107 13 46 131 14
4618 14 12 -18 2 -50 83 -2 24 13 -70 91 90 40 109 57 240 82 98 113 42 20 -173 67 71 -22 -10 -193 122 -199
4646 -199 -167 236 -150 -12 -84 187 165 -56 -17 -39 49 2 -75 78 80 -69 214 -192 -9 28 -128 34 110 -42
4670 -42 -38 -105 10 89 -66 -134 -144 65 112 -22 20 -58 51 118 -243 17 -172 -3 -81 51 82 -105 50 -43 8
4695 8 17 71 -55 22 38 -21 -104 140 -330 38 -33 43 -188 42 32 163 9 144 -154 -72 -8 -141 167 8 129
4720 129 122 -43 5 65 91 59 -25 101 40 82 116 -28 -297 64 182 127 -118 91 26 -125 204 85 229 -71
$$ packed form
4547b5R6k23j5K66p4j55J18j29J75r5K16j16j49L37j41Kj27K15k44JJ62j93J69
4570G1L3J8j62K27j44j47O8o6M9p0K82l66L20j99Q8j09J99k06O5K54j03k87K70
4593H5q1o6J32J22r7J5m0Q8k49k07M63k6j91o3J97j3j89N7Q0j10j4J20L3Q5j17
4618A4kl0K0n2J33q5K6j1q3J61jn0O9n2J83j58J6J5p1k2j93K40Mr3J2j83L15l21
4646a99L2M03l86J38p2K71k2k21L9k2Q8m7p7J53Kj49K83m06J83L7j56J62P6j52
4670d2Mo7J15P9j55o8j0K09M7j34M2p8J09O7l61K60j89J69p8J32L1j87J55r3N1
4695HRN4j26P7J6n9q3K44m70L68p1P6k31K30j0J31j54J35k98Q2O4j33L08j59J21
4720A29pj65M8O0K6l2q4J26o1M2L4j44k69L61J18n5k45K09o5j51L29j19J44l00
$$ plain form
4744 -71 88 9 -70 29 -41 -52 19 135 -92 93 -86 231 49 -209 65 31 72 -120 1 -67 4 61 91 83 -143
4769 -143 -78 -19 79 110 37 -69 -56 38 -154 102 79 58 11 140 44 94 221 -19 -136 60 -125 -103 -158 86 -59
4794 -59 -71 -101 -56 -46 -21 188 132 -37 -10 -171 -228 -105 -91 183 76 -190 -88 138 167 -116 135 142 -92 -9 16
4819 16 -4 -37 -40 -292 157 -81 -2 -76 233 -17 -72 -21 -192 -23 67 -57 -54 102 161 53 -107 -147 -96 19 -145
4844 -145 -76 26 -113 -83 -62 -20 69 -75 22 -43 -32 -119 32 48 -156 250 152 -3 -296 67 -151 12 -8 -70
4868 -70 -9 -62 -64 -310 36 -181 144 73 120 91 119 -85 102 -189 -16 56 -74 135 -48 125 -97 37 182
4891 182 270 -135 21 218 6 -215 -90 53 127 39 127 4 -51 -81 -143 -134 -119 63 60 30 -105 -126 130 189 106
4916 106 75 172 -31 129 307 -243 -88 13 -11 0 -56 47 -42 -247 -328 6 20 -125 -124 110 112 61 -53 -29 3
$$ packed form
4744g1J59p9p9R9p0j1P1J16k27J85j79L17j82k58K74l4M1j92J21o8P1N7L0qk26
4769a43O5N9R8L1p3j06J3R4j92K56k3k1m7J29r6N0J27k40j17J96j85K2n5K44j45
4794e9j2l0M5J0K5K09n6j69K7j61n7J23J4K74j07k66J02K26K9k83K51Pk34Q3K5
4819A6k0l3lk52M49k38P9p4L09k50n5N1j71J69R0j24LJ56N9j08j60m0N1J15j64
4844a45O9J02j39L0K1M2Q9j44R7o5J1q7J51J6k04M06r8j55k93L63k18J63k0o2
4868g0O1n3kk46L46k17L25p1M7k9K8k04J87k91J73P2j30K09j83J73k22J34J45
4891A82Q8m05J56J97k12k21J25J43P4q8Q8j23n5l0o2RJ5J82ll0j35k1K56N9q3
4916A06l1R7k03J60J78n50J55J01k4J1n6J03q9k05q1L34J4j45JK34Kn1j14K4L2
$$ plain form
4941 3 -183 -33 -73 161 45 -110 -3 -213 -80 -55 106 66 9 -46 -186 -58 -99 -173 -297 59 20 -54 106 145
4965 145 223 139 44 -103 -156 -175 17 118 133 105 -163 33 -21 53 162 171 41 -247 -39 -135 -24 35 286 95
4989 95 190 51 204 348 179 202 -10 227 20 51 47 57 119 -210 -12 -114 -31 47 253 -171 -56 210 -74
5012 -74 110 94 -103 -251 65 -263 -149 -33 -139 -184 -277 -181 -85 -23 167 -14 -24 -154 178 -17 -187 120 -57
5035 -57 149 145 -94 58 25 -191 -46 -159 29 133 -272 57 -126 -105 -158 -72 -65 -2 119 -68 -69 -24 -121 -86 32
5060 32 77 -46 277 13 -24 34 51 116 -78 5 113 36 -174 -198 29 191 43 -132 2 -99 155 119 399
5083 399 -77 42 -1 -165 95 64 23 -71 66 -132 156 -94 27 -218 133 -69 102 -34 116 -155 -9
5104 -9 146 -17 91 75 17 -122 -153 -17 201 54 154 -58 286 -81 102 -128 27 6 280 50 -110 -126
$$ packed form
4941Cj86J50m0K34j16j55J07k10J33K5J61m0n7n5j40J28m1p4j24L56l9p4J60L9
4965A45P8q4r5j47n3j9J92J01J5k8k68J96n4P4J09Rj30k88K08r6J11N9K51j91
4989I5R5j39J53J44j69K3k12K37k07L1mJ0O2l29J98j02Q3P8K06m24J15K66k84
5012g4J84j6j97j48L16l28J14J16j06m5r3R6R6O2J90j81j0j30L32j95j70L07j77
5035e7K06mk39J52l3k16J45j13J88J04m05L29j83K1n3Q6PO3J21j87jM5r7L5J18
5060C2M5j23L23k64l7N8J7O5j94Q3J08p7k10k4K27J62j48j75J34j01K54l6K80
5083C99m76J19m3j64K60l1m1r4J37j98K88k50J21k45L51k02J71j36J50k71J46
5104iJ55j63J08j6n8j39l1J36K18j47J00k12L44l67J83k30J55k1K74k30j60j6
$$ plain form
5126 -126 152 7 -134 -87 20 221 277 -19 28 262 -160 -25 -61 77 110 120 -173 96 77 -32 392 -10
5148 -10 -64 213 237 143 -81 -245 46 277 -239 126 46 34 -17 -73 89 1 -89 10 82 46 42 222 -85 -95 -135 -9
5174 -9 -24 -181 -85 -170 -296 1 -146 -14 -16 188 14 174 173 -580 -36 -86 53 113 195 -18 -212 -72 8 -87 13
5199 13 17 142 45 -40 -226 -100 97 7 -182 -6 74 -89 44 189 -79 101 -125 54 -86 -2 -198 27 122
5222 122 104 117 41 143 39 104 -163 -147 90 130 -45 -7 119 89 274 -168 16 -171 -71 -188 -55 -318 26
5245 26 -43 -228 -140 41 50 122 -87 333 29 63 61 -211 -49 -198 41 47 -127 84 242 -187 48 1 82 -3 -257
5270 -257 31 53 242 45 -55 79 97 -45 1 62 -24 214 -58 -2 103 -173 169 -138 99 323 -93 48
5292 48 33 -16 -171 -116 61 -162 -168 19 101 123 -84 -67 38 82 -138 -30 -1 186 9 -16 -86 44 96 -11 11
$$ packed form
5126a26K78j45j41M7J07K01N6k96M7K34m22J35l6J38L3J0k93K69j9j09M24m02
5148a0n4K77K4r4k24j64K91K31n16L65q0j2n1n6J62q8r0R9P2l6mJ80l07j0m0J26
5174ij5j57R6q5j26K97j47J32kK04j74J60jp53N44n0J39O0Q2k13j94J40Q0r5J00
5199A3MJ25r7q5j86J26J97r0j89J76Q0j63J33J45k68J80k26J79j40Q4j96K25R5
5222A22j8J3p6J02j04O5k67J6K37M0j75L8J26l0J85m42J84j87J00j17J33k63L44
5245B6o9j85Q8J81RP2k09M20l04L4kk72J62j49K39Oj74K11J58m29K35m7Q1q5k54
5270b57K88K2J89j97j00J34J8j42M6O1q6K38k72N6J05k76L42l07K37K24m16J41
5292D8j5m9j55N5J77k23oJ87Q2K2k07J7J05M4k20J08K9J87j77k5p0J30N2j07K2
$$ plain form
5317 11 -33 -14 -149 60 72 47 -135 12 -51 185 50 40 89 119 128 189 268 -82 64 39 -94 208 48 -113 -197
5342 -197 115 -10 13 -41 159 129 -5 148 54 -202 -87 76 -230 -77 193 57 -66 -166 32 -101 55
5363 55 -133 57 -12 261 -82 -151 -112 318 81 87 212 -14 -72 7 128 14 147 -8 82 87 -217 188 30 10
5387 10 59 -83 -71 -47 -95 25 77 51 119 122 -138 92 -89 61 -10 -46 151 95 -117 -26 -43 -58 132 148 -53 -55
5413 -55 136 -32 -119 -70 82 51 -120 36 -10 -92 -38 -49 -62 36 32 282 47 -124 -104 102 -64 42 -179 122
5437 122 341 105 -84 116 59 -15 212 -186 83 -112 -25 7 107 47 129 128 -188 -121 -57 -261 150 42 -158
5460 -158 113 80 -243 -34 -22 130 -111 31 47 -65 -32 218 -27 -100 -2 103 -7 56 -293 -128 1 -63 37
5483 37 22 -277 166 43 -90 169 117 -42 -30 -97 -108 109 47 91 254 118 112 -53 16 -104 -81 127 -36 -152
$$ packed form
5317A1m4J9j35K09J2k5j82J47o3K36j35j0M9L0RO1P9l50J46k5j33L02j60j61q4
5342a97L12j25K3n4K00l0j34J53r4k56J15J63l06J53K70j36j23j00J98j33J56
5363E5j88J90o9K73l43o9L9M30k37OJ25k26n8P9J21j14J33j55R0Nl04M05j58k0
5387A0M9j42J2K4m8J20N2k6O8Lk60K30j81J50p1l6J97n6k12R1j7j5J90J6k01k
5413e5J91j68q7M9J52l1j71J56m6q2N4j1j3R8mK50k35j71K0K06j66J06k21L01
5437A22K19k36j89K00n7p4K27l98K69j95Q7L2J00o0Q2jl16O7O4k04M11j08k00
5460a58K71l3l23K09J2J52k41J42J6j12L3K50k45p3R8J05j10O3l49J65J29o4J00
5483C7j5k99M43j23j33K59n2j59J2o7j1K17o2M4J63j36oj65O9j20K3K08j63j16
$$ plain form
5507 -152 81 -140 -246 -43 128 159 -82 166 -86 -18 240 -121 -141 91 90 -97 -143 127 126 101 51 168 330
5530 330 51 -159 71 43 95 -19 -353 41 -189 -44 -129 -8 -167 -76 -24 115 54 -83 114 -19 -272 -94
5552 -94 -128 16 35 -23 -72 -6 105 -307 249 107 131 126 -164 -52 -62 70 75 -192 159 120 72 -48 -126 -68 18 12
5578 12 85 -33 111 -39 312 22 -97 -133 260 30 -47 79 9 13 32 146 23 16 -126 184 34 -126 -18
5601 -18 -92 -208 -32 15 19 -125 107 7 -193 62 52 -118 -8 -38 -182 -150 104 65 46 -11 168 -136 -105 -64
5625 -64 113 4 -92 -18 159 82 0 -50 -109 -176 -109 164 -115 97 78 -65 -266 132 -6 -72 -24 145 -37 -38 24
5650 24 135 -64 84 -61 -6 130 52 225 119 -206 147 -135 -191 66 -124 200 147 48 96 79 -88 -220 -439
5673 -439 142 191 104 -7 -90 160 42 -37 -125 39 -47 -57 212 -252 39 34 0 202 -100 -87 64 146 -36 78
$$ packed form
5507a52K33k21j06K03J71L1k41K48k52O8K58l61k0K32jj87m6K70jk5n0J17J62
5530C30k79k10K30k8N2j14l34L94k30J45q5J21j59R1N2J39o1j37J97j33k53J78
5552i4l4J44J9n8m9O6J11m12N56j42K4nk90J12j0J32Nk67L51l9m8j20p8N8Q6o
5578A2P3j18J44j50L51k90j19l6L93k30p7J26p0MJ9J14j23pj42L10j50j60J08
5601a8p4j16J76M7Mj44K32j00k00K55j0j70J10l0j44L2K54l9j9n7J79l04L1M1
5625f4J77j09r6P4J77p7q2n0n9o7O7K73k79K12j9j43k01L98j38o6M8J69j82jO2
5650B4J11j99J48j45N5J36p8J73j06l25L53k82n6K57j90L24n3r9M8j7j67j32k19
5673d39N81M9q7j11q3K50j18p9q8J64q6j0K69m64K91nl4K02l02J3J51Q2j82J14
$$ plain form
5697 78 -33 210 69 49 -80 -384 23 -65 -197 150 130 -253 25 -33 156 -6 115 318 79 42 63 172
5719 172 20 -32 99 30 -105 132 -38 106 -42 9 31 62 -8 176 -71 -33 110 -85 -154 198 -181 149 62
5742 62 84 154 114 20 143 77 -144 -141 -168 141 69 178 197 252 55 -90 144 -6 -63 39 51 13 -46 73 90 -138
5768 -138 -156 140 43 21 -64 -268 -28 348 83 -40 -92 2 128 153 202 161 -1 280 -135 -58 -173 -100 -95 95
5792 95 191 -10 12 -74 147 9 66 -140 -68 -86 268 124 57 -51 -122 -83 51 243 -89 -22 36 -72 -2 -53 -3
5817 -3 19 126 11 141 128 58 208 77 -65 -149 -82 115 -64 -86 -129 108 57 71 50 -180 -39 176 -226 -73
5841 -73 62 -232 104 -104 52 183 252 -149 -40 99 109 -76 118 -263 53 112 34 130 -40 -55 34 174 19
5864 19 -28 79 78 101 189 -18 -130 196 149 -20 16 29 125 83 -35 -214 347 -31 211 -207 77 103 112 -109 -6
$$ packed form
5697G8j11K43j41k0j29l04M07q8j32L47k0l83K78n8J89j62J21K03k39l7K1J09
5719A72j52n2J31o9j35K37j70J44j48N1K2L1p0J84k47L8J43j95o9L52l79L30q7
5742F2K2P0m0r4J23o6k21Lk7L09p2J09J9N5j97j45K34j50n7J02J2l8n9J19J7k28
5768a38j8K96r7k2q5k04K40L76k65j23n2R4J26K5M9m1j62K81m15P7j15P3NJ90
5792I5R6k01K2q6K21j38N7k06P2j8L54j44o7j08p1L9J34J92l32O7N8j08P0n1N0
5817cK2J07j15J30j3p0J50j31j42q4O7J97j79k2m3K37n1J4k1k30J41K15m02J53
5841g3J35k94L36k08J56J31O9m01J09J39J0j85J94l81L16N9p8R6j70j5Q9J40j55
5864A9m7J07jK3Q8k07j12L26m7j69L6J3R6m2j18j79N61l78K42m18K84K6Rk21J03
$$ plain form
5889 -6 -11 -5 -84 105 -65 -75 -77 108 133 -136 -39 112 50 86 -121 45 -68 -185 -94 -103 -33 -157 43 -33 39 -105 53
5916 53 -79 -63 -103 -120 69 -12 11 -24 56 110 251 168 127 -62 -259 -21 272 -94 -24 -9 86 -68 227 -169 6
5941 6 90 99 252 -51 52 24 -158 197 81 -71 -2 -65 -98 37 27 150 -21 90 -200 193 -48 -80 -127 -26
5965 -26 192 -147 -28 69 -77 -155 -57 -77 126 95 48 23 -72 157 133 -101 -42 -5 190 -74 1 91 69 71 37 -45
5991 -45 75 -13 -45 -37 134 -9 82 -36 23 23 70 142 -185 106 -80 112 -189 -3 -30 -308 -49 5 -48 -30 305
6016 305 86 -11 -1 -192 66 -235 125 233 -107 -73 -74 180 -35 59 -57 -6 -19 37 -59 -97 11 100 -82 5
6040 5 62 33 -101 -97 -75 -83 58 -6 30 67 10 -19 22 -129 35 134 77 -66 -223 8 -156 101 11 18 164 -37 206
6067 206 -19 -23 -23 121 248 162 64 -24 -53 82 -97 -18 75 -100 -36 138 66 0 -13 143 -88 18 26 298 -28
$$ packed form
5889fnOp9J89j70j0kJ85K5k69R7J51o2L6k07J66j13j17R1rP0j24K00p6P2j44J58
5916E3j32J6m0j7J89q1K3l5Q0N4J41q3m1j89j97K38K93l66P0J5R5j54K95l96J75
5941FQ4RJ53l03J03k8j82L55j16j52O9o3l3J35j0J23j71J11k90L93k41l2m7J01
5965b6K18l39J19R7j46p8R8k0K03l1m7k5r5K29k4k34N9L7J95k64P5R0k2Kl4q2
5991d5J20q8l2QJ71j43R1j18N9%M7P2l27K91j86J92l01J86k7k78K59N4n3J8L35
6016C05k19r7J0j91K58l01L60J08l40L4jK54k15R4j16N1j3N6r6l8J08Q9j82Q7
6040EN7k9j34MK2qJ41o4L6L7n7k9M1j51J64R9n7j43j57K31j64K57r0PJ46k01K43
6067B06k25m%J44J27q6r8q8k9J35j79P9R3j75O4J74p2o6j3J56k31J06QK72l26
$$ plain form
6092 -28 53 -32 -109 66 -127 -152 30 -32 134 -44 -291 94 304 -100 -40 134 127 -3 -70 130 -52 0 -42 -252
6116 -252 -45 86 -195 -46 -200 87 -204 293 14 106 138 55 -87 -192 20 297 -192 -303 121 41 4 -41
6138 -41 266 181 -16 204 153 109 -91 189 1 -76 124 -57 222 125 27 5 67 -196 209 -327 -22 43 -63
6161 -63 -62 -147 -127 80 60 -56 160 117 -136 85 146 -95 45 -112 45 -171 -354 -88 197 -149 -98 43 47 239
6185 239 -13 -42 -136 -64 -91 -23 -12 16 20 -205 37 -95 213 72 55 11 -73 47 -130 -70 18 -58 79 -317 40
6210 40 3 19 164 136 -78 -28 305 -23 -239 -370 158 38 45 221 -200 -189 -73 23 26 330 29 -126 142 -7
6234 -7 -199 167 207 21 -81 57 85 -53 -156 -10 -37 -27 -71 -112 -21 39 264 11 96 159 -134 22 106 -104
6258 -104 -21 326 -41 56 156 -6 77 224 -63 -147 26 -282 -205 67 -106 58 182 254 -144 107 78 134 103
$$ packed form
6092b8Q1q5p7J75j93k5J82o2J66j78k47L85K10m04O0J74pj30o7K00j82N2m2k10
6116b52K07J31k81J49j54K87k91M97k79R2L2q3j42j05K12K77m89j11M24q0l7m5
6138d1L07q5j97K20n1m4k00K80j88p7K00j81K79r7r8k2O2k63M05n36L05O5j06
6161f3Jq5K0K07k0j16K16m3k53K21O1k41J40j57J57k16j83K66K85l46N1J41MJ92
6185B39k52k9r4P2k7O8J1K8Mk25K42j32L08j41j7m4q4J20j77O0Q8p6J37l96L57
6210D0l7J6J45k8k14N0L33l28k16j31N28j20PJ76m21J1J16R6LL04l01j55K68j49
6234gj92L66M0j86j02J38K8j38j03J46k7J0m4m1R1O0K25k53Q5O3k93J56Q4k10
6258a04Q3L47l67R7J00j62Q3J47k87q4J73l08P7K72j73J64J24P2l98K51k9N6l1
$$ plain form
6281 103 14 -1 -6 105 -126 3 -201 -72 137 26 19 -154 1 43 20 186 -8 48 -276 48 81 -9 -13 -78 -177
6306 -177 -83 175 -70 -127 60 -86 194 36 293 -108 -5 128 148 77 -57 -77 -6 17 -104 -85 -70 85 201
6329 201 -18 -110 35 -176 114 -50 -218 -53 34 -13 -111 -23 66 -161 -15 220 161 52 16 89 51 -64 -21 90
6353 90 54 100 11 -9 -94 87 53 37 137 67 39 90 -82 -132 -131 -162 166 -9 6 -59 -42 182 227 -239 -55 84
6379 84 -152 -48 22 74 -22 -2 -78 126 -5 -75 206 -89 -7 -115 -45 152 -162 153 -77 -186 24 1 -206
6402 -206 95 112 200 23 -28 -38 39 -181 -77 -249 151 238 59 123 232 61 -171 13 -100 71 -270 -119
6424 -119 -24 87 -39 27 -236 12 -38 133 -43 -5 -142 100 195 -157 -249 -164 -184 -131 -37 -139 -45 -61 142 -57
6448 -57 177 -9 -51 132 70 179 69 30 70 161 160 38 65 11 389 -118 -58 87 162 291 101 101 29 130 -28
$$ packed form
6281A03q9j5nJ11k31J29k04J29K09j11pj73J55M2k3J66j94N6l24L24L3r0mo5r9
6306a77R4K58k45n7J87j46K80j58K57m01J03J33K0p1j34k0P1K3j21J9J5J55J16
6329B01k19r2J45k11K90j64j68J65Q7m7r8Q8Q9k27J46K35n9j09l6P3l8j15M3J11
6353I0l6M6q9k0q5J81l4j6J00p0k8N1j72n0Jl1L28j75J5o5J7K24M5m66J84J39
6379H4k36J04P0N2r6K0p6K04j31p0K81k95Q2j08P0J97l14L15k30j09K10k3k07
6402b06L01J7Q8j77n1j0P7k20J04j72M00Q7j79O4J09j71k32J84j13J71l41J51
6424a19R5J11j26O6k63K48n0J71j76L8j37K42R5l52r2Q5k0N3R4j02R4j6K03j99
6448e7K34j86m2J83o2J09j10l9M0R1jj22K7n4L78n07O0J45P5J29j90%p2J01j58
$$ plain form
6473 -28 93 -60 45 150 -28 17 80 -56 265 83 -80 62 320 -26 255 48 104 -271 -98 13 -356
6494 -356 -64 7 -19 -99 -263 121 34 300 70 110 136 9 77 -99 -45 49 186 -14 130 -104 196 148 -114
6517 -114 32 -14 -65 105 29 -436 -61 85 -153 109 -367 -34 -143 145 224 -113 24 -176 80 -45 -103 -16
6539 -16 -33 -182 -42 6 127 -147 -146 -38 -248 -180 -166 176 -1 40 107 -96 2 333 -93 33 -50 85 -83 31
6563 31 67 45 -113 -56 -90 -106 100 -22 120 -72 -134 210 57 -36 -116 55 -31 -71 -51 109 -89 -25 233 -4
6587 -4 81 -87 -103 -43 119 7 70 121 79 182 -130 -134 143 329 83 -248 -19 194 -4 91 266 150 108 104 204
6612 204 34 219 -26 62 63 -2 231 -108 82 -9 -128 -67 63 -156 -137 72 -10 -342 106 -141 35 -126 -263
6635 -263 -183 -133 112 42 243 -138 186 -52 252 -164 218 -37 -150 -56 -148 56 81 117 -18 5 -38 -83 51
$$ packed form
6473b8J21j53J05J05j78M5O3j36L21j82j63J42K58l46K81k07N6l75J73J11l69
6494c56K92P1k6q0j64L84q7K66k30M0K6j27O8j76N4R4J37k00J44k34L00m8k62
6517a14J46m6n1J70p6m65L75J46k38K62m76L33j09K88P9l37J37k00K56j25n8Q7
6539a6j7j49J40M8J21k74JJ08k10O8J4L42j77M1O7k03R8L31m26J26q3J35j68J14
6563C1L6k2j58N7l4j6K06j22J42j92o2L44j53r3q0J71q6m0K0J60j98O4K58k37
6587dQ5j68j6O0J62j12O3N1m2J03l12mK77J86k46l31K29K13j98R5J75j16m2mJ00
6612B04j70J85k45Q8Jo5K33l39J90r1j19O1J30k19J9K09q2l32M48k47J76j61j37
6635b63Q0N0K45p0K01l81L24k38L04m16L82k55j13R4r2K04K5L6j35K3m3m5J34
$$ plain form
6658 51 84 159 -90 -73 -136 -3 42 32 -56 159 -308 -84 -77 -79 96 -68 -67 221 46 -275 -309 20 46 -150 69
6683 69 35 -197 25 129 65 -33 71 -59 3 86 -22 114 262 -83 -9 296 59 66 -157 -167 -37 44 354 123
6707 123 -191 -138 -43 64 -40 -45 -138 178 -174 70 -19 -178 -172 -72 121 -101 247 -110 106 81 52 81 -228 77
6731 77 -52 152 -197 -11 -53 -44 -15 104 147 3 -92 102 106 71 -73 64 14 64 30 -14 -11 -178 317 -252 -111
6756 -111 -193 -34 187 131 166 88 79 81 -230 216 61 -138 112 -89 8 -197 191 -65 -30 61 63 -62 -9 45 -140
6781 -140 273 81 -306 256 -55 -89 153 -9 -145 -112 124 -19 -92 74 -63 -40 84 -50 -71 -195 -26 6
6803 6 -11 63 3 14 138 128 74 -40 -37 -45 69 25 -170 5 129 -102 20 -297 -94 -119 75 13 -109 -75 -78 -77 4
6830 4 134 -80 -76 -214 118 -179 -174 99 40 -146 52 22 -76 -35 232 26 -25 195 79 -191 61 112 56 -4 15
$$ packed form
6658E1L3P5k49J7o3J33M5j0q8K15m67K24PkJ75j64JK88j75l21l4L29K6j96K19
6683F9l4k32K22J04o4r8J04j30O2Q3j08J36J48l45P4L05k37Pk23j0J30Q1L10k31
6707A23l14N3R5J07j04nr3L16l52K44q9j59OJ00J93k22L48l57K16k5k9K9l09L05
6731G7j29K04l49J86m2RK9J19M3j44r5J94Ml5j44J37n0N0l4m4Lj67M95n69J41
6756a11q2J59K21n6L5p8rKl11M46j55j99K50k01R7k05L88k56L5R1Kj25N3N4j85
6781a40M13j92l87N62l11l4K42j62j36L3K36j43p3J66j37K3J24j34k1j24J69L2
6803Fj7P4o0J1J24j0n4j14LqJ14m4j95J75J24k31J22l17K03k5J94o2j22L4lJQ1
6830DJ30k14Mj38L32k97NK73n9j86J98l0r8M1K67k06n1K20j16k70K52N1n6o0J9
$$ plain form
6855 15 -44 -57 88 -51 -65 53 -248 -10 -112 -230 -55 -50 -93 250 96 -116 -85 -314 117 40 -43 12 -8 13
6879 13 19 -89 -126 74 -6 16 161 112 -87 146 -128 -282 -169 -113 78 -138 -130 224 -239 -192 98 -69 -75 14 200
6904 200 -74 66 31 -44 157 41 -88 32 96 181 -68 -54 -31 112 -88 -129 62 -49 57 113 -9 119 99
6927 99 -90 -11 48 238 319 -161 194 6 82 -24 -7 -111 290 -137 24 -330 -115 149 -149 -8 -149 -62
6949 -62 65 132 -4 108 72 -69 207 53 112 68 199 0 -25 54 6 27 -127 1 74 20 12 -16 54 -144 -123
6974 -123 -123 -12 115 149 -84 -77 14 -137 92 87 -138 36 -14 78 125 244 -92 24 134 153 47 15 -98 13
6998 13 3 59 -106 14 -122 2 -192 -192 -26 -200 47 -193 96 5 39 -152 137 -152 106 28 -52 -138 -98 -67
7022 -67 172 -98 -41 -105 43 -7 297 38 -12 29 -51 37 32 122 -12 -24 -207 -97 -205 -156 -14 112 96 -8 -42
$$ packed form
6855A5n9j3J45j39j4J18l01K38j02j18J75Nm3L43j54k12L1k29M31p7q3N5k0K1
6879A3Oj08l7K00q0K2J45m9j99K33k74j54J13N6J91k16QL54m63M7K90j67oQ9J86
6904B00k74J40l5p5K01j16j29J20O4Q5k49J4K3J43k00m1J91j11J06N6j22J28k0
6927I9j89P9N9J90Q1m80L55j88P6j06J7j04M01m27J61l54K15K64k98J41j41Q7
6949f2J27O7j36J12l6j41K76j54N9m4J31j99k5P9m8K1j54J28P3n4qk8P0j98K1
6974a23%J11J27L4k33PR1j51K29nk25J74n0R2M7J19l36J16J10J9j06l2j13J11
6998A3j0N6j65J20j36J24j94%J66j74K47k40K89r1L4j91K89k89K58p8q0q6M0L1
7022f7K39k70N7o4J48n0L04k59n0M1q0Q8nR0j34j2j83J10j08M9J42J26j6j04l4
$$ plain form
7047 -42 -188 127 -89 -82 102 -22 -68 130 8 3 -102 -51 -3 -71 -19 48 202 136 76 26 -13 -95 138 -65 -49 27
7073 27 57 -17 0 105 -61 -67 -104 -168 -87 -59 -111 -72 182 158 52 -112 133 -66 -134 -37 177 -43 -61 127 43 -10
7099 -10 174 -213 114 46 91 67 84 50 -121 12 19 -84 193 14 -171 261 -82 -152 54 36 -69 64 -166
7122 -166 62 -336 -38 165 117 -33 -172 -159 98 -6 -180 -193 89 -17 -89 44 81 -72 -2 -112 150 14
7144 14 84 28 -27 82 23 239 139 66 8 -23 -217 -310 -74 101 -140 64 -222 143 -49 -18 -15 -5 12 77 -33
7169 -33 -162 -210 -106 -111 -148 2 0 34 202 136 -45 25 144 -152 -166 45 5 144 -71 -92 8 82 -226 55 -24
7194 -24 121 -10 8 20 -98 24 -130 130 -86 -96 228 37 199 134 -116 -7 -122 -43 -101 -110 -75 -111 47 -105
7218 -105 -62 -74 49 -159 -121 41 55 -201 -87 -5 367 -22 -269 22 -8 145 129 -143 19 -3 40 -77 80
$$ packed form
7047d2j46L15k16PJ84j24m6J98j22nj05N1M8o8N2O7J54o6o0n0l9q2K33k03J6P6
7073B7L0p4J7J05j66ol7o4Q1K8n2L9K54k4j06j64K45j99o8R7K14k20j8J88q4n3
7099a0J84l87L27o8M5k4J7l4j71J33Pj03K77j79j85M32l43p0K06j8j05J33k30
7122a66K28l98K98K03m8j50j39J3K57j04j74j3K82j06p2J33L7j53P0j10K62j36
7144A4P0n6n5J09n9K16j00p3n8l1j94r3K36J75k41K04k86L65j92L1LJ0J7O5j10
7169c3j29m8J04nl7J50kL4J68o6j81P0J19k96j4K11m0J39k15k1J00P4l08K81p9
7194b4J45j31J8J2j18J22j54K60k16j0L24j91J62o5k50J09j15P9n8rL5l6J58j52
7218a05M3j2J23k08L8J62J4k56J14Q2L72l89k47K91l0J53j6k72J62k2M3j17J57
$$ plain form
7241 80 8 127 -7 -41 -10 -262 150 -8 288 152 133 -12 76 -86 -162 -94 -76 -190 -237 -34 272 47 -83
7264 -83 172 23 -172 56 179 -236 79 -107 -112 -45 23 34 1 79 107 154 -141 131 68 87 -93 -55 27 -56 267
7289 267 42 31 97 -90 33 171 -320 97 77 -138 17 -223 247 228 333 -26 369 -11 -179 111 32 161
7311 161 28 228 40 -51 -3 -33 -139 -75 -162 83 137 37 -31 92 -114 146 0 44 -80 -7 198 -33 -47
7334 -47 -110 -94 -88 79 115 -29 69 161 -22 139 -122 21 -77 48 -142 158 130 -216 -89 -6 84 -26 -156 221
7358 221 -43 37 79 36 148 147 7 138 78 -31 287 219 -187 189 -87 8 -50 -37 -89 -15 67 -18 35 33 37 110 -367
7385 -367 196 47 39 -248 -79 -31 -74 -14 -53 -5 79 -84 -207 74 -167 33 -100 -6 46 -85 -83 65 -19 -117 20
7410 20 31 -291 397 -1 -95 157 5 67 -101 -169 -39 143 -40 -184 118 0 32 -7 22 -2 -69 -114 92 -307
$$ packed form
7241H0p2J19j34l4L1k52M12j58K96j36j9j45Q8j62p6O8J8j14m7K03L06k25j30
7264h3K55j49j95K28J23m15L15j86nO7O8J1l3P8K8M7k95K72o3J9j80L8Q2q3L23
7289B67k25j1O6j87J23J38m91M17k0k15J55k40M70j9J05l59L95l80j68K90p9J29
7311A61j33K00j88r1M8l0j06O4q7K45N4j00o8J23k06K60j46M4j24P3K05k31j4
7334d7o3J6OJ67L6j44R8R2j83J61k61J43r8J25j90L00k8l46J27Q3R0j10j30L77
7358B21k64Q0M2m3J12jj40J31o0j09L18o8m06L76k76R5n8J3n2P4Q2q5N3kMP3m77
7385c67N63j49qk87J69M8m3O0l9M8Q4j63j23K81k41K00j33R4N2j31KJ48q4r8J37
7410B0J1l22O88l98r4K52j52O2j68o8J30J82j83j44L02j18L2l9K9k4o7m5K06l99
$$ plain form
7434 -307 -28 66 26 -139 -159 20 12 -36 60 -71 -21 84 49 73 -59 -46 40 -16 219 139 -288 93 93 -120 -106 394
7460 394 35 68 -165 -47 -104 16 -77 153 22 -4 -132 -94 238 -110 -186 142 69 -186 127 -56 22 -146 -186
7483 -186 -31 111 31 -124 -112 -46 -204 -62 310 -77 147 -91 -222 58 -210 76 43 1 -81 -196 14 70
7505 70 231 -105 -114 -121 -15 129 104 243 41 167 99 -56 60 -66 266 -28 -129 136 -182 10 -20 45 -179
7528 -179 -60 112 78 -58 -290 -65 73 -17 139 -1 4 106 66 27 81 46 75 52 5 -100 -89 65 -94 -239
7552 -239 239 44 59 -209 236 -78 21 -7 68 -58 -166 -36 35 -123 -67 -70 -7 -113 -22 97 164 148 -4 -43
7576 -43 226 -181 -5 -16 -53 -89 33 -64 -354 215 88 -29 99 -77 -91 -226 234 107 -36 62 -222 -305 81
7599 81 106 -156 279 -150 -16 -38 -43 -127 149 -113 63 -243 -14 86 -197 174 -170 -57 -79 127 14 6 89
$$ packed form
7434c07K79R4m0j65k0J79qm8R6j31N0J05l5K4j32J3Q6n6K35q0m27L81%k13J4N00
7460C94l59L3k33J18n7J20r3K30j31k6j28L8L32l48p6L28p3k55L13j83P8j68m0
7483a86J55J42q0j55J2O6j58J42L72l87K24k38j31K80k68K86l3m2q2j15K10N6
7505G0J61l36rpJ06J44k5J39k02J26o8j55J16j26L32k94j01K65l18J92l0O5k24
7528a79J19J72l4j36k32K25J38r0J56j40NJ02m0l9N4l5K9k3m7j05J1J54j59j45
7552b39M78j95J5k68M45l14R9k8P5j26j08J30P1j58N6lO3j06R1J19O7j6j52l9
7576d3K69m07J76j1l7l6J22r7k90N69j27j17J28j76j4j35M60j27j43R8k84q3L86
7599H1K5k62M35m29J34k2nq4K76k62J76l06K29J00k83L71l44J13k2K06j13qQ3
$$ plain form
7622 89 -117 -18 -66 169 -138 7 -363 143 142 102 -111 177 268 119 -41 -22 -9 -137 -13 -81 94 -65 59
7645 59 -100 0 -292 -220 51 -111 -229 160 72 18 23 -148 -171 131 168 62 51 -161 -146 24 -24 -177 -173 22
7669 22 80 -156 -38 -87 19 -76 -283 316 -158 -96 -35 64 100 131 27 130 -141 -42 -255 -278 -67 13 61 193
7693 193 51 144 47 53 -58 26 87 95 -67 -193 16 3 65 -61 -55 60 -20 -163 -42 30 63 -128 169 -72 147
7718 147 145 4 87 162 92 -90 72 72 -96 -58 28 -59 91 -56 37 164 62 -200 -19 -10 102 -220 -119 179
7742 179 81 56 52 63 132 -192 -240 -98 -277 -61 -63 89 226 -44 77 -56 26 -105 -60 53 56 -2 -99 130 4
7767 4 -45 -135 -44 -123 -92 127 -46 231 -213 79 -20 10 -71 41 118 -43 -15 -44 82 219 -73 20 -35 -43 52 -91
7793 -91 -113 152 -23 -78 -44 -15 58 10 -73 -175 1 -3 -147 -143 129 96 62 -43 102 43 113 -32 45 -118 -62 -212
$$ packed form
7622H9k06R9m8K35l07J45l70N06jm0k13K88R1j49j60J9J3j28J24o8J75j59J24
7645E9j59J00k92P2K71j62j18L89q8n4Nj71k3L02L7j06j1k12J5J70m8j53MJ95
7669B2N8k36J18m9J06r5k07N99m74O2O1R9L6L1j04J03k71R9k13k3K11Q0M8J32
7693A93j42R3r7Oj11Q4O1Qj62j26K09j3O2j26OJ15q0j43J21P2L3j91K97k41K19
7718A47kj41Q3P5p0j82J62%j68L8Q6q7J50j47R3J27j02k62J81RJ12l22J01K98
7742A79r8k5mJ1O9l24m8J42j79K16kJ52J37k70J21j33Q2j31M5J13Ln8r7K29j26
7767Dm9r0R1p9L1K19j73K77m44K92r9L0q1J12P7j61K8k9J26J37k92R3n5qR5j43
7793i1k2K65j75n5L4K9P3m8q3j02J76mj44MK72l3l4j05J45n9P0j45P7j63N6j50
$$ plain form
7819 -212 -73 -13 226 125 273 18 154 -25 -161 205 53 108 81 -71 251 80 28 110 44 -122 7 136
7841 136 -1 97 -145 -56 47 -3 -105 -137 5 -73 94 -91 -62 -65 198 -65 -114 39 -245 -44 -325 27 207
7864 207 20 20 38 -195 196 -131 180 124 -151 109 -88 -106 78 148 -93 -55 196 -110 -31 -138 87 10 -318
7887 -318 -211 -93 -34 -94 97 236 36 -58 53 84 -61 94 -230 64 17 -358 101 -143 -72 147 -75 84
7909 84 76 165 95 -147 160 -134 140 -62 118 122 -175 -33 62 136 -222 -93 83 -17 40 194 -208 206 92
7932 92 94 -89 -68 91 25 -112 -181 -46 227 -92 -106 34 -177 44 248 -66 54 -108 84 147 64 127 93 108
7956 108 -48 168 -16 -68 63 -30 159 30 23 -111 57 81 243 -64 38 -103 29 -20 41 -88 33 -216
7978 -216 -13 95 70 -104 54 -63 265 -55 48 178 -120 41 -164 -40 -128 60 -44 20 232 -163 215
$$ packed form
7819b12J39O0K39j01J48k55J36j79j36L66j52N5k7j52L22j71n2Q2o6j66J29J29
7841A36j37R8k42Q9J03n0j02l2J42p8J67j85K9lK63k63m9J53k84K01k81L52J80
7864B07j87%J8k33L91l27L11n6k75K60j97j8J84P0k41L8K51l06P9j07K25p7l28
7887c18J07J18N9o0J91J39k00r4J11L1j45J55l24K94m7l75M59k44P1K19k22J59
7909H4qQ9p0k42L07k94K74k02J80Mk97J42R5P4l58J29J76j00N7J54m02M14j14
7932I2Kj83K1J59o6j37o9J35K73l19j4J40k11K21K04l14J20j62J92O3q3O3l4J5
7956A08j56K16j84n2J31r3J89j29pj34J68K4J62l07J02j41J32m9O1j29J21k49
7978b16K03J08k5j74J58j17L28l20J03J30k98J61k05J24q8J88j04O4K12l95L78
$$ plain form
7999 215 58 24 -168 -72 42 46 -66 202 106 152 171 -43 -14 -192 7 -55 127 44 -198 49 -166 -89 -183 -49
8023 -49 -53 -76 -20 -15 -103 79 -66 -41 -33 68 75 95 71 67 -199 -76 164 -42 119 -161 -109 4 91 -43 3 -105 -108
8050 -108 -276 -66 -58 -17 110 -171 149 96 156 112 -89 109 105 83 247 149 -249 -172 41 -17 8 -26 -94 133 47
8075 47 -68 225 87 -145 -20 -57 207 -64 104 25 14 48 98 -28 276 -100 -196 38 68 72 99 121 225 134
8099 134 66 18 -198 -5 203 53 -1 195 -146 -243 -63 106 211 29 25 -119 70 -213 84 -8 -102 -48 -133
8122 -133 69 52 -88 -49 -64 25 -124 6 2 51 -151 -211 -162 76 242 172 65 -163 -91 123 35 38 30 -91 137
8147 137 -191 51 28 245 118 -85 92 -95 -228 93 -34 -180 -226 -60 -179 -38 9 -119 34 249 -156
8168 -156 -62 -70 -114 156 -80 -149 56 -150 -241 -137 172 130 -220 138 -324 18 40 200 -93 -5 -136 -89 -24
$$ packed form
7999B15j57l4j92R6J14Mj12K68r6M6J9k14K9j78J99o2J82q3k42K47k15P7r4J34
8023d9mk3N6Nq8J82j45K5QJ01PK0k4mk66J23K40k06J61k80N2J13Q7j34M6j08l
8050a08j68K10QM1J27k81L20n3O0m4k01J98mk2J64r8l98P7K13n8K5l4o8K27q6
8075D7j15K93j38k32J25l7K64k71J68p9j1L4N0j26L04l76r6K34L0MK7K2J04r1
8099A34o8m8k16J93K08j50n4J96l41r7J80J69J05j82mj44J89k83K97r2r4N4q5
8122a33K02j7j40L9j5Q9j49J30mM9k02o0M9K38J66p0j07k28P2K14q8Lqj21K28
8147A37l28K42k3K17j27k03J77j87j33L21j27j46m6J66j19J41M7j28J53K15m05
8168a56R4qm4K70k36o9K05k06r1J04L09m2l50L58m62L42K2J60k93Q8j31M7O5
8191b4
$$ Imaginary data points
##PAGE= N=2
##DATA TABLE= (X++(I..I)), XYDATA
$$ plain form
0 0 0 0 0 0 0 0 0 0 0 0 0 0 0 7 -8 8 -8 8 -14 16 -16 24 -25 32 -37 41 -49 57 -65 77 -88 101 -113 128 -145
35 -145 166 -184 208 -232 262 -289 323 -358 397 -438 486 -535 591 -653 718 -792 873 -961
53 -961 1057 -1170 1293 -1431 1591 -1775 1987 -2242 2548 -2928 3410 -4048 4933 -6261 8495
68 8495 -13245 49253 -93293 -77282 -6929 -76339 136306 100346 -84633 -37072 -61885 -43900
80 -43900 143989 54132 -48864 -23554 -99300 -15632 135333 28841 -17911 -28521 -107507
91 -107507 6087 107931 27036 7469 -47835 -99501 20824 76896 35189 22762 -63667
102 -63667 -85518 24596 54974 45090 26021 -70088 -70212 18320 41839 55228 21526 -69294
114 -69294 -57334 7732 36943 60841 15011 -62674 -49277 -2606 36940 61616 9221 -52673
$$ packed form
0@%%%%%%%%%%%%%Pj5J6j6J6k2L0l2M0m9N7o9P8r0J06j22J42j65J89k14K41k73
35a45L11l50L92m40M94n51O12o81P55q35R24j021J126j244J371j510J665j834
53i61K018k227K463k724L022l366L762m229M790n476O338p458Q981j1194J4756
68H495k1740O2498j42546J6011P0353o9410K12645l5960j84979M7561k4813J7985
80d3900J87889q9857j02996K5310p5746Q3668J50965j06492m6752j0610p8986
91a07507J13594J01844q0895j9567n5304n1666J20325N6072m1707j2427q6429
102f3667k1851J10114L0378r884j9069r6109j24Q8532K3519J3389l3702r0820
114f9294J1960O5066K9211K3898m5830p7685J3397M6671L9546K4676n2395o1894
$$ plain form
126 -52673 -46258 -10537 39400 58087 6733 -43082 -47075 -13688 39817 52693 8267 -37060
138 -37060 -48380 -12881 37022 46956 12967 -34224 -48538 -10588 32308 43983 16510 -33889
150 -33889 -46057 -9971 26653 44203 17876 -33469 -40737 -12374 22087 45342 15955 -31033
162 -31033 -35829 -16047 20222 45805 13070 -26604 -32605 -20273 20935 43837 10768 -20995
174 -20995 -32140 -22926 22089 40103 9986 -15187 -33281 -23135 23251 34645 11296 -10857
186 -10857 -35382 -21405 22530 29834 14326 -8857 -36669 -18307 20219 25825 17896 -8869 -36476
199 -36476 -14823 15932 23809 20999 -10429 -34550 -12454 11537 23626 22576 -12027 -31233 -11784
212 -11784 7134 24870 22233 -12935 -27023 -12711 4571 26472 20525 -12520 -23155 -14503 3244
$$ packed form
126e2673O415L5721M9937J8687n1354m9815l993L3387N3505J2876m4426m5327
138c7060j1320L5499M9903R934l3989m7191j4314L7950M2896J1675k7473n0399
150c3889j2168L6086L6624J7550k6327n1345p268K8363L4461K3255k9387m6988
162c1033m796J9782L6269K5583l2735l9674o001J2332M1208K2902l3069l1763
174b0995j1145R214M5015J8014l0117k5173j8094J0146M6386J1394k3349k2153
186a0857k4525J3977M3935P304j5508k3183k7812J8362L8526N606p929k6765k7607
199c6476K1653L0755P877k810l1428k4121K2096K3991J2089j050l4603j9206J9449
212a1784J8918J7736k637l5168j4088J4312J7282K1901n947l3045j0635Q652J7747
$$ plain form
225 3244 26622 18071 -10683 -20675 -16809 3240 26625 15865 -8199 -19099 -18207 3880 24709
238 24709 14558 -5315 -18692 -18917 4557 22762 14007 -3220 -18851 -18257 4425 20240 14238
251 14238 -1618 -18446 -17461 3788 18286 15043 -1009 -18369 -16533 2696 16755 14986 -524
264 -524 -17297 -15778 1901 15811 14957 -404 -16169 -15490 795 15187 14965 408 -14838 -15068
278 -15068 49 13993 14363 1141 -14241 -14705 -378 12915 14249 1631 -13536 -14341 -823
291 -823 11589 14001 2441 -12834 -13453 -1322 10654 14205 2617 -12312 -12852 -1998 9737 14191
305 14191 2629 -11201 -12052 -3276 9253 14087 2719 -10448 -11456 -4166 8783 13556 2243
318 2243 -8970 -11306 -4680 8796 12985 2365 -7624 -11290 -4981 8720 11983 2824 -6234 -11367
$$ packed form
225C244K3378q551k8754r992L866K0049K3385j0760k4064j0900Q92K2087K0829
238B4709j0151j9873j3377k25K3474J8205q755j7227j5631N94K2682J5815o002
251A4238j5856j6828R85K1249J4498l243j6052j7360J836J9229J4059j769j5510
264e24j6773J519J7679J3910q54j5361j5765O79J6285J4392k22j4557j5246k30
278a5068J5117J3944L70j3222j5382m64J4327J3293J334j2618j5167q05J3518
291h23J2412K412j1560j5275o19J2131J1976L551j1588j4929n40J0854J1735M454
305A4191j1562j3830q51Q776J2529M834j1368j3167j008P290J2949M773j1313
318B243j1213k336O626J3476M189j0620r989l666O309J3701L263r159r058n133
$$ plain form
332 -11367 -5391 8299 11083 3541 -5596 -11591 -5049 7684 9770 4328 -4988 -11427 -4464 6708
346 6708 9390 4932 -5028 -11220 -4124 5731 8993 5334 -4784 -10283 -3900 4813 8345 5693 -4769
361 -4769 -10014 -4030 4019 8620 5689 -4596 -9090 -4147 2948 8700 5536 -4457 -8367 -4256 2901
376 2901 8430 5396 -3818 -7707 -4732 2397 8161 5192 -3575 -7285 -4866 2148 7791 4729 -3043
391 -3043 -6864 -5042 2113 7784 4714 -2249 -6611 -5235 1950 7059 4594 -1880 -6174 -5269 1540
406 1540 6628 4375 -1357 -5956 -4874 1620 6085 4506 -944 -5883 -4923 1355 5859 4187 -638
421 -638 -5564 -5028 1203 5433 4246 -156 -5716 -4624 996 4812 4189 -292 -5113 -4519 1052 4639
437 4639 4096 -120 -4952 -4389 183 4379 4335 -163 -4632 -3982 145 4092 4263 -3 -4478 -3891 31
$$ packed form
332a1367N976J3690K784p542r137n995O542J2733K086n442r316o439O963J1172
346F708K682m458r960o192P096R855L262l659j0118n499O383Q713L532k652j0462
361d769n245N984Q049M601k931j0285m494M943P095N752l164r993l910M111P157
376B901N529l034r214l889K975P129N764k969q767l710K419P014N643l062p772
391c043l821J822P155N671l070o963m362J376P185N109k465o474m294R05O809
406A540N088k253n732m599J082O494M465j579n450m939R60O278M504j672m825
421f38m926N36O231M230j187m402n560J092N620L816o23m481m821N94N571L587
437D639n43m216m832N63M572M196m4m498m469O50M127L947J71m266m475N87L922
$$ plain form
454 31 4214 4293 -108 -4326 -3822 -207 3619 4295 77 -3865 -3809 -606 3831 4180 -20 -3534 -3540 -1070
472 -1070 3580 4227 310 -3088 -3689 -569 3284 3610 342 -2919 -3729 -936 3285 3613 632 -2968
488 -2968 -3709 -815 2826 3640 595 -2430 -3657 -798 2557 3449 854 -2390 -3509 -1064 2772 3124
504 3124 1084 -2347 -3221 -899 2382 3080 1131 -2109 -3198 -962 2094 3016 1153 -1915 -2934 -1080
520 -1080 1689 2988 962 -2022 -3108 -909 1562 3047 1073 -1669 -2718 -963 1548 2865 1289
535 1289 -1621 -2711 -1342 1458 2780 1012 -1274 -2199 -1220 1412 2499 1375 -1247 -2419 -1427 1262
551 1262 2446 1320 -906 -2181 -1411 1249 2037 1292 -717 -2113 -1243 828 2256 1168 -827 -2070
567 -2070 -1246 1015 2248 1105 -664 -2109 -1333 637 1954 1481 -605 -1834 -1056 624 1891 1049
$$ packed form
454C1M183P9m401m218N04L615L826O76m218l942N6L203M437L49m200l514oK470
472a070M650O47l917l398o01L120L853L26l268l261q10K793M221L28k981l600
488b968p41K894L641Q14l045l025j227K859L355Q92k595l244j119K445L836L52
504C124k040l431q74K322L281O98j949l240j089K236L056R22j863l068j019J854
520a080K769J299k026k984j086K199K471J485j974k742j049J755K511J317j576
535A289k910j090J369K800J322j768k286r25R79K632J087j124k622j172R92K689
551A262J184j126k226j275P70K660P88p45k009j396Q70K071J428j088j995j243
567b070Q24K261J233j143j769j445P76J970J317m73k086j229P78J680J267q42
$$ plain form
583 1049 -610 -1743 -1210 526 1649 1217 -468 -1600 -1066 540 1690 1249 -302 -1531 -1111 255
599 255 1706 1161 -324 -1459 -1035 369 1389 1124 -375 -1267 -1109 361 1466 1145 -194 -1326 -1225
616 -1225 263 1572 1130 -102 -1314 -1077 138 1247 1232 -115 -1255 -1019 222 1203 1228 -156 -1291
633 -1291 -1057 29 1059 1125 -137 -1173 -955 122 1097 903 135 -1184 -1109 5 1129 971 -125 -1092
651 -1092 -1239 -3 1195 878 -117 -1002 -1109 -209 1024 1110 96 -874 -984 -42 942 1078 -131 -890 -1086
670 -1086 -176 802 1065 -82 -614 -990 -3 772 976 -47 -746 -1053 -358 813 883 101 -707 -886 -328
689 -328 898 911 165 -757 -814 -474 565 867 348 -746 -738 -124 733 819 285 -373 -926 -166 714 948 402
710 402 -389 -925 -531 277 719 284 -574 -858 -238 244 694 411 -723 -853 -355 455 700 355 -548 -907
$$ packed form
583A049j659j133N33J736J123m32j685j132N34J606J150m41j551j229M20J366
599B55J451n45j485j135M24J404J020k65j499q92J58J470J105l21j339j132J01
616a225J488J309m42j232j212K37J215J109j5j347j140K36J241R81K5j384j135
633a291K34J086J030O6j262j036K18J077R75j94p68j319P5J114J124j58j096r67
651a092j47J236J198l17r95q85j07R00J233Q6j014r70j10R42R84J36j209p59j96
670a086R10R78K63j147n32l76R87P75K04j023o99l07O95J171P0p82q08j79N58
689c28J226J3p46r22n7L40J039L02n19j094QO14Q57Q6n34o58n53P60Q80K34n46
710D02p91n36L94Q08M42m35q58k84O20M82M50k83j134j30M98Q10K45l45r03l59
$$ plain form
730 -907 -356 412 748 570 -590 -477 -230 262 887 276 -419 -671 -710 160 677 265 -273 -625 -521 403
750 403 724 454 -517 -373 -458 309 633 245 -172 -643 -291 166 635 665 -52 -593 -433 434 395 490 -91 -668
772 -668 -451 38 404 356 -320 -314 -371 8 604 231 104 -246 -534 36 804 638 -251 -589 -503 97 589 598 -136
795 -136 -488 -334 -148 617 405 41 -317 -249 66 498 475 -21 -503 -395 36 233 231 145 -421 -505 -24 368
817 368 556 -48 -234 -490 -120 248 409 38 -135 -328 -68 119 370 212 -331 -328 -168 494 463 140 -286
838 -286 -201 -77 337 485 194 -315 -558 -80 414 244 29 -134 -430 -258 -71 469 299 -113 -298 -257 395
859 395 389 123 -258 -404 -393 378 180 -59 -202 -293 -102 196 396 94 -68 -334 -259 -106 267 -35 -102 -37 147
882 147 66 38 144 -179 -261 -88 156 182 94 39 -2 -178 162 357 -10 -182 -292 -283 245 166 318 -123 -230 -62
$$ packed form
730i07N51P68L36j78j160J13K47M92O25o11o95k52l9Q70N17m12n38l52J04R24
750D03L21k70r71J44q5P67L24l88m17m71L52M57M69L0p17n41J60Q67l9R5n81n77
772f68K17M89L66m8o76On7L79N96l73j27l50k88N70P68j66q89l38Q6O00M92Rp34
795a36l52J54J86P65k12l64l58O8L15M32k3m96m82J08M31J97kq6n66q4M81L92
817C68J88o04j86k56L70L68J61l71j73j93K60J87K51j58n43LJ60O62l1l23m26
838b86Q5J24M14J48k91n09k43M78M94j70k15j63k96J72J87N40j70m12j85M1O52
859C95ok66l81j46J1P71j98k39j43r1J91K98K00l02j62k66P5J53L73l02o7O5J84
882A47q1k8J06l23q2J73K44K6q8n5m1j76L40J95l67j72j10RN28p9J52m41j07J68
$$ plain form
906 -62 30 246 29 -76 -280 -120 -26 152 78 -248 -225 -211 204 263 214 -48 -158 -294 -96 168 109 -38 -145
929 -145 -375 206 135 142 92 -17 -203 217 162 -18 154 -383 -138 -110 196 28 -47 14 -239 -130 119 65 -138
952 -138 -268 -141 -225 156 -116 83 -149 -320 79 92 241 48 -114 -108 -242 228 141 43 -136 -252 -145 -133 149
975 149 -88 97 -111 -15 168 348 164 77 -43 -54 -106 81 257 0 -176 -193 179 124 -60 56 -252 34
997 34 170 82 -11 -114 -304 -95 11 -37 110 10 -168 -124 -95 35 -21 -68 -39 -230 134 6 118 117 -172 71
1021 71 262 78 66 -192 -159 -81 -30 217 149 91 -325 78 -94 92 95 147 23 18 -17 62 197 128 -10 -30 -230
1046 -230 -31 -21 -63 -93 -165 -97 197 112 141 168 -115 -73 190 252 -52 13 -133 26 -24 -22 15 -8 -64 -87 60 126
1072 126 68 0 -170 141 22 256 -67 -150 -41 195 -79 126 19 -110 -24 -190 -82 8 -136 -104 -235 -50
$$ packed form
906f2R2K16k17j05k04J60R4J78p4l26K3J4M15N9m9k62j10j36J98K64n9j47j07
929a45k30N81p1Pn0j09j86M20n5j80J72n37K45K8L06j68p5O1k53J09K49n4k03
952a38j30J27q4L81k72J99k32j71L99J3J49j93j62Oj34M70q7r8j79j16J07J2K82
975A49k37J85k08R6J83J80j84q7j20j1n2J87J76k57j76j7L72n5j84J16l08K86
997C4J36q8r3j03j90K09J06m8J47j00j78M4K9J30n6m7K9j91L64j28J12jk89K43
1021G1J91j84j2k58L3P8N1K47o8n8m16M03j72J86LN2j24nl5P9J35o9j38k0k00
1046b30J99J0m2l0p2O8K94q5K9K7k83M2K63O2l04O5j46J59n0KL7k3n6k3J47O6
1072A26n8o8j70L11j19K34l23q3J09K36k74K05j07j29Q6j66J08R0j44L2j31J85
$$ plain form
1094 -50 35 93 16 -88 -113 -134 158 -213 57 -40 -96 -97 217 -169 79 58 -85 51 231 221 -74 -41 -107 106 288
1119 288 -63 -140 -175 -130 -242 85 107 139 -253 -174 -303 -32 431 21 65 33 -255 100 223 60 -124 -2 -231
1142 -231 20 124 121 92 -203 -48 104 128 282 60 -173 -183 -119 153 251 -41 -111 -170 80 42 -30 178 -96 -214
1166 -214 183 -63 10 39 -104 -144 -93 97 161 139 -95 -164 68 223 91 -28 -37 -64 -171 25 167 88 -334 -215
1190 -215 -167 -85 198 50 -68 -119 61 -61 7 90 106 -356 85 -91 -5 217 -20 58 -38 -88 150 47 -189
1213 -189 -6 -72 275 75 27 -149 -164 101 280 158 -126 90 -101 27 31 120 186 -168 -61 27 9 90 -65
1236 -65 -214 -156 39 29 -59 129 -124 -258 -252 -53 170 58 47 -283 -53 57 91 156 63 -190 -84 43 -293
1259 -293 335 -127 -52 -120 197 -204 241 119 -36 -147 -57 195 230 154 80 -48 -113 154 349 -47 -402 -61
$$ packed form
1094e0Q5N8p7j04k5k1K92l71K70r7n6jL14l86K48k1j43J36J80j0k95L3o6K13J82
1119B88l51p7l5M5j12L27K2L2l92P9j29K71M63m10M4l2k88L55J23j63j84J22k29
1142b31K51J04lk9k95J55J52K4J54k22k33j0O4K72R8k92p0n9K50l8p2K08k74j18
1166b14L97k46P3K9j43m0N1J90O4k2k34o9K32J55j32j19rk7j07J96J42p9m22J19
1190b15M8Q2K83j48j18n1J80j22O8Q3J6m62M41j76Q6K22k37P8r6n0K38j03k36
1213a89J83o6L47k00m8j76j5K65J79j22k84K16j91J28MQ9O6l54J07Q8j8Q1j55
1236f5j49N8J95j0q8J88k53j34OJ99K23j12j1l30K30J10L4O5r3k53J06J27l36
1259b93O28m62P5o8L17m01M45j22j55j11R0K52L5p6p4j28o5K67J95l96l55L41
$$ plain form
1281 -61 126 221 -43 103 -218 -286 104 286 -28 128 -421 77 1 274 18 162 -87 -332 34 87 145 -127
1303 -127 50 110 163 -35 36 -244 -16 -126 165 144 63 8 -136 -41 -209 75 48 42 -137 -53 -119 37 170 -35
1327 -35 -241 118 79 221 -76 -33 -161 -165 85 -115 -34 205 -89 -113 -5 -83 125 99 -86 -183 -69 308 55
1350 55 -7 -95 90 160 137 173 51 -24 -152 152 -101 -128 -12 20 -196 23 117 126 277 97 -52 19 182 144 24
1375 24 49 -282 -149 -71 111 154 -3 -50 157 -132 -43 10 192 -275 -82 177 121 -16 -1 112 -139 -91 201
1398 201 141 78 -88 -5 197 236 16 1 -298 -7 11 108 -86 -8 -261 -353 208 -48 3 67 -267 -14 78 16
1422 16 53 -234 -151 -295 -97 162 66 -220 -107 -76 67 52 283 -122 -231 -198 6 -65 -27 -129 -123 -6 190 197
1446 197 164 68 -65 -187 129 -37 -77 -47 2 -193 -60 80 205 -100 152 -27 -73 39 96 -107 -198 3 21
$$ packed form
1281f1J87R5k64J46l21o8L90J82l14J56n49M98p6K73k56J44k49k45L66N3N8k72
1303a27J77O0N3j98P1k80K28j10K91k1q1n5j44R5j68K84k7oj79Q4o6J56J33k05
1327c5k06L59l9J42k97M3j28mK50k00Q1K39k94k4J08p8K08k6j85r7J14L77k53
1350E5o2q8J85P0k3L6j22p5j28L04k53k7J16L2k16K19R4RJ51j80j49P1J63l8j20
1375B4K5l31J33P8J82M3j57m7K07k89Q9N3J82m67J93K59n6j37J5J13k51M8K92
1398B01o0o3j66Q3K02L9k20j5k99K91J8R7j94P8k53r2N61k56N1O4l34K53R2o2
1422A6L7k87Q3j44J98K59r6k86J13L1J43j5K31m05j09L3K04p1L8j02OJ17J96P
1446A97l3r6j33j22L16j66m0L0M9j95J33J40J25l05K52j79m6J12N7k03r1K01J8
$$ plain form
1469 21 -162 92 -24 -174 -80 -93 123 -71 102 -361 -299 120 227 130 -23 -102 46 97 -40 4 314 -166 -313
1492 -313 108 11 -115 69 -127 70 -153 230 174 -41 -61 158 -61 242 97 194 -93 -70 28 69 -30 194 -31
1515 -31 -55 -161 -172 107 -119 68 -101 216 42 176 -131 -137 -110 -188 103 -115 -15 -118 -3 112 140 30 -76
1538 -76 -73 -177 -78 85 114 -23 -216 -223 106 -113 39 34 45 -8 -232 -70 67 129 -15 -102 -154 54 108 145 -11
1563 -11 -87 -55 22 -30 231 -20 -163 -246 351 96 216 -117 -229 145 56 120 169 -48 38 -147 -216 10 302 -44
1587 -44 147 -213 -82 31 146 -193 69 -87 -182 149 40 122 108 -60 188 108 68 -85 -29 -162 51 187
1609 187 20 -24 30 -164 -103 100 183 -54 -152 -205 -57 120 79 2 35 95 -264 -106 9 -48 -243 57 -85 72
1633 72 -75 -19 -51 -190 83 52 -56 -49 27 -131 53 50 236 57 69 -61 84 151 -36 -32 -68 15 187 108 89 -44
$$ packed form
1469B1j83K54j16j50R4j3K16j94J73m63O2M19J07r7j53p9J48N1j37M4L10m80j47
1492c13M21r7j26J84j96J97k23L83n6k15k0K19k19L03j45R7k87K3R8M1r9K24k25
1515c1k4j06j1K79k26J87j69L17j74J34l07oK7p8K91k18J00j03J15J15K8j10j06
1538g6Lj04R9J63K9j37j93pL29k19J52nJ1n3k24J62J37O2j44q7n2K08N4L7j56
1563a1p6L2P7n2K61k51j43q3N97k55J20l33j12L74q9O4M9k17Q6j85o9K26K92l46
1587d4J91l60J31J13J15l39K62j56r5L31j09Q2j4j68K48q0m0j53N6j33K13J36
1609A87j67m4N4j94O1K03Q3k37r8n3J48J77m1p7L3O0l59J58J15n7j95L00j42J57
1633G2j47N6l2j39K73l1j08PP6j58J84lJ86j79J2j30J45O7j87Ml6Q3J72p9j9j33
$$ plain form
1659 -44 -247 34 206 262 80 5 21 -283 -50 -30 17 19 9 -129 -23 17 149 -26 -116 -33 -21 30 152 152 -69
1684 -69 -183 237 150 146 211 -108 19 194 139 6 -36 3 -22 -61 -12 173 69 -310 190 -5 45 126 -139 161
1708 161 63 12 47 133 1 -87 -107 -82 21 15 -60 100 -134 58 -79 122 62 -9 -80 -85 170 113 90 -39 42 -29
1734 -29 176 239 129 -22 80 -123 163 31 -392 -194 -243 -63 -79 72 67 -162 -71 21 57 185 233 -120 172
1757 172 3 7 -179 44 -45 -53 -5 36 -165 -245 112 -196 -62 100 71 83 -134 -162 24 -51 116 -80 -90 -224
1781 -224 -289 -121 -5 125 103 -118 -289 168 189 65 26 150 57 -264 -96 117 -146 -178 55 42 263 -327
1803 -327 46 1 -238 141 169 166 139 56 296 225 -9 156 65 27 -55 -36 49 29 111 -26 -90 100 254 0 181
1828 181 5 104 74 10 110 110 -3 75 -38 108 -65 -147 42 -193 226 69 66 -96 99 -63 50 148 -68
$$ packed form
1659d4k03K81J72N6j82p5J6l04K33K0M7Kj0j38J06M0J32j75r0Q3J2N1J22%k21
1684f9j14M20q7mO5l19J27J75n5j33m2L9k5l9M9J85j04l79N00j95N0Q1k65L00
1708A61r8n1L5Q6j32q8k0K5J03op5J60k34J92j37K01o0p1p1nK55n7k3j29Q1p1
1734b9K05O3j10j51J02k03K86j32m23J98m9J80j6J51nk29R1R2L6J28M8l53K92
1757A72j69Mj86K23q9qM8M1k01q0L57l08J34J62k9J2k17k8J86p5J67j96j0j34
1781b24o5J68J16J30k2k21j71M57K1j24l9J24r3l21J68K13k63l2K33j3K21n90
1803c27L73m5k39L79K8lk7q3K40p1k34J65r1l8q2J9Q5k0Q2j37o4J90J54k54J81
1828A81j76R9l0o4J00%j13P8j13J46j73q2J89k35M19j57lj62J95j62J13R8k16
$$ plain form
1851 -68 -18 152 -229 -147 -277 6 119 109 -205 124 40 -8 182 -145 -221 -26 -51 0 114 -118 156 43 218
1874 218 27 -236 -39 53 -67 -134 79 85 316 17 35 45 -60 76 -75 -113 -140 87 -23 -58 27 69 129 75
1898 75 -21 80 -117 -100 7 -90 -139 -9 240 -155 -106 -102 -125 12 -4 20 89 118 43 -106 47 37 -4 128 188 -222
1924 -222 29 100 -95 -165 -60 94 46 -25 52 173 189 -73 215 4 250 -151 -171 77 151 -147 -73 -51 33 -73
1948 -73 98 -65 64 31 122 99 -24 85 -31 50 11 56 -96 -157 93 75 -12 96 -93 -155 -185 19 -113 131
1972 131 67 34 -19 -97 188 138 110 -123 247 -175 -15 244 158 -14 34 2 48 11 107 22 89 146 -29 29 -32 242
1998 242 27 40 82 100 -34 -74 -87 -15 89 253 -26 -2 8 -18 340 100 131 95 -256 99 32 74 -81 -13 -139
2023 -139 202 56 -104 -76 28 -146 59 13 82 23 -65 -169 -58 -39 271 125 -159 74 -88 76 178 30
$$ packed form
1851f8N0J70l81Q2j30K83J13j0l14L29q4m8J90l27p6J95k5N1J14k32K74j13J75
1874B18j91k63J97R2j20o7K13OK31k99J8J0j05J36j51l8k7K27j10l5Q5M2O0n4
1898G5r6J01j97J7J07r7m9J30K49l95M9Mk3J37j6K4O9K9p5j49J53j0m1J32O0m10
1924b22K51P1j95p0J05J54m8p1P7J21J6k62K88k11K46m01k0K48P4k98P4K2Q4j06
1948g3J71j63J29l3R1k3j23J09j16Q1l9M5j52o1K50j8q7J08j89o2l0K04j32K44
1972A31o4l3n3p8K85n0k8k33L70m22J60K59q6j72M8l2M6l7R6q5O7N7j75N8o1K74
1998B42k15J3M2J8j34m0j3P2J04J64k79K4J0k6L58k40L1l6l51L55o7M2j55O8j26
2023a39L41j46j60K8J04j74K05m6O9n9q8j04J11J9L10j46k84K33j62J64J02j48
$$ plain form
2045 30 -152 -58 136 -101 -144 14 15 -258 75 187 72 15 -77 19 -20 25 -6 120 82 -72 16 -189 154 -252
2069 -252 78 -61 -77 -79 130 74 14 23 53 -166 -9 4 12 76 -182 5 72 -7 38 -55 -225 -32 241 96 236
2094 236 217 132 -59 216 166 -39 -84 31 126 28 -66 29 -31 -160 -188 -171 -158 110 49 -111 -51 17 98 -92 -222
2119 -222 99 -119 191 -68 -12 22 53 -94 -139 127 -138 -261 20 223 -80 -34 -135 -242 243 -53 -97 -48
2141 -48 188 -158 -147 4 86 -33 30 114 -95 -49 23 -61 79 -27 -166 120 62 25 -83 206 160 -149 292 174
2165 174 28 78 -346 -37 -85 -110 -91 23 -125 24 174 -82 -91 -30 52 -276 54 56 104 267 -45 19 4 54 -213
2190 -213 -84 55 71 -244 66 124 188 14 -58 84 -82 -187 -33 -167 -54 -176 -44 42 110 -73 -76 124 44
2213 44 129 106 37 139 99 167 327 -40 -233 -230 48 128 -21 -35 -1 94 -27 -95 -23 -91 -154 79 106 -72 119 29
$$ packed form
2045C0j82R4J94k37m3J58Jk73L33J12j15n7r2R6l9M5l1J26l8j54Q8k05L43m06
2069b52L30j39j6kK09n6o0RL0k19J57J3QO4k58J87O7p9M5r3j70J93K73j45J40
2094B36j9q5j91K75n0k05m5J15R5r8r4R5o0j29k8J7J3K68o1j60O0O8Q1j90j30
2119b22L21k18L10k59N6L4L1j47m5K66k65j23K81K03l03M6j01j07M85k96m4M9
2141d8K36l46J1J51Q2j19O3Q4k09M6P2q4J40j06j39K86n8l7j08K89m6l09M41j18
2165A74j46N0m24L09m8k5J9J14j48J49J50k56rO1Q2l28L30KM8J63l12O4j5N0k67
2190b13J29J39J6l15L10N8O4j74p2J42j66j05J54j34J13j22J32Q6O8j83lK00q0
2213D4Q5k3o9J02m0O8J60l67j93LK78Q0j49j4L4R5j21o8P2o8o3K33K7j78J91r0
$$ plain form
2239 29 76 68 -217 100 -135 -25 -30 41 123 -34 -56 -51 168 -132 88 197 -40 -74 31 -57 169 86 -28 -167 49
2264 49 59 25 -147 -41 -40 78 -101 51 69 154 -91 54 14 193 80 -127 -8 120 65 49 369 -153 30
2287 30 -56 229 49 -23 -46 -220 127 238 77 -25 47 67 -92 126 -2 -115 -168 87 40 -51 118 -138 -239
2310 -239 98 48 -99 10 -188 232 -206 114 -144 -51 53 -174 -41 -24 67 66 34 23 48 100 -78 -23 -22 -24 200
2335 200 58 223 37 256 94 35 63 -57 70 -60 20 134 -31 103 -232 38 34 103 -92 -239 41 64
2357 64 178 -84 -61 -203 324 -11 -270 36 -68 -128 -46 -115 -109 65 64 87 -15 -216 -157 -129 -20 -71 -131 50 0
2382 0 -151 146 -7 -124 2 -64 335 146 -144 -356 71 112 62 -18 -203 178 39 72 82 -48 -134 70 142
2405 142 -50 17 14 -32 -85 -3 149 107 -11 16 11 -49 187 -49 110 84 127 -106 47 103 71 -23 -196 -139 131 96
$$ packed form
2239B9M7qk85L17k35J10nP1Q2j57k2NK19l00K20J09k37l4J05q8K26q3j14j39K16
2264D9J0l4j72J06JJ18j79J52J8Q5k45J45m0J79j13k07J19J28n5j6L20n22J83
2287C0q6K85j80p2k3j74L47J11j61j02P2K0j59K18j28j13n3K55m7r1J69k56j01
2310b39L37n0j47J09j98M20m38L20k58R3J04k27J33J7R1jl2j1K5N2j78N5JkK24
2335B00j42J65j86K19j62n9K8j20J27j30Q0J14j65J34l35K70mO9j95j47K80K3
2357F4J14k62K3j42N27l35k59L06j04o0Q2o9OJ74jK3j02k01N9K8J09n1o0J81n0
2382@j51K97j53j17J26o6L99j89k90k12M27M1n0q0j85L81j39L3J0j30q6K04P2
2405A42j92O7lm6n3Q2J52m2j18K7no0K36k36J59k6M3k33J53N6l2r4j73N7K70l5
$$ plain form
2431 96 -142 -90 13 1 22 55 -87 -330 -116 290 -9 170 26 -147 -24 19 157 -190 -1 -233 37 62
2453 62 -156 -5 50 -146 246 125 128 114 53 -151 35 -183 214 -4 -8 103 -54 -58 14 72 -153 33 114 -261
2477 -261 229 -62 -158 -257 78 112 148 -154 -19 36 183 149 -28 -50 -122 -20 -204 172 206 15 -76 -63 52 -88
2501 -88 -228 -116 45 -31 -129 145 -153 195 -67 244 -75 49 -123 -69 377 -73 -20 -164 115 178 -11 -93
2523 -93 -87 186 4 118 12 287 30 119 -185 182 -45 0 175 -42 -216 -31 50 87 172 54 -60 97 -238
2546 -238 -222 59 -257 214 -68 -89 47 229 -19 -252 -170 -131 -20 -10 112 -242 -123 151 150 77 -278 -20 48
2569 48 -99 198 115 -22 201 83 -66 98 25 -170 -3 117 -78 146 5 -54 64 -296 -99 -46 125 107
2591 107 -57 -1 76 -74 -173 171 -103 -122 43 -57 51 -134 -9 -72 -65 -215 32 -62 177 -250 -69 -147 60
$$ packed form
2431I6k38N2J03j2K1L3j42k43K14M06k99J79j44j73J23M3J38l47J89k32K70K5
2453F2k18J51N5j96L92j21Lj4o1k04J86k18L97k18mJ11j57mP2N8k25J86Q1l75
2477b61M90k91r6r9L35L4L6l02J35N5J47l4j77k2p2J02j84L76L4j91r1J3J15j40
2501h8j40J12J61p6r8K74k98L48k62L11l19J24j72N4M46m50N3j44K79O3j89q2
2523i3OK73j82J14j06K75k57Q9l04L67k27M5J75k17j74J85Q1L7Q5j18j14J57l35
2546b38J6K81l16M71k82k1J36J82k48k33Q2L9J11J0J22l54J19K74jp3l55K58O8
2569D8j47K97q3j37K23j18j49J64p3j95J67J20j95K24j41n9J18l60J97N3J71j8
2591A07j64N6P7j50r9L44k74j9J65j00J08j85J25o3Pj50K47r4K39m27J81p8K07
$$ plain form
2614 60 146 206 302 -95 33 265 -32 -120 -85 -159 74 -107 -81 -50 -270 100 -2 -33 73 -17 4 -139 60 40
2638 40 36 80 -15 51 -91 135 -152 -75 -19 51 19 265 305 -319 94 -257 53 -294 -25 -114 211 293 63 -16 -87
2663 -87 50 208 -195 -98 36 73 -163 17 109 -42 -54 209 -17 -227 292 39 5 -260 -37 52 7 -116 -40
2686 -40 173 -154 -14 -15 41 138 65 59 -95 -204 -14 -161 108 182 142 210 -157 20 5 10 -17 -68 -383 -101 151
2711 151 -74 -7 153 -90 -62 -196 -152 -70 -317 -26 -27 -236 33 -139 55 248 -97 -67 -127 228 -86 198 66
2734 66 -143 -31 -86 -135 -48 -25 55 -116 -41 -113 -66 75 -37 -135 78 -20 -243 -180 -60 213 148 -53 47 -117
2758 -117 46 -16 100 -11 -166 164 176 6 130 115 -49 8 87 10 -293 -75 133 119 15 104 -8 152 -182
2781 -182 39 -29 215 -142 -57 -83 72 146 207 -21 57 -77 -66 -97 106 -15 -186 -193 -17 202 -187 167 61
$$ packed form
2614F0Q6O0R6l97J28K32k97q8L5p4K33j81K6L1k20L70j02l1J06r0K1j43J99k0
2638D0mM4r5O6j42K26k87P7N6P0l2K46M0o24M13l51L10l47K69q9L25Q2k30p9p1
2663h7J37J58m03R7J34L7k36J80R2j51j2K63k26k10N19k53l4k65K23Q9m5j23P6
2686d0K13l27J40jN6R7p3oj54j09J90j47K69P4m0O8l67J77j5Nk7n1l15K82K52
2711A51k25O7J60k43K8j34M4Q2k47K91jk09K69j72J94J93l45L0o0L55l14K84j32
2734F6k09J12n5m9Q7K3Q0j71P5p2M7J41j12r8K13r8k23O3J20K73o5k01J00j64
2758a17J63o2J16j11j55L30J2j70J24j5j64N7P9p7l03K18K08j4j04Q9j12J60l34
2781a82K21o8K44l57Q5k6J55P4O1k28P8j34J1l1K03j21j71pJ76K19l89L54j06
$$ plain form
2804 61 74 91 -82 34 37 10 -81 -122 -60 -185 92 93 46 -225 29 49 0 -164 104 -155 173 92 236 -84 -145
2829 -145 51 229 -271 -39 -25 -50 95 -174 -166 16 -131 103 -15 -93 50 264 3 342 -44 114 -79 -50
2851 -50 90 -75 29 26 -37 106 -61 -194 49 90 -10 -76 118 -5 52 -43 107 10 137 -69 -126 -84 247 -139
2875 -139 -9 -132 -10 -74 -64 146 -57 -192 17 84 29 72 395 91 63 -71 -144 -125 249 241 -37 17 14 3 -162
2900 -162 -115 -36 -82 72 -139 66 -18 -78 55 -173 308 42 84 79 38 18 32 -114 129 -71 -91 -11 17 -11 -167
2925 -167 -76 20 231 -213 -24 59 -14 27 2 -44 -142 -230 -115 111 -12 -34 33 22 -168 -26 -261 -137 -13 159
2949 159 28 347 -8 -210 -173 -221 32 -124 5 20 163 143 -136 -160 -80 32 -147 87 -149 -40 22 295
2971 295 76 26 53 78 -40 -205 26 223 258 -39 -47 109 -173 -214 -76 -6 -181 66 -136 -17 71 -39 138
$$ packed form
2804F1J3J7j73J16Lk7r1m1O2j25K77Jm7k71K54K0m9j64K68k59L28q1J44l20o1
2829a45J96J78n00K32J4k5J45k69QJ82j47K34j18p8J43K14k61L39l86J58j93K9
2851e0J40j65J04lo3J43j67j33K43M1j00o6J94j23N7r5J50r7J27k06n7M2L31l86
2875a39J30j23J22o4J0K10k03j35K09O7n5M3L23l04k8j34p3J9L74qk78N4lj1j65
2900a62M7P9m6J54k11K05q4o0J33k28M81k66M2nm1k0J4j46K43k00k0Q0K8k8j56
2925a67R1R6K11m44J89Q3p3M1k5m6r8q8J15K26j23k2O7j1j90J42k35J24J24J72
2949A59j31L19l55k02L7m8K53j56J29J5J43k0k79k4Q0J12j79K34k36J09O2K73
2971B95k19n0K7K5j18j65K31J97L5k97qJ56k82m1J38P0j75K47k02J19Q8j10J77
$$ plain form
2994 138 64 -132 -202 3 134 105 -192 23 -60 165 14 42 156 52 -194 -22 87 -83 10 134 -41 143
3016 143 35 -54 -70 129 167 15 -91 45 -22 17 -283 -90 178 -143 -42 163 100 135 -220 -2 -77 -120 -138
3039 -138 104 -94 -19 9 -110 -148 194 32 172 -45 111 125 242 -5 17 44 -185 114 -53 93 137 -231
3061 -231 -6 115 -173 -167 23 19 67 148 -43 1 -51 47 -17 67 -105 -105 -59 -123 16 -46 -214 7 -89 123 378 -98
3087 -98 -145 -33 -34 -177 277 -34 -114 -11 -6 16 -19 119 178 32 -122 297 27 -106 -176 -126 -48 -94 -38 40 -59 -18
3113 -18 -43 15 -9 67 50 -69 -161 122 60 94 55 118 -147 -88 88 -17 -22 -64 84 -52 63 -59 -39 169 -69
3138 -69 13 160 -76 -126 -144 -45 54 27 35 -176 52 -33 -60 28 136 -81 152 67 -285 -57 161 -20 71 -15 -33
3163 -33 33 -79 -5 59 35 -40 115 242 98 9 -63 136 25 -157 108 -27 11 -127 -199 85 90 135 174 -61 62
$$ packed form
2994A38p4j96p0K05J31k9k97K15q3K25j51K8J14j04k46J72J09j70R3J24j75J84
3016A43j08q9j6J99L8j52j06J36o7L9l00J93K68l21J01K05o3L5l55K18p5m3j8
3039a38K42j98P5K8j19l8L42j62J40k17J56J4J17k47K2K7k29K99j67J46M4l68
3061b31K25J21k88OJ90mM8Q1j91M4n2R8o4Q4j72%M6o4J39o2j68K21r6K12K55m76
3087i8m7J12jj43M54l11q0J03NK2l5J38N9j46j54M19k70j33p0N0P8m6N6P8r9M1
3113a8k5N8k4P6j7j19r2K83o2L4l9O3k65N9J76j05nm2J48j36J15j22K0K08k38
3138f9Q2J47k36n0j8R9R9k7Qk11K28q5k7Q8J08k17K33q5l52K28K18j81R1q6j8
3163c3O6j12P4O4k4p5J55J27j44q9p2J99j11j82K65j35L8j38p2K84NM5L9k35J23
$$ plain form
3188 62 36 52 49 -51 32 -220 -52 -151 -219 -59 -234 70 -155 -259 -108 -26 3 -154 179 -128 -144 -55 55 44
3212 44 -194 141 5 -220 -8 -255 -227 63 -103 -95 -168 113 167 -131 -220 187 -145 21 21 80 129 147 -6 63
3236 63 9 255 -72 -241 36 -23 273 -95 -19 -65 48 63 181 -44 45 -106 -22 -80 119 -118 75 -87 -81 139
3260 139 -210 -2 -24 153 -7 15 30 43 70 15 68 -6 -107 95 -150 111 41 -195 36 72 -216 52 -5 -23
3284 -23 -136 -104 241 -79 -6 -168 -144 71 -46 132 -47 35 -12 -94 -19 -132 -145 -230 -203 2 -167 105 -33 -37
3308 -37 75 45 -64 147 4 -13 -85 38 87 -35 -256 -42 -169 65 -53 -270 -83 64 216 -99 -26 -98
3330 -98 51 14 88 29 157 -124 -344 -132 -40 -104 -9 -187 135 -29 41 154 0 85 54 60 376 126 173 55
3354 55 44 206 -55 -48 128 66 -99 52 -11 -81 -61 53 -212 119 63 167 -115 163 -131 22 23 194 154 -205
$$ packed form
3188F2k6J6lj00Q3k52J68r9o8J60j75L04k25j04J51Q2K9j57L33l07j6Q9J10j1
3212D4k38L35j36k25K12k47K8K90j66Qp3K81N4k98q9M07l32J66%N9M9J8j53O9
3236F3n4K46l27j69K77n9K96l68P6m6J13J5J18k25Q9j51Q4n8J99k37J93j62OK20
3260A39l49K08k2J77j60K2J5J3K7n5N3p4j01K02k45K61p0k36K31L6k88K68n7j8
3284b3j13L2L45l20P3j62K4K15j17J78j79Q2m7q2P5j13j3q5K7K05j69K72j38m
3308c7J12l0j09K11j43j7p2J23M9j22k21K14j27K34j18k17J87J47J52l15P3p2
3330i8J49l7P4n9J28k81k20K12R2o4R5j78L22j64P0J13j54Q5l1OL16k50M7j18
3354E5j1J62k61PJ76o2j65J51o3p0K0J14k65L31n6J04k82K78k94J53JJ71m0l59
$$ plain form
3378 -205 122 -148 -3 -163 -43 -63 60 98 26 -94 -37 -48 -7 69 153 -23 -75 -31 26 -210 -193 -87 50 -62
3402 -62 -65 153 12 -168 25 -63 219 65 151 48 -32 -133 -136 58 198 -80 60 162 -272 152 -42 66 102
3425 102 108 -54 129 135 -119 79 -75 73 40 30 -82 -30 -48 -29 48 -81 68 -416 -173 30 41 -135 -337 -175
3449 -175 -40 -84 -19 13 47 112 -25 -6 82 -20 302 -80 -53 162 -24 68 -119 -132 -73 -1 0 10 -5 -19 62 -384
3475 -384 -43 45 59 211 -56 17 -302 27 173 -46 54 -101 -43 -19 226 -70 16 117 221 -135 10 19 -89
3498 -89 -67 5 -27 -91 -101 78 137 115 -48 -123 -114 192 22 -81 22 213 -126 150 79 -207 -110 -120 -179 108 -189
3523 -189 25 -81 21 -46 -47 199 -55 -25 -42 -53 19 71 74 174 -36 -82 -8 56 -200 4 56 -14 -205 22 -38
3548 -38 -134 112 -62 -49 -52 -110 188 -98 -60 166 34 46 9 -21 26 69 -121 -80 -88 -56 -139 -87 -123 -71 24 191 -147
$$ packed form
3378b05L27k70J45j60J20k0J23L8p2j20N7j1M1P6Q4j76n2M4N7k36J7J06J37j12
3402f2lK18j41j80J93q8K82j54Q6j03q0j01lJ94J40k78J40J02m34M24j94J08L6
3425A02Oj62J83Ok54J98j54J48l3j0j12N2j8J9P7j29J49m84K43K03J1j76k02J62
3449a75J35m4O5L2L4O5j37J9Q8j02L22l82K7K15j86R2j87j3N9P2JJ0j5j4Q1m46
3475c84L41Q8J4J52k67P3l19L29J46k19J00j55N8K4K45k96Q6J01J04l56J45Rj08
3498h9K2P2l2o4j0J79N9k2j63p5RL06j70j03J03J91l39K76p1k86R7j0n9K87k97
3523a89K14j06J02o7jK46k54L0j7j1P2N2LJ00k10m6P4O4k56K04N2p0j91K27o0
3548c8r6K46j74J3ln8K98k86L8K26j32J2l7l0M7M3j90M1qL2q3N2l6N2R5J67l38
$$ plain form
3575 -147 28 133 -265 272 29 -131 -16 33 -198 -80 158 62 -219 -51 108 158 -101 -88 59 124 160 9
3597 9 -131 -28 -157 51 -48 -3 77 9 70 54 -88 -68 -23 184 99 74 121 96 -109 -159 128 -2 160 47 -329
3622 -329 -5 87 -320 16 -174 -79 -61 -174 2 -15 77 51 -177 82 -50 -41 196 59 171 -50 -231 -9 -184
3645 -184 -70 0 60 -74 206 88 36 75 -22 70 -141 -57 -117 -110 -153 251 289 159 30 81 74 141 -107 -94 -274 -30
3671 -30 11 196 -223 39 -99 152 -101 261 147 -144 60 -141 8 35 207 68 -153 224 -82 -149 86
3692 86 -61 147 -31 -287 72 -31 -93 -7 22 26 -76 -80 33 153 -258 -34 -8 33 -11 174 -49 -109 66 -235
3716 -235 45 42 -60 -64 -7 183 -43 -45 16 -196 -28 11 72 -145 109 53 43 -15 -184 64 44 68 212 0 115
3741 115 -25 197 14 9 -92 -261 -158 -3 -74 -159 45 -94 23 -110 83 -253 -113 1 -141 60 68 -64
$$ packed form
3575a47J75J05l98N37k43j60J15M9k31J18K38r6k81J68J59N0k59J3J47O5L6j51
3597Ij40J03j29K08r9M5Q0o8O1j6j42K0M5K07q5k5M7k5k05n0K87j30J62j13l76
3622c29L24R2m07L36j90R5J8j13J76j7R2k6k28K59j32RK37j37J12k21j81K22j75
3645a84J14P0O0j34K80j18n2L9r7R2k11Q4o0Pm3M04L8j30j29N1pO7k48J3j80K44
3671c0M1J85m19K62j38K51k53L62j14k91K04k01J49K7J72j39k21L77l06o7K35
3692H6j47K08j78k56L59j03o2Q6K9Mj02mJ13J20m11K24K6M1m4J85k23o0J75l01
3716b35K80lj02mN7J90k26kO1k12J68L9O1k17K54n6j0n8j69K48k0K4J44k12J15
3741A15j40K22j83nj01j69J03J55p1q5K04j39J17j33J93l36J40J14j42K01Qj32
$$ plain form
3763 -64 -128 -150 -59 -206 43 -106 -17 -140 -99 -66 283 -117 101 -176 8 143 -57 149 -153 -62 73 29 -203
3786 -203 32 -147 193 74 -43 121 168 5 221 120 -52 -66 53 -124 48 14 10 249 55 131 123 64 -64
3809 -64 -61 -127 204 113 65 -49 -168 167 2 11 -142 -147 -165 -17 -116 -14 31 41 67 -67 10 -127 129 132 70 73 -232
3836 -232 -157 94 -96 59 -85 -104 42 -18 177 24 73 -98 43 -5 -174 89 150 -99 -111 -160 -6 -232 59
3859 59 129 80 109 -196 -40 194 176 -219 -98 -174 -26 -28 66 -164 -56 18 -233 35 -1 29 -179 -106 18 -165
3883 -165 83 -40 -108 -123 -83 98 50 20 108 221 -48 30 -9 14 -31 -15 -147 -139 -46 39 -52 188 -152 -86 -128 9
3909 9 -84 -159 190 66 120 194 -286 -215 62 -286 -393 231 10 -104 -147 -168 -17 227 18 149 -45 -196 -56
3932 -56 -17 93 -91 144 -182 74 -147 -286 -177 72 77 -74 -31 -31 98 130 -14 -39 5 -288 -68 117 67 175
$$ packed form
3763f4o4k2R1j47K49j49Q9j23M1L3L49m00K18k77J84J35k00K06l02R1J35m4k32
3786b03K35j79L40j19j17J64M7j63K16j01j72j4J19j77J72l4mK39j94P6qn9j28
3809f4Lo6L31r1m8j14j19L35j65Rj53nj8J48r9J02M5J0K6j34P7j37K56Lo2Ll05
3836b32P5K51j90J55j44j9J46o0J95j53M9j71J41m8j69K63O1k49j2m9J54k26K91
3859E9P0m9K9l05J56K34j8l95J21p6J48kR4k30J08P4k51K68l6L0k08P3J24j83
3883a65K48j23o8j5M0J81m8l0Q8J13k69P8l9K3m5J6j32QR3Q5r1K40l40O6m2J37
3909Ir3p5L49j24N4P4m80P1K77l48j07O24k21j14m3k1J51K44k09J31j94j51J40
3932e6L9J10j84K35l26K56k21j39J09K49Nj51M3%J29L2j44k5M4k93K20J85n0J08
$$ plain form
3956 175 -93 -34 -12 -56 -176 18 -40 -34 57 -125 -86 60 -31 6 -193 -82 -162 68 -86 158 23 284 61 84
3980 84 -83 -195 -151 -25 -10 -113 40 -55 78 29 -39 92 141 -65 58 170 133 96 7 -12 134 -63 -20 -33
4004 -33 206 51 -166 85 -59 36 5 169 -137 -3 -206 -139 203 -48 150 -41 -48 -60 -195 157 37 -181
4026 -181 190 144 -22 -27 -1 -105 -10 55 -176 -14 -88 205 76 -48 116 62 50 194 106 -151 -124 -88 -72 -168 46
4051 46 24 11 78 -49 62 89 -68 -166 167 -172 -344 -153 46 184 -3 26 -81 100 -162 -132 71 158 -48
4074 -48 -46 94 5 -80 -99 9 49 3 101 -18 179 -128 165 -34 -67 227 -68 167 -253 -91 -61 56 51 47 -31
4099 -31 228 10 38 32 -260 -72 -207 14 103 82 62 37 27 79 59 -17 229 234 56 -82 193 154 68 -56 -15 114
4125 114 -70 231 -178 -60 -121 -63 -9 112 231 -75 -14 21 -121 -24 70 31 111 25 -39 289 7 59 -42 -128
$$ packed form
3956A75k68N9K2m4j20J94n8OR1j82L9J46r1L7j99J11q0K30j54K44j35K61k23K3
3980H4j67j12M4J26J5j03J53r5J33m9o8J31M9k06J23J12l7l7q9j9J46j97M3j3
4004c3K39j55k17K51j44R5l1J64l06J34k03O7L42k51J98j91pj2j35L52j20k18
4026a81L71m6j66nK6j04R5O5k31J62p4K93j29j24J64n4j2J44q8k57K7L6J6r6K14
4051D6k2j3O7j27J11K7j57r8L33l39j72J91J99J38j87K9j07J81k62L0K03Q7k06
4074d8KJ40q9q5j9J08M0m6R8j19J97l07K93j99l3K94k95K35m20J62L0J17nmp8
4099c1K59k18K8ok92J88j35K21Q9k1k0k5j0N2k0p6K46Nj78j38K75l9q6j24M1J29
4125A14j84L01m09J18o1N8N4J21J19l06O1L5j42R7R4l9Q0q6o4L28k82N2j01q6
$$ plain form
4149 -128 120 11 -36 21 163 281 -121 19 137 -49 52 -7 35 -19 81 187 121 190 168 -12 -202 64 40
4172 40 6 -202 -106 -101 -19 -81 -143 -206 91 158 -75 70 -4 -118 -29 -36 -23 17 -212 -5 104 14 -241 105 218 -6
4198 -6 277 -25 100 420 -40 23 -148 -55 44 -212 -324 -214 -55 115 68 -124 -100 214 -18 -257 51 266
4220 266 93 263 -92 -231 -5 62 81 242 19 12 -74 158 159 92 336 -128 38 43 159 188 214 159 -97 -253
4244 -253 27 -83 -72 19 -166 -202 47 110 -9 45 -71 101 68 -30 -37 -122 -6 -53 -6 -53 114 -53 -3 -7 -58 -450
4270 -450 39 111 34 -9 22 -27 95 -33 -92 -32 159 -115 -74 -43 -87 -235 131 75 -27 56 43 -115 -44 -94 -59
4295 -59 35 -74 77 -325 172 -125 73 50 110 129 -79 152 92 108 -109 -165 78 239 -19 34 196 87 -80
4318 -80 55 -141 -12 32 -48 -15 -20 40 2 -34 -59 236 -247 30 -88 -185 -176 207 130 -36 -5 -4 -108 -216 -40 -192
$$ packed form
4149a28K48j09m7N7J42J18m02J40J18j86J01n9M2n4J00J06o6O9k2j80j90K66k4
4172D0l4k08R6NQ2o2o2o3K97O7k33J45p4j14Q9pJ3M0k29K07J09r0k55L46J13k24
4198fK83l02J25L20m60O3j71R3R9k56j12J10J59J70m7j92K4L14k32k39L08K15
4220B66j73J70l55j39K26O7J9J61k23pq6K32Jo7K44m64J66NJ16K9K6n5k56j56
4244b53K80j10J1R1j85l6K49O3j19N4j16J72l3r8pq5J16m7M7m7J67j67N0mn1l92
4270d50M89P2p7m3L1m9J22j28n9O0J91k74M1L1m4j48L66n6j02Q3j3j58P1n0L5
4295e9R4j09J51m02M97k97J98k3O0J9k08K31o0J6k17n6K43J61k58N3J62j09j67
4318h0J35j96J29M4q0L3nO0l8l6k5K95m83K77j18r7RL83p7j66L1Jj04j08J76j52
$$ [...]
8191a13
##END NTUPLES=NMR FID
##END=
