##TITLE=1H_PR-SA3
 CDCl3,8 sc, 
 29.9.2021
##JCAMPDX= 6.0         $$ Bruker NMR JCAMP-DX V2.0
##DATA TYPE= NMR FID
##DATA CLASS= NTUPLES
##ORIGIN= UXNMR, Bruker Analytische Messtechnik GmbH
##OWNER= root
$$ XWIN-NMR		Version 3.5
$$ Wed Sep 29 13:14:53 2021 Russian Standard Time (UT+4h)  she@DPX200
##.OBSERVE FREQUENCY= 200.1313468511
##.OBSERVE NUCLEUS= ^1H
##.DELAY= (6, 6)
##.ACQUISITION MODE= SIMULTANEOUS
##.ACQUISITION SCHEME= undefined
##.AVERAGES= 8
##.DIGITISER RES= 18
##SPECTROMETER/DATA SYSTEM= spect
##.PULSE SEQUENCE= zg30
##.SOLVENT NAME= CDCl3
##.SHIFT REFERENCE= (INTERNAL, CDCl3, 0, 15.7039)
##AUDIT TRAIL= $$ (NUMBER, WHEN, WHO, WHERE, WHAT)
$$ ##TITLE= Audit trail, XWIN-NMR		Version 3.5
$$ ##JCAMPDX= 5.01
$$ ##ORIGIN= Bruker BioSpin GmbH
$$ ##OWNER= she
$$ F:/spectra/data/she/nmr/H-F/1/audita.txt
$$ ##AUDIT TRAIL=  $$ (NUMBER, WHEN, WHO, WHERE, WHAT)
(   1,<2021-09-29 13:13:57.92 +0400>,<she>,<DPX200>,
      <created by zg, POWCHK disabled, PULCHK disabled
       configuration hash MD5:
       00 E9 B6 7A A2 85 ED C7 34 08 36 98 17 FE 4E 26
       data hash MD5: 16K
       0C AA C6 2F B0 58 A3 36 20 9B DF 37 BF 37 9E FF>)
$$ ##END=
$$ 
$$ hash MD5
$$ 48 B9 8D D9 63 6E 39 49 D1 AC 69 8D 93 58 FE 42
##$RELAX= 
##$RELAX= 
##$RELAX= 
##$RELAX= 
##$RELAX= 
##$RELAX= 
$$ Bruker specific parameters
$$ --------------------------
##$DU= <F:/spectra>
##$EXPNO= 1
##$NAME= <H-F>
##$PROCNO= 1
##$TYPE= <nmr>
##$USER= <she>
##$AMP= (0..31)
100 100 100 100 100 100 100 100 100 100 100 100 100 100 100 100 100 100 
100 100 100 100 100 100 100 100 100 100 100 100 100 100 
##$AQSEQ= 0
##$AQ_mod= 1
##$AUNM= <au_zg>
##$AUTOPOS= <>
##$BF1= 200.13
##$BF2= 200.13
##$BF3= 200.13
##$BF4= 200.13
##$BF5= 200.13
##$BF6= 200.13
##$BF7= 200.13
##$BF8= 200.13
##$BYTORDA= 1
##$CFDGTYP= 0
##$CFRGTYP= 5
##$CHEMSTR= <none>
##$CNST= (0..31)
1 1 145 1 1 1 1 1 1 1 1 1 1 1 1 1 1 1 1 1 1 1 1 1 1 1 1 1 1 1 1 1 
##$CPDPRG= <>
##$CPDPRG1= <>
##$CPDPRG2= <>
##$CPDPRG3= <>
##$CPDPRG4= <mlev>
##$CPDPRG5= <mlev>
##$CPDPRG6= <mlev>
##$CPDPRG7= <mlev>
##$CPDPRG8= <mlev>
##$CPDPRGB= <>
##$CPDPRGT= <>
##$D= (0..31)
0 1.2 0 0 0 0 0 0 0 0.06 0 0.03 0 0 0 0 0.0002 0 0 0 0 0 0 0 0 0 0 0 0 
0 0 0 
##$DATE= 1632906837
##$DBL= (0..7)
120 120 120 120 120 120 120 120 
##$DBP= (0..7)
150 150 150 150 150 150 150 150 
##$DBP07= 0
##$DBPNAM0= <>
##$DBPNAM1= <>
##$DBPNAM2= <>
##$DBPNAM3= <>
##$DBPNAM4= <>
##$DBPNAM5= <>
##$DBPNAM6= <>
##$DBPNAM7= <>
##$DBPOAL= (0..7)
0.5 0.5 0.5 0.5 0.5 0.5 0.5 0.5 
##$DBPOFFS= (0..7)
0 0 0 0 0 0 0 0 
##$DE= 6
##$DECBNUC= <off>
##$DECIM= 32
##$DECNUC= <off>
##$DECSTAT= 4
##$DIGMOD= 1
##$DIGTYP= 9
##$DL= (0..7)
0 120 120 120 120 120 120 120 
##$DP= (0..7)
150 150 150 150 150 150 150 150 
##$DP07= 0
##$DPNAME0= <>
##$DPNAME1= <>
##$DPNAME2= <>
##$DPNAME3= <>
##$DPNAME4= <>
##$DPNAME5= <>
##$DPNAME6= <>
##$DPNAME7= <>
##$DPOAL= (0..7)
0.5 0.5 0.5 0.5 0.5 0.5 0.5 0.5 
##$DPOFFS= (0..7)
0 0 0 0 0 0 0 0 
##$DQDMODE= 0
##$DR= 18
##$DS= 0
##$DSLIST= <SSSSSSSSSSSSSSS>
$$ [...]
##$SUBNAM2= <"">
##$SUBNAM3= <"">
##$SUBNAM4= <"">
##$SUBNAM5= <"">
##$SUBNAM6= <"">
##$SUBNAM7= <"">
##$SUBNAM8= <"">
##$SUBNAM9= <"">
##$SW= 17.3497169576618
##$SWIBOX= (0..15)
0 0 2 0 0 0 0 0 0 0 0 0 0 0 0 0 
##$SW_h= 3472.22222222222
##$TD= 16384
##$TD0= 1
##$TE= 0
##$TE2= 300
##$TE3= 300
##$TEG= 300
##$TL= (0..7)
0 120 120 120 120 120 120 120 
##$TP= (0..7)
150 150 150 150 150 150 150 150 
##$TP07= 0
##$TPNAME0= <>
##$TPNAME1= <>
##$TPNAME2= <>
##$TPNAME3= <>
##$TPNAME4= <>
##$TPNAME5= <>
##$TPNAME6= <>
##$TPNAME7= <>
##$TPOAL= (0..7)
0.5 0.5 0.5 0.5 0.5 0.5 0.5 0.5 
##$TPOFFS= (0..7)
0 0 0 0 0 0 0 0 
##$TUNHIN= 0
##$TUNHOUT= 0
##$TUNXOUT= 0
##$USERA1= <user>
##$USERA2= <user>
##$USERA3= <user>
##$USERA4= <user>
##$USERA5= <user>
##$V9= 5
##$VALIST= <valist>
##$VCLIST= <CCCCCCCCCCCCCCC>
##$VD= 0
##$VDLIST= <DDDDDDDDDDDDDDD>
##$VPLIST= <PPPPPPPPPPPPPPP>
##$VTLIST= <TTTTTTTTTTTTTTT>
##$WBST= 1024
##$WBSW= 4
##$XGAIN= (0..3)
0 0 0 0 
##$XL= 0
##$YL= 0
##$YMAX_a= 345240
##$YMIN_a= -263045
##$ZGOPTNS= <>
##$ZL1= 120
##$ZL2= 120
##$ZL3= 120
##$ZL4= 120
##$ABSF1= 10
##$ABSF2= 0
##$ABSG= 5
##$ABSL= 3
##$ALPHA= 0
##$AQORDER= 0
##$ASSFAC= 0
##$ASSFACI= 0
##$ASSFACX= 0
##$ASSWID= 0
##$AUNMP= <proc_1d>
##$AZFE= 0.1
##$AZFW= 0.1
##$BCFW= 1
##$BC_mod= 2
##$BYTORDP= 1
##$COROFFS= 0
##$CY= 11.3945322036743
##$DATMOD= 1
##$DC= 2
##$DFILT= <>
##$DTYPP= 0
##$F1P= 2.36226072786647
##$F2P= -0.459571619588291
##$FCOR= 0.5
##$FTSIZE= 0
##$FT_mod= 4
##$GAMMA= 1
##$GB= 0.15
##$INTBC= 1
##$INTSCL= 1
##$ISEN= 128
##$LB= 0.24
##$LEV0= 0
##$LPBIN= 0
##$MAXI= 10000
##$MC2= 0
##$MEAN= 0
##$ME_mod= 0
##$MI= 1.114404
##$NCOEF= 0
##$NC_proc= 0
##$NLEV= 6
##$NOISF1= 3.799351
##$NOISF2= 2.8
##$NSP= 1
##$NTH_PI= 0
##$NZP= 0
##$OFFSET= 15.70392
##$PC= 1
##$PHC0= -13714.36
##$PHC1= 9.40085
##$PH_mod= 1
##$PKNL= yes
##$PPARMOD= 0
##$PSCAL= 0
##$PSIGN= 0
##$REVERSE= no
##$SF= 200.130013532006
##$SI= 16384
##$SIGF1= 3
##$SIGF2= 2
##$SINO= 400
##$SIOLD= 16384
##$SREGLST= <1H.CDCl3>
##$SSB= 0
##$STSI= 0
##$STSR= 0
##$SW_p= 3612.71676300578
##$SYMM= 0
##$S_DEV= 0
##$TDeff= 0
##$TDoff= 0
##$TI= <>
##$TILT= no
##$TM1= 0
##$TM2= 0
##$TOPLEV= 0
##$USERP1= <user>
##$USERP2= <user>
##$USERP3= <user>
##$USERP4= <user>
##$USERP5= <user>
##$WDW= 1
##$XDIM= 8192
##$YMAX_p= 0
##$YMIN_p= 0
$$ End of Bruker specific parameters
$$ ---------------------------------
##NTUPLES= NMR FID
##VAR_NAME=  TIME,          FID/REAL,        FID/IMAG
##SYMBOL=    X,             R,               I
##VAR_TYPE=  INDEPENDENT,   DEPENDENT,       DEPENDENT
##VAR_FORM=  AFFN,          ASDF,            ASDF
##VAR_DIM=   8192,          8192,            8192
##UNITS=     SECONDS,       ARBITRARY UNITS, ARBITRARY UNITS
##FACTOR=    0.000288,      1,               1
##FIRST=     0,             0,               0
##LAST=      2.359008,      0,               0
##MIN=       0,             -263045,         0
##MAX=       2.359008,      345240,          0
$$ Real data points
##PAGE= N=1
##DATA TABLE= (X++(R..R)), XYDATA
$$ [...]
1940b292J642J998l50j120q5rl11Q04J647p46k526LK642J453k127j908J033J771
$$ -2292 -650 1348 998 -122 -207 -216 -527 277 1924 1178 -1348 -1345 1297 2750 623 -1285 -252 1519
1958A519O4n66j31m90p92Q15J942o08k668r24K123J640j691k077J32J326J19j32
$$ 1519 1583 1017 886 396 -396 419 2361 1753 -915 -1839 284 1924 233 -1844 -1712 -386 -267 -399
1976c99L37o37j053N66K668J99k762j118K279J751j060j652l6L01K30O1M46n98
$$ -399 -62 -699 -1752 -1186 1482 1681 -1081 -2199 80 1831 771 -881 -917 -616 -386 -325 121 -477
1994d77j889N29K337Q85k187j505J688K312j06j265j57N14q4N21J105q48k324
$$ -477 -2366 -1837 500 1385 -802 -2307 -619 1693 1587 322 165 679 595 1116 2221 1373 -951
2011i51k56K326Q83k075j911P61K010r3q24k51J37k77P58J469l40j985r18K238
$$ -951 -1207 1119 2002 -73 -1984 -1223 787 694 -130 -381 -244 -521 237 1706 1366 -619 -1537 701
2029G01J418j605k068K12J147K12o17l2l64p09N24J893L34k140p44K013J951q33
$$ 701 2119 514 -1554 -1342 -195 17 -600 -632 -996 -1705 -1181 712 1046 -1094 -1838 175 2126 1293
2047A293j465p5J015Rk1k5m39j419J02J801O04k123j408J243K125m74j325LP19
$$ 1293 -172 -247 768 777 756 731 292 -1127 -1025 776 1380 -743 -2151 -908 1217 743 -582 -579 140
2066A40Q0N33N19l22j621k18J833J039j719j960P42J587k12q88n92L13k13L90
$$ 140 220 753 1272 950 -671 -889 944 1983 264 -1696 -954 633 421 -467 -1059 -746 -959 -569
2084e69J086q2j658n39K209J392j099j951L21J764M6o24l40p2m55K09J469J06
$$ -569 517 435 -1223 -1762 447 1839 740 -1211 -890 874 920 296 -44 -116 -571 -362 1107 1213
2102A213j725j220J740J715p55j656N1J125N28k00m7l83q63P6J558M55j748j515
$$ 1213 -512 -1732 8 1723 968 -688 -637 488 1016 816 769 386 -477 -401 1157 1612 -136 -1651
2120a651J121J486j74j798k29Q02J15J85J48k77j074j29J633J218j421j621Q16
$$ -1651 -530 956 782 -1016 -1245 -443 -328 -143 5 -272 -1346 -1475 158 1376 -45 -1666 -850
2137h50J716J44j243l78L50L8J56O50k22j416m32J510J273j136j711N86J649L00
$$ -850 866 1010 -233 -611 -261 -223 -67 583 361 -1055 -1487 23 1296 160 -1551 -965 684 984
2155I84q81j09K76k74N07R12J85j434r34J353J397q84j637j81Q94N02n92k26l6
$$ 984 103 -6 270 -4 503 1415 1600 166 -768 585 1982 1098 -539 -720 174 676 84 -142 -178
2174a78p14J95J256L15j333j129J108J869m25j452m92R29K68j70o1k56q52k99
$$ -178 -892 -697 559 874 -459 -1588 -480 1389 964 -488 -980 -51 217 47 -14 -270 -1122 -1421
2192a421J272R50j228j362O97J636J08r66l31O27L53K3M31j48q60m19J216O26
$$ -1421 -149 801 -427 -1789 -1092 544 652 -314 -645 -18 335 358 789 641 -219 -638 578 1204
2210A204p55j484L8J335J55p79n08L83L64M6N91M65j023o97J199J500p54j541
$$ 1204 449 -1035 -997 338 493 -286 -794 -411 -47 -1 590 1055 32 -665 534 2034 1280 -261
2228b61j36J108K48n52l99j97l43J8P27J97r21q99M94J667n7j281j93R08O09l51
$$ -261 -397 711 959 407 8 -189 -532 -514 213 410 -511 -1410 -916 751 694 -587 -780 128 737 386
2248C86k58J67n64k37Q10O77j067j243L26J386J93j372m65O82M76j33L23o2o08
$$ 386 128 295 -269 -506 304 981 -86 -1329 -1003 383 576 -796 -1261 -579 -103 -236 87 25 -583
2267e83k64J156R19p85j401L87J207L25j184m02J35L90LK84P7n46p09J079J092
$$ -583 -847 309 1228 443 -958 -571 636 961 -223 -625 -490 -100 -97 187 264 -282 -991 88 1180
2286A180m01j166p1J508N47o76n70K12N9k21M34O8r39r48N66J220l39j432k53
$$ 1180 779 -387 -458 1050 1597 921 351 563 622 401 835 903 -36 -984 -418 802 463 -969 -1222
2305a222R05O67l95k75J19n7j61O42N74r29q89M41Q52K40j279n79O29N57l35k98
$$ -1222 -317 350 -45 -320 -201 -258 -419 223 797 -132 -1021 -580 272 512 -767 -1346 -717 -160 -495 -793
2325g93K38k44k98Q24P81n86j018N04J211M18q19m36O12K86rN7k8l65n63P40P46
$$ -793 -555 -799 -1097 -273 508 -78 -1096 -592 619 1037 218 -218 394 680 671 728 700 335 -228 512 1258
2346A258k79j379K8J031M94n15n19M12J3p3K97K50o37r28M58R75l61j236l90O48
$$ 1258 979 -400 -372 659 1153 638 119 531 544 471 768 1018 381 -547 -89 886 525 -711 -1101 -453
2366d53M76o19k36L4j02o0N18L14n27n98M12R70K56p93o17P30M47k54j73n8n5
$$ -453 23 -596 -832 -798 -900 -960 -442 -128 -655 -1253 -841 129 385 -408 -1025 -295 152 -102 -275 -333 -388
2387c88j59N33M68l68r97K44J239N55q73l78M08N14J33k02J27k91j69L86N08k70
$$ -388 -547 -14 454 86 -911 -667 572 1127 254 -124 284 798 931 729 856 565 396 782 1290 1020
2407A020j180r4Q40M26q10o22K50J63Ln6J56m56n78M26Q58j52r90k04O85O76p70
$$ 1020 -160 -254 586 1012 202 -420 -170 -7 -4 -60 96 -360 -938 -512 346 194 -796 -1000 -315 361 -409
2428d09k31n2R4n7J30L33l52q09M77J070K12p71l74O01O32j32k62R9m5R9J62O60
$$ -409 -640 -692 -598 -655 -525 -192 -544 -1353 -876 194 406 -365 -739 -138 494 362 100 199 154 253 415 1075
2450A075l47r36m3J038J03p81n02K86N07jk89N8j09j82J79P37j44j050M6R24L42
$$ 1075 728 -208 -251 787 890 109 -393 -107 400 399 110 168 59 -123 56 793 649 -401 -355 569 911
2471I11p40n48J80L10k83j86K37n67m35M11P19j43p39k00P22Q58n65l39J39N09
$$ 911 171 -377 -197 113 -170 -356 -119 -686 -1121 -710 9 -134 -873 -1073 -351 507 -58 -397 -258 251
2491B51k7Q5R7k38l81R8P13N5r79k89N65N54k70m08K44O1pQ5O34m95m20J0Q09
$$ 251 224 309 406 168 -213 -115 598 653 -326 -615 -50 504 234 -174 70 131 124 209 843 348 -72 -62 747
2514G47J51q66l12J31N19m25l45J8k09K9R0N61j30m82l06J031M16l33o90L68L89
$$ 747 898 32 -280 -149 370 -55 -400 -382 -591 -562 -472 89 -41 -523 -829 202 618 285 -405 -37 352
2535C52o0m4p5j89m00K00M34Jq78PO00N30m61n34L49N66J03j38J87j06m73K01
$$ 352 292 248 173 -16 -416 -216 218 219 -659 -652 -52 478 17 -517 -168 398 501 363 550 444 -29 172
2557A72N33M2o86l83K29N48m01p39K32P6K06j37K24K2m96J84N20K02m37l02K47
$$ 172 705 747 61 -322 -93 455 54 -685 -453 -377 -171 -308 -84 -62 -558 -374 146 348 -89 -391 -144
2578a44M09j2n08m4L9q9M1M36J18q05J8O32M73m65l56K38O43j98o0p2L03l43j59
$$ -144 265 253 -255 -299 -260 -349 -308 128 246 -559 -541 91 564 99 -257 -19 624 426 366 294 597 254 95
2601I5L90r2n97l19O39K54j49n20J87L40j07r1J34J35m32nO54l3o40k63L36K65
$$ 95 485 393 -204 -523 116 370 221 -299 -112 228 121 30 164 299 -133 -138 516 483 -157 -420 -84 181
2623A81j51l59O4P5J17k08J67j44j82o7N49L30n52l97M20L97k12k74J03M20l58
$$ 181 30 -329 -265 -190 -73 -281 -114 -258 -440 -507 42 372 -180 -577 -157 240 28 -246 -143 277 -81
2644h1q8L79K19m07k58N75L38n55l84K21N24j04l17n9J54k12J03L72oo55p2M30
$$ -81 -169 210 429 22 -236 339 677 122 -262 -41 483 379 62 3 157 -55 48 420 414 -241 -313 117
2666A17J81j78n08Q3N86j01m08K24K7r4L7L40Q2m48l95L49M45l29k84l0L14J21
$$ 117 298 120 -388 -305 281 180 -228 -4 23 -71 -34 306 388 -60 -455 -106 339 10 -274 -304 10 131
2688A31j04J65o3j67j78L30K80l58m79K61M84l44l82J34J98j39N4K26k3j71m7
$$ 131 27 192 129 -38 -216 114 394 36 -443 -182 302 -42 -424 -290 -92 -231 -177 49 26 -145 -192
2709a92L20M24m89m03L37M61k73k65m7J48J1j38J67M1k84j56M19K17k03l38K31
$$ -192 128 552 63 -340 -3 458 185 -80 -127 21 32 -106 61 102 -182 -338 81 298 95 -243 -12
2730a2L39l0k09K36j44l1P5L8K45k83n17M03K58k75m31J14K43K2k37j5K15k34
$$ -12 327 297 88 324 180 149 224 262 507 224 -293 110 368 93 -338 -224 19 41 -196 -211 4 -230
2752b30j73M68O4l20l40K59K99k18l57m2K17L5m1o0J45L3j27J48M27j18l42K95
$$ -230 -403 65 129 -191 -531 -272 27 -191 -548 -590 -373 -338 -379 -439 -294 -261 -388 -240 187 69 -273 22
2774B2L41j62j36J83J52J92l74K06%k16r1J67L20j8n23J17K63Q5l74p9L46o0j72
$$ 22 363 201 65 248 400 592 218 424 424 208 117 284 604 586 63 180 443 528 154 75 421 361 189
2797A89O4J52l79k67J85J94k28l20J66J35l5k44j01kr0RK46mk14j58K15K41o5
$$ 189 253 405 26 -241 -56 138 -90 -410 -244 -109 -144 -388 -489 -491 -581 -572 -326 -330 -544 -702 -487 -246 -311
2820c11m63J88L37j07L1Q7K69o5j12L55K94j03k34R3M28j84j25j9L03K9l16J73
$$ -311 -774 -586 -249 -356 -325 -238 31 -34 -146 209 503 400 166 259 687 503 378 359 662 691 375 548
2842E48N6j89k66L54K7o3k22J0k3J27j80l38J81l2j71j42J08j45k61J18J52n9
$$ 548 604 415 149 503 530 467 245 255 232 359 179 -159 22 -10 -181 -323 -215 -360 -621 -503 -351 -410
2864d10l63R1K14Q0j69n9L9N6m8P4K01k03QJ16L20j64K2m9K64J57l9O3O5R4j43
$$ -410 -773 -682 -468 -388 -557 -616 -577 -521 -569 -495 -294 -497 -489 -373 -53 -217 -195 -244 20 177 138 201 266 360 217
2889B17K69K84j29k83K0L66j45j35j77K69j35q8j64K18p5j93p2K74k58k77J51
$$ 217 486 770 641 358 378 744 599 464 287 556 421 333 169 387 312 119 47 321 63 -214 -63
2910f3J77o7l45O6M8p9k83J08J75j66j29o8L40k46M1J07L20j85%j13L66M7j15
$$ -63 114 47 -298 -232 -184 -263 -546 -438 -263 -429 -558 -626 -286 -532 -491 -384 -64 -249 -249 -362 4 51 -64
2933f4oJ26J3m0n6K67r2k85L43o5P2q6j3K37K4j56J22J04j51N8L3K1j21k0j48
$$ -64 -70 56 69 29 -27 240 148 -137 206 141 213 127 114 351 375 219 341 445 294 352 385 406 285 265 117
2958A17M2J8l49K25l7j27k88M3K41J00k37K8K3L0j24j40M31k7l17J29L0K58k87
$$ 117 159 177 -172 53 16 -111 -399 -356 -115 -15 -252 -224 -201 -171 -295 -435 -4 -31 -348 -219 -189 69 -218
2981b18N5K34j41j78K6J72K43k86N0J99J44j77K6Q6O9j82l8K26j25j91p5J84p6
$$ -218 -163 71 -70 -248 -222 -50 193 -93 -43 156 300 123 149 235 304 122 84 310 185 -6 -81 103 27
3004B7j40M6R9K3k42K62m7Lk27J23J59p2j76J60R1j06l22j2K98J87m29K6K59m
$$ 27 -113 -67 32 55 -187 75 28 31 -196 -73 86 14 -162 -2 89 -17 -339 -351 -53 134 -295 -269 -10 -14
3028a4j35M3J12J19j93K47l7j44O0R6K4M0o2j48J72j50P2j30J05L21k88j90K86
$$ -14 -149 -106 6 125 -68 179 142 -2 58 154 178 218 156 8 180 30 102 -28 77 398 110 -80 206
3051B06M9l56K3O7J16k02j10J66J06k39j54J30M3j31O9J1K16k75K5L9J21p1J16
$$ 206 255 -101 -78 -11 105 -97 -207 -41 65 -174 -328 -198 -155 -286 -217 -206 10 -265 -240 -201 -80 -151 -35
3074c5N8j7p7N3K06J7j95r4K07K05k58k87M11m8j21L1j14K25j30j55L74K3j41
$$ -35 23 6 -71 -18 188 205 10 -84 123 328 70 -217 194 146 25 56 -58 167 37 -118 256 279 138
3097A38j17J9K02k02j42Q2K64j91q3J60j46j04l7K78Pk36m0K6K61m23R2N4J38
$$ 138 21 40 242 40 -102 -20 244 53 -30 130 -16 -120 -157 121 128 -108 -148 -122 139 -284 -192 -138 0
3120@k23N1J14l9k5n1L49Mk03j73K05L5n4k5J63m3j14q1J82l6j47K53Q4r7j68
$$ 0 -223 -172 -58 -97 -122 -173 176 180 -23 -196 9 44 -10 -35 128 85 -29 -110 72 36 -111 142 226 129 -39
3145c9j09J52J04o7O1Q7k42Q4K1J42k74n1n8K18J1Nn6J03J70k29J0J99j17j80
$$ -39 -148 4 108 41 102 189 -53 31 52 194 -80 -131 -189 29 40 45 -11 92 262 33 43 242 125 -55
3169e5J98N0N7k47j07J54r1o1j03L2J43J49m4o5l3l7J32rK06j44l04J59O4j56
$$ -55 143 193 250 3 -104 50 -41 -102 -205 -173 -30 119 75 10 -23 -60 72 63 269 125 -179 -20 44 -112
3193a12p0MK4J27l59J05J27j76RK79qj11n9K08R6Jk9p7J44K7j87J10M4o8K6M4
$$ -112 -182 -178 -154 -27 -386 -281 -154 -330 -321 -42 -50 -161 -220 -12 84 85 56 -21 123 150 -37 73 117 49 75 119
3219A19J43k02j37J82K6J90m9r6K17k58k2K88Kj18k08L4O8k08j54Qp2J90j11k20
$$ 119 262 60 -77 105 131 321 272 176 393 135 113 401 403 285 77 111 179 -29 -183 -175 -247 -57 -168 -388
3243c88J42n2J03N8Oj82l9K25J37j09m63L63p3j9Q6j8o9K6nJ37O9J0j79K37L84
$$ -388 -246 -298 -195 -137 -131 -313 -352 -127 10 -99 -562 -199 -272 -291 -205 -223 -292 -266 -271 -134 -65 -55 -234 3 387
3268C87p0j79J5L04j46J7Q1j63r9k4J91O2j47j55J99R8Q5k68j3J29p1p6J87j06
$$ 387 317 138 153 457 311 328 409 246 147 123 314 376 229 74 273 371 456 188 175 304 233 157 344 238
3292B38k34OJ3o7L9n63J19J5J16j58p1j38J20J81J9K0j52J34J49K93j32k54K17
$$ 238 4 10 23 -44 -5 -568 -449 -434 -318 -476 -547 -685 -565 -384 -365 -345 -497 -363 -214 79 -53 -307 -90
3315i0r9K08j63Q0O9j20K04k6J02m9q7K39J24J07k60K14K3r6J51o5k0l16P1J65
$$ -90 -189 19 -144 -64 5 -115 89 63 165 116 29 268 392 499 239 453 476 380 531 466 446 130 201 366
3339C66O9l93j25L8K05Rr3k18J08J47K8M8k45m3o6R5P9k64j50j86K40j7l09K76
$$ 366 435 42 -83 -45 160 169 76 -142 -34 113 141 189 -56 -99 -165 -70 9 -255 -405 -591 -351 -368 -677 -401
3363d01j21J19J59L8k2nK50k5K10Rk19j95M31n2J03j76R9k03M4J34j18J34j03
$$ -401 -522 -403 -244 -206 -228 -233 17 -8 202 211 -8 -203 228 176 279 103 202 -1 43 177 59 193 90
3386I0O3K76M6j63n5m0M7J01j42Oj09k42L26j36k08k21J98J17K4k68J24J18j1
$$ 90 153 429 475 312 257 217 264 365 223 229 120 -122 204 68 -140 -361 -163 -46 -22 -290 -166 -48 -59
3409e9J76l27K87j54J09jJ05k49m07K55L5O9j44j84J25j4K89L5P5o9m3J96M7J00
$$ -59 117 -210 77 -77 32 31 136 -113 -520 -265 -230 -161 -305 -489 -364 -378 -89 -54 21 -48 -91 105 152 252
3433B52k94O8K11L7j89j44k4l5R9P4r3l1l63M76J0P2r5p6J49P7N1k02P4m8RJ21
$$ 252 -42 26 237 274 85 -59 -83 -118 -19 55 -38 -69 -432 44 54 126 31 -45 104 181 232 30 104 56 65 186
3459A86k39j57l8Q0K58r5k18MK2K32P7j7Q9j55J00J22L7j7k73O6R5P5j79m04K86
$$ 186 -53 -210 -248 -168 90 -5 -223 -219 -197 35 112 95 184 29 129 251 288 271 -2 64 159 234 55 -349 -63
3484f3M1RJ2P1k60L6K07J6j20q0J57L1J57m42K35j75J13l9J03j82j72P0J49J05
$$ -63 -22 -13 -1 70 -190 -154 53 69 -51 -131 26 57 214 -228 7 -168 -55 -94 9 -173 -345 -275 -126 -21
3508b1n1o2j38K51K06l8qk57M7K58M7j53p9K25j9J95k36j25L2M1J75k15K2j8j42
$$ -21 -72 -134 -272 -21 185 147 139 -118 -71 187 234 81 2 227 208 403 167 42 74 115 290 75 97 79 -63
3533f3K97Q7L8l87N8Q3J60q8k17j20M3J84j87l8j7k79J97K61j64r6j39J80J50
$$ -63 234 321 359 -28 30 113 273 185 -32 -152 -109 75 -112 -150 -167 -446 -249 12 -152 -248 -387 -207 -57
3556e7K4Q5k86Q0J43oJ58J5l30O4L05j14Ql72J11O6K28m7k01jO0J92q3O9L4m4
$$ -57 -33 52 -234 -154 -11 -17 141 156 -174 -110 195 81 89 -283 -172 -106 122 75 -126 -127 -67 125 42 111 145 101
3582A01J46L45j58l48M6q0K69j71l2j13j50J34Q3m4j60k06K87K10%j92k34K62
$$ 101 247 592 434 86 132 52 321 150 118 5 -145 -11 72 28 -132 -338 -51 159 159 -33 -267 -5
3604eK54m0k93J01j70J62N5p2j52j14J83R7N7k48Nj65N94j78L9m4l41L52J8O9
$$ -5 249 209 -84 17 -153 9 64 -8 -160 -274 -91 6 63 -185 -180 -345 249 71 110 66 -275 77 95 164
3628A64n8k71j54K92J47k54o8p3K5L13m9j31j4O5K66K48k37j58l9K57J34k12j92
$$ 164 106 -165 -319 -27 120 -134 -202 -275 -250 63 14 -117 -131 -66 200 448 211 53 14 271 405 193 1
3651AJ00L5j53J53r5l08M3K55J22J1o3k20J60M15o6j85k01P6rO2O3l79j40K07
$$ 1 101 136 -17 136 41 -267 -224 31 153 164 101 -119 41 456 390 205 4 80 71 133 196 -183 -323 -116
3675a16J6j60J82k56J22%L81j27k5k21J39Q3K10k70j55J17J4Q5j26k70k80M43
$$ -116 -100 -260 -78 -334 -212 -212 169 42 17 -204 -65 18 228 -42 -197 -80 -66 19 -107 -377 -657 -214
3697b14j3P3k19k6K94K43K67j65p8J04R2J28k12o3j97J42O1o3k7k66R1P6K84P5
$$ -214 -227 -154 -373 -399 -105 138 405 240 162 266 358 486 274 211 14 156 217 154 127 -139 -48 28 312 387
3721C87j35k70K90J60M7l24l8n5OJ49J1l12j70NJ06p1j28l41L00J80Q0o0p9J09
$$ 387 252 -18 272 432 479 155 117 62 68 217 228 -84 -254 -249 -143 -214 -342 -683 -383 -203 -123 -183 -262 -153
3745a53J01K62j74q9k94K9K86j54j63j91R8J55p4L03k16RK90L25Mj09K3J23L49
$$ -153 -52 210 36 -53 -347 -318 -32 -186 -349 -540 -442 -287 -361 -58 -274 -265 25 350 354 245 268 391 740
3768G40j86J38m39qOM5L8j70k11k4M6j1qj84M0L80J69j40Ol17J76J21N2k02k61
$$ 740 554 692 253 245 251 296 334 164 -47 -71 -25 -36 -44 -228 -188 192 361 221 227 -90 86 207 259 57 -204
3793b04j97J86m5r8j52k12K77K1L34K5l13R6L93L1K32j51j36K2J72j10j93j15
$$ -204 -401 -215 -260 -358 -510 -722 -445 -424 -90 -65 -378 -282 111 142 374 223 87 109 281 171 -22 -137
3815a37N5k3J53o8q2j65J97K17J85o9j23P7K14K2m0k41l5J77p8j79o3m43J73J04
$$ -137 -82 -105 48 -20 -102 -267 -70 147 332 263 140 217 431 453 413 172 137 314 236 57 -6 -449 -276 -172
3839a72kj52j17J29J45J52Q3m9j07K6L37j36P0l18k78L37J64k23k22j11lK80J16
$$ -172 -174 -326 -443 -314 -169 -17 66 17 -90 -64 273 137 207 -111 -389 -52 112 -111 -333 -444 -447 -167 -51
3862e1k08O6J77K56J44j13m3l4O9K88j01k46k39J50n3k9j5m42l4J31K85k8q5o6
$$ -51 -259 -193 -16 240 384 271 228 194 263 551 450 204 -35 115 62 33 18 -424 -458 -327 -42 -70 -155 -221
3886b21L1M44jj97k68M3J65K03k01k11j62j23M21j18j24j54OM69kl0q2j3K13Q9
$$ -221 -190 254 253 56 -212 -169 -4 199 -2 -213 -375 -498 -77 -195 -319 -473 -467 2 0 -30 -112 -125 88 177
3910A77Q3p6j82K8J18L78j52j95l47K80J52P7k31k57O9K65L53l12k50Q7L45M9
$$ 177 260 184 2 30 148 526 374 179 -168 112 264 341 110 -147 -78 187 540 228 -22 65 410 459
3932D59j95j30j04j44K56l5k68l54J44K21o7Q8j43j86K19N9N2K20l84J92K04J07
$$ 459 264 134 30 -114 142 107 -161 -515 -371 -150 -217 -129 -272 -458 -239 -180 -128 92 -292 -100 104 211
3954B11j56o9n6m1J20J65k70l7p0J98J17n7r4K0K20J10mk55J34j66L36R5j51j65
$$ 211 55 -14 -70 -111 9 174 -96 -133 -203 -5 112 55 -39 -19 201 311 307 52 186 20 356 451 300 135
3978A35r0J53O1P9k95j34J8K14N9k80M7j53L08k7L6l90n2J51R3lj28n9j59L64
$$ 135 45 198 259 338 43 -91 -73 141 200 -80 -33 -186 122 95 131 -259 -311 -160 -67 -70 -198 -257 -416 -52
4002e2L9J25k85j22J68J89K3j06l95K50J13J61j15p9k31L01J49K4p3j80K9K73
$$ -52 -13 112 -173 -295 -127 62 85 -21 -416 -166 -53 108 -7 -86 -317 -16 133 157 84 -96 -67 206
4024B06P7q8k92JJ92P3j8k68m7n5L93j8J77n48J88J01K82o0j87k33J9L17q1k75
$$ 206 283 195 -97 -96 96 169 151 -117 -164 -219 174 156 333 -215 -27 74 356 296 109 -124 -105 212 131 -144
4048a44kj71K26M12m48J2p4j1J77Q8k25o0M4K83K70k65k40L0J95O0n6j08k51J92
$$ -144 -146 -317 -91 321 -127 -115 -189 -200 -23 65 -160 -220 -176 107 377 112 -128 -98 97 157 101 -7 -258 -66
4072f6J33N3q2k17K0K00Q2J83k95r0J27K55k1l17j30n3J44L18k46k10n4R7K99
$$ -66 67 120 38 -179 -159 41 123 306 11 -79 48 303 282 -35 -165 -218 -74 244 -2 -212 -266 -169 130
4095A30Q2m36J12M4L66N8k6k76q9J72J43N6k14m53R2K93R7j20j59l29K42L24J32
$$ 130 212 -224 -112 -68 298 356 330 54 -35 137 280 336 122 -331 -239 54 151 31 -128 -457 -215 109 241
4118B41l79j39K47R6K68j46l37Q2R9J09j91k21j78K01K14O0q0k07o6K70K43m5
$$ 241 -138 -277 -30 66 334 188 -149 -67 32 141 -50 -271 -449 -248 -34 26 -54 -261 -327 -57 186 141
4140A41j42n5J48L04K5k76j76mJ4J93j57l20P1KL11N1j87o4J10K67K67k40k90
$$ 141 -1 -56 92 396 421 145 -31 -35 -21 172 15 -305 -234 -232 79 130 -57 -121 -11 256 523 283 -7
4163gQ8p1M09p9j93k63o7R0J41j18k61j48J71L36m1k56j60K33M89lk27k84J41
$$ -7 81 10 419 340 147 -116 -183 -93 48 -70 -331 -479 -308 28 -13 -269 -429 -196 293 290 63 -221 -80
4186h0J87Npk86l11L89J72qj38j06p1M25K31p3j87k5K36K53j8l28j96J32J50m6
$$ -80 107 112 105 -181 -492 -103 69 61 -77 -183 -254 171 402 329 142 117 353 606 588 260 64 196 346 300
4210C00j07l77k2o6M29j62l42j24K31M01N3j7k49j8J85K67j55m86k7P0J34Ql09
$$ 300 193 -184 -206 -272 157 -5 -347 -471 -240 161 214 197 -52 -70 115 382 227 -259 -286 -216 -82 -74 -383
4233c83m10J48K54J35L7k11n6L84K56l0R1k53J12Q2K89j35k31r9l1M09j15k82
$$ -383 -793 -645 -391 -256 -219 -430 -486 -102 154 124 215 -38 74 156 445 310 79 -20 -51 358 243 -39
4255c9j94K20L41O3r2j76J21O6J98O7k79K4j00N2J18l67k66o3q3L94o4k68K8r4
$$ -39 -233 -13 328 391 299 123 244 310 508 575 296 320 220 272 390 23 -243 -306 -389 5 -59 -327 -299 -393
4279c93L17O4l0k81O2K98J58r9k34k40K8K36J80l57k26J37J77J54j39j01L5Q4
$$ -393 -76 -12 -42 -323 -261 37 195 96 -138 -378 -350 -114 66 -291 -517 -380 -203 -49 -188 -289 -254 -170
4301a70L94J50k10j2JL34J76n30J22j56J42K10j38j85k07PM13N0r8n82K70K04
$$ -170 224 374 164 152 153 487 663 133 255 99 241 451 313 128 -79 -72 341 391 293 -289 -19 185
4323A85J75k6l29n0R5K15J8j36l29j24P3L18k76j91j78J79L37k6k14q6J82K49
$$ 185 360 334 5 -45 50 265 283 147 -182 -306 -233 85 -191 -382 -560 -381 -44 -70 -284 -370 -188 61
4345F1j27J51k40P1J58J63k04k9m10L8K86K29j98q6j81K65M51M2m44j49J97L53
$$ 61 -66 85 -155 -84 74 237 33 4 -406 -368 -82 147 -51 -137 -318 -53 398 440 -4 -153 44 397
4367C97Q2k42r8j42R5K67j4m21j61R9L78k3k6l73J30J18K33j55k64j49K26J80
$$ 397 479 237 139 -3 92 359 345 -76 -237 -138 240 217 191 -182 -52 66 299 144 -120 -269 -43 137
4389A37K4j11l38R3J13K04j07k87j52K87L33k01j4k57J4K94P9j15j53n5K83J56
$$ 137 161 50 -288 -195 -82 122 15 -272 -424 -137 196 -5 -19 -276 -262 32 111 -4 -157 -212 71 227
4411B27j00j84j70J96q0L33k50j86l1N7M21j60q3n7K08O6L3p3l20%J25J05mk78
$$ 227 127 -57 -227 -31 -111 222 -28 -214 -245 -188 233 73 -10 -67 141 207 240 167 -153 -153 -28 77 73 -205
4435b05j19K84L70p9l04j11j0M36J8k20k55n2L00L35o9m31r0M5K22P3j31k94q7
$$ -205 -324 -40 330 251 -53 -164 -174 262 280 60 -195 -247 53 388 319 -112 -202 -157 65 138 7 -287 -374
4458c74N17m5P6k10l43K88L13J67l55k15j60L37K51j10l42L1J03J05K89k69l18
$$ -374 143 98 174 -36 -379 -91 222 389 34 -181 -341 -4 247 137 -205 -174 -71 34 323 54 -264
4479b64k9M52J21j21l92m2J06J75K24m13j80Q3L26J95k04j70j64K60J02J89k76
$$ -264 -293 159 280 159 -233 -275 -169 6 230 -183 -363 -280 46 241 37 -133 -297 -37 65 254 -22
4500b2j68L3L63l8pk92K2M3K52R8m88L5M6L24J09o7l38N0K20rm2k35k51L08L03
$$ -22 -190 -157 206 168 161 -131 -109 -66 186 284 -204 -169 -123 201 310 243 -95 -45 175 166 124 -111 -362 -54 249
4525B49l5j44m10k5L95K16j18l09K3P0L91j43r0k03j19L35ON0l10k12K13J78J13
$$ 249 214 70 -340 -365 30 246 128 -181 -158 -88 303 160 70 -133 -252 83 89 139 -171 -383 -170 8 121
4548A21k54k23J31K35J36k72m3p2K52L71j28j93k48L8K73O9j51l00r5L92lJl73
$$ 121 -133 -356 -225 10 146 -126 -169 -241 11 382 254 61 -187 -149 124 193 42 -258 -353 39 36 37 -336
4571c36L0J86K53K17j90j77k16M73J72j68l47P7K53K09j73k06l09R8R5K75j24
$$ -336 -306 -120 133 350 160 -17 -233 240 412 244 -103 -26 227 436 263 57 -252 -154 -59 216 92
4592I2k71K4J10M31o8l63J23j20J56K55l15r5l9n3K32q3k23l24P1M29J41l37k3
$$ 92 -179 -155 -45 386 318 -45 78 -42 114 369 54 -41 -80 -133 99 16 -207 -531 -460 -31 110 -227 -250
4615b50j34J48N21j40j37k89J93K15K9j64l63K22K4J46j39j98j37K91L33j73J16
$$ -250 -384 -236 285 145 8 -281 -88 127 156 -8 -371 -149 -125 21 -118 -316 -453 -162 171 -2 114
4636A14k64J22N31Q4k97k07j7Q3K69rk66l10J73L22j44p7l59j5K59K39P3m02n1
$$ 114 -150 -28 503 587 290 83 66 149 418 409 143 -167 6 328 184 107 -252 -267 -8 231 304 -98 -149
4659a49K29L14N3k78k25M8r0L47k18l23k45J80J71ok39j27K19R7J95r5K0k25K28
$$ -149 80 394 447 169 -56 -8 -98 249 31 -292 -537 -357 -186 -192 -431 -558 -339 -242 -47 -142 -122 -347 -119
4682a19K79p5j94j17P5L00K7j27l03j64L31J53K79l01l52L34K59J55l9m33J28
$$ -119 160 85 -109 -226 -151 149 176 49 -254 -418 -87 66 345 44 -308 26 285 440 401 -32 96
4703I6L55M3k46j36k22J27K27K4j23k65q7L57Q5o8j70k90K80K82k85r3q4mK51
$$ 96 451 494 248 112 -110 17 244 268 145 -120 -207 150 235 167 -3 -293 -13 269 -16 -109 -193 -197 54
4726E4o5J44n87k01K85J49J79m07n0J31L19K83l54k22p1L89K54K12m63j28Q0L13
$$ 54 -11 133 -454 -655 -370 -221 -42 -449 -499 -368 -49 234 -120 -342 -413 -24 230 442 -21 -149 -69 244
4748B44j4l12j48N1J48K44j9k80n9J01M52r4r6j20p6K63J30m9m69L5J81OR6k62
$$ 244 230 -82 -230 -179 -31 213 194 -86 -145 -44 408 314 218 98 22 285 415 366 -103 -68 113 119 215 -47
4772d7j68r7L23J53M3l92oJ92J79l4k59r4Q0N2K89k67k82lJ88K39J5m50j44J91
$$ -47 -215 -312 11 164 207 -185 -191 1 180 146 -113 -207 -127 -75 214 -53 -335 -338 -150 89 104 -346 -490 -299
4796b99N02oj30l55J36J91J10J58l47j67O3K84J84j56l86r8K89K08P8n07L0J03
$$ -299 203 197 67 -288 -152 39 149 307 -40 -207 -144 140 324 168 -218 -316 -27 181 259 -248 -218 -115
4818a15N00j49j20m02Q5N03J30j63l87J57r7L53j07j56k59J27J65K88k46k92j24
$$ -115 385 236 116 -286 -201 302 432 269 -118 39 -58 295 188 32 -227 -100 65 353 107 -185 -309
4839c09K41L81j43l25m7J80K01J90k26k46j05J38L32j99k81k87L76L41j10j68
$$ -309 -68 313 170 -155 -202 -22 179 369 143 -103 -208 -70 262 63 -218 -505 -129 212 102 -66
4859f6l09J25L60K46Ql89l0j7K05J38l19k90O3K66J54j09j51k62L99N7Q8k15j70
$$ -66 -375 -250 110 356 364 -25 -55 -72 133 271 -48 -338 -275 -9 145 36 -115 -377 22 79 167 -48 -218
4882b18o6M17J11j88k25k6K78J11j68ok57K50O8J15k54j93oL97K18om17j60J56
$$ -218 -284 133 244 56 -169 -195 83 194 26 20 -237 13 81 196 -58 -251 -257 140 358 352 -65 -225 -69
4905f9K65K9ll61n1K69J97p7k37j67Q8N89j06k18l69K17N8K04Pl57j84K46M19
$$ -69 196 225 222 -139 -190 79 276 199 -38 -205 -117 472 366 148 -221 -4 54 258 265 -92 -276 -30 389
4928C89j59n05M8n4K32J13k62j65K0L02Q3Q2k27J4j66K64J04j55l12r2M53J74
$$ 389 230 -275 -227 -281 -49 64 -198 -363 -343 -41 42 124 -103 -89 -255 9 113 -42 -354 -446 7 181
4950A81j10r2j67o6L17K67j66l37j26M60K25n3k71l06J47K69O8j45l06J16K21
$$ 181 71 -21 -188 -254 63 330 164 -173 -299 161 386 333 62 -244 -97 172 240 95 -211 -95 126
4971A26K07j95j89l26N30L26k12j14l33J75K30k8Nk51k99M05J82j9l03l44L38
$$ 126 333 138 -51 -377 153 479 267 153 -180 -5 225 197 202 -49 -348 57 239 220 -83 -427 -89
4992h9J03J21j01l18K5O3L16r0k9j87nL47L4k06k45j0J70J69r4n4k44K82K17m8
$$ -89 14 135 34 -284 -259 -196 120 30 1 -186 -191 156 190 -16 -261 -271 -101 68 -26 -80 -324 -42 175 127
5016A27l1l39j5M82J08j84j71j13K55J68Q2m99l6p3L58J16k03k93l2K12M24Jk36
$$ 127 96 -243 -258 224 332 148 -23 -136 119 287 369 -130 -166 -239 119 235 32 -261 -293 -81 343 344 108
5039A08k11N2L39k3o9k79J25o2J54J05l24k37J84P6K0j51j76K0K79L20j64k78
$$ 108 -103 -51 288 265 196 -83 42 -20 134 239 -85 -322 -138 -62 -42 -193 -369 -349 -70 250 86 -192
5061a92k14J74K73K56l26l32J71J53M3j19j68M9J6J65J43j54j90J52L81N9r9l54
$$ -192 -406 -232 41 297 -29 -361 -190 -37 6 -113 -281 -232 -216 -51 92 -62 -252 -100 281 340 241 -113
5083a13q2L46J92n7l14j50Q1J35J41l93Lm6J56N43j31k25j69L13K04q6j31l26
$$ -113 -195 151 343 286 -28 -178 -97 38 179 -214 -211 -257 -101 442 311 86 -83 230 434 348 217 -109
5105a09k1R9K72j79k32k92L04O9N0j01j27L1K30K22K4m22j43L32j2K51k63l60
$$ -109 -130 -31 241 62 -170 -462 -158 -89 -39 -140 -267 -236 -6 216 240 -182 -325 7 -5 246 -17 -377
5127c77M4L30K4k18n3j02L31J0N3lj15j19M94lj77j60j84N53mj85q1l5j5K96r7
$$ -377 -333 -3 21 -197 -250 -352 -21 -11 42 39 -76 -195 299 296 119 -41 -225 328 324 139 58 23 8 304 207
5152B07k04j40j4Q0L63m0k55k17K23M40j11k78r8j90L18K40l33R2k14n1N16l12
$$ 207 3 -137 -151 -71 292 252 -3 -220 3 443 332 54 -44 -234 84 324 -9 83 -131 -182 334 22
5174B2j74k64O5K31J35J4k30j10K84K98k79j39j37J46K81J39m19q5j49M23J01
$$ 22 -152 -416 -351 -120 15 29 -201 -311 -27 271 -8 -147 -284 -138 143 282 -137 -222 -371 52 153
5195A53p0k96j73K78L28J87m58j31J01K97%J06l93l8J86N7J07j41m13K33J35L92
$$ 153 83 -213 -386 -108 220 407 -51 -182 -81 216 216 322 -71 -109 77 134 241 100 -313 -80 55 447
5217D47l21k59j64L39K83j52j70j41J10O4K29l04N8l04R2L55jl23j42N4K59J66
$$ 447 126 -133 -297 42 325 173 3 -138 -28 36 265 -39 19 -285 -193 162 161 -162 -304 -250 9 175
5239A75k57k60J9K14K64K4l06k20O8M34k6q0l45J92J23J64ok20j97J14L25k1j12
$$ 175 -82 -342 -323 -109 155 179 -127 -347 -279 155 129 49 -296 -104 19 183 177 -43 -240 -126 199 178 66
5262F6k87J24K12K25j65l23j8J62J27J87l57k37J60L3L54j69l15L3K48J56l2j64
$$ 66 -221 -97 115 340 175 -148 -166 -4 123 310 -47 -284 -124 -91 263 94 -221 -188 60 216 184 20
5284B0j64J13R9M8O6m14j89M07L11k00k11k49K49K45j31K6j90JJ56L23o0k97j85
$$ 20 -144 -31 68 116 182 -232 -421 -14 297 97 -114 -363 -114 131 0 26 -164 -163 -7 316 256 -41 -226
5307b26J69K00mk18l38J57K96L52j00m28k4O8L52j85j7m50K58K79K16k64l42N5
$$ -226 -57 143 139 -79 -417 -260 36 388 288 -140 -164 -96 256 71 54 -396 -138 141 357 93 -249 -194
5329a94K62J16r7k11k43L08l1K86k43j94%K36K13j1k29k19J99K17j51k0j91M6
$$ -194 68 184 87 -124 -367 -59 -90 196 -47 -241 -241 -5 208 197 -32 -251 -52 165 14 -6 -197 -151
5351a51P4K33R5m20K3J03J62R2j81j48lJ98J81J24l82j38P8L86q1j27l36OL29
$$ -151 -77 156 251 -169 -146 -43 119 211 30 -118 -121 77 258 382 0 -138 -60 326 245 118 -218 -212 117
5374A17J16r0k49j6J14K49j32m7k69L4L08Lj05k29j01J14K22J13m10k01K49J82
$$ 117 233 143 -106 -122 -8 241 109 62 -207 -173 135 138 33 -196 -297 -183 39 152 -258 -459 -210 -28
5396b8J55l1j95j32K24K53q0l53r4J81Q4J47k7k45r1M45J09m9k05j82M02k8Mk95
$$ -28 127 96 -99 -231 -7 246 166 -187 -281 -100 -16 131 104 -141 -232 213 322 273 68 -114 288 260 264 -31
5420c1J56j88J75L43k34l67j41K42J65O5k38k15J9L64O3p4l43L6J02N02j60j74
$$ -31 125 -63 112 455 221 -146 -287 -45 120 185 -53 -268 -249 115 178 104 -239 -203 -101 401 241 67
5442F7l34L0M14j18j08k18j98M47J29j14k91K9j31M13J31k58o4M9K50K06k64j66
$$ 67 -267 -237 177 59 -49 -267 -465 -18 111 -3 -294 -265 -396 17 148 -110 -174 -125 125 331 67 -99
5464i9j85J36M12m7k11k31J3L18J05j41%k29J34M14m8l18N9N5Q4J09j09k62j43
$$ -99 -284 -148 264 217 6 -225 -212 106 211 70 70 -159 -25 389 341 23 82 137 221 330 221 -41 -184
5487a84J52J67k45P7k90R5K90J71k69m5LJ24J87qk24n5j15K88O3k74j71l8L68
$$ -184 -32 135 -110 -33 -323 -228 62 233 -36 -81 -78 46 233 225 1 -54 -169 119 182 -92 -263 -301 67
5510F7K0l6k83L5r1M18O1k17j66q7K81K67m1j95n5m8K13m6k49j76P3L73k9j4k20
$$ 67 87 51 -232 -197 -288 130 191 -26 -192 -279 2 269 228 33 -22 -70 143 97 -152 -328 -255 118 89 75 -145
5535a45j2O2L28p2j02p6K23J00q2%k73kO2J97r8j60k22K14M8K26k47o0J7J14J64
$$ -145 -157 -95 233 161 59 -17 206 306 224 224 -49 -51 11 208 110 -50 -272 -58 -10 216 -31 -91 -74 40 204
5560B04l0j92j87K66J19J14l05l27P0J94J22j94j49j78L27J62J5m1j51j24J75
$$ 204 174 -18 -205 61 180 294 -11 -338 -268 -74 48 -146 -295 -473 -146 16 31 -10 -161 -285 -110
5581a10L63k53j28j48L07J51j54k37qO3J84n5M5j48q2K10L24K3l71n1K47L05j55
$$ -110 253 0 -128 -276 31 182 28 -209 -217 -154 30 -25 20 -128 -210 0 324 347 -24 -75 172 477 322
5604C22o2l36J45J39L9j51P4l15J68J73J11l63L7q9K44J44j9k02k59K64K49o4
$$ 322 260 -76 69 208 247 96 170 -145 23 196 307 -56 -19 -108 136 280 261 59 -200 64 313 249
5626B49j63m56K72J87k11l1j27k04K02K96p3q3k22J54L48O6j42k23n2J09K82r0
$$ 249 86 -370 -98 89 -122 -153 -280 -484 -282 14 -59 -142 -364 -210 138 204 62 -161 -213 -104 178 88
5648H8l63m0K29KK87p6l90J14L74J25k34k25k3J06L62L0l03j92L08j33K76j39
$$ 88 -275 -315 -86 -84 203 127 -263 -149 225 350 116 -109 -132 -26 336 366 63 -129 179 46 322 183
5670A83k68j02K07J35j06q4j07O7J98K05l46Q5k02J73J12J24l76k27M0L03R5k60
$$ 183 -85 -187 20 155 49 -35 -142 -75 123 328 -18 67 -135 38 150 274 -102 -329 -289 14 109 -151
5692a51l8k2J12J90n7o6j95M6L23K2j1j97m4J02K05Ql14n4n7L61j00l7k82K62
$$ -151 -189 -211 -99 91 34 -32 -227 -181 142 164 153 -44 -88 14 219 227 -87 -141 -198 163 63 26 -256 6
5716FJ99J08k21j66J6J31J67j16j98j85J00Q6J21M1j92j24M8K57O4l13L5r0L41
$$ 6 205 313 92 -74 -58 73 240 124 -74 -259 -159 -73 48 89 -103 -227 -179 78 142 -171 -136 -226 115
5739A15K27l75j34J57J23O8J55l90n2K12J1K37l87k19J10J67J44Lj86k2MJ20O6
$$ 115 342 -33 -167 -10 113 181 336 -54 -106 106 117 354 -33 -252 -142 25 169 172 -14 -36 -32 88 154
5762A54j68j55M7J00J74o1k83J8J95N5J63j21m82K93K31J58k90k29j3K43M7L6
$$ 154 -14 -169 -122 -22 152 91 -192 -174 21 76 239 118 -364 -71 160 318 28 -201 -214 29 76 112
5784A12n1k35L6J88K7o7k84M3J09J62J07l44L0K75J19m4j95q0q6K60K86j01k15
$$ 112 61 -174 -138 50 77 10 -274 -231 -122 40 147 -197 -167 108 227 183 -12 -92 -178 82 368 267 52
5807E2m16L33K32l7j28n6o7J18J81nj91j93J49J55kj11j31j01K32J89k25k07q1
$$ 52 -364 -31 201 164 36 -20 -87 31 212 207 16 -177 -28 127 125 14 -117 -218 14 203 -22 -229 -310
5830c10K28J25Q0k01j09P9L0L26k77O2l02J6M27k05o3k97K42J62J4k4j89%J61
$$ -310 -82 43 123 -78 -187 -108 -78 248 -29 33 -269 -253 174 -31 -94 -391 -149 13 27 3 -186 -186 -25
5853b5L18j66p3j03qL75j1j25j33m8J0L37k56o3j35KJ58K15k27j32P5M9J76Kk52
$$ -25 293 127 54 -49 -57 318 307 182 49 1 11 348 92 29 -106 -104 54 269 42 -90 -15 34 210 212 -40
5878d0r5K39j36J92j81k48J6K13K46j34m16J12J21Q3J63j71p4O5J5J54O2k28o3
$$ -40 -135 104 -32 160 -21 -269 -253 -40 206 72 -344 -232 -111 -28 135 -36 -110 -45 -30 124 186 -42 -105
5901a05K55m1k6j53j60O8K04O1o1l06J51qJ70O5j50j91L08O3L1j00j42J49j44
$$ -105 150 109 83 -70 -230 -162 42 103 42 -264 -113 -121 49 114 -36 -227 81 144 175 75 -67 82 -62
5924f2J30q2j86J2RJ96P3k18K1j0L16l8p6J1j45P9J53p1p5j93N5J91j3k51j5o9
$$ -62 68 -14 -200 -188 -179 17 90 -128 -107 -117 199 161 85 96 -49 30 183 112 37 -156 -101 90 77 -174 -189 -258
5950b58K69J55j67n7j14M9K19K32j89j34r5K4L35k37k17j51J82K6P6j90Q4l8j3
$$ -258 11 166 -1 -58 -172 -123 96 328 139 5 -90 -66 269 32 -185 -336 -154 -128 -52 -242 -158 -196 -209
5973b09K82j00k58K6K24J81J31k78l9J3P0N3jk80q6K15o6K08j00j00J18J83l9
$$ -209 73 -27 -285 -259 -35 146 277 -1 -40 -27 43 96 95 -185 -271 -56 -122 86 -14 -114 4 187 148
5996A48q1L5j51J90L5J42j43k27q8K90K6j35l90K67J75j5k9j71J54j42K04J38
$$ 148 67 102 -49 141 176 318 175 -52 -140 150 176 41 -349 -82 93 78 49 -122 32 -110 94 232
6018B32k62j69KK26J33j59j31j57J29J83q9o3l60K35J35K62m7k76RN2K77o9j20
$$ 232 -30 -199 -197 29 162 3 -128 -285 -156 27 -62 -125 -485 -250 -115 147 100 -176 -167 -115 162 93 -27
6041b7K9m2K77l1j31j22j97K07J19r6j29k48L58O7K08r7r5Q3M5M9m0q0k47q8L76
$$ -27 2 -40 237 206 75 -47 -244 -37 82 -14 -143 -391 -33 34 242 145 50 133 178 227 187 107 -140 -228 148
6066A48L6j95l00J50k1J90Jj16L7M3J47j3n2l27K65O1J66j17j36q2J34Q0j44O1
$$ 148 184 -11 -311 -161 -182 8 9 -107 -70 -27 120 107 55 -272 -7 54 220 103 -33 -115 19 99 -45 16
6090A6l54J37K32R1J5l47K38o5K68L5k24j25J22K73j58n7o6j82J81N2Q8k18q3
$$ 16 -338 -201 31 122 137 -210 28 -37 231 266 42 -83 39 312 154 97 31 -151 30 82 170 -48 -131
6113a31J02J02J44j96j28o2K60R2Q9l28j93J79k0J78j96j12L4J35L4O1l09R1M9
$$ -131 -29 73 217 21 -107 -169 91 183 272 -56 -249 -70 -90 88 -108 -220 -186 -51 -17 44 -265 -174 -125
6136a25K57k09J17j25J02J11P5k5k87Q1m1L25k27J74k64O5J02J20j79j64J9Q6
$$ -125 132 -77 40 -85 17 128 203 178 -109 -28 -69 256 29 203 -61 4 106 226 47 -117 -98 -12
6158a2L27m4j59l48K71K08l7j70r2k96K55J46R6k77P0o3L39q7r3j28p4K10Q4J0
$$ -12 315 271 112 -236 35 243 206 36 -56 -352 -97 49 145 -132 -62 -125 214 127 34 -94 -168 42 126 136
6182A36l13r5K67j13j5M3j56J59J38J73j77n5j53J65R9J02j09k05J37K3L9J4j41
$$ 136 -177 -272 -5 -118 -133 -90 -246 -87 51 224 47 -8 -161 4 103 205 96 -109 28 51 90 104 -37
6205c7j70J90K29o5j32j31J31J22p7m0jqM0J01M8l65j29J12J47J19l29n2J64J71
$$ -37 -207 -17 212 147 15 -116 15 137 60 20 19 11 51 152 200 -165 -294 -182 -35 84 -245 -297 -133 38
6229C8p9J61j99j86J88Q2K32j92k66P1J61kP6q7j88N0K26k6j20q3P5J01J00l09
$$ 38 -41 120 -79 -265 -77 5 237 45 -221 -150 11 9 85 -2 -190 -140 86 60 -60 -143 -68 33 133 -176
6253a76N4M2K12j2N4o7k20O9J83J84k52j01j7J35Q8j24n2r9J5J19J69l9l43l0
$$ -176 -122 -80 132 120 174 107 -113 -44 139 323 71 -30 -47 88 176 52 0 -99 -84 35 204 165 -178 -208
6277b08M40r7j1j53r0k2K97j30j21k32J73K37R2q4j78J0j4K52J94j65j74J7L04
$$ -208 232 135 124 -29 -119 -141 156 26 -95 -327 -154 83 175 91 -87 -77 -91 161 355 190 16 33 337
6300C37j10k11m9J0q0K31l9q8k79J1M11Mr1j57n8K34L0P7k79OL6J28N9j44j64
$$ 337 227 16 -33 -23 -103 128 89 1 -278 -267 144 148 57 -100 -158 76 106 183 -96 -90 -54 74 133 -11 -175
6325a75j36J83K21j38j60n0J77J11R3k85L1O0J03J44j0j59k03K95J25k47L5j92
$$ -175 -311 -128 93 -45 -205 -255 -78 33 126 -159 -128 -68 35 179 169 10 -193 102 227 -20 15 -177
6347a77R3P3J37J9k12J09j15K96Kq1k32J25r1L39l93M6j01n9J55P0q4k76Q2K46
$$ -177 -84 -11 126 145 -67 42 -73 223 225 144 -88 37 -54 285 -108 -62 -163 -222 -67 3 -81 -357 -275 -29
6371b9J67k87j50P5J73J18Lj75Q3j29P1P7Qm3j33J51P5k09j33K72k20K90knr6
$$ -29 138 -149 -299 -224 -51 67 70 -105 -22 -151 -80 -3 5 -38 -171 -20 55 -154 -287 -15 -235 55 53 48 -48
6396d8r3M30j18J24l28N3J23k3l1p0k37J84J08L5l5rj27r2K28Q4j55j6O8K37Q
$$ -48 -141 289 171 295 -33 20 143 120 89 19 -218 -34 74 109 74 65 -62 -154 74 158 3 -13 55 292 300
6421C00k12j11k4L1J59k08j96OJ65k7L11j94j97J92P1L2k3r6J0J31p9Jm9j15P0
$$ 300 88 -23 -47 -16 143 -65 -261 -255 -90 -117 194 0 -197 -5 66 98 75 -21 -11 120 41 42 -7 -122 -52
6446e2O8J1J2j01j17J0K52j15K6L8p6K53j41K26k29j91K40P5j30l3j54J5K44j41
$$ -52 16 27 39 -62 -179 -169 83 -32 -6 32 -44 209 68 294 65 -126 114 189 59 26 -128 -113 131 -10
6470a0J37j35j25K72J19k6k01j21J22P6L2rj8j91J20J28k81J04k05k4K69J35j52
$$ -10 127 -8 -133 139 258 232 31 -90 32 108 140 131 113 -78 42 170 -111 -7 -212 -236 33 168 16
6493A6n8k9K31l9M8Nj83j0L02j56j14r4o9J89P5r8k59J65R2j62J83j27j11M8K58
$$ 16 -42 -71 160 121 169 174 -9 -19 283 127 13 -81 -150 39 114 16 -243 -78 14 -148 35 -92 -203 -155 103
6518A03J2j59j55nJ04J83n8k05q9L35r6O3J01k74n6L07ll4k9q9P2K34q0r5j37
$$ 103 115 -44 -199 -204 -100 83 25 -180 -269 66 -30 33 134 -140 -196 111 108 74 45 -44 28 262 182 87 -50
6543e0K3Q6K08j84j11K6m4J37j4P4k87N9R5J32j45l05N5J56J89l8r1j07p0J31
$$ -50 -27 59 267 83 -28 -2 -46 91 77 151 -136 -77 18 150 5 -300 -245 -89 100 62 -29 -136 -206 -75
6567g5j5n2n7j01N5J57l2o9J6K8K31l3o6j74J35p3J07n7p1k6K6J82%j8K7j57J7
$$ -75 -90 -142 -199 -300 -245 -88 -120 -189 -173 -145 86 53 -13 -187 -52 -125 -18 -75 -146 -172 -146 36 36 18 45 -112 -95
6594i5K60p3o4q1J30L4K10l80K9k0L47n0j44k0k19J30K42r1q4l49K34J5J93j26
$$ -95 165 92 28 -53 77 111 321 -59 -30 -50 297 247 103 83 -136 -6 236 145 61 -288 -54 -39 154 28
6618B8o7n5p1J16J8Q2j67oK51J4j17j22M3J61q5K2j38K7p7K39k72J50J8o9j8J47
$$ 28 -39 -94 -165 -49 -31 51 -116 -122 129 143 26 -96 -53 108 23 45 -93 -66 -143 96 -176 -26 -8 -77 -95 52
6644E2l6j71J98k79L08L3j61p2l2K33N9R1m30K91o0Nj58P2j19K12L4O0n3j00o2
$$ 52 16 -155 43 -236 72 105 -56 -128 -160 73 132 223 -207 84 24 29 -129 -57 -176 36 70 130 77 -23 -85
6669h5J09L6K23j74k13J37O7J17j55k17J80J05q3J76k76j22J39K06P8j91k21P3
$$ -85 24 60 283 109 -104 33 100 217 62 -155 25 130 47 223 -53 -175 -36 170 248 57 -164 -91
6691i1O8L9P6r9l0rJ21J56l10J7L5k3Q5j96J31j61J55J10q4m8k01J60M5J86j54
$$ -91 -23 16 92 -7 -37 -46 75 231 -79 -62 -27 -50 35 -161 -30 -191 -36 74 -10 -58 -259 -99 -54 132 -22
6716b2o9j40K56l0N6j51j12J16O9N4p2j4j00R7K78oj21k02J6K23M1nj45LM7rQ2
$$ -22 -91 -231 25 -5 51 -100 -212 -96 -27 27 -45 -59 -159 -62 216 210 89 -113 -97 126 167 162 17 20 67 58 140
6743A40j39l4P5L9O6k01L7j14R9K34j49m3j75L4L52j70j22q9O7O0N7r6j20k5L7
$$ 140 1 -33 42 81 147 -54 -17 -131 -32 202 53 10 -165 -131 221 51 -71 -160 -93 -33 24 -72 -192 -217 -180
6768a80K11m6j71j11R5J42R4m8k73K88j23J47J54k31j99J19J84qN8k16J45j5J40
$$ -180 31 -15 -186 -297 -202 -60 34 -14 -287 1 -122 25 179 -52 -251 -132 52 44 102 -114 31 16 156
6791A56K6rmk74L68Q8k92j01J28R4R4j48j00j59J69Q7N6q6j25J7J44J53k52n3
$$ 156 182 173 169 -105 263 351 59 -42 86 180 274 126 26 -133 36 123 179 93 -32 -15 129 282 30 -23
6815b3j31J73l7Jp7j31J55n9K7J9k02R7Q2N5K23k93r5J43O2j16j03K14k06J33
$$ -23 -154 19 -18 -17 -94 -225 -70 -129 -102 -83 -285 -188 -106 -51 172 -121 -216 -73 -11 -127 -230 -16 -222 -89
6839h9P4K78l37j2J28R3jj03m8j8N2Lm1o6M7J18j15K54l6k24QJ61J70j4k89k08
$$ -89 -15 263 -74 -86 42 135 134 31 -17 -35 17 20 -21 -87 -40 78 -37 217 181 -43 -35 126 296 282 -7 -215
6865b15L01j9J06k87P6q9N0K63p4k20J7J21l1J28k18j40J37L4L8J13k95Q5M9J36
$$ -215 86 67 173 -114 -38 -127 -77 186 112 -108 -91 30 -1 127 -91 -231 -94 -60 -22 91 -204 -119 -70 66
6889F6r9j27M2J04J48k1k15l2P8J9J81N2j98k16K48m0K66j87j51N2K1l0J31k74
$$ 66 -33 -160 -118 -14 134 113 -102 -134 -56 -37 144 196 -2 -218 30 -10 256 69 -82 -30 -9 -39 92 -182
6913a82J07P8J31J63l31o3J31q4J71p3p5k6N9q3K38k81J8m0R5J94l8k84Q0K48
$$ -182 -75 3 134 297 -34 -97 34 -50 121 48 -27 -53 6 -77 161 -120 -102 -142 -47 147 109 -175 -95 153
6937A53j12N4j24Q0j46K23Q6r1k04QJ13p2Q4j61j2LJ73N3j86j4n8L8J43J3j83
$$ 153 41 95 -29 51 -95 128 214 123 -81 -73 40 -32 52 -109 -121 -118 55 108 -78 -92 -150 -112 31 44 -139
6962a39j8J30P6n0J03k80K58O4r2Qm7k01N1K48j26L8j75J0J67M3q2P5q5M6K6q0
$$ -139 -157 -27 49 -1 102 -178 80 144 52 60 13 -188 -137 111 -15 23 -152 -142 25 68 -14 61 -24 22 48 -32
6988c2O6N1j16J71J73k03k47R1J98Q9k04j09PK06l2j2l9j57o6K91j69L8q7j32
$$ -32 34 85 -31 140 313 110 -137 -46 152 241 37 -72 -65 141 109 97 58 -99 -165 126 -43 -5 -92 -224
7012b24N5K20j37J04M3o6o6J07r2o4O5r6J13Qj04M6l6J28P7j18J27k12K55J5n0
$$ -224 -169 51 -86 18 61 -5 -71 36 -56 -120 -55 -151 -38 -30 -134 -88 -124 4 81 -37 90 -122 133 148 98
7037I8%k33P8J38Mm6o4k4O5J46j59M0k65K08PP5P9k86mK08j9k6j72Mo0K38J48
$$ 98 98 -135 -57 81 85 39 -25 -49 16 162 3 43 -222 -14 -7 68 147 -139 -143 65 46 20 -152 -148 -208 30 178
7064A78k60L2j18K9J79J08l0k91J76R1J40k03j53P1J48K7L4j22Q2q3Q5R1j70p6
$$ 178 -82 -50 -168 -139 40 148 118 -173 3 94 234 31 -122 -51 97 124 158 36 118 35 120 211 41 -35
7088c5M8M9M2o5j87L0K86j66P7k14Q4O5l7P8k07j4M6j38K33j39l3j11K37PN2N5
$$ -35 13 62 104 39 -148 -118 168 2 79 -135 -51 14 -23 55 -152 -166 -120 -258 -25 -164 -197 -308 -71 -64 -12 43
7114D3k98K17L6r6K22k59m0K35O5l0p6j69j6J48J51o5j19n5J65o3J85j00o9J15
$$ 43 -255 -38 -2 -98 124 -135 -175 60 125 95 19 -150 -166 -18 133 68 -51 -106 59 -4 181 81 12 127
7138A27j80jK87k16Kp0oN0p6MR5n%j95o7NK47M6J6k04O4mJ18k78J00n4J4J32J14
$$ 127 -53 -54 233 17 19 -51 -57 -7 -83 -79 16 11 11 -184 -251 -246 1 47 63 -141 -77 -81 37 -241 -141 -195 -181 -49 65
7167F5p3j33j04J28M4J02%j07P9R3P5r7M1p2j1K2K12k33j10J16Lo7J69l2j01L7
$$ 65 -8 -141 -245 -117 -73 29 29 -78 1 94 169 72 113 41 30 52 264 31 -79 37 40 -27 142 110 9 46
7193D6J39k24J87j22j48L95k37J8l3R4j0j44K7j02q9J26j0L1m4q9qQ6J67r0j79
$$ 46 185 -39 148 26 -122 273 36 54 21 115 105 -39 -12 -114 -203 -77 -87 -56 -100 -189 -197 -111 56 -34 -213
7218b13J08J0m9M4j2k32J71O1J56k11l1K27p4P4j24Q9M4lj7L56j37l08nJ62J07
$$ -213 -105 -95 -144 -100 -112 -344 -173 -112 44 -167 -198 29 -45 29 -95 -6 38 35 18 374 237 -71 -76 86 193
7243A93k0k06J34q2R2J3j25Kp1K00j56O5n8q1J68j26K04k04o7K2K54j7q0j82J
$$ 193 173 -33 101 19 111 124 -1 1 -70 130 -26 39 -19 -100 68 -58 146 -58 -125 -103 151 134 54 -128 -127
7268a27M7J99j63p5k43J72J45M2j25J29Lm8l5Q2Q6p2N5J60j30j62j1Q4MP7j48
$$ -127 -80 119 -44 -119 -362 -190 -45 -3 -128 1 4 -44 -79 3 89 17 72 232 102 -60 -71 13 17 94 -54
7293e4m9R0M8O6j05J38j90LK43N7j15q9j38J41NN0n7n8j17Q8J62q7q5J58n5J5
$$ -54 -103 -13 35 101 -4 134 -56 -53 190 247 132 43 -95 46 51 101 44 -14 -131 -43 119 32 -53 105 50 65
7319F5j7l4j52J49K5m1N0j09Q9lj2l4J9j35K0J21rJ11k48Q0J58P6n8p1j51Q9J68
$$ 65 48 14 -138 11 36 -5 45 -64 25 22 10 -24 -5 -140 -120 1 -8 103 -145 -65 93 169 111 40 -111 -22 146
7346A46po3n7q2L6o6K79j43r5J02Q0J42k1k43n3J82L1p2j52J40j09K34j68j31
$$ 146 139 76 19 -63 -27 -93 186 43 -52 50 130 272 251 8 -45 137 168 96 -56 84 -25 209 41 -90
7370i0J5k03L84J23k94k05J59N7l7O8N3k71J57J07K9j05R5k9j7j20O2J8k75K33
$$ -90 -75 -278 106 229 -65 -270 -111 -54 -91 -23 30 -241 -84 23 52 -53 42 13 -4 -124 -62 -44 -319 -86
7394h6kJ51j28M2q7o0K12k60K28r3l8Q6K12k18j7R2j4L5l9n2J23j80L20j22j84
$$ -86 -88 63 -65 -23 -110 -170 42 -218 10 -83 -121 -35 177 -41 -58 34 20 55 16 -36 87 -93 227 105 -79
7419g9J9q2J37J29k8j58Q3M0l0J32j92J36k17P4J59N7k84m2K72k63K00j52j49
$$ -79 -60 -142 -5 124 96 -62 21 61 31 163 -29 107 -110 -36 123 180 -104 -146 126 -137 63 -89 -238
7442b38K48j57J90j61M6NM8J01r6j24q7R1J39j08J03j2j77K61r9rj85O5K24nm7
$$ -238 10 -147 43 -118 -72 -67 -19 82 -14 -138 -225 -134 5 -103 0 -12 -189 72 -27 -36 -221 -156 68 63 16
7467A6J06k45K41kl8J32l31R4K9N6J80l9j48Q7j97J90K2o1q2K6K4nQ7j46j49J72
$$ 16 122 -123 118 116 78 210 -121 -27 2 58 238 199 51 138 -59 131 153 92 10 36 60 55 142 -4 -153 19
7493A9J30k37P6q4k3J41j37q9J10M3L9Mm7q5j1K38j95J54j56R9o0O6r4J58j63
$$ 19 149 -88 -12 -96 -119 22 -115 -204 -94 -51 -12 -8 -55 -140 -151 87 -108 46 -110 -11 -71 -5 -99 59 -104
7518a04J73j21J6p6J4J13l7J18O3Oj09P9K7q2K9n8l2Q5M5Qj32j01J16L5J29j58
$$ -104 69 -52 -36 -112 -98 15 -22 96 159 165 56 135 162 80 109 51 19 104 149 157 25 -76 40 75 204 46
7544D6k53R7K09k13J06j2r3J16P0l5j2j78Q4P7m1j35O2J25r2J85k45J27j28mK8
$$ 46 -207 -110 99 -114 -8 -20 -113 3 73 38 26 -152 -68 9 -32 -167 -105 20 -72 113 -132 -5 -133 -137 -109
7569a09J19J%p0n9K96l6j26p8n5J15K02j03j01o7Q4J2J11j00l3j9M1Q9j84J37
$$ -109 10 11 11 -59 -118 178 142 16 -62 -117 -2 200 97 -4 -71 13 25 136 36 3 -16 25 114 -70 67
7594F7o6J34m1K1J23k40o4J93k1l1k82J39j02J13J98j85j15%K31l2q2n5m1J08
$$ 67 1 135 94 115 238 -2 -66 127 106 75 -207 -68 -170 -57 141 -44 -159 -159 72 40 -42 -97 -138 -30
7618c0J75j50J3J1K8m5Q6j12N3j47O3M9r1J36j32J58Qp9J11l7j01K39k32k7J28
$$ -30 145 -5 8 19 47 2 88 -24 29 -118 -55 -6 -97 39 -93 65 73 -6 105 68 -33 206 -26 -53 75
7643G5o7N2j19J53r5qJ0l2M0m1P4p3qJ29j22pJ3j04R6P0q9k0M6n2J20j16o1R4
$$ 75 8 60 -59 94 -1 -9 1 -31 9 -32 42 -31 -39 90 -32 -39 -26 -130 -34 36 -53 -73 -27 -79 41 -75 -136 -42
7671d2RR4j4j83J00M0p2J41o7p4l7K31r7p2oJ02j04K42o0j8k25j8J62K8O4j51
$$ -42 -33 61 47 -136 -36 4 -68 73 6 -68 -105 126 29 -43 -49 53 -51 191 131 113 -112 -130 32 60 124 -27
7697b7J01j6kO0j78p1oM3K6P5j32J47n4q0J94k17pJ44m8N3J32r0l42J88L2N2J05
$$ -27 74 58 56 116 -62 -133 -139 -96 -70 5 -127 20 -34 -114 80 -137 -144 0 -48 5 137 47 -295 -107 -75 -23 82
7724H2k06J12j2j31K57j67KJ25L5k3j6m2m7K23o7N3k96K01r5R4Qo8N4k20J21R4
$$ 82 -124 -12 -24 -155 102 -65 -63 62 97 74 58 16 -31 192 125 178 -118 83 -12 82 90 22 76 -144 -23 71
7750G1j49j55K96L2rj16N7L1k6P7j36po1J7k7Q6J7q2j06O3J38O1j97Kj7L99k21
$$ 71 -78 -233 63 95 86 -30 27 58 32 109 -27 -34 -95 -78 -105 -19 -2 -84 -190 -127 11 72 -125 -123 -140 259 38
7777C8JO5j53J51l9j1rk28J55K06k43n0J22L3r4P0M1j78L2J27l2K26k13O2J7k74
$$ 38 39 104 -49 102 63 52 43 -185 -30 176 -67 -117 5 38 -56 14 55 -123 -91 36 4 230 17 79 96 -178
7803a78J30N5L9j22M9N7J31j83L5n0n4M0J48oj32K72l17J21p2j3J77k34J63k30
$$ -178 -48 7 46 -76 -27 30 161 -22 13 -37 -91 -51 97 91 -41 231 -86 35 -37 -50 127 -107 56 -174
7827a74J46j6NR7j2Qk16J38N1Rn5o5K2R1j29K11o7j55J54n9j04P8j13J69M1k84
$$ -174 -28 -44 -39 58 46 54 -162 -24 27 36 -19 -84 -62 29 -100 111 44 -111 43 -16 -120 -42 -155 14 55 -229
7853b29L94j61O7j16M9n2L5l5K6Q1L8j36K62l35K13L1p6k0JK2L7j24L1p9M0M1
$$ -229 165 4 71 -45 4 -48 -13 -48 -22 59 97 -39 223 -112 101 132 56 36 37 59 96 -28 3 -76 -36 5
7879EO1lm8j9o7J38M6k91J73p4J06K9J18j26k0lO2q2p4j60J39M9nJ19j46Rn3M2
$$ 5 66 63 15 -4 -71 67 113 -178 -5 -79 27 56 174 48 28 25 87 5 -69 -229 -90 -41 -46 73 -73 -64 -117 -75
7907g5P4n9J02r9J58j00o6J24j52J31k23K08j12P7n1K66k08J93q0k1j59Q7n7L2
$$ -75 -1 -60 42 -57 101 1 -65 59 -93 38 -185 23 -89 -12 -63 203 -5 188 108 87 -72 15 -42 -10
7931a0K63k94k4oP5n2N4K7J1j31M4j50N2K58j46J0j02L14j14k7j19P0k4pp1Q1
$$ -10 253 -41 -65 -71 4 -48 6 33 44 -87 -43 -193 -141 117 -29 -19 -121 193 79 52 -67 3 -21 -28 -99 -18
7957a8j05J33q6J10M6k48O3j19J38M6K2pL7j4Q4k2j42O4L0J27j87Q2j6p0p6K60
$$ -18 -123 10 -76 34 80 -168 -105 -224 -86 -40 -18 -25 12 -2 82 60 -82 -18 12 139 -48 34 18 -52 -128 132
7983A32k1j95O8r0R5P3jQ2K9k84J74m0K0j6j60J76k01J33l7N1m0m1J74k63K92
$$ 132 111 -84 -16 -106 -11 62 61 143 172 -112 62 22 42 26 -134 42 -159 -26 -63 -12 -52 -93 81 -182 110
8008A10o7j63J62J06j10O4K5q5r9%j5J77k83J25Pj4J21L1r8j9N5N5p3J25q2j40
$$ 110 43 -120 42 148 38 102 127 42 -57 -57 -72 105 -178 -53 -46 -60 61 92 -6 -25 30 85 12 137 55 -85
8034h5J01J14j56J13j72N0r7J01O8j02J57j76J03K1p0J52q6L0J56k80K0O7j1Q5
$$ -85 16 130 -26 87 -85 -35 -132 -31 37 -65 92 -84 19 40 -30 122 36 66 222 -58 -38 29 18 103
8058A03KJ2j22L8M8j70J11k1Q7p2KOL8J12k22J11r7J02l2j67Q4m0L5N1l2J04o3
$$ 103 105 117 -5 33 81 -89 22 1 88 16 18 24 62 174 -48 63 -34 68 36 -131 -47 -87 -52 -1 -33 71 8
8085HL1j85L20k1j98rJ32N2k00J27K4p6RK00l45J43J2N6J31l25K1l8J08O4O8M5
$$ 8 39 -146 174 153 -45 -54 78 130 -70 57 81 5 14 214 -131 12 24 80 211 -114 -93 -131 -23 41 109 154
8111A54j59N2j32K04j26J3K3lnM2j61J56m4o1M3N0j66K49k8np0o5R9Qq4m2n9J68
$$ 154 -5 47 -85 119 -7 6 29 26 21 63 -98 58 14 -47 -4 46 -120 129 101 96 26 -39 60 68 -16 -58 -117 51
8139E1j22m6J93j43R4J6Kj31K8Lm2K05j70J45n5R3q2M0r8j21J88M4r2j71K28j16
$$ 51 -71 -117 76 -67 27 43 45 -86 -58 -55 -97 108 -62 83 28 121 39 79 -19 -140 48 92 0 -171 57 -59
8165e9J77q4r7P5K1m7L5j02K40j81J72j92M2m7N1J52j10o3L7k27K22Kn4L6R7j68
$$ -59 118 34 -63 12 33 -14 21 -81 159 -22 150 -42 0 -47 4 156 46 -17 20 -207 15 17 -37 -1 96 -72
8191g2
$$ Imaginary data points
##PAGE= N=2
##DATA TABLE= (X++(I..I)), XYDATA
0@%%%%%%%%%%%%%pJ5j6J6j6J6k4L2l4M2n1N9p1Q2r4J09j25J43j65J89k15K44k75
$$ 0 0 0 0 0 0 0 0 0 0 0 0 0 0 -7 8 -8 8 -8 8 -16 16 -18 24 -27 32 -39 43 -51 58 -67 76 -89 100 -115 129 -146
36a46L08l44L85m31M81n33N92o57P29q06Q89r82J084j195J314j448J597j759J941
$$ -146 162 -182 203 -228 253 -280 312 -345 384 -422 467 -515 569 -626 688 -760 837 -922 1019
55A019k145K377k644K949l306L731m242M875n685O762q273J0563j4491K3090p7004
$$ 1019 -1126 1251 -1393 1556 -1750 1981 -2261 2614 -3071 3691 -4582 5981 -8510 14580 -62424
70f2424N8236R4683r9881O083J12554Q0286l0780N959J4470o3902q0011N9353
$$ -62424 -4188 90495 -9386 -3303 109251 189537 158757 164716 179186 115284 35273 94626
82I4626P1932r5048j62327J8214J34788K5248r0936j7389P4323M9668J1186M7777
$$ 94626 166558 71510 -90817 -72603 62185 87433 -3503 -20892 53431 103099 114285 162062
94A62062L5445n1984n7963N9842Q3530o7736j65841m9276P5127O579j11803p5951
$$ 162062 197507 145523 87560 147402 230932 163196 -2645 -51921 23206 29785 -82018 -157969
106a57969J3165J862k0201M2039N5109m3314n9840Q1896J41493k648j12472j6417
$$ -157969 -144804 -142942 -163143 -121104 -65995 -109309 -169149 -87253 54240 51592 -60880 -77297
118g7297R2831L3178o3845m5321k638k9659l3100L5929M2417n5377p8223N1351
$$ -77297 15534 48712 -15133 -60454 -63092 -92751 -125851 -89922 -47505 -102882 -181105 -129754
130a29754J34372L3776p2926r934R7387O9915j1144n147K0934k2569l7819L6268
$$ -129754 4618 38394 -34532 -44466 52921 122836 111692 106545 127479 104910 67091 103359
142A03359N0685o5234j20216j737R4973J1513r1927m2765N2116M0549o168J3391
$$ 103359 154044 88810 -31406 -33143 61830 73343 -18584 -61349 -9233 31316 25148 38539
154C8539K6234k5392l2326N0635P2932l7490j09700k0416P4657J7159q2621o1082
$$ 38539 64773 39381 7055 57690 130622 93132 -16568 -36984 37673 54832 -27789 -88871
166h8871J4396J2023j9001R955K6234l0344m4709M9544R8811K69q4526j2474Q4881
$$ -88871 -74475 -62452 -81453 -71498 -45264 -75608 -120317 -70773 28038 28307 -56219 -68693 16188
179A6188M4568m5566l8423J1314r7j9108J7929K7069m2106o5767K7973R2514J3133
$$ 16188 60756 15190 -23233 -11919 -12016 -31124 -13195 13874 -28232 -93999 -66026 26488 39621
192C9621p4993k3703P1176N4416j7664j8728J5614k042j8649K5659L9819l7956
$$ 39621 -35372 -59075 12101 66517 48853 30125 45739 43697 25048 50707 90526 52570
204E2570q2510J256P7752J4238p7443m3822M1462L7955j4317r423J3811j2021
$$ 52570 -29940 -28684 49068 63306 -14137 -57959 -16497 21458 7141 -2282 11529 -492
216d92k3729L3581N7540k1870p9944q750P3635K8505o1745m8802K1682K5718j1121
$$ -492 -24221 9360 66900 45030 -34914 -43664 29971 58476 -3269 -52071 -30389 -4671 -15792
229a5792k739J4041k0976l5200K9882O9497l745p4343j6812O9647M1732m0734
$$ -15792 -18531 -4490 -25466 -60666 -30784 38713 34968 -39375 -56187 13460 55192 14458
241A4458l9916J4463J5875j0172O824J9861k6088m8868J8485P0720P373o9589
$$ 14458 -25458 -10995 4880 -5292 1532 21393 -4695 -53563 -35078 35642 43015 -26574
253b6574k8830N6379M5480k3700l0033Q854P320j0594J5670L0116k4230o0012
$$ -26574 -55404 975 46455 22755 -7278 1576 8896 -1698 13972 44088 19858 -40154
265d0154M627O9357J7863o4983m0969L9171M0729j4546k1302O440l121j6282K0669
$$ -40154 -35527 33830 51693 -13290 -54259 -15088 25641 11095 -10207 -3767 -6888 -23170 -2501
278b501M2257j5909o3056n169O6696K9253n1984m2207K5819L3606p575j1086P699
$$ -2501 39756 23847 -39209 -44378 22318 51571 -413 -42620 -16801 16805 9230 -1856 5843
291E843j0936k5131J9582N0915o358o4156j6945O0496L8526l7974m0523J5311
$$ 5843 -5093 -30224 -10642 40273 33915 -30241 -47186 13310 51836 13862 -26661 -11350
303a1350K5676k918l75J2938j6183l5399J4508N5991L175o3369k9433M8088M0090
$$ -11350 14326 11408 11033 23971 7788 -27611 -13103 42888 46063 -17306 -46739 1349 41439
316D1439k6812l6690O070J4717m708P273K0801j5287m2841O897N8715J5639n6735
$$ 41439 14627 -22063 -15993 -1276 -5984 1289 22090 6803 -36038 -29141 29574 45213 -11522
329a1522l6929L5391L8530j7178l0623l83K355j1120J1177K8622j2221m8855q98
$$ -11522 -48451 -13060 25470 8292 -22331 -22714 -20359 -31479 -20302 8320 -3901 -52756 -53654
342e3654O1422L0486m2640l6095K8940M0722k702j6314K700l677j6867J1831L5301
$$ -53654 7768 38254 -4386 -40481 -11541 29181 26479 10165 12865 9188 -7679 4152 39453
355C9453q453n5457j6210N1510L4533l4643l8086J7539L3894L272m261R739n206
$$ 39453 31000 -24457 -40667 10843 45376 10733 -27353 -9814 24080 27352 23091 32830 27624
368B7624k1860J1333M2934N22n7150l0588L7711L2029l1101m4244m10J6600k521
$$ 27624 5764 17097 60031 60553 3403 -27185 10526 42555 11454 -32790 -33200 -16600 -19121
381a9121p88J2368q683k8931R332N2264J7336m5916l1397L3801L9023j6283l6086
$$ -19121 -19909 -7541 -16224 -45155 -35823 16441 33777 -12139 -43536 -9735 29288 13005 -23081
394b3081n461N725q452P3J5477j1029l8574j144N2632K9844l3373k8542L3071
$$ -23081 -28542 -22817 -31269 -31196 -15719 -26748 -65322 -66466 -13834 16010 -17363 -45905 -12834
407a2834M7359L958j5613L935O641p204O822K3541r235m9089j8661L9451K6588
$$ -12834 34525 38483 22870 26805 33446 26242 33064 56605 47370 -1719 -20380 19071 45659
420D5659l5757m1291J3107L5314N597q793O114L211r638J1713L5941K506m6973
$$ 45659 9902 -31389 -18282 17032 22629 13836 19950 23161 13523 25236 61177 63683 16710
433A6710k6721L1460K7583l2505m8573o020J5717m485j1727J802n727k0103P623
$$ 16710 -10011 21449 49032 16527 -32046 -38066 -22349 -26834 -38561 -36759 -42486 -62589 -54966
446e4966M3965J8487l4020k2645L5976M3048r805l3120l714J2640k958n453N161
$$ -54966 -11001 7486 -26534 -49179 -13203 29845 20040 -13080 -16794 -4154 -7112 -12565 -7404
459g404j0901l2915m788M0493K3571l0611k7941L0117M8148P258j6091M334J5775
$$ -7404 -18305 -51220 -56008 -15515 8056 -22555 -50496 -20379 27769 35027 18936 23270 39045
472C9045K997N631J7352n894l8693j7574K9732J9502l6149m3954O427K9966J254
$$ 39045 42042 47673 65025 59131 20438 2864 32596 52098 15949 -28005 -21578 8388 9642
485I642j7304j123O480k648R323K8498O353l3463j8964L1040K9064k5562m4273
$$ 9642 -7662 -8785 -2305 -4953 4370 32868 39221 5758 -13206 17834 46898 21336 -22937
498b2937n406J8359k567j7434o338n189j5331L704L2571J5368k7629j8626L4082
$$ -22937 -28343 -9984 -12551 -29985 -36323 -41512 -56843 -53139 -20568 -5200 -32829 -51455 -17373
511a7373M3174m510k8847J97K0651M636o730P73o737k3952o624K8045J5856l0152
$$ -17373 25801 21291 -7556 -7359 13292 17928 11198 11971 5234 -18718 -25342 2703 18559 -11593
525a1593k9518K1850M0057K948k1179J64J7886P738L502J2135j540k6601j2630
$$ -11593 -41111 -19261 20796 23744 2565 2729 20615 28353 31855 43990 42450 15849 3219
538C219K5692J8481l0626m1089L805K7788l2k2771p675O401N53M635J9576N852
$$ 3219 28911 47392 16766 -24323 -20518 7270 7238 -15533 -23208 -16807 -16254 -11619 7957 13809
552A3809k4034j3284K9356K9593j7879l6418n90K4170K859j7559q081r19q458
$$ 13809 -10225 -23509 5847 35440 17561 -18857 -19447 4723 7582 -9977 -18058 -18977 -27435
565b7435M23K1555R987k4133j8436K6524L6939n273k8372j018K2871Q768p644
$$ -27435 -27012 -5457 4530 -19603 -38039 -11515 25424 20151 -8221 -9239 13632 22400 14756
578A4756k268k810j5329m850K1455J2248k6728k8282J5969L3637r3k5421n181
$$ 14756 12488 9678 -5651 -10501 10954 23202 -3526 -31808 -15839 17798 17705 -7716 -12897
591a2897J7005Q709j071N285l51j7718q259K2032J7405k3356l3289N643K8764
$$ -12897 4108 12817 11746 17031 16680 -1038 -9297 12735 30140 6784 -26505 -20862 7902
604G902J949k2781r096R253M279J544J1377M105j8329j0928K4085K6529j4435
$$ 7902 9851 -12930 -22026 -12773 -8494 -6950 4427 8532 -9797 -20725 3360 29889 15454
617A5454l2063P60K6207O776j6658r313K371j996N8J4806O781k0032j6850K0495
$$ 15454 -16609 -15849 10358 17134 476 -8837 -6466 -8462 -8404 6402 13183 -6849 -23699 -3204
631c204L0430o343k8857l651K2078R247j0607o329q20q423l420J5357J0185k1187
$$ -3204 27226 20883 -7974 -11625 10453 19700 9093 2764 1944 -6479 -9899 5458 15643 -5544
645e544k3840J3159L0754j07k5623p161J7375J0451l569j23Q0j1511o196J7771
$$ -5544 -29384 -16225 14529 14422 -11201 -18362 -987 9464 5895 5772 5852 -5659 -11855 5916
659E916J5792j8383k8552N320K8442M246k2047j0446J0732P995J81N684K905j3034
$$ 5916 21708 3325 -25227 -19907 8535 12781 -9266 -19712 -8980 -985 -804 4880 7785 -5249
673e249q862J9122K2271j2115k8914M18K5096P673j7389j1483M315K500p99Q726
$$ -5249 -14111 5011 27282 15167 -13747 -13329 11767 19440 2051 -9432 -5117 -2617 -3416 5310
687E310M724j5589j4239J6590K6542n866k7493m355K2295J0835j1037r405Q76
$$ 5310 10034 -5555 -19794 -3204 23338 17472 -10021 -14376 7919 18754 7717 -1688 -812
700h12k841k084J1075P713j6987k0385J1377K7415k19k5075p880J7502J2158n133
$$ -812 -3653 -5737 5338 13051 -3936 -24321 -12944 14471 14252 -10823 -18703 -1201 10957 5824
714E824m137P30n800l765J3445J2880j4952k4222N221K5812L895k2072j1844J1011
$$ 5824 1687 2417 -3383 -7148 6297 19177 4225 -19997 -14776 11036 14931 -7141 -18985 -7974
728g974R505j909j95J329r298o833J5110J8656j0050k5126O12K5100R042j6632
$$ -7974 1531 -378 -573 756 -8542 -15375 -265 18391 8341 -16785 -16173 8927 17969 1337
742A337j1963N847O472l30L763K722j1689j1654J3061K1588n018k5269m199K1352
$$ 1337 -10626 -4779 1693 1363 5126 7848 -3841 -15495 -2434 19154 14136 -11133 -15332 6020
756F020J1976j1155j0518K978K718m40P329O175j2330j6288R007K3361n22k4432
$$ 6020 17996 6841 -3677 -699 2019 1579 8908 15083 2753 -13535 -4528 18833 18311 -6121
770f121r764J5759J2107p186q311k86k155k541R695J0452j1256j9855N047K4086
$$ -6121 -15885 -126 11981 4795 -3516 -3802 -5957 -8498 1197 11649 393 -19462 -14415 9671
784I671M971k0349j2045J1334J1041l136m994j01n801n581J0155J4223q133k1600
$$ 9671 14642 -5707 -17752 -6418 4623 1487 -3507 -3608 -9409 -14990 -4835 9388 1255 -20345
798b0345O87K3479J0117j5125j1233Q352J0258P61Q81K217p395q559R456J7576
$$ -20345 -19658 3821 13938 -1187 -12420 -4068 6190 6951 7832 10049 2654 -5905 3551 21127
812B1127m764k3527n979J8918J1236j1857j2445K940N618N65M213N090q117j2272
$$ 21127 16363 -7164 -13143 5775 17011 5154 -7291 -4351 1267 1832 6045 11135 3018 -9254
826i254P830K0498K95k1804r853J4516J1930q387j1854q10L85k290N035P241q430
$$ -9254 -1424 19074 19369 -2435 -12288 2228 14158 5771 -6083 -6893 -6508 -8798 -3763 3478 -4952
841d952j5964M277K1809O245j7769j0774J2287J3442k429o638o66k318l975O471
$$ -4952 -20916 -16639 5170 11415 -6354 -17128 -4841 8601 6172 -466 -1132 -3450 -7425 -954
855i54J0333p018j9476j025K0095R600j4345j2119Q123J2660J199j590J901l132
$$ -954 9379 2361 -17115 -18140 1955 11555 -2790 -14909 -6786 5874 7073 5483 7384 4252
869D252n553O968J4506l463k0636o519J6414J0217j2605j4382K167P368K00K92
$$ 4252 -1301 5667 20173 16710 -3926 -10445 5969 16186 3581 -10801 -8634 -1266 -1066 -774
883g74L148m838q612O451J7995K438j8313q910J4611J3109p348j2653j102L044
$$ -774 2374 -2464 -11076 -4625 13370 15808 -2505 -11415 3196 16305 8957 -3696 -4798 -1754
897a754j085J531M257o235j3555K738J8703O194j5699j0363J1916J4801j880q089
$$ -1754 -2839 -1308 2949 -3286 -16841 -14103 4600 10794 -4905 -15268 -3352 11449 9569 1480
911A480n11J292j920L449P158n666j6325k703J6513Q054j4407j3511O819J2741
$$ 1480 969 2261 341 3790 10948 5282 -11043 -13746 2767 10821 -3586 -17097 -10278 2463
925B463P76m535N00k30l186N341J2038j681j6901o000J4769J0780j1405j4954
$$ 2463 3239 -1296 -796 -1026 -4212 1129 13167 11486 -5415 -11415 3354 14134 2729 -12225
939a2225J563Q845Q67k659R43k486n844M870J5441L119j4860p303J3975J4036
$$ -12225 -10662 -1817 -950 -3609 -2666 -5152 -10996 -6126 9315 12434 -2426 -9729 4246 18282
953A8282n975j2626l66N912L42r88J912m792j0577J050J5016N118j4519j0870
$$ 18282 12307 -319 -685 5227 5569 4581 6493 1701 -8876 -7826 7190 12308 -2211 -13081
967a3081J0408J4481j930r481j321L261N6J384M584m243j3784k999J3857P121
$$ -13081 -2673 11808 9878 397 -924 2337 2393 3777 8361 4118 -9666 -12665 1192 8313
981H313j3312j4091N719J2859K99o803o76J701p65M119Q989m26j3189m578J3722
$$ 8313 -4999 -19090 -13371 -512 -213 -7016 -7692 -5991 -6756 -2637 6352 5926 -7263 -11841 1881
996A881J0758r791j4265K200J0000J750m450o58o46l559L576J2083L113j2730
$$ 1881 12639 2848 -11417 -9217 783 2533 -1917 -2575 -3221 -6780 -3204 8879 11992 -738
1010g38o660J2725J3784m920j2830n37P362J758k386l14l457q049J09J1418M237
$$ -738 -7398 5327 19111 14191 1361 824 8186 9944 7558 7244 3787 -4262 -4153 7265 11502
1025A1502j3404j0739Q640J3646j872j1056j976N075J592J37K533l008j0281k559
$$ 11502 -1902 -12641 -4001 9645 7773 -3283 -5259 -184 1408 1545 4078 1070 -9211 -11770
1039a1770J1675O670j1726j3081M735J2916P75p839k150L152J077K887O883J04
$$ -11770 -95 6575 -5151 -18232 -13497 -581 194 -7645 -9795 -6643 -5566 -2679 4204 4308
1053D308j0202l971J2442J0593q066j3351J409J1109K288n643k815M49j775K239
$$ 4308 -5894 -9865 2577 13170 5104 -8247 -6838 4271 6559 916 -1899 -1450 -3225 -986
1067i86Q621K340j0615o547J1039J2692m637j2632r11Q634K964l956j850k138
$$ -986 7635 9975 -640 -7187 3852 16544 11907 -725 -1636 6998 9962 6006 4156 2018
1081B018n288j96Q730L447j1446j0071P203J3206j581j1131k878O324L045m53
$$ 2018 -3270 -3466 5264 8711 -2735 -12806 -5603 7603 6022 -5109 -7987 -1663 1382 929
1095I29Q70j559p246j756R825O629r933j2116M407J2692J053q962l199M248K568
$$ 929 1799 240 -7006 -8762 1063 7692 -2241 -14357 -9950 2742 3795 -5167 -8366 -4118 -1550
1110a550J300L905L15p695l530J0547R521p097j2897J230J1214K498o890l899
$$ -1550 -250 3655 3970 -3725 -7255 3292 12813 5716 -7181 -5951 5263 7761 871 -3028
1124c028J266k51J136N916J349q829o325R133J1696m038j2263j273R171L912m193
$$ -3028 -1762 -2013 -877 5039 6388 -2441 -8766 367 12063 8025 -4238 -5511 3660 7572 3379
1139C379k911q59k504j52O822L135r423q902O595J2513j378j1286k652P131M354
$$ 3379 468 -391 -2895 -3047 3775 6910 -2513 -11415 -4820 7693 6315 -4971 -7623 -492 3862
1154C862j802p31o35m521j098Q046N671q297j0771L894J2055J231r162m309M513
$$ 3862 2060 1329 694 -3827 -4925 3121 8792 495 -10276 -6382 5673 6904 -2258 -6567 -2054
1169b054L423L18J554k81o101l105Q251Q221o303j1753Q84J0800L094p505m768
$$ -2054 1369 1687 3241 2960 -3141 -6246 2005 10226 3923 -7830 -6946 3854 6948 -557 -5325
1184e325K108J363L14L510J032p115m768P265J0209l549j1556r58R526M474m897
$$ -5325 -3217 -1854 -1540 1970 3002 -4113 -8881 -1616 8593 5044 -6512 -7470 2056 6530 1633
1199A633l527M00k37J89N021K781p219p616N894J1219j002j0820l166P347M795
$$ 1633 -1894 -1494 -1731 -1542 3479 6260 -959 -8575 -2681 8538 7536 -3284 -6450 897 5692
1214E692k570k282j92k482p42O283M431o594r369L482J1122J397r460m624N122
$$ 5692 3122 840 648 -1834 -2576 3707 8138 1544 -7825 -4343 6779 8176 -1284 -5908 -786
1229g86M128r35p89l39m173k403O143O659n281j0892J113J0589L010p216n001
$$ -786 3342 2407 1618 1279 -2894 -5297 846 7505 2224 -8668 -7555 3034 6044 -1172 -6173
1244f173K658L149J53J560N46n124m336N879Q661l165j0799j469R175M857n139
$$ -6173 -3515 -366 -213 1347 1893 -3231 -7567 -1688 6973 3808 -6991 -8460 715 5572 433
1259D33m615J318J704O41L152K453n269n808M764R982q80j0320l437P216N064
$$ 433 -4182 -2864 -1160 -519 2633 5086 -183 -5991 -1227 8755 7875 -2445 -5882 1334 6398
1274F398l483l884k02p54l67M053L958n065p713L139J0573J907q735m471N264
$$ 6398 2915 -969 -1171 -1925 -2292 1761 5719 654 -7059 -3920 6653 8560 -175 -4646 618
1289F18M959j112k143p33k847k164M112N363m774r506J94R854L425p114n173L656
$$ 618 5577 4465 2322 1589 -1258 -3422 690 6053 1279 -8227 -8033 1821 5246 -1868 -7041 -3385
1305c385M316M50j5M15l458k895M677O745l004j0240k076Q335M228n386n618J468
$$ -3385 931 1381 1366 1781 -1677 -4572 105 6850 3846 -6394 -8470 -135 4093 -1293 -6911 -5443
1321e443K666Q74J967K099l619m118M506Q860K06r187l391P076N234l676n117
$$ -5443 -2777 -1903 64 2163 -1456 -5574 -1068 7792 7998 -1189 -4580 2496 7730 4054 -1063
1336a063m52J88m05K324K709m144o232K893R842J973p544l865N962O130j382k925
$$ -1063 -1515 -1327 -1732 592 3301 -843 -7075 -4182 5660 7633 89 -3776 2186 8316 6934 4009
1352D009p75r63j714K496L260m249q995l53Q120K935p244n583L647N229O04o97
$$ 4009 3234 2271 557 3053 6313 2064 -6931 -7284 836 3771 -3473 -9056 -5409 -180 424 -273
1368b73L79j704j657L964N967k511q882k257P510L883o070o334R94L410N0O18
$$ -273 106 -1598 -3255 709 6676 4165 -4717 -6974 536 4419 -1651 -7985 -6991 -3581 -3531 -2913
1384b913R26k010k539M175Q318N58p340k613P577N643l516n366m10J397m05O30
$$ -2913 -1987 -3997 -6536 -2361 5957 6515 -825 -3438 4139 9782 6266 900 490 1887 1482 2112
1400B112R18l396n762J901Q229J691p085l787N999O622q71l385l23P35p07J861
$$ 2112 3030 -366 -6128 -4227 4002 5693 -1392 -5179 820 7442 6571 3186 2863 3598 2891 4752
1416D752K383l728p763j054O855K219p644o055L064N284N4k159K15J4m85L321
$$ 4752 7135 3407 -4356 -5410 1445 3664 -3980 -10035 -6971 -1687 -1633 -3792 -3577 -3563 -4048 -727
1432g27N189j129p074j251O869M141n443o542J010L482M08j254l9j502k183L124
$$ -727 4462 3333 -3741 -4992 1877 6018 575 -5967 -4957 -1475 -1067 -2321 -2360 -3862 -6045 -2921
1448b921O657O11o176k042O886O272k670n477J32K661K91j31k11k845m649J191
$$ -2921 3736 4347 -1829 -3871 3015 9287 6617 1140 1272 3933 4224 4093 3882 1037 -3612 -2421
1464b421O209Q67o944m070N179O204j104m141j86J844O26J274J702k553n651m15
$$ -2421 3788 4655 -2289 -6359 -1180 5024 3920 -221 -407 1437 2063 3337 5039 2486 -3165 -3580
1480c580N949J916o619n981K744N206m25l171m66N95j49K495L999r89n617o82
$$ -3580 2369 4285 -2334 -8315 -5571 -365 -790 -3961 -4427 -3832 -3981 -1486 2513 1524 -4093 -4775
1496d775O762M137m740n881J467M617M98k363o84p96j166J998M589J54n890k189
$$ -4775 1987 6124 1384 -4497 -3030 1587 2085 -278 -962 -1758 -2924 -926 3663 3817 -2073 -4262
1512d262O091N549l081n490M60L520P17r05k49j592l240R61N094Q48n950m200
$$ -4262 1829 7378 4297 -1193 -733 2787 3504 2599 2350 758 -2482 -1521 3573 4421 -1529 -5729
1528e729M506N596j391m769o28K497O68L32J028j780m054J43N557J937n513m947
$$ -5729 -1223 4373 2982 -1787 -2415 82 750 1082 2110 330 -3724 -3581 1976 3913 -1600 -6547
1544f547K893N580l24l761r10J392K61J393K529r55m783p89N535L742m282n752
$$ -6547 -3654 1926 1602 -2159 -3069 -1677 -1416 -23 2506 1551 -3232 -4021 1514 5256 974 -4778
1560d778J749M983O32k572q61L49o88J625L480J67n335k028M970M619l211n431
$$ -4778 -3029 1954 2586 14 -847 -498 -1186 439 3919 4086 -1249 -3277 1693 6312 3101 -2330
1576b330r1L895P45j872p40q72j748Q30M186J123n031l448M459N304j292m656
$$ -2330 -2421 1474 2219 347 -393 -1265 -3013 -2183 2003 3126 -1905 -5353 -894 4410 3118 -1538
1592a538o16K679J380p33n1j064l177j49M531K031m790m514K854N520Q5m101o92
$$ -1538 -2154 525 1905 1172 1121 57 -3120 -3269 1262 3293 -1497 -6011 -3157 2363 2448 -1653 -2345
1609b345J925J185N46J604o37l829q45M369L298m097n492J385M757P66l303j426
$$ -2345 -420 765 1311 2915 2278 -1551 -2396 1973 5271 1174 -4318 -2933 1824 2590 -713 -2139
1625b139J069R2J082K470j3l887j885M531M325k978n271j52M166R57k305j365
$$ -2139 -1070 -978 104 2574 2561 -1326 -3211 1320 5645 2667 -2604 -2756 1410 2367 62 -1303
1641a303m33r71N44L072R73m135k862L785M994r70m878m77L592J537j235k35p79
$$ -1303 -1736 -2707 -2163 909 1882 -2253 -5115 -1330 3664 2694 -2184 -2661 931 2468 1233 998 219
1658B19j855m7L476J700m068m004K546N020j18m180j241K346J450O1L05l57k465
$$ 219 -1636 -1683 1793 3493 -575 -4579 -2033 2987 2869 -1311 -2552 -206 1244 1305 1610 1253 -1212
1675a212q36L662K857l249m907J306M969M05l184j685J208O91M20J361k37l032
$$ -1212 -2048 1614 4471 1222 -3685 -2379 2590 2995 -189 -1874 -666 25 445 1806 1569 -1463
1691a463j461L200L852k729m947N4M061J332k464j399L85J0L49K315P04l182k435
$$ -1463 -2924 276 4128 1399 -3548 -3494 567 1899 -565 -1964 -1579 -1569 -1220 1095 1799 -1383 -3818
1708c818L300M190j109m578q26L234J567j355j228j35j040J39K834J579l001l143
$$ -3818 -518 3672 2563 -2015 -2841 393 1960 605 -623 -758 -1798 -1659 1175 2754 -247 -3390
1724c390K372M810J17m044j410K456J628n42p27n38j878q09K614K264k899m273
$$ -3390 -1018 3792 3909 -135 -1545 911 2539 1997 1270 732 -1146 -1955 659 2923 24 -4249
1740d249J210M741Q86l079j435J537J783J60P40l0k446j586K669K681k336m701
$$ -4249 -3039 1702 2588 -491 -1926 -389 1394 1554 2294 2264 -182 -1768 901 3582 1246 -3455
1756c455l27L571J270k722j803O07Q45N46J653P63k029j723L035M008q67m224
$$ -3455 -3782 -211 1059 -1663 -3466 -2859 -2014 -1468 185 948 -1081 -2804 231 4239 3372 -852
1772h52j127L223J572j934j929l44l31j2J663J151k371k563K020M822K18l331
$$ -852 -1979 1244 2816 882 -1047 -1391 -1722 -1734 -71 1080 -1291 -3854 -1834 2988 3206 -125
1788a25j165K892K244n77j200m29j198q61J629J632k770m059P40L717R06l022
$$ -125 -1290 1602 3846 3269 2069 1640 442 -419 1210 2842 72 -3987 -3247 470 1376 -1646
1804a646j610J928J899L83L44J02j084n89K025K530j821m338n65L259P52k661
$$ -1646 -3256 -1328 571 954 1298 1400 316 -273 1752 4282 2461 -1877 -2442 817 1569 -1092
1820a092k563N06J009J50O85N28j476j001K303L593k43l391n28L291J984j892
$$ -1092 -3655 -3149 -2140 -1990 -1305 -777 -2253 -3254 -951 2642 2399 -992 -1520 1771 3755 1863
1836A863j973o2N5l61R46N06k179k331J298L708N56l417j093L005K349m66j220
$$ 1863 -110 -172 -117 -478 468 974 -1205 -3536 -2238 1470 2026 -1391 -2484 521 2870 2404 1184
1853A184Q9j08l02J484R82j805l528P8L317O76l338k035J664J855o6o05K77n05
$$ 1184 1273 1165 863 2347 3329 1524 -2004 -1926 1391 2067 -1271 -3306 -1642 213 147 -458 -181 -686
1871f86l41J728K264j076l271l35L103J079k378k677P36J269l10M1j89j065j118
$$ -686 -1027 701 2965 1889 -1382 -1717 1386 2465 87 -2590 -1854 -585 -895 -854 -1043 -2108 -3226
1888c226J634K873k10l171o33L335K054j630j395J00J012K04L60L22j447k041
$$ -3226 -1592 1281 1071 -2100 -2733 602 2656 1026 -369 -269 743 947 1307 1629 182 -1859
1904a859R78K972N0l072j313K218K054p68j230J01J27JR34J197j289k150J07L001
$$ -1859 -881 2091 2141 -931 -2244 -26 2028 1260 30 131 258 259 1193 2390 1101 -1049 -942 2059
1922B059Q07k852k171J606J915l86j243l85k90l02J056J535r90k699q3K893J030
$$ 2059 2866 14 -2157 -551 1364 978 -265 -650 -940 -1242 -186 1349 359 -2340 -2423 470 1500
1939A500j895k118R63J799jn17k2o18q77J104K189n23k799p69K591J757j386j832
$$ 1500 -395 -2513 -1550 249 248 -269 -291 -909 -1786 -682 1507 984 -1815 -2584 7 1764 378 -1454
1957a454K51J273M44j5L07n97j120Q04K471L94k624j370K150J919j195j813j04
$$ -1454 -1203 70 514 499 806 209 -911 -107 2364 2758 134 -1236 914 2833 1638 -175 -279
1974b79L59Q2L80L60j162j781N15K584P87k309j657J438K220l19j111l91K93k32
$$ -279 80 162 542 902 -260 -2041 -1526 1058 1845 -464 -2121 -683 1537 1218 107 -284 9 -223
1992b23M54J096j066k334j31K273J091k199j757Q90J810o2l65m8L9j63O65J797
$$ -223 231 1327 261 -2073 -2204 69 1160 -1039 -2796 -1906 -96 -158 -523 -571 -532 -695 -30 1767
2010A767r5k350o21K134J638j519k092J99J319J41l93j87n70n19N27K086K38k144
$$ 1767 1672 -678 -1299 835 2473 954 -1138 -939 380 521 128 -59 -629 -1148 -621 1465 1703 -441
2028d41j064J912K006p85j766j29Q01L3j37K64p63j771L25K124J79j839j576J479
$$ -441 -1505 407 2413 1628 -138 -267 534 567 430 694 -69 -1840 -1515 609 788 -1051 -2627 -1148
2046a148J926j34j209l07Q30J34N72P06m64j618m49K179Q95j943j791O02J866
$$ -1148 778 644 -565 -872 -42 92 664 1370 906 -712 -1161 1018 1913 -30 -1821 -1219 647
2063F47j45r35k52jq6N92J473k64j777n95K089J637j124k051L35J394O5m64n73
$$ 647 502 -433 -685 -686 -772 -180 1293 1029 -748 -1343 746 2383 1259 -792 -457 937 1002 538 -35
2082c5j23p89K60J463M8j868j168J795J708o77j828J6J287K54k17J48k26q60R2
$$ -35 -158 -947 -687 776 824 -1044 -2212 -417 1291 614 -1214 -1198 89 343 126 274 48 -812 -720
2101g20J619N36j784j599J183K024n15j204n78Q87L17K19M64k77j135k11J837
$$ -720 899 1435 -349 -1948 -765 1259 744 -460 -1038 -151 166 385 849 572 -563 -774 1063
2118A063R69j476j596O96J680rj079m93K05q2K95N33l03j338n64J507J358j113
$$ 1063 2032 556 -1040 -344 1336 1327 248 -245 -40 -122 173 706 403 -935 -1499 8 1366 253
2136B53j838N54J362L69o42l89L6k07L04J033J10j631j094J463J291p85j639k4
$$ 253 -1585 -1031 331 700 58 -331 -295 -502 -198 835 945 -686 -1780 -317 974 189 -1450 -1474
2154a474J043N87o24qll42L50J035P09j339j143J154J879l25j512k27P62J99j73
$$ -1474 -431 156 -468 -476 -479 -821 -471 564 1273 -66 -1209 -55 1824 1499 -13 -240 522 721 548
2173E48j17Jr33k25J146Q81r84j660N64J805K53j271l54M91K34J6M96j42j327
$$ 548 431 432 -501 -726 420 1301 317 -1343 -779 1026 1279 8 -346 145 379 395 891 749 -578
2192e78m76J244J079j091j624J85J277K75p81n20M40J54J72P57J14j004o54J161
$$ -578 -1054 190 1269 178 -1446 -1261 16 291 -490 -1010 -570 -416 -244 513 627 -377 -1031 130
2210A30J325o70j490j37Q72N52n73m94q0m32K68Q66L94r37j126J072J639k71j207
$$ 130 1455 785 -705 -842 30 582 9 -485 -565 -997 -729 137 531 -406 -1532 -460 1179 908 -299
2229b99j93R86M95q4p2k34n63k06Q65O27j299j242L05J577L8j144k93L89O79q4
$$ -299 -492 494 989 905 833 599 36 -170 695 1322 23 -1219 -914 663 701 -443 -736 -347 332 248
2249B48K35N0o76k31J028Q87p35j600J70J285J69j039n73M66J3p8L41J33q85m36
$$ 248 483 533 -143 -374 654 1541 806 -794 -624 661 830 -209 -782 -316 -303 -381 -40 93 -792 -1228
2269a228R54J296p11j223R9R80O10n40p30K05o0l17P15K37p61j118Q67J133k34
$$ -1228 -274 1022 311 -912 -813 167 777 237 -493 -288 -348 -665 50 287 -474 -1592 -725 408 174
2288A74r23m17J234N26k57n4J17k58M6P46O26q25r73K38J290rj102p51N77O24
$$ 174 -749 -1166 68 594 337 283 400 142 188 934 1560 735 -238 0 1290 1281 179 -572 5 629
2308F29n45K8L3l50k23P61R30p72j164K75J238J19p20n98K55L13k70j12P4n62
$$ 629 84 112 145 -205 -428 333 1263 491 -673 -398 840 959 239 -359 -104 209 -61 -173 -99 -661
2328f61p11M28J189n37j302J15J034N79o11m09K60K98Q5L67K27m49o79O48R21
$$ -661 -1372 -944 245 -292 -1594 -1479 -445 134 -477 -886 -626 -328 -243 124 351 -98 -777 -129 792
2347G92k22j144k24Q99N63l03k51J71j75J89N53M44o03p23M43J298j09j050o59
$$ 792 570 -574 -798 101 664 361 110 281 106 295 848 1292 689 -34 409 1707 1598 548 -111
2366a11P57J37k57r5l30m74p5L56M65m44j101Q7J047M49p60o37M65M92k04P2k16
$$ -111 646 783 526 431 101 -373 -448 -92 373 -71 -1172 -1085 -38 411 -349 -986 -521 -29 -233 -161 -377
2387c77k33k91L39P90k31j275o0J049M57p49m12L20M02N1K96K31n22j69O68P92
$$ -377 -610 -901 -562 228 -3 -1278 -1338 -289 168 -581 -993 -673 -271 -220 76 307 -215 -384 284 1076
2407A076J4r98p7Q24N18m09o90O0K69j46K91J05l00p89K42Q78j08p26n03N64N63
$$ 1076 1090 92 15 839 1357 948 258 318 587 441 732 837 537 -252 -10 868 760 34 -469 95 658
2428F58m13k94k6j92j0P8O28m90r47M9Q58L17q01o19M04O30l62Q4R1o9k43M79
$$ 658 245 -49 -75 -267 -277 -199 429 -61 -1008 -959 -101 216 -585 -1204 -800 -170 -532 -448 -357 -426 -669 -190
2450a90P92j66r59M2R17L86n84o44K59N14k63R4K26l51n14M10Q53j98p32j98Q07
$$ -190 602 436 -523 -481 436 822 238 -406 -147 367 104 198 424 73 -441 -31 822 624 -108 -306 501
2471E01M97l66n65L28K92j02k96K99m48n57j4Q74j42p70o00M97M04j71j90M2K83
$$ 501 998 632 67 395 687 585 289 588 140 -417 -431 443 301 -469 -1069 -572 -168 -339 -529 -487 -204
2492b04j24J70L27q8o66R9Q50J73p54m75M86M53j53k85R0L4k51K71N38j93o04
$$ -204 -328 -158 169 81 -585 -486 364 537 -217 -692 -206 247 94 -191 -101 -67 -318 -47 491 298 -306
2513c06J25P04L31k99o37L29N19l33k31r7K07o09j6N51r3p68l69P81N65o51r5
$$ -306 -181 523 854 555 -82 247 766 433 202 105 312 -297 -313 238 145 -623 -992 -211 354 -297 -392
2534c92J64K83k6J61K59k88m19L0N64Q9o40o04M89N38l14o19J44L11m1R3M70j07
$$ -392 -228 55 29 190 449 161 -258 -228 336 425 -215 -819 -330 208 -106 -725 -581 -270 -311 -218 252 145
2556A45m16J87O45L79o09m30M52K13L2n13oJ42n06L99J29j08o49nO77K65l79n52
$$ 145 -271 -84 561 940 331 -99 353 566 598 85 79 221 -285 114 243 135 -514 -519 158 423 44 -508
2578e08M47L92j48l27J87l2l54K52J47J17o80l41N50M54j99o54K67L16K48k32
$$ -508 -61 331 183 -144 43 11 -343 -91 56 173 -507 -848 -298 156 -43 -697 -430 -114 134 -98
2598i8K52P7l00J47K84L61q23k57O35L52l20o57K00L51k10j07L83r2l86K0N58
$$ -98 154 231 -69 78 362 723 -100 -357 278 630 310 -347 -147 204 -6 -113 270 178 -208 -188 370
2619C70K43m40m48M35O14k56m91l6J26j15j7K23n5l91k26M72L33n09n28L15L72
$$ 370 613 173 -275 160 774 518 27 -9 117 2 -15 208 153 -238 -464 8 341 -168 -696 -381 -9
2640ik4l88J75J57j32j20L16K20n58j36N80K65l97k67Q5M38j66k9K18M8m76J50
$$ -9 -33 -421 -246 -89 -221 -341 -25 195 -363 -499 81 346 -51 -318 -233 205 39 10 228 276 -200 -50
2662e0N13r0m17r2J97L99m96j64R4L06O0k61K6J13k87j8M20J29l89l93L08N01
$$ -50 463 373 -44 -136 61 460 -36 -200 -106 200 260 -1 25 138 -149 -167 253 382 -7 -400 -92 409
2684D09k19l69NP0L3q0K81O4k75k26O37J17l16m27K77K83j08l46K6J80j83j14
$$ 409 190 -179 -174 -104 -71 -151 130 194 -81 -307 330 447 131 -296 -19 264 156 -190 -164 16 -167 -281
2706b81J29J29j95l35M91L94m87j90J79M59o2j29q4Q3j51j30K07J45l44k43K92
$$ -281 -152 -23 -218 -553 -62 332 -155 -345 -166 293 231 102 18 101 -50 -180 27 172 -172 -415 -123
2727a23K31j21m08J12N89k81p3lQ2K9n4L13O7l5l61J48M69k39k13o3K04n2p9l3
$$ -123 108 -13 -421 -309 280 -1 -74 -77 5 34 -20 293 360 325 -36 112 581 342 129 66 270 218 139 106
2751A06J36k67N2N4M25l08l61J89J73J88n85j68M80j60k22J72l44j04j34J80K53
$$ 106 242 -25 27 81 506 198 -163 26 199 387 -198 -366 114 -46 -268 -96 -440 -544 -678 -498 -245
2772b45j52l83J52N99j87p0j33M38j06k93K76K98k21k41K04L48j79k23K64Q8P5
$$ -245 -397 -780 -628 -29 -216 -286 -419 19 -87 -380 -104 194 -27 -268 -64 284 105 -118 146 234 309
2793C09k02J4J23Q3Q4J26k6k3j79K0L57j54l20N8J82j5l24K95j13k95j81J83J5
$$ 309 107 121 244 327 411 537 511 488 309 329 686 532 212 270 452 437 113 408 295 0 -181 2 17
2816A7k5l98J48J63k6n44M1J11R7j96J50j09j05p4K75O0K7k98K56K10M9j37k5
$$ 17 -8 -406 -258 -95 -121 -665 -624 -513 -416 -612 -462 -571 -676 -750 -475 -415 -388 -686 -430 -220 -171 -308 -333
2839c33K91K3j3J29J47j07k7J24M18k45j60N7J32K90l17M6J57q3Q3j01M4j76k66
$$ -333 -42 -19 -32 97 244 137 110 234 652 407 247 304 436 726 409 455 612 529 612 511 555 379 113
2862A13m5M04j22l17k5J54l7k50j21K27p8k29J8N2j02k01J4K91j53k62N6K33o3
$$ 113 68 472 350 33 8 162 125 -125 -246 -19 -97 -326 -308 -256 -358 -559 -545 -254 -407 -669 -613 -380 -443
2885d43j62%J72J20k48J49L97m1k59L15K64M0k98J55J30M2o0n0J30J45m15J33
$$ -443 -605 -605 -433 -313 -561 -412 -15 -56 -315 0 264 304 6 161 291 333 273 223 353 498 83 216
2907B16M17j25l62j7M07J4k03M7Q1Mk61J27r8K2k38k61J41k8k30k50M55l6j56
$$ 216 633 508 146 129 536 550 347 394 475 479 218 345 247 269 31 -230 -89 -117 -347 -597 -142 -178 -334
2930c34J3k8K38k79rK78l7j63p4K59p0k75J01L06r0o4j34K21J49j40rK86J08k17
$$ -334 -321 -349 -111 -390 -399 -121 -158 -321 -395 -136 -206 -481 -380 -74 -164 -228 -362 -141 8 -132 -141 145 253 36
2954C6J25J45J29p4o7J41J99l58j99L02n0k80J10l2j53P3j05J67Kl49J30N1K2
$$ 36 161 306 435 361 294 435 634 276 77 379 329 49 159 127 -26 47 -58 109 111 -238 -108 -57 -35
2977c5k05K0L55j80j64J32P5j45k10K14O0ll51L6J70K47k35J16J62l2K9K9j26
$$ -35 -240 -220 135 -45 -209 -77 -2 -147 -357 -143 -83 -86 -437 -401 -231 16 -219 -103 59 27 56 85 -41
3000d1L58l06m0K42Q3m92K55N5K6l15N7K30k7j74M6K72P8l02RJ88K07l68O4O4
$$ -41 317 11 -29 213 296 -196 59 114 140 -175 -118 112 85 -89 -43 229 307 5 14 202 409 41 105 169
3024A69m3j33j64K58j27j13j0l8J37k04j9L15P3k39R0P1J6oj08J56k2n2J46p2
$$ 169 126 -7 -171 87 -40 -153 -163 -201 -64 -268 -287 28 101 -138 -48 23 39 33 -75 81 59 7 153 81
3048H1rL1j01L36j08j14m8L6O7j31OJ03M7k00o5K18P6k54k6J91l21On5Q7lp8o7
$$ 81 72 103 2 338 230 116 68 104 171 40 46 149 196 -4 -69 149 225 -29 -55 136 -185 -179 -234 -147 -150 -228 -295
3075b95J73j9q5m6Q1J40k75J68J32J05j95j24L27j19J49j60O3m2r1mJ03K86m41
$$ -295 -122 -141 -226 -272 -191 -51 -326 -158 -26 79 -116 -240 87 -32 117 -43 20 -22 -113 -117 -14 272 -169
3098a69J97J16J3j96Q1N9j12J30j07J30M3k09j7L91O3l94Q5J5J27k02j51J95O
$$ -169 28 144 157 -39 42 101 -11 119 12 142 185 -24 -41 350 413 19 104 119 246 44 -107 88 94
3121I4p9j38J37k36L3k1K38m0j32Op3L37r0J3k83L69j18j11J08M2j67j00J73J53
$$ 94 15 -123 14 -222 -189 -210 28 -12 -144 -138 -211 126 36 49 -234 135 17 -94 14 56 -111 -211 -38 115
3145A15o2j53J16J50j21q3K44k32m2K4J19Qp7k66J68J92k69j17J82O0q2j8j5K49
$$ 115 53 -100 16 166 45 -38 206 -26 -68 -44 75 83 6 -260 -92 100 -169 -286 -104 -44 -126 -144 -159 90
3169I0j94K28L6J05j61r0K5J99j36j18M9O6j67Q4L4j40j16R1J24K26k29R3M5J69
$$ 90 -104 124 160 265 104 14 39 238 102 -16 33 99 -68 16 50 -90 -206 -115 9 235 6 99 144 313
3193C13j38j27J88q3l4k65K55j37j55j09J53J38k14j41M8J35J19j40R4J9k8j5
$$ 313 175 48 236 153 119 -146 109 -28 -183 -292 -139 -1 -215 -356 -308 -173 -54 -194 -100 -81 -109 -124
3215a24J63k0k54j6K48Nj45j96K35J6M3o4m0J33R4K08j08K11k17K53J09L0M4k43
$$ -124 39 19 -235 -251 -3 2 -143 -339 -104 -88 -45 -109 -149 -16 78 286 178 389 172 425 534 564 608 365
3239C65J02j51K8j78o5n3n6R0L6j2k32N7j9K41m4j05M4p0k7j66n0K0k10pJ72P0
$$ 365 467 316 344 166 101 48 -8 82 118 106 -126 -69 -88 153 109 4 48 -22 -49 -215 -265 -245 -455 -462 -290 -220
3265b20k64j28J44J56J9q2J48r5J77p0J60J95k39j63L09J61j58l9q3K16N1P8n6
$$ -220 -484 -612 -468 -312 -293 -375 -227 -322 -145 -215 -55 140 -99 -262 47 208 50 11 -72 144 195 273 217
3288B17J39j23R7K39j81J11m2k8Q6Lj82j0j65J79j67k25nk00O9J00L4k83o1K37
$$ 217 356 233 330 569 388 499 457 429 515 518 336 326 161 340 173 -52 -57 -257 -188 -88 -54 -337 -398 -161
3312a61J8J01k38j3l0J43j94J70j4k65J42K2n7l8o3J52P9K28j35J12j36K71J62
$$ -161 -143 -42 -280 -293 -323 -180 -374 -204 -218 -483 -341 -319 -376 -414 -477 -325 -246 -18 -153 -41 -177 94 256
3335B56r4K42k42J4J24K27l32j90K45Q3N7j94j67J07K57Mj5p0j01K2K10j38J01
$$ 256 162 404 162 176 300 527 195 5 250 333 390 196 29 136 393 397 382 312 211 233 443 305 406
3358D06l10n3J24k72K1j69L9j95lR6j4q0j36K15K79k56K1J17K1Q1M2o0k06o6K61
$$ 406 96 43 167 -105 -84 -253 -214 -409 -412 -316 -330 -410 -546 -331 -52 -308 -287 -170 -149 -68 -26 -86 -292 -358 -97
3383i7k8j16P2j73P1L28n7oJ01K5P8J64K0r8j45K23n5J58k70k46J22K99k16j83
$$ -97 -125 -241 -169 -342 -271 57 0 -6 95 120 198 362 382 284 139 362 307 465 195 -51 71 370 154 -29
3407b9n6J5J30J5Jm1L1N2P1Q7j39p7j14J30Lk08j54nm3J30J22j76j16r8K79J19
$$ -29 -85 -70 60 75 76 35 66 118 189 276 137 60 -54 76 79 -129 -283 -288 -331 -201 -79 -255 -371 -469 -190 -71
3433g1R6j11m6K44L0N7j10j32O5O8o7N9k06r0rK93r9k8p6J49Q5M8k06J63j60R5
$$ -71 25 -86 -132 112 142 199 89 -43 22 90 23 82 -124 -214 -223 70 -29 -57 -133 16 101 149 -57 106 -54 41
3459D1J10Qj35j50K4K09J10m79j9J56n7K89j33J22k49J30K07O8p3j38N8K49n7
$$ 41 151 159 24 -126 -102 107 217 -262 -281 -125 -182 107 -26 96 -153 -23 184 252 179 41 99 348 291
3482B91l0j79q0J27nj13P2j28k30J20J16O8l16K26J50J50q2k5p8o1J80j15j25
$$ 291 261 82 2 129 124 11 83 -45 -275 -155 -39 29 -287 -61 89 239 157 132 54 -7 173 58 -67
3505f7j02j35J60L19k01k77j7L0J25J59j73Jj41Q5L55j50Qj86N1K99L2k41M8J9
$$ -67 -169 -304 -144 175 -26 -303 -320 -290 -165 -6 -179 -178 -319 -234 121 -29 -21 -207 -156 143 175 -66 -18 1
3529AJ02l9K6j8j73K9L09N3j72N4j1J90Q9j48r6k8K35jo2k29j2k21J06J30j73
$$ 1 103 64 90 72 -101 -72 237 290 118 172 161 351 440 292 196 168 403 402 340 111 99 -122 -16 114 -59
3554e9k36J63Q0J35ql52Q4k6K01J59j62j57j38J52K75j79l3j46J16K86k38k0l28
$$ -59 -295 -132 -52 83 75 -277 -193 -219 -18 141 -21 -178 -316 -164 111 -68 -101 -247 -131 155 -83 -103 -431
3577d31J08J56j6Po4P6J06L10j45j04J1J48J07L0n1k95j6K29J17o1k27j00JK13
$$ -431 -323 -167 -183 -176 -240 -164 -58 252 107 3 14 162 269 299 248 -47 -63 166 283 222 -5 -105 -104 109
3601A09j2m1o0P2N9J16m8K0j69k8N7K03k58j51p3K03k4J25k45j59J02J01Rl6j28
$$ 109 97 56 -4 68 127 243 195 215 46 18 75 278 20 -131 -204 -1 -25 100 -145 -304 -202 -101 -92 -128 -256
3626b56R2K12N0J0j70N3p9L17J0l13o6r4J88j31K6j78qN7K20j46K1j91L94J20
$$ -256 -164 48 98 108 -62 -9 -88 229 239 -74 -140 -234 -46 -177 -151 -329 -337 -280 -60 -206 -185 -376 18 138
3650A38K44j79k67N5RK52j37m7q5j54J75R3j66q8L2K86K01j66j72j5J66K31j7
$$ 138 382 203 -64 -9 0 252 115 68 -17 -171 4 97 -69 -157 -125 161 362 196 24 9 175 406 389
3673C89k93n6J23N0P6o8k27j28J00L0n6j2k20J79K42J4J80l36J08J77J04l45k34
$$ 389 96 40 163 213 289 221 -6 -134 -34 -4 -60 -72 -292 -113 129 143 323 -13 95 272 376 31 -203
3696b03L7j1pP9k15j18o3o3N18j53j39K11N4L2K64k42j17J58K41j0j3m39J58l9
$$ -203 -166 -177 -184 -105 -320 -438 -501 -564 -46 -199 -338 -127 -73 -41 223 -19 -136 22 263 253 240 -199 -41 -80
3720h0J62K19l32j16J51J48K49j27K1J6J41K20q3j85k69N5K1J07l07j12m7L3J24
$$ -80 82 301 -31 -147 4 152 401 274 295 311 452 672 589 404 135 190 211 318 11 -101 -148 -115 9
3743IJ2j32k22L00R9J09k7k96M1J82M6n0k57j83J51n6K7j77k05J25J52O1o6Pj24
$$ 9 21 -111 -333 -33 66 175 148 -148 -107 75 121 71 -186 -369 -218 -274 -247 -424 -629 -504 -352 -291 -357 -350 -474
3768d74O20l1R6J9j74O0L23O1j74k54J7J5K08j04k61j30R9K73K6j06J37j34L15
$$ -474 146 115 211 230 56 116 439 500 326 72 89 104 312 208 -53 -183 -84 189 215 109 246 112 427
3791D27rl6m7k79J44J07k20j56l13r7K10J28j04p9j34J18J99J68L6k40J46L52
$$ 427 418 382 335 56 200 307 87 -69 -382 -479 -269 -141 -245 -324 -458 -340 -141 27 63 -177 -31 321
3813C21Nj07k13j85J62N8r3l38j00J40N5J91l1j68L1M07J26L8j85J44M4J55J35
$$ 321 326 219 6 -179 -17 41 -52 -390 -490 -350 -295 -104 -135 -303 -272 135 261 299 114 258 302 457 592
3836E92j21l25Q4r6J09j94k22k00J18J83J04l21j00K35K48j9P6m4j92J64K22j46
$$ 592 471 146 230 134 243 49 -173 -373 -255 -72 32 -289 -389 -154 94 75 151 107 -85 79 301 155
3858A55k40n6l48J96J28j15k06J39M6K12J87l24P1K08J10K51o4k74L3Q2L2J27
$$ 155 -85 -141 -489 -293 -165 -280 -486 -347 -301 -89 98 -226 -155 53 163 414 350 76 109 191 223 350
3880C50k10j29r2K62p6j45j47p2L51J91k8p0j45O3K18Q5j73j82k21K55J16j37
$$ 350 140 11 -81 181 105 -40 -187 -259 92 283 255 185 40 103 321 406 233 51 -170 85 201 64
3902F4m00q2J42K15k16k37J51M1L07P2L2k37j54K72K67k1j77k23P7K39K3l51L
$$ 64 -336 -418 -276 -61 -277 -514 -363 -322 -15 57 89 -148 -302 -30 237 216 39 -184 -107 132 155 -196 -193
3925a93j27L00L03j66j46o8J42J91J92l6l05L1Q7K10k2l46j33L5K56L9l12k68
$$ -193 -320 -20 283 117 -29 -97 45 236 428 392 87 118 205 415 393 47 -86 -51 205 244 -68 -336
3947c36P4K70J13k43k37k5L09Q4P8j46l05L5K17J96j49j72m8L3L64k07j32j88
$$ -336 -262 8 121 -122 -359 -384 -75 9 87 -59 -364 -329 -112 84 -65 -237 -285 -252 112 -95 -227 -415
3969d15K33J00O9O5j71j07J63M09j92l6j69J51K50L7j69l07m4K39J41k9j40k11
$$ -415 -182 -82 -13 52 -119 -226 -63 346 154 118 -51 100 350 387 218 -89 -133 106 247 218 78 -133
3991a33J60M22j04l22O5J39N8J22j95l75rJ61L0J20l49l5p9L71P5j49k56m4J94
$$ -133 27 449 345 23 88 227 285 407 212 -163 -172 -11 19 139 -210 -245 -324 47 122 -27 -283 -327 -133
4014a33K09N7l98o1R7L02Q4j34k15l6L00P4j33j08J2M0K82p2j12j64l1Q1K20k8
$$ -133 76 133 -265 -326 -229 73 157 23 -192 -228 72 146 13 -95 -83 -43 239 167 55 -109 -140 -59 161 133
4038A33j52k64L18J91k9j36j78L8K18J13j6k86j28L05J04P0l34k19J28K33J35
$$ 133 -19 -283 35 226 197 61 -117 -79 139 252 236 -50 -178 127 231 301 -33 -252 -124 109 244
4059B44k53qj98J75K17j22k13n4J39L58k44k9k37Q9O6J09J87l88j48J41L04O8
$$ 244 -9 -17 -215 -40 177 55 -158 -212 -73 285 41 12 -225 -136 -70 39 226 -162 -310 -169 135 203
4081B03l38l7p1L52L31k63k36m8L1L57L3l68k49J89Q2J29k07j17Q0N6K96Ml94
$$ 203 -135 -172 -243 109 440 177 -59 -107 -76 281 314 -54 -303 -114 -32 97 -110 -227 -147 -91 205 209 -185
4104a85J9J16L78J18l36j72j76M11L7l7j95k56M9L41Q5j12k57n1L72J95j11k89
$$ -185 -166 -50 328 446 110 -62 -238 173 210 173 -22 -278 -229 112 197 85 -172 -223 149 344 233 -56
4126e6K2R6J04o7p7k30m7J31J84k14l05O8K05K32n4r4n7Q5K12J89j77j01k67K59
$$ -56 -34 62 166 99 22 -208 -255 -124 60 -154 -459 -391 -186 46 -8 -102 -159 -74 138 327 150 49 -218 41
4150D1L96j84k72o2k4J96Q6j75k65o3K98J86O0l41P5R9K83K54k47l14L6L7K91
$$ 41 437 253 -19 -81 -105 91 177 2 -263 -326 -28 158 218 -123 -48 51 334 588 341 27 63 100 391
4173C91j26r9m20N1K62j57j34j32l6L72Q6J71l40k61L76L72p3l60l01J54J79j04
$$ 391 265 166 -254 -203 59 -98 -232 -364 -400 -28 58 229 -111 -372 4 376 303 -57 -358 -204 -25 -129
4195a29j01k64Q8m2M95q6j72k92K90L79M7J9n1o7K07J92km42Q6l5J46M4m44j00
$$ -129 -230 -494 -406 -448 47 -39 -211 -503 -213 166 213 232 181 114 321 513 511 69 155 120 266 310 -134 -234
4219b34j17M81O1Q2k23J3R7K28J12k28l24K31J32J01k44j78k67J50R9l4n18J2
$$ -234 -351 130 191 273 50 63 160 388 500 272 -52 179 311 412 168 -10 -277 -127 -28 -62 -580 -568
4241e68p3M02J05o5k48J40N9L91N5k11k59J02K76j96l3j24j31L15l9N8j50j89
$$ -568 -641 -239 -134 -199 -447 -307 -248 143 198 -13 -272 -170 106 -90 -123 -247 -378 -63 -102 -44 -194 -383
4263c83K55K09K24L8j03j31K67K93j26l59j03P3K95j28k84j16l26L83J25j16j25
$$ -383 -128 81 305 343 240 109 376 669 543 184 81 154 449 321 37 -79 -405 -22 103 -13 -138
4284a38j97L07K70r7j69j28K5K69L3J00n36q2J52N0m8l47q5J14Q5K28j03M7k68
$$ -138 -335 -28 242 145 -24 -152 -127 142 175 275 -261 -343 -191 -141 -189 -536 -621 -507 -422 -194 -297 -250 -518
4307e18M60L51j51l03j33L08K25l6k16k0j28J64K28p8j67j27K59K61J20m23j8
$$ -518 -58 293 142 -161 -294 14 239 203 -13 -33 -161 3 231 153 -14 -141 118 379 499 76 58
4328E8R7K33L14k21k46o8J48j6k2k45k37j16L21Q0j57j76k62M92J0R3j02j71J9
$$ 58 155 388 702 481 235 167 315 299 277 32 -205 -321 0 80 -77 -253 -515 -23 -13 80 -22 -193 -174
4351a74K98j21j5j61k08L11Q3j1k64k34J80K31Q6l78kL3L78L9q8j24j15K24L62
$$ -174 124 3 -12 -173 -381 -70 13 2 -262 -496 -316 -85 1 -377 -379 -346 32 71 -17 -141 -256 -32 330
4374C30p8j25k29MK08J90j80k10l04L19M85k19N3l06J16J75P3Lm42M7K78O6l1
$$ 330 252 127 -102 -98 110 300 120 -90 -394 -75 410 191 244 -62 54 229 302 305 -137 -90 188 254 223
4397B23l40k45K86O8J25l71r1J25J15K67j3k75j24J40L13P0j85k34L0L37q2Ll39
$$ 223 -117 -362 -76 -8 117 -254 -345 -220 -105 162 149 -126 -250 -110 203 273 88 -146 -116 221 139 142 -197
4420a97j58K30K34J98k71m91L09R1M07l56j89O2K47J43J30m22k17J52J89P7k10
$$ -197 -355 -125 109 307 36 -455 -146 -55 352 -4 -193 -131 116 259 389 -33 -250 -98 91 168 -42
4441d2j58j78L65K69l8j95k35K36J62J10j87k22m7K28n1K04k76l21L47J88R6k74
$$ -42 -200 -378 -13 256 218 23 -212 24 186 296 109 -113 -160 68 17 221 -55 -376 -29 159 255 -19
4463a9k29K8L59J41j58j35k27K93J08J10k79k30J7M50J40l15j84j7K63O6O7j90
$$ -19 -248 -220 139 280 122 -13 -240 53 161 271 -8 -238 -221 229 369 54 -130 -147 116 182 249 59
4485E9k54Q1J82R7p8m61K18r3L11k6j68n0p3L31J57r8k91j16K01K92l3k50j46
$$ 59 -195 -114 68 165 87 -374 -156 -249 62 36 -132 -182 -255 76 233 135 -156 -272 -71 221 188 -62 -208
4508b08J62L16P2m63j95J18K47J57p0k90J72o0L07n2j28j60n9K70J88k05k82j79
$$ -208 -46 270 342 -121 -316 -198 49 206 136 -154 18 -42 265 213 85 -75 -134 136 324 119 -163 -342
4530c42K76K32J35k62l54M64OJ08k12j07k5K39K0M0j77j97K50J55J93m62l40N8
$$ -342 -66 166 301 39 -315 149 155 263 51 -56 -81 158 178 218 41 -156 94 249 442 -20 -360 -302
4552c02L55J68r6m96Q7J78K63Nq1l06J07L32P6p5l13l8J02j4R8j99k06M9K07L30
$$ -302 53 221 125 -371 -284 -106 157 162 81 -225 -118 214 290 215 -98 -136 -34 -48 50 -149 -355 -306 -99 231
4576B31j97k18k38L41K64j16j5k97K14J49J71j33j49k11L36M3k5k97k05J93K88
$$ 231 34 -184 -422 -81 183 67 52 -245 -31 118 289 156 7 -204 132 175 150 -147 -352 -159 129
4597A29J61j29k37r3L49J33P1j41m06K02L37L1k00l27q1L75L2j23m04p0L14K06
$$ 129 290 161 -76 -169 180 313 384 243 -163 39 376 407 207 -120 -201 174 206 83 -321 -391 -77 129
4619A29P4l16k67J58K49K79k16k36k8K13J28n9l54l09J86J12K21j51k36l4L46
$$ 129 203 -113 -380 -222 27 306 90 -146 -174 39 167 108 -246 -555 -369 -257 -36 -187 -423 -457 -111
4640a11M09j87j02k86J01M75Q3k21j30l3J59J95ml34k31R3N11j51j73k38J44L11
$$ -111 298 111 9 -277 -176 299 382 161 31 -2 157 352 348 14 -217 -124 387 236 63 -175 -31 280
4662B80K55j52l73N3O7L50Km24j55q1L44O2l17k46K6J53L9J91l17p3KL58lJ31
$$ 280 535 383 10 63 130 480 482 58 -97 -178 166 228 -89 -335 -309 -156 -117 74 -243 -316 -314 44 41 172
4686A72n13p4M30K3l9k89j21J13J30m5q5j09p1L04K39J40l12j90K22L13R1k93
$$ 172 -341 -415 15 38 -1 -290 -411 -298 -168 -213 -298 -407 -478 -174 65 205 -107 -297 -75 238 329 36
4708C6kk61N32J47k00j37j80J21J49l7k42M1M0J14J63R3l09o1J49K16p5k26l7
$$ 36 34 -227 305 452 252 115 -65 56 205 168 -74 -33 7 121 284 377 68 7 156 372 297 71 34
4731C4n9K39J9l14j94j44O6L23o8k58k1M0K00K00k77l5j3L06J23m4l25j81J93
$$ 34 -25 214 233 -81 -275 -419 -353 -30 -98 -356 -377 -337 -137 63 -214 -249 -262 44 167 123 -202 -383 -190
4754a90K48J06l17k72K02J49K32j24j36N1K6N06j20k63k33L32J20n2J04m12K1
$$ -190 58 164 -153 -425 -223 -74 158 34 -102 -51 -25 481 361 98 -135 197 317 265 369 -43 -22
4775b2J15J74J33m76m7K8K60J40k50j70j9J77K64r2k84k8nK69P4l15j85o5K16
$$ -22 93 267 400 -76 -123 -95 165 305 55 -115 -134 43 307 215 -69 -97 -102 167 241 -74 -259 -324 -108
4798a08K58p0l15l9J41L59r3p7l96P6N15l1q5j92q5J6K59j86j46k0j07L41R1J05
$$ -108 150 80 -235 -274 -133 226 133 56 -340 -264 251 220 135 -57 -142 -126 133 -53 -199 -219 -326 15 106 211
4822B11l81k30L62L24j40k71j18J15K11J78q3l87o0K25L14j82l04q3O3M09J8k41
$$ 211 -170 -400 -38 286 146 -125 -243 -128 83 261 178 -209 -269 -44 270 88 -216 -299 -236 173 191 -50
4844e0j16M9J09M05k25k04k17L50R5N2k76k83P1O9K67p1l00o2K96J57J13k21k43
$$ -50 -166 -117 -8 397 172 -32 -249 101 196 248 -28 -311 -240 -171 96 25 -275 -337 -41 116 229 8 -235
4867b35J54K92J28j88m02J60J15N9j39R3l10J8L16J19j64j87j2J43K20J9l09k01
$$ -235 -81 211 339 151 -251 -91 24 83 -56 37 -273 -255 61 180 16 -171 -183 -40 180 199 -110 -311
4889c11J26K04J45j27j86m5L47N7j50l90P9J43K76J17k05l47J82J33K92j86j85
$$ -311 -185 19 164 37 -149 -194 153 210 60 -330 -251 -108 168 285 80 -267 -85 48 340 154 -31
4910c1k00J80M08l3l13k85J67K44J6k12j37J07Q2J52P9j58j86jL55Q3j63l00j05
$$ -31 -231 -51 357 324 11 -274 -107 137 153 -59 -196 -89 -7 145 224 66 -120 -121 234 317 154 -146 -251
4933b51L57l9R4k28j69jM21K39m54j81O6J71L13k00m41J11j33L36P3j33k09mQ1
$$ -251 106 67 161 -67 -236 -237 184 423 -31 -212 -146 25 338 138 -303 -192 -325 11 84 -49 -258 -262 -181
4956a81L44k70P8m32L79L20M6k43j70Q3M4K46l25j04r2L86J79k06j73j84J87J54
$$ -181 163 -107 -29 -461 -82 238 284 41 -129 -46 -2 244 -81 -185 -277 109 288 82 -91 -275 -88 66
4978F6J64k75k6oJ34K81L6k84j12Q3L74o0j53m12P4K24O9j11j08j69J58L12ok70
$$ 66 230 -45 -71 -77 57 338 374 90 -22 61 435 375 222 -190 -116 108 177 66 -42 -211 -53 259 253 -17
5002a7r5p3L17K78l82k49n0K48K1K0j10k75N2N30l9j55k48j92L74K42K5k90j83
$$ -17 -112 -185 132 410 28 -221 -271 -23 -2 18 -92 -367 -315 215 176 21 -227 -419 -45 197 222 -68 -251
5025b51J45K12K53l24j19n6K9K44j7k07k44K34L25lj89j87O9J44K25kl33J21J9
$$ -251 -106 106 359 35 -84 -140 -111 133 116 -91 -335 -101 224 221 32 -155 -86 58 283 281 -52 69 88
5048H8L52r3j90k61J24L14k38K16l45j69R9L39q1p7l01J89K16J18j70k07j66J35
$$ 88 440 347 157 -104 20 334 96 312 -33 -202 -103 236 155 78 -223 -34 182 300 130 -77 -243 -108
5070a08L91n8m32l54L12J93J16J9m22qL57J68r9k17p3J42K51Q6j27k95N7p7M37
$$ -108 283 225 -207 -561 -249 -56 60 79 -343 -351 6 174 75 -142 -215 -73 178 264 137 -158 -101 -178 259
5093B59j14k75l05L60K79j45J0k30R4L22J35j12k72q9K63J43J40k74k88Q4L69
$$ 259 145 -130 -435 -75 204 59 69 -161 -67 255 390 278 6 -83 180 323 463 189 -99 -15 354
5114C54j03j15m33j9K49K76r2k59j55J88J32J66m6m55J89J56M1K9k16k23J11J38
$$ 354 251 136 -297 -316 -67 209 117 -142 -297 -109 23 189 143 -312 -123 33 74 103 -113 -336 -225 -87
5136h7M2l3k89rK10K02rl05J75J88l7J91r2l01J6K88K04j93l02p6J41K07J64m29
$$ -87 -45 -78 -367 -376 -166 36 27 -278 -103 85 48 239 147 -154 -138 150 354 161 -141 -217 -76 131 295 -134
5160a34j4j26M93l5K7k00k17K89J28Q8j09j96m5M91pk76m09N7J80K39k2k76k81
$$ -134 -148 -274 219 184 211 11 -206 83 211 299 190 -6 -51 440 433 157 -252 -195 -15 224 202 -74 -355
5183c55P9L29J53j09l21L6M21j36k5l19L5L3K47J53k96m52K05K10K11m1m15M0
$$ -355 -276 53 206 97 -224 -188 233 97 72 -247 -212 -179 68 221 -75 -527 -322 -112 99 58 -357 -317
5205c17K90L76j57j12k10l4K94J84j67l08k04L01L04l3k44j23J12J03J72m5k96
$$ -317 -27 349 192 80 -130 -164 130 314 147 -161 -365 -64 240 207 -37 -160 -48 55 227 182 -114
5226a14j3J83K43j0l77j89J72L30J80l07l78Q7K59J24j64j05k76J73M12O9k32
$$ -114 -127 56 299 289 -88 -277 -105 225 405 98 -280 -193 66 190 26 -79 -355 -182 230 299 67
5247F7k73J17J06J41j12j53j40L5J87J34k95j72J12J46L28j43l23M2K38K28J21
$$ 67 -206 -89 17 158 46 -107 -247 -212 -25 109 -186 -358 -246 -100 228 85 -238 -196 42 270 391
5268C91m15k9LJ42J31n0l05l6J82K16Mm36j68K46K71P2k79j01R6J95J93j83p5
$$ 391 -24 -53 -50 92 223 173 -132 -168 14 230 234 -202 -370 -124 147 219 -60 -161 -65 130 323 140 65
5291F5k31R0L07l9k04j33N1J49p0j6j17j46K38J74J59m12K7j7K76or1k26j58L18
$$ 65 -166 -76 231 192 -12 -145 -94 55 -15 -31 -148 -294 -56 118 277 -135 -108 -125 151 145 54 -172 -330 -12
$$ [...]
8191F8
##END NTUPLES=NMR FID
##END=
