##TITLE=1H_PR-SA2
 CDCl3,8 sc, 
 29.9.2021
##JCAMPDX= 6.0         $$ Bruker NMR JCAMP-DX V2.0
##DATA TYPE= NMR FID
##DATA CLASS= NTUPLES
##ORIGIN= UXNMR, Bruker Analytische Messtechnik GmbH
##OWNER= root
$$ XWIN-NMR		Version 3.5
$$ Wed Sep 29 09:04:15 2021 Russian Standard Time (UT+4h)  she@DPX200
##.OBSERVE FREQUENCY= 200.1314
##.OBSERVE NUCLEUS= ^1H
##.DELAY= (6, 6)
##.ACQUISITION MODE= SIMULTANEOUS
##.ACQUISITION SCHEME= undefined
##.AVERAGES= 8
##.DIGITISER RES= 18
##SPECTROMETER/DATA SYSTEM= spect
##.PULSE SEQUENCE= zg30
##.SOLVENT NAME= CDCl3
##.SHIFT REFERENCE= (INTERNAL, CDCl3, 0, 15.7039)
##AUDIT TRAIL= $$ (NUMBER, WHEN, WHO, WHERE, WHAT)
$$ ##TITLE= Audit trail, XWIN-NMR		Version 3.5
$$ ##JCAMPDX= 5.01
$$ ##ORIGIN= Bruker BioSpin GmbH
$$ ##OWNER= she
$$ F:/spectra/data/she/nmr/H-F/1/audita.txt
$$ ##AUDIT TRAIL=  $$ (NUMBER, WHEN, WHO, WHERE, WHAT)
(   1,<2021-09-29 09:02:57.46 +0400>,<she>,<DPX200>,
      <created by zg, POWCHK disabled, PULCHK disabled
       configuration hash MD5:
       00 E9 B6 7A A2 85 ED C7 34 08 36 98 17 FE 4E 26
       data hash MD5: 16K
       E8 32 13 86 A3 7F 23 D1 CA 3F 51 CF DB E1 40 88>)
$$ ##END=
$$ 
$$ hash MD5
$$ D2 56 F4 DD 28 A2 E5 0A DA DF 06 A2 69 83 37 D4
##$RELAX= 
##$RELAX= 
##$RELAX= 
##$RELAX= 
##$RELAX= 
##$RELAX= 
$$ Bruker specific parameters
$$ --------------------------
##$DU= <F:/spectra>
##$EXPNO= 1
##$NAME= <H-F>
##$PROCNO= 1
##$TYPE= <nmr>
##$USER= <she>
##$AMP= (0..31)
100 100 100 100 100 100 100 100 100 100 100 100 100 100 100 100 100 100 
100 100 100 100 100 100 100 100 100 100 100 100 100 100 
##$AQSEQ= 0
##$AQ_mod= 1
##$AUNM= <au_zg>
##$AUTOPOS= <>
##$BF1= 200.13
##$BF2= 200.13
##$BF3= 200.13
##$BF4= 200.13
##$BF5= 200.13
##$BF6= 200.13
##$BF7= 200.13
##$BF8= 200.13
##$BYTORDA= 1
##$CFDGTYP= 0
##$CFRGTYP= 5
##$CHEMSTR= <none>
##$CNST= (0..31)
1 1 145 1 1 1 1 1 1 1 1 1 1 1 1 1 1 1 1 1 1 1 1 1 1 1 1 1 1 1 1 1 
##$CPDPRG= <>
##$CPDPRG1= <>
##$CPDPRG2= <>
##$CPDPRG3= <>
##$CPDPRG4= <mlev>
##$CPDPRG5= <mlev>
##$CPDPRG6= <mlev>
##$CPDPRG7= <mlev>
##$CPDPRG8= <mlev>
##$CPDPRGB= <>
##$CPDPRGT= <>
##$D= (0..31)
0 1.2 0 0 0 0 0 0 0 0.06 0 0.03 0 0 0 0 0.0002 0 0 0 0 0 0 0 0 0 0 0 0 
0 0 0 
##$DATE= 1632891776
##$DBL= (0..7)
120 120 120 120 120 120 120 120 
##$DBP= (0..7)
150 150 150 150 150 150 150 150 
##$DBP07= 0
##$DBPNAM0= <>
##$DBPNAM1= <>
##$DBPNAM2= <>
##$DBPNAM3= <>
##$DBPNAM4= <>
##$DBPNAM5= <>
##$DBPNAM6= <>
##$DBPNAM7= <>
##$DBPOAL= (0..7)
0.5 0.5 0.5 0.5 0.5 0.5 0.5 0.5 
##$DBPOFFS= (0..7)
0 0 0 0 0 0 0 0 
##$DE= 6
##$DECBNUC= <off>
##$DECIM= 32
##$DECNUC= <off>
##$DECSTAT= 4
##$DIGMOD= 1
##$DIGTYP= 9
##$DL= (0..7)
0 120 120 120 120 120 120 120 
##$DP= (0..7)
150 150 150 150 150 150 150 150 
##$DP07= 0
##$DPNAME0= <>
##$DPNAME1= <>
##$DPNAME2= <>
##$DPNAME3= <>
##$DPNAME4= <>
##$DPNAME5= <>
##$DPNAME6= <>
##$DPNAME7= <>
##$DPOAL= (0..7)
0.5 0.5 0.5 0.5 0.5 0.5 0.5 0.5 
##$DPOFFS= (0..7)
0 0 0 0 0 0 0 0 
##$DQDMODE= 0
##$DR= 18
##$DS= 0
##$DSLIST= <SSSSSSSSSSSSSSS>
$$ [...]
##$SUBNAM2= <"">
##$SUBNAM3= <"">
##$SUBNAM4= <"">
##$SUBNAM5= <"">
##$SUBNAM6= <"">
##$SUBNAM7= <"">
##$SUBNAM8= <"">
##$SUBNAM9= <"">
##$SW= 16.8808012054999
##$SWIBOX= (0..15)
0 0 2 0 0 0 0 0 0 0 0 0 0 0 0 0 
##$SW_h= 3378.37837837838
##$TD= 16384
##$TD0= 1
##$TE= 0
##$TE2= 300
##$TE3= 300
##$TEG= 300
##$TL= (0..7)
0 120 120 120 120 120 120 120 
##$TP= (0..7)
150 150 150 150 150 150 150 150 
##$TP07= 0
##$TPNAME0= <>
##$TPNAME1= <>
##$TPNAME2= <>
##$TPNAME3= <>
##$TPNAME4= <>
##$TPNAME5= <>
##$TPNAME6= <>
##$TPNAME7= <>
##$TPOAL= (0..7)
0.5 0.5 0.5 0.5 0.5 0.5 0.5 0.5 
##$TPOFFS= (0..7)
0 0 0 0 0 0 0 0 
##$TUNHIN= 0
##$TUNHOUT= 0
##$TUNXOUT= 0
##$USERA1= <user>
##$USERA2= <user>
##$USERA3= <user>
##$USERA4= <user>
##$USERA5= <user>
##$V9= 5
##$VALIST= <valist>
##$VCLIST= <CCCCCCCCCCCCCCC>
##$VD= 0
##$VDLIST= <DDDDDDDDDDDDDDD>
##$VPLIST= <PPPPPPPPPPPPPPP>
##$VTLIST= <TTTTTTTTTTTTTTT>
##$WBST= 1024
##$WBSW= 4
##$XGAIN= (0..3)
0 0 0 0 
##$XL= 0
##$YL= 0
##$YMAX_a= 649066
##$YMIN_a= -388343
##$ZGOPTNS= <>
##$ZL1= 120
##$ZL2= 120
##$ZL3= 120
##$ZL4= 120
##$ABSF1= 10
##$ABSF2= 0
##$ABSG= 5
##$ABSL= 3
##$ALPHA= 0
##$AQORDER= 0
##$ASSFAC= 0
##$ASSFACI= 0
##$ASSFACX= 0
##$ASSWID= 0
##$AUNMP= <proc_1d>
##$AZFE= 0.1
##$AZFW= 0.1
##$BCFW= 1
##$BC_mod= 2
##$BYTORDP= 1
##$COROFFS= 0
##$CY= 11.3945322036743
##$DATMOD= 1
##$DC= 2
##$DFILT= <>
##$DTYPP= 0
##$F1P= 2.36226072786647
##$F2P= -0.459571619588291
##$FCOR= 0.5
##$FTSIZE= 0
##$FT_mod= 4
##$GAMMA= 1
##$GB= 0.15
##$INTBC= 1
##$INTSCL= 1
##$ISEN= 128
##$LB= 0.24
##$LEV0= 0
##$LPBIN= 0
##$MAXI= 10000
##$MC2= 0
##$MEAN= 0
##$ME_mod= 0
##$MI= 1.114404
##$NCOEF= 0
##$NC_proc= 0
##$NLEV= 6
##$NOISF1= 3.799351
##$NOISF2= 2.8
##$NSP= 1
##$NTH_PI= 0
##$NZP= 0
##$OFFSET= 15.70392
##$PC= 1
##$PHC0= -14074.66
##$PHC1= 8.80089
##$PH_mod= 1
##$PKNL= yes
##$PPARMOD= 0
##$PSCAL= 0
##$PSIGN= 0
##$REVERSE= no
##$SF= 200.130013532006
##$SI= 16384
##$SIGF1= 3
##$SIGF2= 2
##$SINO= 400
##$SIOLD= 16384
##$SREGLST= <1H.CDCl3>
##$SSB= 0
##$STSI= 0
##$STSR= 0
##$SW_p= 3612.71676300578
##$SYMM= 0
##$S_DEV= 0
##$TDeff= 0
##$TDoff= 0
##$TI= <>
##$TILT= no
##$TM1= 0
##$TM2= 0
##$TOPLEV= 0
##$USERP1= <user>
##$USERP2= <user>
##$USERP3= <user>
##$USERP4= <user>
##$USERP5= <user>
##$WDW= 1
##$XDIM= 8192
##$YMAX_p= 0
##$YMIN_p= 0
$$ End of Bruker specific parameters
$$ ---------------------------------
##NTUPLES= NMR FID
##VAR_NAME=  TIME,          FID/REAL,        FID/IMAG
##SYMBOL=    X,             R,               I
##VAR_TYPE=  INDEPENDENT,   DEPENDENT,       DEPENDENT
##VAR_FORM=  AFFN,          ASDF,            ASDF
##VAR_DIM=   8192,          8192,            8192
##UNITS=     SECONDS,       ARBITRARY UNITS, ARBITRARY UNITS
##FACTOR=    0.000296,      1,               1
##FIRST=     0,             0,               0
##LAST=      2.424536,      0,               0
##MIN=       0,             -388343,         0
##MAX=       2.424536,      649066,          0
$$ Real data points
##PAGE= N=1
##DATA TABLE= (X++(R..R)), XYDATA
0@%%%%%%%%qQqJ6j6J8k6L3m1N3o2P4r0J07j27J51j79K10k44K83l25L74m29M87
32B59n56O29p10Q01r01J012j131J264j410J567j737J926k132K356k600K867l160
49a656L481l837M229m661N141n676O280o965P748q657R722j0992J2541j4476J6974
64I196k0347K5179l2731M6337p8756L10641L89547q0611r688j59970j25586j66234
76A06977j36843j37913n1288m4345O933L7720O0809K8126M4037Q106k3651m0958
88a42290l3047n5552k4679J2774L8755O7007J18807J18460J12575J08688P3018
99C94516J0964j8380o1990j10202j18881j07604j08421p1930j9314O994L5632
110a68616P5779P0849N2680M7762J3405l1951m4825n9755p9340o0773k9105j3903
$$ y = [0, 0, 0, 0, 0, 0, 0, 0, 0, -8, 0, -8, 8, -8, 10, -16, 17, -24, 29, -33, 41, -49, 58, -69, 82, -97, 113, -131, 152, -173, 201, -228, 259, -297, 332, -378, 423, -478, 534, -597, 667, -743, 824, -913, 1013, -1119, 1237, -1363, 1504, -1656, 1825, -2012, 2217, -2444, 2697, -2979, 3301, -3664, 4084, -4573, 5149, -5843, 6698, -7778, 9196, -11151, 14028, -18703, 27634, -51122, 259519, 649066, 568455, 558767, 398797, 273211, 106977, -29866, -167779, -219067, -263412, -256479, -218759, -157950, -129824, -85787, -77681, -101332, -142290, -175337, -230889, -255568, -242794, -204039, -137032, -18225, 100235, 212810, 321498, 394516, 405480, 387100, 325110, 214908, 96027, -11577, -119998, -191928, -211242, -204248, -168616, -92837, -21988, 30692, 78454, 91859, 59908, 15083, -44672, -124012, -184785, -213890, -227793]
122b27793K2047O6144P4672Q0487R1752O6688L1636J5378j5996n2191n4621n2446
134D5757n7896l3007J5R062K8431N1318L8198K1517J4615j7681n2741o0483p2363
147h5258q4901o2155l3441j6784K2345O2464P2841Q5538R6465P5007M8645L4394
159B15160J921l1204l6662m4271n4433l5855j6366j2662O054K3108J4066P559
171C6415P246j5198l5430l5701m4952n2615l2084j3320l997K6878N2479N5489
183e4790O4605P0738M9755K9912J9095r623l4315l5707m4613n0839l2326j7054
195d5162j2643P701K2964J7164J7315K0006Q62j2525j1974k4558l2604j8700j2008
208h4162r410J2507K6421K5096L4111L8732K2333J3760R720j1076k4077k0736
$$ y = [-227793, -205746, -139602, -64930, 15557, 107309, 173997, 205633, 221011, 205015, 152824, 98203, 45757, -12139, -45146, -45131, -36069, -7638, 43680, 81878, 103395, 118010, 100329, 47588, -12895, -85258, -170159, -232314, -265755, -282539, -260194, -197730, -124889, -39351, 57114, 132121, 180766, 215160, 217081, 185877, 149215, 104944, 50511, 14656, -1710, -14372, -8318, 14790, 28856, 36415, 43661, 28463, -6967, -42668, -87620, -140235, -172319, -185639, -189636, -162758, -110279, -54790, 9815, 80553, 130308, 160220, 179315, 169692, 135377, 99670, 55057, 4218, -28108, -45162, -57805, -50104, -27140, -9976, 7339, 27345, 28207, 15682, 3708, -20850, -53454, -72154, -84162, -93572, -81065, -54644, -29548, 4563, 43295, 65628, 79388, 89108, 78032, 53955, 33219]
220C3219k7666l1567j4340o011m093J2777K2188J5636J8505J9928L562m730m032
233C3376j7479k3867j3209j4145j3798L499J0316P849J7863K1809R785Q887R486
246D0372n755j1659o562j4436j6720m811l026m295P926J1872N002J0381J2421
259B0710k23r82J724r114j2011l270p804r664K387K483j322P627R334N55M535
274D965P133l240k658K623n440o716J908k193n778L291K287l681L843N467k278
289d67K731O790j158l64N292j520m595J657k920r211j348k187p760J77M370j172
305a1685M316R999K985K560P778o39n755p83n859j1244l083j455n160L980R017
320e028M632P927J2155L285p41J447q120j4313q775j1444j3748l584J973J006
$$ y = [33219, 5553, -26014, -40354, -46365, -50458, -37681, -15493, 143, 18648, 38576, 42138, 37408, 33376, 15897, -7970, -21179, -35324, -49122, -45623, -35307, -27458, -9595, 12214, 21999, 30886, 40372, 34617, 22958, 16396, 1960, -14760, -19571, -22597, -26892, -18966, -7094, -2092, 8289, 20710, 20487, 19505, 21229, 12115, 104, -3166, -10970, -20634, -18247, -15764, -17086, -9459, -125, 430, 4965, 12098, 8858, 6200, 8823, 3383, -3333, -1425, -3618, -9396, -6105, -3818, -7499, -3656, 1811, -467, 2264, 9054, 7896, 7532, 12824, 11304, 6709, 8366, 5446, -3765, -5113, -7300, -15060, -14883, -10513, -11685, -7369, 2630, 5615, 8175, 15953, 15314, 9559, 8776, 2917, -8327, -11410, -12865, -18025, -14045, -5028, -396, 7531, 19686, 22971, 22230, 23677, 15557, 1244, -7531, -18975, -32723, -36307, -34334, -33328]
334c3328J0330J6539J0691J2064J3702K646l442k205j0739j5624q276p349p814
347b2805M100R623P166J3356J5955O082K015L76j1865j8255j5159j8839j9295
360d7545o651n83K936J5023K1464J7006J9372J8134N022j466m347j4937j9077
373D351j2841j2354j0013L604R568J0514J8486J9403J0188O843J655j2540j8775
386A8089j9104k4169k3151j1250n818j50J4380K0038J7958K2340J9431O845N26
399C5965l438j5167j7683j1384j1330o087Q488J4165J6976K4966K3830J3696Q168
412H1165n44j7257k4631k7582l4353l2335k0999j4571o021J0278J7244J9591K5944
425b4071K3588J3548R507L985p217r009n334o454j334J0551J4132J6487K3521
$$ y = [-33328, -22998, -6459, 4232, 16296, 29998, 32644, 29202, 26997, 16258, 634, -7642, -14991, -22805, -18705, -9082, -1916, 11440, 27395, 33477, 35492, 35868, 24003, 5748, -9411, -28250, -47545, -54196, -54779, -51843, -36820, -15356, 1650, 21022, 39156, 44178, 42712, 38365, 23428, 4351, -8490, -20844, -30857, -27253, -17685, -7171, 11315, 30718, 40906, 47749, 49404, 36864, 18089, -1015, -25184, -48335, -59585, -65403, -65553, -51173, -31135, -13177, 9163, 28594, 35439, 35965, 32527, 17360, -323, -11707, -23037, -29124, -20636, -6471, 10505, 35471, 59301, 72997, 81165, 80621, 63364, 38733, 11151, -23202, -55537, -76536, -91107, -97128, -86850, -69606, -50015, -24071, -483, 13065, 22572, 26557, 19340, 10331, 4997, -1457, -2791, 7760, 21892, 38379, 61900]
438F1900J9145R177L639q009k4427l1316l4586m0479l6256k3318j5861l082J4701
451a08772K2633K7128L3835L0600K0770J5551P719n605q645q331j1817o900L360
464A1526N764J0185J7078J4280P218L976n621j9405k3504k7501l3354k7329j7896
477h4583j1680K17J5201K0396K4561K9321K3695J3796Q499o85j2961j4856j4602
490c681j6423q530K341P116J4824K3327K1773J7715J5542M774p641j3193k0153
503C7791k7854k4966k0567j7624p847K981O327J0828J6341J1652N717L940l377
516f658j0782r331p933p793J828J1108J5855K3091K9561K6231K1691J7207M235
529A08310q478j5991k4864l3058l0907k8188k5304j4891l880Q58Q081J4648J3044
$$ y = [61900, 81045, 90222, 93861, 85852, 61425, 30109, -4477, -44956, -81212, -104530, -120391, -123473, -108772, -86139, -59011, -25176, 5424, 26194, 41745, 49464, 43859, 35214, 26883, 15066, 8166, 11526, 17290, 27475, 44553, 58833, 66051, 70027, 64406, 45001, 21497, -6004, -39358, -66687, -84583, -96263, -96046, -80845, -60449, -35888, -6567, 17128, 30924, 39423, 38738, 25777, 10921, -3681, -20104, -28634, -26293, -19177, -4353, 18974, 40747, 58462, 74004, 78778, 71137, 57944, 37791, 9937, -15029, -35596, -53220, -61067, -58086, -51759, -40931, -24590, -12938, -7221, -3281, -6658, -17440, -26771, -34704, -42497, -40669, -29561, -13706, 9385, 38946, 65177, 86868, 104075, 108310, 99832, 83841, 58977, 25919, -4988, -33176, -58480, -73371, -77251, -76393, -68312, -53664, -40620]
542d0620J0020J1086M114p88R8o25j794M816J0886J1614J7496K1174J6715J3092
556G7284R045k028j1406j6020k4095k8758k5179k2024j8654q243J814N766J2993
569d9505J7885J4911J2479J1197L685j747k844n431p506k436J437J930Q557J2338
583A4950R720R437Q325J022m267o490j2655j5710j2655j1823r759k335K898M603
597b4739R029J1503O932N344L489k865p272p118r624r488m086n42K291Q570J2164
612f412J1434J2803J1822O007K302J28o119r629q407r296r447m305j835j386K615
627i725M059J068J313J088l250n228l326n489m823L03J700L756Q698R896R180
642I220R771Q936L557J089q57o481q160p207r165q508m054l013k049K014K882
$$ y = [-40620, -30600, -19514, -15400, -16188, -16090, -16715, -18509, -13693, -2807, 8807, 26303, 47477, 64192, 77284, 86329, 84301, 72895, 56875, 32780, 4022, -21157, -43181, -61835, -70078, -68264, -62498, -49505, -31620, -16709, -4230, 6967, 10652, 8905, 6061, 630, -6876, -9312, -7875, -5945, 2612, 14950, 24670, 34107, 42432, 43454, 39187, 32697, 20042, 4332, -8323, -20146, -29905, -32240, -29342, -24739, -15710, -4207, 2725, 8069, 11558, 8693, 1421, -5697, -15321, -24809, -28895, -29437, -27146, -18576, -6412, 5022, 17825, 29647, 35654, 37956, 38084, 31965, 22336, 13929, 4633, -4814, -9119, -10954, -12340, -9725, -5666, -4598, -3285, -2197, -5447, -10675, -14001, -19490, -24313, -24010, -22310, -18554, -9856, 40, 9220, 18991, 27927, 31484, 32573, 31716, 25235, 17075, 9868, 703, -7805, -11859, -14872, -16921, -14907, -12025]
657a2025J377K948L089k95l93N65j878j737J786J082J531M786M587K683M347L406
673A5859n7p05j241m915m730l431m981m331p33q86m20K581K459J142K870K520
689A001J72O59J150j398p27J132n89m75J464K68o96J069J27j946k87Q0k393p66
707b155M7j349q06J416j58n50J367N32o08J258Q23j82J287J749k95Q33J626m58
725D377p90N08j461k566p06j223k242r7R91n84J475K380P99J436J409J19j091
742B734l81j554k472m20n31j125J242J867J046K302K078M03k39J6k697l269j521
759b521l021k531J36O97O77L222L630K611K435K261k68j655j014l312l490j470
775c613j653r51J736K050K282L094L356N28J91n51l398l639l286m121k701j05
$$ y = [-12025, -10648, -7700, -4611, -4906, -5299, -4734, -6612, -8349, -6563, -5481, -3950, 836, 5423, 8106, 12453, 15859, 15802, 15097, 13856, 8941, 4211, 780, -4201, -8532, -9265, -10151, -10571, -7990, -5531, -4389, -1519, 1001, 1173, 1832, 2982, 1584, 857, 1989, 1400, 925, 2389, 2657, 1961, 3030, 3157, 1211, 924, 1004, -1389, -2155, -2108, -3457, -4263, -2847, -3005, -3555, -2188, -1656, -2264, -1006, -183, -365, 922, 2671, 2376, 3209, 4835, 4377, 3587, 4095, 2634, 68, -638, -1861, -4103, -4200, -3209, -3793, -2318, 62, 861, 2297, 3706, 3825, 2734, 2353, 799, -1673, -2093, -2624, -3749, -2507, -640, 406, 2708, 4786, 5189, 4950, 4966, 2269, -1000, -2521, -5542, -8073, -7937, -7240, -6563, -3341, 289, 2900, 5335, 7596, 7328, 5673, 4659, 1347, -2143, -3613, -5266, -6217, -4481, -2431, -149, 2945, 6301, 6829, 7020, 6469, 3071, -568, -3854, -7975, -10676, -10781]
791a0781O83J823M017M728L601M140L195R7p99j816l554m175k183k849j815J406
807d282J785J830L248K388J12J67j656m151m430l816m381k527J29J209K818N730
823e827O056N221N491L904Q45o86j876m400m446l611l313k039K01J090J711L003
839A324K200O62O6j301l585m107l740m100k298k75R62L379N399N970N148N323
855A1027L330O66p68k090m471m193l054l390j369R48J442K567L563K452J312l98
871G574j974m104m431n141n411l533j415Q3J943M519M908N160N511L743K314J290
887A1036p12j817j900j335j529PJ477J724J848L021Q56r46j579m107n549n974
903e479o412o435l826j848k18K549N373N369O594O937M884L502K885K25p64j080
$$ y = [-10781, -10098, -8275, -4258, 470, 4071, 8211, 11406, 11503, 10704, 8888, 5334, 1159, -1024, -3873, -5688, -4282, -2497, -667, 2581, 4969, 5081, 5248, 3592, -559, -4989, -8805, -13186, -15713, -15584, -14375, -11557, -5827, 229, 5450, 10941, 14845, 15690, 15004, 13128, 8728, 4282, 671, -2642, -4681, -4480, -3390, -1679, 1324, 3524, 4186, 4252, 2951, -634, -4741, -8481, -12581, -14879, -15154, -14192, -10813, -5414, 556, 5704, 11027, 14357, 15023, 14255, 12165, 7694, 3501, 447, -2943, -4312, -3364, -1922, 645, 4208, 6660, 7972, 7574, 5600, 1496, -2935, -8076, -13487, -17020, -18435, -18352, -16409, -11890, -6982, -1822, 3689, 7432, 9746, 11036, 10324, 8507, 6607, 5272, 3743, 3750, 5227, 6951, 8799, 11820, 12676, 11730, 10151, 6044, 495, -5479, -11891, -18326, -22152, -24000, -24218, -21669, -16296, -10927, -4333, 2604, 7488, 10990, 13875, 14100, 13336, 12256]
919A2256j476j809j327L49l98M22P50q19j549k716l964n192m504m786m450k044
935b1257k37J106L657N542N352N818N326M401K002J846q67k080j626k793k427
950C763n80j48j37R19J404N01p2m02k059l048k423l474l261j480p27MJ707K721
968f792K535K755K569J157M10M68j196j570p60p18k13J118J969J802L027K720
984I281J301M39K31k261l049l004m041l755l015k310j913L43O63J607J846K041
1000e596J236J344J424N22R37P89J189J188K284K297J752J996J173l07n41j955
1016I732l135l470l814l908l391k119j797l77R20J634K136K156K617J831J707
1031G22J337P34J33P26J44K28N65N64O5N22l89j061j243j390k343k041j765j356
$$ y = [12256, 10780, 8971, 7644, 7993, 7595, 8017, 8767, 7948, 6399, 3683, -281, -5473, -9977, -14763, -19213, -21257, -21494, -20388, -16731, -11189, -5837, -19, 5307, 9708, 11710, 13556, 12689, 10609, 8983, 6190, 3763, 3183, 3035, 2898, 3817, 5221, 5722, 5650, 5248, 3189, 141, -2282, -5756, -9017, -10497, -11224, -11220, -9513, -6792, -4257, -1502, 1067, 2224, 2634, 3102, 1906, 336, -424, -1142, -1355, -237, 1732, 3534, 6561, 9281, 10582, 11021, 11252, 8991, 5942, 2938, -1103, -4858, -7873, -10183, -12096, -11753, -11090, -9483, -7637, -5596, -4360, -3016, -1592, -1070, -133, 656, 1845, 3033, 5317, 7614, 9366, 11362, 12535, 12228, 11687, 9732, 6597, 3127, -687, -4595, -7986, -10105, -11902, -12279, -11359, -9725, -7589, -5433, -2816, -985, 722, 2059, 2793, 2926, 3652, 3796, 4024, 4589, 5153, 5218, 5740, 5351, 4290, 3047, 1657, -686, -2727, -4492, -5848]
1049e848r89J83P28J035J965J897J598J679R14L61km24q93j041q62m60n66L0M52
1068b43J64P42K39n9j19N3p40k69m50m3j74P18M88Q23L77M68n9m11m80j078r48
1089a001j247q73n93L31l33O79J442J055R88J170Q23M69l2k74n90p40o18o72n68
1108e84J74l16J28K7o4k18k40N1o27J78k48K99N27R96Q88P86J460O47J27L21q85
1129C427r08j313j296j705o10r58n43l4L63L40Q74J035Q00O14P58J02N98L03K43
1148B090m1P02o3l3l2k38n69j069r61j226j360p59j003n88L24N01J066J105J460
1167f94J473J228J091N20K96m3J1m55p75l91o33m78l38o49n83m72j105k56n20
1186b773o48l54R6M62P73J244J207J248J345Q43N22j08j06n91j132r67j174r14
$$ y = [-5848, -6837, -6654, -5926, -4891, -2926, -1029, 569, 2248, 3162, 3523, 3521, 3097, 2204, 1163, 301, -159, -725, -695, -243, -79, 663, 902, 843, 724, 777, 37, -232, -682, -725, -899, -181, 307, 1130, 1507, 1975, 1916, 1505, 1025, -53, -1001, -2248, -3121, -3714, -3383, -3716, -3037, -1595, -540, 448, 1618, 2441, 2910, 2878, 2604, 2014, 1274, 656, -16, -584, -410, -726, -598, -571, -635, -853, -1093, -1042, -1669, -1491, -1739, -1440, -913, 83, 971, 1757, 3217, 3864, 3991, 4312, 3427, 2519, 1206, -90, -1795, -2405, -3363, -3906, -3940, -3577, -3237, -2363, -1328, -528, 86, 844, 946, 1544, 1847, 2090, 2049, 2751, 2688, 2655, 2623, 2385, 1816, 747, -214, -1440, -2800, -3559, -4562, -5150, -4826, -4325, -3259, -2154, -694, 779, 2007, 3098, 3618, 3914, 3871, 3882, 3427, 2652, 2261, 1628, 1150, 812, 163, -420, -892, -1997, -2253, -2773, -3421, -3775, -3679, -3217, -2444, -1200, 7, 1255, 2600, 3443, 3965, 3857, 3751, 3160, 2028, 1061, -113, -1027]
1204a027o45j21m21K21N56J43N80J09l19q5O7l64k71O82J58P40P57O42O78L53
1224B433K32m35p12p26r14j058o98k92J18N07J148R32J350Q45K94L75o22j146
1242A631j209j293j334q57o96Q7J57P67R84J071R99O66K25Q4k37k79k39l30K14
1261D11R61O47Q37P30O83K17q46j004j816k330k448j856j663r56K23R56J533K269
1279c452K513K570J973J714N86L13n26q34o13j030o69k49M2p3J2r3l34j457j183
1298g90j929k374j531j416q47K13J138J945K389K880K657K864J671P15j03j065
1314F417j395k389j920j304j075l64N95P14Q49J059O25L2m21j182j948j654j339
1331d700j017l63N48J359J553K449J959J522J361K68q80j065j105j950j580q91
$$ y = [-1027, -1672, -1793, -2214, -1993, -1437, -1294, -714, -605, -924, -1009, -942, -1306, -1577, -895, -737, 3, 760, 1402, 2080, 2433, 2665, 2230, 1518, 792, -122, -1180, -1878, -2170, -2052, -1545, -397, 535, 1885, 2730, 3024, 3399, 2777, 1631, 422, -871, -2205, -3062, -3758, -3671, -3514, -2747, -1763, -692, 307, 973, 1198, 1282, 1045, 766, 527, 197, 411, 1372, 2019, 2856, 3586, 4269, 4486, 3640, 2636, 820, -1510, -3958, -5814, -7477, -8433, -8210, -7254, -5721, -3452, -939, 1631, 3604, 5318, 5904, 6217, 5691, 4857, 4244, 3214, 2545, 2296, 2338, 2265, 2277, 2184, 1850, 393, -790, -2719, -5093, -6624, -8040, -8887, -8674, -7536, -5591, -3202, -322, 2335, 5199, 6870, 7585, 7482, 6417, 5022, 2633, 713, -591, -1666, -2030, -1435, -721, 128, 1187, 1812, 1844, 1423, 241, -1707, -3361, -4700, -5717, -6080, -5532, -4173, -2620, -171, 1788, 3310, 4671, 4939, 4059, 2994, 1889, -61, -1641, -2532]
1347b532J83O71J701J998K057J900Q94j88q25j825k997k679k848k557j556m69
1363i072O76J325J862K403K189J948J200L03j14n51p77o66p2K01P95J356J686
1380D692J629Q95J73j107j259k954k985l601k817k303j467K30Q00K455K974L297
1396a348K856K513J910L84K2j132j541j331j147p35k25O83P18R14P95N08o82r37
1414B225j395k472j834k240j657l97M02J473J962K477L095J999J715N67n28r00
1430D492k259k008k025j770r15J16O48J674K030K312J752R92L53o15j082j687
1446B008k021j639j306n99k70J210J214R85J278J045J07n00p96j337j631j243
1462c495r29m2Q06J378K136J995K333K125Q06K24p76j793j843k523k514k084j089
$$ y = [-2532, -2349, -1678, 23, 2021, 4078, 5978, 6872, 6684, 5859, 4034, 1037, -1642, -4490, -7047, -8603, -9072, -8396, -7071, -5209, -2806, -617, 1331, 2531, 2834, 2720, 2169, 1392, 726, 654, 855, 1650, 3006, 4692, 6321, 7216, 7389, 6282, 5023, 2069, -916, -4517, -7334, -9637, -11104, -10874, -10074, -7619, -4645, -1348, 1508, 4021, 5931, 6315, 6337, 5205, 3664, 2333, 1186, 451, 226, 909, 1627, 2541, 3336, 3844, 3162, 2225, 830, -1642, -3476, -5716, -7373, -7770, -7368, -5895, -3933, -1456, 1639, 3638, 5353, 5920, 5392, 4492, 2233, 225, -1800, -3570, -4485, -4369, -3721, -2047, -17, 2295, 4047, 5039, 5392, 4777, 3695, 2008, -13, -1652, -2958, -3557, -3827, -2617, -1403, -418, 860, 1905, 2012, 1512, 716, -621, -2252, -3495, -4424, -4466, -3660, -2282, -146, 1849, 4182, 6307, 7113, 7337, 6561, 4768, 2925, 402, -2112, -4196, -5285]
1479e285p16J93J196J421J346J787J201Q12l0m77p91p68p14o63j6N46P62J224
1497A028J574P04K15N2m06j207j582j776j446j454o28K93R44J527J914J829J878
1514C459J235N28P3j139j456j642j820j852j157r84K92K26J150J044J274J069
1530C00N24N04k58J34l28o26k15K7K78J015P13Q67P30M94k37n14j291j846j793
1549a522k111j667j074k85n5J162J530J397K031K084J782Q99Q15m35l35o81j099
1566B436j262m70n96j08Q2K00N36M03l8J04r39r85r06j451o70p59j38O82P04R40
1586b235J648J367J233J102J51m1q17r58p71j588l88m63K88L51J112J107J172
1603B270J148M07k95k20j218j743j538j318j520l80o87J51J093J160J237J768
$$ y = [-5285, -6001, -5808, -4612, -3191, -1845, -58, 1143, 1955, 1925, 1448, 657, -111, -825, -1488, -1504, -958, -196, 1028, 2602, 3306, 3521, 3573, 3167, 1960, 378, -1398, -2844, -4298, -4926, -4633, -3689, -2162, -248, 1581, 3459, 4694, 5222, 5295, 4156, 2700, 1058, -762, -2614, -3771, -4755, -4463, -4237, -3087, -2043, -769, 300, 824, 1328, 1070, 1204, 876, 250, 35, 62, 340, 1355, 2068, 2935, 3665, 4159, 3922, 3408, 2117, 271, -1522, -3633, -5300, -6374, -6659, -6714, -5552, -4022, -2625, -594, 1490, 3272, 4171, 4986, 4551, 4216, 3535, 2436, 1174, 704, 108, 0, 82, 282, 818, 1221, 1183, 1287, 348, -637, -1543, -2994, -3664, -4423, -4561, -3879, -3175, -2235, -587, 780, 2013, 3115, 3266, 3225, 2408, 1450, 679, -909, -1297, -1760, -1472, -1121, -9, 1098, 2270, 3418, 3825, 3530, 3310, 2092, 349, -1189, -2507, -4027, -4407, -5094, -4943, -3850, -2690, -1453, 315]
1619C15Q44M56N94n3n75p69J50k85l46P25P12J013J146L35P4J06j089j479k182
1638c08j909k240j968r61n58L94J223K051J884K541J702J495R84M77m32q00q43
1655B732j060q62m83J63M63M79M65K74K52k91j305j352j476j661j433p32n73O07
1673e793J128J694K440K094J818J118P23Q8o97j048j600j695j319p28J55m5J004
1690f63R44J061J097K72k28j065r46j834j558j108q96n69N94J079J507J749J843
1707A279J326J095M2k42r74p87j609p75m00k18M32Q41J304J487Q76K12l12p19
1725B858j548j916k211j562j635p79J47Q45J511J975K228K242J667R23N20l3j018
1742D214j260j118q05p96k80M70R7P45N60k32j6o73j394j802j662j319j450n68
$$ y = [315, 1159, 1615, 2209, 2156, 1581, 812, 962, 677, 331, 1056, 1768, 2781, 3927, 4262, 4336, 4442, 3353, 1874, -308, -2217, -4457, -6425, -7386, -7944, -7550, -6327, -4276, -2392, 149, 1851, 3346, 4330, 4807, 4375, 3575, 2732, 1672, 810, 327, 490, 953, 1432, 1897, 2171, 2423, 2132, 827, -525, -2001, -3662, -5095, -5827, -6400, -5793, -4665, -2971, -531, 1563, 3381, 4499, 5222, 5310, 4613, 3565, 1965, 270, -1049, -1777, -1622, -1667, -663, 281, 1342, 2439, 2711, 2483, 1418, 472, -1362, -2920, -4028, -4924, -5493, -4899, -3820, -2313, -564, 1279, 2605, 3700, 3742, 3500, 2526, 1739, 130, -645, -1045, -1263, -831, 10, 1314, 2801, 3677, 3889, 3577, 2858, 1310, -606, -2817, -4379, -6014, -6793, -6646, -5801, -4290, -2315, -87, 2155, 3822, 4745, 5265, 5232, 4214, 2954, 1836, 1031, 235, -45, 425, 522, 1267, 1827, 1595, 1579, 906, -488, -2290, -3952, -5271, -6721, -7289]
1760g289P51P33J779K763K198K440J871J496R8j98r13j835j691j563j461j041
1776a862j42J06K21J142P23J23P3k10r85j119q94j118k66j28N77J303J848J648
1794A040J548J402J085R6k33j374j256j761j438j263m24N3K16Q27J437J104O04
1811A663Q71j47l68j275j489j723p63j181m91M02P84J245J309J672J345O18R33
1828C405j44n43m60p01q16m84K8n2R81P86L33O77k6k92j240j061k084j670j662
1847e025j264n50J26Q42J373K018K219J977J589J584O97j68n44q95r76j420j078
1864E05n92m03P5j61M11J65P7n51n10p07j331n23r97j51J02Q29J432J669J941
1883A280J473J579J055qm74p06j499j681j756j404o08l23L0R69J120Q12J202P37
$$ y = [-7289, -6538, -5805, -4026, -1263, 935, 3375, 5246, 6742, 6840, 6642, 5729, 3894, 2203, 640, -821, -1862, -2004, -1898, -1677, -535, 188, 311, 384, 174, -811, -1930, -2824, -3942, -4208, -4336, -3759, -2456, -608, 1040, 2588, 3990, 5075, 5171, 4938, 3564, 2308, 547, -891, -2154, -2578, -2525, -2309, -1482, -45, 1059, 1663, 2534, 2387, 2019, 744, -745, -2468, -3231, -4412, -4903, -4501, -3717, -2472, -1163, 509, 1854, 2472, 3405, 3261, 2718, 2258, 1557, 741, 257, 285, 233, 1214, 2000, 2333, 3010, 2984, 2692, 1452, 391, -1693, -3363, -5025, -6289, -6839, -6713, -5871, -4498, -2480, -261, 1716, 3305, 4889, 5586, 5418, 4874, 3979, 3003, 1583, 505, -87, -490, -415, -576, -165, 0, 77, -474, -984, -1691, -3022, -3545, -4542, -4693, -4591, -3762, -2330, -661, 1280, 2753, 4332, 5387, 5379, 4905, 4199, 2700, 1019, -737, -2141, -2749, -3072, -3042, -2073, -953, -141, 1061, 1798]
1901A798N27n9o43r19r57q99p22n01j32O46O98R51R92O43K71o1p28r40q00j109
1921a944q54j42K58Q51J003J447J809J077J245L44k76q08j818j584j667j693j169
1938c921p18j37P95P94J431J207J062R02K39k76m27n86p29p39J9L0P00J109J072
1957A827J154J013R1m2p01j303j706j885j380j120l91l24J135J021J372J451J297
1974A509R64K32l49p67r49j253j318p88m03L22R38J326J377J252J314M67J5n66
1992C323j121j420j153j172n77k65J33N82J258J248O27L79O01j044r11j086j417
2009b015j199p19m21M17R65J428J725J754J816J068J65l07p55j263j048j731j036
2026a156q48j22L93O67P54N45J025p7l80q25j070j540j036r55j56r1J367J326
$$ y = [1798, 2325, 2266, 1623, 704, -253, -1152, -1874, -2375, -2507, -1861, -1163, -212, 780, 1423, 1694, 1633, 905, -35, -835, -1944, -2798, -2940, -2682, -1831, -828, 619, 2428, 3505, 4750, 5094, 4818, 4010, 2192, 608, -1059, -2752, -3921, -4639, -4776, -3981, -3187, -1756, -549, 513, 1415, 1654, 1378, 951, 365, -364, -1103, -1084, -1054, -354, 755, 1827, 2981, 3994, 4085, 4043, 3342, 2039, 333, -1552, -2932, -4052, -4443, -4767, -3632, -2611, -1239, 212, 1509, 2473, 2705, 2356, 1589, 640, -613, -1931, -2719, -3122, -2800, -1862, -536, 841, 2093, 3407, 3874, 3889, 3323, 2202, 782, -371, -1543, -2120, -2385, -2252, -1670, -412, 836, 1463, 1842, 2443, 1399, 488, -598, -2015, -3214, -3933, -4354, -3937, -2972, -1544, 181, 1935, 3751, 4819, 4984, 4677, 3922, 2659, 1611, -120, -1156, -2004, -2126, -1733, -1066, -312, 233, 1258, 1181, 801, -24, -1094, -2634, -3670, -4625, -4781, -4872, -3505, -2179]
2044b179J638K120J789J316N57J38o37j044j496j147j332j024l77j05P43N59P21
2061B40R53j53l24n94j175j250j313n86o71J40J085J291J470K012J854J499Q49
2078E327L03p55r65j107j595j213r37r88q8J74L62P31Q78L85p2m16o45o97j033
2097b351o51o48J08P54O93J676J565J302R10Q28K44n50q60j092j439j276n89q80
2115b256K70L71N51Q62J016Q17n1K08q62q18q43j146r23l10q6K59J100J002Q45
2134FJ528N13L62l0l64m83q82n63o87k72L89K69M41M89Q50N30n4k45q17j090j248
2155a358j035p93o62mL64O42J523Q56J185J385M75N34J28l87o43p84n21n38k20
2174A47M5l22L93K02k64K61k38n50p13j46j201m31L8j63N46M09P60J329R22J221
$$ y = [-2179, -541, 1579, 3368, 4684, 5241, 5379, 4742, 3698, 2202, 1055, -277, -1301, -1678, -1783, -1040, -481, 240, 1193, 1040, 716, 122, -1053, -2303, -3616, -4202, -4873, -4733, -3648, -2357, -887, 1125, 2979, 4478, 5327, 5630, 4875, 3910, 2803, 1208, -5, -942, -1930, -2018, -1844, -1482, -751, 127, 512, 440, 24, -621, -1318, -2351, -3002, -3650, -3542, -2788, -2095, -419, 1146, 2448, 3358, 4186, 4430, 3880, 3020, 1928, 489, -787, -1376, -2256, -1986, -1615, -1064, -202, 814, 1631, 1580, 1788, 926, 108, -735, -1881, -2804, -3114, -3200, -2941, -1841, -839, 6, 1534, 2047, 2409, 2379, 2015, 1532, 650, 87, -600, -872, -483, -214, 227, 716, 1566, 2096, 2042, 1797, 980, -110, -1358, -2393, -3186, -3848, -3852, -3488, -2846, -1323, -467, 718, 2103, 2578, 3112, 3240, 2853, 2210, 1426, 905, 367, 147, 192, -130, 263, 465, 201, 462, 224, -326, -1039, -1185, -2386, -2817, -2779, -2942, -2396, -1987, -1227, 102, 1024, 2245]
2194B245M45L53J1n18l68r01o23j156j41l82q6J60K47l07N44M20l82J43l18m00
2214a014j02l28P0K44J58P28O58P16Q36K7L18j21k76l74l39o22p98m42l20r9k1
2235a101o7j02P39r6l5M92K73m22k71K16j58l24L46K96J22L67M70M1Q67k83j10
2256A260K40k00o87k63o46n07q1l04j64J54M23L05M33N47j69o4J03n4j67j04m12
2277c57l28l9L67l4n2M94M13J12M57J72j47j15r2k95k70k41l20NN9M5PL98k7k66
2301e4Kk59m12o23j50n94J80J0K67K35J301K30P18R29O31L27J80k36n49o04o50
2322H79q20p07o39O1n6j29J66K23J19j3K7l66j97K41j47K22L14M03Q81R40K17
2343A619J035L19k7k2l94j171p90r79q40o27n09j89K83M09N96M80P19N08L07O
$$ y = [2245, 2690, 3043, 3054, 2536, 2168, 1267, 644, -512, -653, -1035, -1121, -961, -714, -1021, -477, -57, -439, -296, -614, -1014, -1116, -1444, -1374, -1130, -972, -244, 414, 1130, 1966, 1993, 2311, 2190, 1914, 1540, 1201, 579, -219, -661, -981, -1080, -1101, -1168, -1270, -531, -627, -662, -170, 103, -319, -590, -374, -532, -856, -510, -214, -92, 275, 745, 786, 1653, 1370, 1260, 1500, 1300, 613, 350, -296, -803, -884, -1188, -1352, -1198, -775, -470, -37, 510, 341, 277, 380, 326, 159, 55, -357, -685, -724, -357, -391, -443, 51, 464, 576, 1033, 1205, 1058, 943, 851, 556, 286, 45, -275, -270, -211, -166, -159, 239, 212, -54, -52, -311, -723, -1346, -1496, -2090, -1910, -1900, -1633, -1398, -97, 133, 851, 1780, 2411, 2738, 2918, 2682, 2133, 1529, 879, 59, -648, -1287, -1226, -1282, -1411, -1245, -1022, -903, -916, -889, -1255, -1452, -1211, -1358, -1136, -822, -419, 462, 1402, 1619, 2654, 2973, 2946, 2924, 2530, 1359, 569, -410, -1250, -1877, -2386, -2575, -2292, -1883, -1287, -807, -88, 420, 727, 733]
2363G33p9n77l53l46k69K19J78L12N59P56J05M90j83l75n23m27p61n01m95J51
2383a386j2L89R49Q84K36O33K20K4l42o50n89j366o66m97m37J58L24O07J019O26
2403A24Q42L77L64j64k71l28l50m97m77J47l8M72L25N86M25j28j45k79r09j176
2423a100q57l81p93j07K89L42J026R87J106J088N60M47n7n06n65m50q41o0j97
2442f9m04K33Q1R34L43P9J28m20n76q11l93j142n38k58L71J24O36J159J006O64
2462A147N98L00jm59l73r12l31n39m7k57L27O01L00O45M31o4Pn29n75q30p13m84
2484a758j56l20N69M60N59J139P00M35L56k83m79m62j036m77l44l91J63J16N98
2503f11Q03N57O78M91J21n19j51n60n37p98o44%j18J02M28L89K91J30J47k59l11
$$ y = [733, 654, 77, -276, -622, -891, -672, -494, -182, 377, 1133, 1238, 1728, 1545, 1170, 647, 220, -541, -1042, -1537, -1386, -1398, -1009, -60, 824, 1060, 1693, 1913, 1937, 1595, 945, 356, -1010, -1676, -2173, -2610, -2452, -2128, -1521, -502, 124, 966, 1343, 1707, 1543, 1272, 944, 594, 97, -380, -233, -271, 201, 526, 1112, 1537, 1409, 1264, 985, 76, -1100, -1957, -2338, -3131, -3238, -2949, -2607, -1581, -594, 512, 1600, 2160, 2607, 2550, 2044, 1479, 1029, 188, 128, -69, -473, -240, -159, 775, 1118, 1197, 1325, 905, 329, -482, -875, -2017, -2555, -2813, -2442, -2318, -1682, -523, 483, 1147, 1745, 2045, 2044, 1585, 1212, 300, -31, -570, -617, -874, -547, 54, 354, 999, 1430, 1366, 1373, 844, 269, -561, -1274, -1758, -1914, -2234, -1665, -1205, -646, 493, 1193, 1628, 1984, 1701, 1222, 760, -276, -753, -1097, -1488, -1325, -1209, -611, 192, 749, 1427, 1918, 2039, 1520, 1369, 809, 272, -526, -1170, -1170, -1288, -1186, -758, -369, -78, 52, 199, -60, -371]
2524c71j49q88j24j15k48P35M11P47Q84J004O19P41Q0l45m68q55p46j433l89q78
2544a788k66j91L13J22N29K54L26K19J49j29K27L1K36l26N86L47K60O43M57M20
2564B419ml47l65q09p29q26q21o75N5j51k3N97N89M87O27O97K24J66J49j79o29
2585D52m52j37j90J31k12J27J63j00K40K11r8N8l02o1l48J29M8L2M76P6N34J86
2607I63K15o6J01n46k99m04n01o16m82j71J05j63N30K36Q71K23M95K88M07K02
2627A388j83n9p7l2k85J47l61n18J7n1l47j30k84j10j67j93j91K79j07K25K18
2648h21M56M31K63M54M72K35J86o6k66l14p6k91m71k34k32l87p6j51J69k12J89
2669g42rK00L20j63N85m0JRK54l0O0j01J32j07J57J13O3l58j2m8n37K38n76j37
$$ y = [-371, -520, -1408, -1532, -1647, -1895, -1160, -749, -2, 882, 1886, 2505, 3246, 3326, 2981, 2513, 1658, 912, -521, -910, -1788, -2054, -2245, -1932, -1810, -1281, -1027, -701, -482, -333, -462, -235, -204, 32, -294, 292, 639, 899, 1542, 1999, 2419, 2415, 2068, 1703, 894, 165, -661, -1482, -2157, -2102, -2253, -2276, -1679, -1090, -603, 24, 721, 945, 1111, 1260, 1081, 452, 0, -137, -327, -196, -408, -281, -118, -218, 22, 233, 135, 193, -109, -170, -518, -389, -341, -309, 167, 243, 777, 963, 1178, 1112, 1213, 667, 368, -36, -537, -1153, -1635, -1806, -1701, -1864, -1334, -1098, -227, -4, 491, 779, 1186, 1388, 1205, 1146, 1069, 1037, 752, 899, 538, 20, 37, -14, -361, -491, -775, -885, -1052, -1245, -1436, -1157, -1264, -1039, -821, -365, 66, 329, 783, 1255, 1490, 1676, 1610, 1344, 1030, 954, 663, 192, -42, -274, -661, -737, -888, -719, -931, -742, -751, -551, -231, -394, 191, 151, 152, 161, 415, 385, 445, 344, 476, 369, 526, 639, 702, 344, 332, 284, -253, -15, -591, -728]
2693g28j49n2OJ42J14N63K1J36L8K28M00k11j2M4k72r0j15j54K69p5qJ38L7j77
2717I3J44r2k06j41k57l72J4k9J99L16M0L68L78J68Q2L43k45k55j85l58n64k06
2739g65n7R5l32P18J39L23J73L1K54j42j64k21j42m21m6M8p6L61M0L7N30J72q1
2762D74l75l59J62n56q5k97R1K92K75N39N20N06N88L42q2l11l43p37n03m17o60
2783i36m99k24j18L92K07N3R01m7r2K07K75m96K11L86k12K40P05K32M72n3P36
2804B340l0l76p08o04p18p41r08p73J38m73N63L21O19O82N88O60K18J44J92J10
2824A244n74p2n5j07m5J21O6L97K26N2m15j04p42l48l39n55j54j80j59L31P69
2845f43M61K50O58K17J18k09j20l14o33n23k64j43M40J8L25N70K35N36N40k67
$$ y = [-728, -877, -929, -923, -781, -667, -104, -83, 53, 91, 319, 719, 508, 496, 540, 268, 178, 63, -91, 178, 103, 95, 233, 270, 93, 237, 145, -61, -202, -459, -831, -817, -846, -647, -331, -291, 77, 455, 623, 705, 1048, 803, 548, 363, 5, -559, -765, -822, -727, -1059, -341, -202, 121, 294, 325, 579, 437, 273, 52, -90, -511, -557, -509, -585, -224, -184, -147, 383, 555, 474, 99, -260, -98, -654, -739, -1036, -945, -653, -378, 161, 681, 1187, 1775, 2117, 2035, 1724, 1381, 644, 141, -276, -936, -1435, -1659, -1777, -1385, -1178, -1125, -224, -271, -363, -156, 119, -377, -166, 220, 8, 248, 953, 1185, 1657, 1604, 2340, 2310, 1934, 1226, 622, -96, -837, -1745, -2518, -2380, -2853, -2290, -1969, -1350, -668, -80, 580, 798, 942, 1134, 1244, 670, 598, 543, 436, 391, 512, 578, 975, 1201, 1253, 838, 734, -8, -356, -695, -1250, -1404, -1584, -1743, -1412, -643, -182, 68, 726, 943, 1061, 852, 732, 418, -215, -738, -1002, -1145, -705, -687, -362, 208, 443, 979, 1519, 1252]
2865A252J02m09o20m55j24k11l49q5L1J00O33J05J35m6R2m18m86o7k72J06j14
2886a100K98N89N22N97O07N44N0K01o81l59m55n81q43k20l38j9J8J75K54L23K22
2907a96O0N3j94m55J14N8k48K8K16L21J44O56N85K69K16J11l87j96m82l35n64
2928b26l46l25r5K1K36L16K82J61K70k6j56k97k50j8j79j1L3R5N03L91M70J58
2950A007K14K80k68k37l05m29m86m69l21J98JJ61K0M38K80o8K61q5q0k5l12l75
2972f00L86o3j65L49L9O26k11K76j48p2j7m05O0l57j90j44M1K75n3M85L43J6K82
2995G53K84k47M4j4m90l25J8m72k23J25J1k01K58K52r0N11j48%k99J40J30j39
3017a22K60j01J22J14L09J1K93j09l68K7k69l97j70r2l77q7M6O3K00L21L50P4
$$ y = [1252, 1354, 945, 325, -130, -254, -465, -814, -899, -868, -768, -135, -30, 105, 59, 151, -267, -753, -820, -1092, -986, -1100, -802, -213, 309, 906, 1513, 2057, 2107, 2308, 1627, 1268, 813, 232, -611, -831, -1169, -1188, -1170, -995, -741, -418, -196, -136, -83, -277, -732, -618, -560, -808, -780, -564, -243, -99, 557, 1142, 1411, 1627, 1738, 1351, 1155, 673, 338, -226, -572, -897, -992, -971, -735, -419, -137, 24, 294, 268, 112, -185, -435, -453, -632, -643, -610, -515, -12, 379, 849, 1007, 1221, 1501, 1233, 996, 691, 262, -224, -693, -1014, -816, -815, -654, -634, -196, 84, 16, 277, 192, 112, 87, -225, -600, -214, -277, -442, -93, -54, 572, 361, 637, 489, 417, 400, -5, 55, -302, -492, -636, -595, -320, -373, 112, 455, 471, 753, 1037, 790, 834, 820, 330, 5, 23, -449, -672, -547, -536, -737, -479, -227, -317, 194, 46, 46, -253, -113, 17, -122, 138, 37, 159, 273, 582, 593, 886, 777, 409, 436, 167, -230, -400, -492, -869, -956, -910, -847, -647, -326, 24, 98]
3039I8K49J89J25J87l99Rn1k05Nk17j10J51q5k34K74%l18K41k8J80o1r2Q7J12
3063A07K2qQ0nL24l06L5o3R5k23k11m4k77k77J22r9q3K78lJ74K47K36K13J73K02
3088G09J40N9l82n3j41k01q5j01r7j15n5O4M38j84l8J19l01l20J90PM1j24K33
3111a97M10O1J24J16J2K38k53m4j25j72n65K26k81j33l71N34J9K14K35j80Q9L13
3133B70q3l17K87l39J92j89J08m1K37L20k12Q1L87k28l4p5l74m33N4k69r5J30
3155f23J16L07j00O86K79q0L32r8J1m1l37l56j00j28M2k00J47K6l1K3J30P6o79
3178e98l1p8ml59K83M6L25M17L8O36R8K32N9j33M0o06p0l53l49k30J13j12L8J80
3202d18L76NJ28l6L2l04P6j02j91Q6j75J73K92L50O5M68Q7j31p6k27k62l66q1
$$ y = [98, 347, 536, 661, 848, 449, 458, 407, 202, 207, -10, -120, 31, -54, -288, -14, -14, -332, -91, -119, 61, 0, -92, -5, 107, 129, 121, 201, 196, 520, 214, 249, 186, 281, 58, -153, -197, -474, -751, -629, -728, -811, -533, -536, -362, -115, 121, 334, 507, 709, 849, 908, 526, 473, 332, 131, 46, -55, -152, -267, -322, -258, 180, -4, -42, 77, -224, -544, -354, -347, -306, -430, -197, 213, 274, 398, 514, 526, 764, 511, 467, 342, 170, -395, -169, -450, -583, -954, -420, -401, -187, 48, -132, -43, 270, 187, -130, 157, -182, 10, -179, -71, -112, 125, 445, 233, 314, 701, 473, 439, 364, -10, -443, -389, -658, -753, -623, -507, -200, -300, 386, 665, 585, 917, 819, 830, 789, 452, 96, -4, -132, -90, -290, -143, -117, -148, -125, 5, 81, -598, -629, -707, -711, -1070, -787, -741, -416, 1, 39, 675, 773, 1005, 1064, 931, 971, 365, 295, -58, -407, -637, -524, -636, -598, -418, -42, -37, 91, 55, 87, -217, -141, -243, -434, -348, -523, -350, -58, 292, 357, 825, 912, 781, 705, 478, 216, -150, -231]
3225b31l25j8l8M8L23L47M1O63J02n2m28k99k20N5o00k43O0k22K39J21K37J96
3247b44M12o4K60l4j84L4R9Lj85K95J44R7M09j15Ro7j43p52N7n24l84j46n25J20
3271a428J54N8M54L91K94P01j4K02M6%kk90r2J44m30J41J35l19K18o2j19j25l91
3294c34K20o45k2j84m61M33J77j33M01M67K68N12j45Q0K84l43L1m60K9j30j53
3315a08j49K09J78n6K79K09r8k62m6J7k33j03k35K8j84j3K17M37l8P7N4RK73n95
3339a33k1j33J15j27J88K72NJ43K46J74k47J82J2m53k27j83qk17l98PJ70J96j87
3362f24L27O7K84p6J36j32L5l11N78l54N7K96pj68L92J42j66j96m6k30R5l4k55
3385a90k48J62k41K2J99L76n0J6oj16j3K77l0l39R7J00j05J14j67M10k64O0R7
$$ y = [-231, -556, -574, -612, -564, -241, 106, 147, 810, 912, 860, 432, 133, -87, -32, -632, -875, -815, -1037, -798, -677, -440, -244, 168, 104, 364, 330, 146, 180, 279, 282, 97, 392, 536, 633, 1042, 927, 936, 869, 726, -26, 31, -493, -877, -1023, -1548, -1428, -1274, -1216, -762, -371, -77, 624, 610, 812, 858, 858, 856, 566, 474, 618, 188, 329, 464, 145, 363, 301, 182, 57, -334, -114, -759, -781, -965, -1426, -993, -816, -949, -548, -81, 187, 699, 554, 634, 918, 575, 606, 146, 175, 45, -108, -257, -48, 130, 74, 353, 562, 464, 202, 156, 173, -60, -163, -398, -370, -554, -567, -350, 87, 49, 126, 180, 189, 462, -133, -154, -287, -172, -299, -111, 161, 166, 309, 555, 729, 482, 664, 676, 223, -4, -187, -195, -412, -810, -803, -633, -437, -624, -297, -230, 54, -22, 114, -18, 17, -294, 284, -70, -13, 283, 276, 108, 500, 642, 476, 280, 234, 4, 99, 65, -190, -438, -276, -517, -495, -296, 80, 30, 46, 40, -76, -89, 188, 158, -181, -84, 16, -89, 25, -142, 268, 4, 64, 161]
3408A61j27M4k12M4j66J37j35J01Q9j17O9J90j66L49k70K2M8J81j23J70o5k08
3430A6L24j03k9rN0j21j49j19N7m6k4J47o09J72J23r3R7o4K37J52M7j6J02j51
3454ioJ66kR4K3R8P3k08j01L7j56j4l34m7j61q1L04j37J36N6O9M0m2K84l0O6j90
3481g2l7K64J07l9J71Ok4R7jk70p5J42l26j93J87k37Q5J25k06J3K08o0p2K90k90
3506b07J13k47K51k27k47L76n9OJ34J53M4N42k80P4J06j62lj34m57K79j09j78
3528b32J51q2K9R0k32k6J0J12l67Q7nJ1o2P8J99K48K70M4L54J25n0k80J31j37
3552D66P5k50k00l39Q2K72k13J8o7l6kN5k17k67J77p7m1P9j16J77K04R0L13RJ21
3577C13J21K3j18N3m1o7j19l01L59L9J08j95j26J97J33j42l11j15o3L7l55J53
$$ y = [161, 34, 78, -134, -90, -256, -119, -254, -153, -64, -181, -112, 78, -88, 261, -9, 13, 61, 242, 119, 289, 224, 16, 340, 237, 208, 199, 249, 128, -21, -140, -83, -129, -153, -6, -615, -443, -320, -413, -316, -380, -143, 9, 56, 40, 142, -9, -15, 151, 149, 243, 266, 364, 437, 229, 128, 165, 9, -5, -339, -386, -547, -628, -324, -461, -325, -269, -200, -160, -202, 82, 52, 118, -72, -109, 155, 262, 223, 394, 400, 376, 473, 472, 202, 127, 269, -57, -250, -63, -300, -215, -90, -296, -283, -75, -135, -207, 83, -207, -94, -341, -90, -317, -564, -188, -247, -241, -107, 46, 90, 632, 352, 426, 532, 370, 367, 233, -224, 55, -54, -232, -81, -163, -134, -44, -276, -302, -292, -180, -547, -460, -465, -454, -516, -438, -239, 9, 279, 323, 677, 802, 752, 472, 603, 466, 541, 291, 91, -248, -166, 106, -107, -89, -156, -192, -194, -139, -356, -623, -446, -523, -564, -485, -601, -424, -220, -130, 183, 192, 313, 434, 457, 339, 392, 351, 284, 165, -136, 223, 262, 370, 175, 49, 246, 379, 237, -74, -189, -252, -215, -570, -417]
3599d17N6J89k95L16J25K3j72K00N4K70jm39K79N7J56N5K8l3mp1J75k19j72r6
3623F4k01j68r3l65J03M7m4J12p6J22Q0K37J28L09l02O0j98M05J57j88L43k15
3645C17K08j08l08K24j01O7j10k57O0P6k66j74j33K90j48RJ09K15p5Q1M2J04j73
3668e1K03k69K26K49l88K65J65m30M76r1j1l01K99j87j16K95j48k02j67P9J5N0
3690c9k06K46k49o8J15k93lJ65K50j79J59L15j02N7k1J90J66l5r6l3k40Q7j3o6
3714A07R8N6k19Q0l43j88K42k45J65j67L97j18M5j02L04j0o7J07K72j81j17J12
3736B28k0j97o0k28J62K0j37K14j17L40q9Ok44L02k61l6k8J21j71L33l2R8PJ81
3760C92k55l24L92k39k75J27P8j99M36k37J35J49j22J61J44r2l8j51K9n3P9k5
$$ y = [-417, -361, -172, -467, -151, -26, -3, -175, 25, 79, 349, 348, -91, 188, 245, 401, 456, 484, 451, 447, 376, 551, 332, 160, 64, -137, -305, -398, -763, -660, -613, -657, -545, -621, -499, -419, -182, -54, 255, -47, 13, -185, 220, 377, 189, 532, 317, 525, 417, 109, 333, 232, 299, 189, -68, -8, 68, -198, -372, -505, -215, -363, -354, -245, -30, -105, -24, 18, 122, -51, 152, -117, 109, 358, -30, 235, 400, -30, 446, 355, 344, 43, 342, 155, 39, 334, 186, -16, -183, -104, -89, -39, -245, 1, -248, -316, -201, -494, -497, -332, -82, -261, -102, 213, 111, 168, 147, 337, 503, 468, 372, 339, 99, 186, 173, 107, 205, 261, 42, 122, -221, -409, -167, -412, -247, -414, -17, -135, -90, -192, 112, 102, 35, 142, 414, 233, 116, 228, 208, 11, -49, -277, -115, -95, -232, -18, -135, 205, 116, 122, -122, 180, -81, -117, -145, -24, -195, 138, 106, 204, 211, 392, 137, -187, 205, -34, -309, -182, -104, -303, 133, -104, 31, 180, 58, 219, 363, 271, 233, 82, 111, 58, 137, 112]
3782A12l63M04O3k78j24K86j79J75k13J57j98o4K12k43M5J76k12K88k85L00J55
3803B14j62J16P7l56R5j43J05l34K60NJ88J40j86M01j42K21k87K50q3j18j88k62
3825a89K90O1k38j76j3j8Kj47J99oJp6J4J93j32L5K97O9l5L62Q4L9Pk93K47p5
3851E02l42l9j29j66o4k60n4P6L33m02K02J89K24k4k09L4j60L78j33J44r5J69
3873A74KK68j56L3nJ11k1j46j57k02J60k04l1Pl6Q6O0nJ80M8J57n83L17l44J53
3898a34k31n2m1K4qK38M14l83M64l38N67k33M1Q2j22Q7q4j47M7k30J3J44l8j78
3922i8J73m75J71p8j07J49m71K35n2J73K13j19O50Lp5M58q2k56J36L7j97k03k0
3945A65j93j42k07J51J3J15J04K47j99L4o5Ln16lK26j51J68j91L77m0J62L36l63
$$ y = [112, -251, 153, 216, -62, -186, 100, -79, 96, -117, 40, -158, -222, -10, -253, -208, -32, -244, 44, -241, 59, 214, 52, 168, 245, -111, -16, -159, -54, -388, -128, -123, 65, 205, 19, 420, 278, 499, 212, 462, 379, 261, 73, -189, 101, 162, -76, -252, -265, -283, -281, -428, -229, -235, -234, -310, -296, -103, -235, -200, 97, 166, 131, 493, 577, 616, 623, 330, 577, 502, 160, 121, -8, -174, -238, -498, -552, -476, -143, -545, -343, -154, 70, 46, -163, -129, -289, 89, -44, 100, 5, 174, 176, 444, 288, 321, 316, 427, 406, 260, 103, -99, 61, -143, -174, -167, -203, -117, -57, -62, 118, 166, 323, -260, 57, -287, -134, -365, -417, -458, -434, -442, -204, 210, -173, 291, -47, 520, 287, 328, 410, 288, 375, 291, 144, 191, -39, -26, 118, 80, -98, 75, -400, -229, -307, -414, -265, -736, -501, -553, -380, -167, -286, 364, 367, 292, 750, 668, 412, 548, 585, 388, 185, 165, -28, -170, -377, -226, -213, -98, 6, 253, 54, 88, 23, 26, -490, -493, -267, -418, -250, -441, -64, -104, 58, 394, 31]
3968C1J55j78oq6j20K10j64K0P8L29j50K60q0K33J56k26M4k83M1l78m7m29o0Q8
3992e62L5R8J47P4L07j6k57K10r2J54J9j26J40P4p8J28M93MJ08m47J80p5k71m86
4016b39l83J08k76J57k69K46L29L6K96J60k75O8K28K9l54J80j93K37j28n2L72
4037B77N0J36K6J11j62l01J08nk68l18K67k73j38m8K13MM59K84m97o6J14J04l23
4060b46j07j7j82J57J09J60J97M3K93j2K29o6k26m7J66m66l21P9j34J23o8l6N23
4083A51J7k35k32K24l95P7k3j14J76j59J81J68M21j82O40J01m0l4j13p6k99p0
4105A84m46J52l3N1q2l7K65j16j46L04j85m9j91j32Q6J51j82J06Q2L97K0P7K91
4128E67j15j16o3p9j32j18Lp0j04J46j95K15L44o6j45Q1p4nQ9k84k22J70j11K49
$$ y = [31, 186, 8, 2, -84, -204, 6, -158, -138, -60, 269, 119, 379, 299, 532, 688, 462, 506, 223, 264, -114, -161, -590, -650, -562, -527, -429, -282, -208, 99, 83, -174, 36, -56, 98, 117, -9, 131, 205, 127, 255, 748, 752, 860, 413, 593, 518, 247, -239, -622, -514, -790, -633, -902, -656, -327, -291, 5, 165, -110, -42, 186, 215, -139, 41, -152, 85, -43, -95, 277, 327, 463, 489, 600, 438, 137, 245, 240, -28, -346, -79, -352, -490, -538, -325, -321, 138, 422, -75, -141, -27, 77, -246, -353, -370, -552, -395, -286, -126, 71, 114, 407, 395, 624, 558, 332, 285, 451, -15, -336, -257, -391, -268, -336, -372, 151, 168, -67, -299, -75, -470, -393, -416, -530, -354, -513, -332, -164, 257, 75, 715, 816, 776, 742, 629, 553, 254, 184, -262, -110, -143, -92, -174, -211, 54, -62, -208, 96, -89, -138, -329, -461, -375, -224, -406, -300, -218, 179, 199, 276, 567, 452, 336, 273, 194, 62, -56, -53, -123, -227, -81, -276, -61, 283, 217, 72, 153, 79, 74, 163, -121, -343, -173, -284, -35]
4152c5k07P2L16J58j99K38N1j57J12k02k84m7k2P6j07K29l9J67Q5K1j27O4j23
4175D0k6k7l84J95m4J07j08J95m7J43J56J66k58j38n2j06N8M9q3k03L60k83J38
4198a52J32O6j11L32j94o9l8L11j21k87J45M14L0j56k61Q5J79m74J39P8l55J51
4220a56Nj77L08j90q7K7N6k1M7J75j57L7j53J28J16J88M2J80P3l8q2K27l29K0
4244B39R8n01J89n2M6k97K78K6k30K6P5L1l7J2j87q7j04K84l7J49K21N9J79J63
4268E43j71K12j90Q3q3j02l88K32l52r9K27J77j57J81kN6k16m14J53k31J36l57
4290g62J42J71J58M35j52J19J34L04J8k9K5j64j65j19k20K60O0l23L4J71l6k0
4312D1J03j16l05l54K11l31j49P5K45M30K43K34J26K04Q1J18l2l5k18l92k02P3
$$ y = [-35, -242, -170, 146, 304, 105, 343, 394, 237, 349, 147, -137, -184, -206, -130, -237, -8, -47, 120, 205, 226, 99, 163, 40, 14, -13, -397, -202, -246, -139, -247, -52, -99, 44, 200, 366, 108, -30, -82, -188, -130, -81, -164, -367, -7, -290, -152, -20, 46, -65, 267, 73, 4, -34, 277, 156, -131, 14, 428, 458, 302, 41, 126, 305, -169, -30, 48, -307, -156, -151, -328, -20, -210, -297, -270, -214, -235, -188, -13, -170, -133, -286, -158, -42, 146, 188, 368, 441, 403, 321, 548, 219, 239, 337, -164, 25, -27, 19, -278, 0, 26, -204, -178, -103, -72, -109, -97, -284, -371, -475, -191, -228, -79, 142, 201, 380, 543, 372, 584, 394, 477, 394, 292, -96, 136, -216, -315, -88, 89, -68, 113, 111, 167, -49, -463, -310, -541, -405, -762, -620, -449, -291, 144, -8, 111, 245, 549, 567, 538, 563, 399, 234, 115, -105, 155, 215, -108, -74, 97, 61, 41, 144, 28, -277, -631, -420, -751, -900, -825, -580, -150, 93, 327, 453, 657, 738, 856, 824, 789, 571, 179, -23, 50]
4334E0l86Q2K2J73K54k01q4J12k19J41m64J82l53qJ14J4K18M07J08M89m1J58J67
4357I35k00r3m21m48j67k30J96k31M61K16K43k6J86K16m33j02k30m1j55k70q6
4378f80N7M12k34N81J53K48R0K7k48j69p1l84k50om5J32L37J74lJ95J76j40K8
4401C80Nl22o44n3l26p0L7K04J43O11J83J32K46K30j3k13K4m71k9K7l18J10N6
4424g1R3P6J82K21j07l15Om40j46o5k95NJ57%J56Q91J66N05j75K31k4r5l93m43
4448A20l5l61J06k83p8m7M31P1O9L90k1l81k26k08k88J58k50J5K30M34O63K82
4470G91J1N4k2QM9k84l30l03l47k5k79q0K77L24J01L37j00k4K3r3j08m00K6J7
4494c77l83L73L07K36L53K12m3J14j43j21k03k93j77j06k72n7J08M49k9L05Ml6
$$ y = [50, -336, -254, -232, -59, 195, -6, -90, 22, -197, -56, -520, -338, -691, -699, -585, -571, -353, 54, 162, 651, 610, 768, 935, 735, 642, 221, -227, -394, -624, -428, -659, -198, 18, 261, 235, 421, 637, 204, 102, -128, -169, -324, -594, -680, -623, -211, -445, 136, 289, 537, 627, 654, 406, 237, 166, -218, -468, -474, -519, -387, -50, 124, 121, 316, 492, 352, 380, 385, 63, -581, -634, -960, -1030, -993, -789, -646, -35, 148, 280, 526, 756, 743, 530, 554, 83, 54, 81, -237, -127, -71, 22, 98, 280, 501, 394, 79, 85, -355, -501, -566, -861, -856, -699, -699, -543, 348, 514, 1019, 844, 1075, 1051, 956, 563, 120, 85, -276, -170, -453, -531, -578, -147, -76, -7, 383, 362, -19, -245, -453, -741, -583, -833, -818, -588, -154, 509, 791, 802, 856, 834, 842, 891, 607, 277, -26, -373, -398, -677, -757, -480, -156, -55, 282, 182, 158, 181, 88, -20, -420, -394, -377, -760, -387, -80, 156, 509, 721, 678, 792, 649, 528, 325, 32, -145, -251, -523, -580, -472, -23, -52, 253, 257, 221]
4516B21J58j12o2j59l49r5m6j96K52J39L37l9L13L6L2k7j50k45J64q2m42L20R6
4539F4j88K08N9J96L34m08K55k60k96P2l00l18J33J7m2m0J46J73rL49J62K7k63
4562G1J38J11j89M9J28k55P7MO3l7q8K18k55O8k47j55J57j74J40j02o7p2K88K91
4586A62j73J56R6R6R8N7k6j70j52K23k18rJ86n10J06Q5k01R4Pk87J6K59%J01k4
4611b8n9L18N0o7k30M79k37j07l6k9J87o48K29J34k19L41n32N2j53K29K16j60
4633b70L70j07J60L92k37K48j19J69J13k37k81n81P1k36o8J2L20j47JK73j55J0
4655b99L24k3R7j17J05j16J01P5j9J86Q8K63m7q0R2j48l32l99q6j06m56R1J15
4678f91k7K25L38K87k66O05k31J17j11r0M0k25l25N4J53j71M70L84k49K56J27
$$ y = [221, 379, 267, 205, 46, -303, -398, -444, -640, -388, -249, 88, 49, 362, 398, 430, 403, 253, 8, 172, 90, -352, -32, 64, -124, 84, 143, 339, 673, 265, 520, 260, -36, 36, -264, -582, -449, -432, -474, -514, -368, -195, -204, 145, 307, 334, 71, 209, 320, 131, 180, 308, 53, 130, 134, 197, 160, 72, 290, 35, 103, -144, -299, -142, -316, -176, -278, -345, -417, -129, 162, -11, 145, 241, 337, 435, 492, 466, 296, 144, 367, 149, 140, 326, -184, -78, 7, -194, -100, -93, -380, -364, -105, -105, -4, -28, -87, 231, 281, 214, -16, 463, 226, 119, 83, 54, 241, -407, -178, -44, -263, 78, -454, -402, -555, -326, -110, -270, 100, -7, 153, 545, 308, 556, 437, 606, 719, 482, 201, -380, -309, -545, -613, -601, -281, -428, -427, -154, -309, -299, 25, 2, 99, -18, 87, -29, 72, 147, 128, 314, 402, 665, 618, 538, 630, 482, 150, -249, -335, -441, -897, -806, -691, -718, -493, -155, 132, -134, 471, 240, 357, 246, 156, 196, -29, -354, -300, -147, -318, 152, 536, 287, 543, 670]
4699F70k21j29k22j49m76p0j64j18K02N11q4N33o4L08j64j50J36n60k46k05j%
4721f63J27O59lL90K05K77j0P4k77l92k83k64l93k13p7J65K0O38j88K03L65J7
4743C77J89q78q8k36j46J91j08J80N16n5P06L68J86l3J36k63k22o56l24m21l55
4764i36R5j1M48K4J28O02n1Q3l31n7P6o01k50p4O1kP66L26O47N6L40J07ok96l37
4789H07n50k27p95j92l6J76k04L77K48K69N26n2j49j00l39l62p8q5Q6K18K02Q24
4811E64L35L65J65l8N1j52k85o09p71m08l61l59j30M43O33J71N30J15J10K5q7
4832C07l50m7k79k13L6P2N60M93l6P13J05j71J23l44k51p31k46m78p8k33j75K75
4854i48M81O7M28L94j9J04k23k93r3l68l91m4K92N40r4L08N75K17J02L82l78m45
$$ y = [670, 449, 320, 98, -51, -527, -597, -761, -879, -677, -166, -250, 283, 219, 527, 363, 213, 349, -211, -457, -662, -663, -663, -536, 123, 120, 510, 715, 992, 982, 1056, 779, 387, 104, -160, -553, -766, -843, -678, -658, -20, -208, -5, 360, 377, 566, -312, -400, -636, -782, -591, -699, -519, -3, -58, 648, 1016, 1202, 1169, 1305, 1042, 820, 164, -160, -581, -936, -841, -852, -404, -380, -252, 350, 299, 382, 51, -6, 70, -531, -781, -855, -794, -796, -30, 296, 943, 999, 1339, 1446, 1440, 1144, 807, 257, 30, -765, -957, -993, -817, -1021, -644, -396, -127, 399, 347, 198, 98, -241, -603, -681, -766, -680, -462, -260, 564, 899, 1264, 1429, 1391, 1442, 1290, 1005, 396, -375, -783, -1144, -1503, -1633, -1190, -557, -386, 144, 259, 369, 394, 307, -43, -90, -369, -582, -546, -474, 86, 579, 543, 1256, 1361, 1190, 1313, 969, 718, -13, -259, -737, -815, -1048, -1223, -948, -467, -400, 28, 422, 403, 507, 284, -9, -102, -470, -861, -905, -613, -73, -167, 141, 716, 933, 1035, 1417, 1039, 594]
4876E94k53k98l15k33k58P1J91L58J87M3J16K58k51k11m74j71l16J21k78L70O
4897g43M96K48O85O15L7K78m61j04j52m49m38l67m17J64M0K64j04K57j45L02M
4918A0j42l45M3k58k33K26Q2M50K65L87N57J53Oq2n2l16l30l68k58O0l99j28K50
4941d22n7Q3J34K62K9k48J42J18l54K3j08j41K80N2K10L74R5J47m1L83k83l46
4963C32M3m63K10o15R4k4J84P3K00n5J65L5j20k14q4mk3j01J17jK00kL05o1J66
4988C57J95j89j92J65l12J02k18o7j5o6K76n9QJ51P6o9j24P5j12j0Q7m41k4J80
5012b26p3K20o1nj08J35K44l52J35j32N01k45O0K16L05k91Q5j63j45Q5J08o8k71
5035d6oN0k49rJ99j0j02r4J20R3o7KJ50l21K48k02L89n7L51r1K94j09k06k58k6
$$ y = [594, 341, 43, -272, -505, -763, -692, -501, -143, 44, 87, 203, 461, 210, -1, -475, -646, -962, -841, -1119, -749, -743, -247, 1, 686, 1301, 1338, 1616, 1155, 1051, 899, 450, 12, -355, -772, -608, -568, -304, -408, -151, -296, 6, 10, -132, -477, -434, -692, -925, -699, -617, -167, 98, 485, 1042, 1195, 1201, 1119, 1067, 751, 421, 53, -205, -145, -544, -672, -422, -479, -396, -262, 0, 29, -219, -77, 41, -313, -290, -398, -539, -259, -207, 3, 377, 472, 619, 578, 961, 678, 332, 375, -88, 122, -493, -399, -423, -239, -166, 34, -21, 144, 179, 59, -155, -239, -243, -266, -367, -250, -251, -51, -53, 252, 191, 357, 552, 363, 171, 336, 24, 126, -92, -159, -174, -240, 36, -23, -15, 136, 212, 143, 19, 94, -18, -28, 59, -382, -406, -226, -299, -79, -140, -145, -253, -118, 126, -226, -91, -223, 278, 33, 93, 309, 614, 323, 408, 245, 100, 185, 293, 225, -46, -52, -2, -251, -260, -61, -71, -173, -267, -147, -54, -121, -119, 31, -290, -42, -244, 145, 88, 439, 348, 642, 533, 327, 69, 43]
5060D3k2l15r9j18J96k7R7L83j76K86k51K51j33k55Jq5J8q7j56J32K95K29L97
5083F04l80J48j9l76nj15j95J04m37L87J42J93N21j68K69n7J81k43lm88m72j92
5105f01j37J41l34L89l2J90L05K24j04K61k83L37l65k60K09j64j1L9O55J33J20
5126G12K8J96j47m56j43n29k23m80nM4j24L2O03L49J76M51N43l59j73k45j50L6
5148A36m58j65K89J71L43J11J91N0J5m15J12j60o74l17k36j1l27K61K90K55Q12
5169B73J4K17J41K5n2j74k22m10l35q6J10J68M37R6K85J2K90Jm9n69m48K3m67
5192g20l22r4L43M1P2N55L10M51K90Lk63k92n30l77K31j73m3K48N8N93K29Q3K42
5215I35J9n14K37p60m46j59o8k32r3L56L58M28L61R5J97m55Q3ml51l19j6m52J96
$$ y = [43, 21, -294, -393, -511, -315, -342, -245, 138, -38, 248, -3, 248, 115, -140, -139, -224, -206, -293, -449, -317, -22, 207, 604, 224, 372, 353, -23, -28, -143, -338, -234, -671, -284, -142, 51, 572, 404, 673, 616, 797, 554, 551, 63, -409, -601, -738, -597, -931, -542, -574, -384, -79, 145, 41, 302, 19, 356, -9, -269, -60, -224, -235, -196, 459, 592, 712, 740, 936, 789, 333, 190, -339, -562, -1042, -1047, -1003, -1127, -1095, -492, -143, 33, 484, 1027, 668, 495, 250, 100, 136, -322, -487, -198, -27, 316, 427, 618, 668, 683, 268, 380, 220, -454, -771, -1007, -1018, -1345, -1084, -794, -539, 273, 287, 504, 645, 670, 618, 444, 222, -188, -523, -609, -499, -331, 106, 202, 487, 499, 789, 790, 741, 172, -276, -253, -720, -1042, -1136, -793, -752, -680, -125, 185, 636, 926, 929, 666, 374, -156, -533, -302, -475, -518, -270, -212, 381, 610, 693, 935, 954, 440, 677, -83, -529, -688, -756, -988, -1081, -725, -367, 61, 422, 517, 714, 259, 342, 338, -13, -332, -348, -800, -604]
5238f04K49l6Q96R9J51L29j46j1l49n58J26n41l93l53L44k1N45Q1L74N6J13n3
5260B98R6k88j42l78o3p5L87Q1L31L40L31p7L13k86j27l54l94m09n76j92j42J28
5282a198J32M18P0O00L45q6K82Jk39j3k69k85K62j81K53K83J23L47j6r5K47q23
5304A58ql18n92Q2k13k19J44J63K10M92K33M96r6JR4k89r7k75j1j32R0n1L73r2
5328A43N8L70K0J6j23m12k06k04l4k96K12k92L61J24L24J91k29K27M13m15m21
5349a73Q6k06j3Q3k41L52RN11j38L61j70J98j11p3k19j1k16l43j22K47n8J7O3
5372a67P6k27K11J95Lk12J12qk29M3K12K75J28j68J54pN8M9k58r3k00l4j43J88
5396d2n12K39K6k7K93k89L68j80N3J21j27q7M9N0O9J61j03M1J24K55r8m8J60l67
$$ y = [-604, -355, -391, 505, 604, 755, 1084, 938, 927, 578, 20, 146, -395, -788, -1141, -797, -818, -273, -192, 182, 238, 351, 298, 394, 106, -36, -414, -477, -552, -165, -84, 247, 587, 918, 841, 1154, 868, 741, 387, -7, -416, -992, -1184, -1326, -1198, -1066, -648, -578, 22, 367, 281, 563, 564, 325, 312, 43, -242, 20, -161, 92, 375, 498, 845, 829, 734, 981, 158, 150, -168, -760, -678, -891, -1110, -966, -803, -593, -101, 132, 628, 532, 533, 627, 338, 241, -34, -45, -177, -87, -138, 235, 143, 201, 571, 591, 607, 484, 72, -134, -338, -372, -668, -456, -748, -387, -263, 61, 252, 23, 250, 663, 248, -173, -87, -293, -306, -223, -464, -112, -103, 408, 270, 631, 461, 659, 548, 475, 256, 245, 29, -314, -436, -189, -247, -230, -167, -91, -318, -107, 88, 91, -121, -9, -17, -246, -203, 9, 284, 412, 244, 398, 391, 449, 498, 240, 147, -53, -87, -230, -42, -554, -315, -289, -316, -23, -312, 56, -124, -71, 50, -77, -164, -115, -65, 4, 165, 62, 103, 227, 482, 384, 336, 496, 129]
5420A29j17m5j0J13j59K20P7j64j26J06M2j25J83m07R5J50l05K40K1J61j16L87
5442C50j33j19j94K30n3q0j79j0NMl03N26K00j05O1k25J54k15J7j08P1j00J63
5465d3q2K31M3Q6M4J92k93j97P8k84m7l1k6l23O45k36K27L39k98M56J35l43Q3
5488C56Ln61K2J17j17J29K0j3O6K66K6j06k41l1j26k9l22K40n83L57O7J21M07
5511F8K92J23j01L21j33k19Lj07o19K91l96M0J90P0jM33L24k62j28j40l35q7k67
5534f40NJ61K8M4K53K60J09L70K42k86P4q3l91k01j48j60k3p6K54nN85P5J7j17
5558C47R5k57j31l81j59k23J72M0qL60l5L91K26J95j17K00m30n6k46k41J0j3j4
5581b75Q6N44Mn5K76K9n95R8k02l00k47k18J62k50N96Q5J14J20M61oJ20q9j08
$$ y = [129, 12, -33, -43, 70, -89, 131, 208, 44, -82, 24, 66, -59, 124, -283, -188, -38, -343, -103, -82, 79, -37, 350, 217, 98, -96, 134, 81, 1, -178, -188, -183, -179, -482, 44, 244, 139, 200, -25, 129, -86, -69, -177, -106, -206, -43, -125, 106, 149, 235, 279, 471, 178, -19, 59, -225, -272, -303, -329, -652, -7, -243, -16, 323, 25, 481, 616, 273, 356, 359, -202, -180, -63, -180, -51, -31, -44, 22, 288, 314, 208, -33, -64, -190, -219, -541, -301, -884, -527, -460, -339, 68, 360, 483, 382, 703, 570, 351, 354, 247, -372, -81, -477, -437, -247, -177, -178, 255, 579, 317, 189, 49, -286, -373, -640, -635, -474, -446, -402, -149, 111, 220, 590, 832, 546, 620, 537, 146, -55, -203, -363, -386, -462, -208, -213, 372, 447, 464, 347, 442, 185, 54, -327, -486, -709, -537, -497, -505, -145, -180, 211, 437, 632, 515, 715, 285, 229, -17, -258, -248, -261, -275, -189, 355, 359, 304, 580, 609, 14, 112, -90, -390, -637, -855, -693, -943, -347, -262, -148, -28, 433, 427, 547, 458, 350]
5604C50r2j48k97J88n05K74J48OL65L34k25R6Q7n93r7l71j74m29J19J40J20L58
5626c46L04K58K2J76K95N2k55l32j35j39j27l22K46J41K63J53L8R8q9j73k34p8
5648a84j71Mk77K2j8j08O56LK25K82K93o3o2k85n4Mn19R6l08K47q5O5L75R3J40
5673C71j22J69m84m0j91l2j12l34J08K10K87p7N93m0L42l84K31j78j05J3l12k51
5695c38M0Q9N3J67J37K90j09J27m32K1m7m00Lj29L7o8J65Q6K84j4M03R5k72M04
5719E92l40l30m8Q0m16K12p0L70N1L33k40J35k02o6R8j81j58k42j92J5L11L9R1
5742a58K01k37K90L5M32k45n8R5j17k14p6J85k98O7L33N6K2o3M1k13j49K8k63
5765c06kk16P4L03m4M7J99R8J31k9K42j19M1l13l2l30L22k01J11M1k85M20l4j96
$$ y = [350, 258, 110, -187, 1, -504, -230, -82, -76, 289, 623, 398, 494, 581, -12, -109, -480, -654, -1083, -964, -824, -704, -346, -42, 216, 238, 414, 709, 761, 506, 174, 39, -100, -227, -549, -303, -162, 101, 254, 292, 390, 301, 128, -106, -184, -355, -351, -628, -606, -624, -732, -76, -73, 152, 434, 727, 664, 602, 317, 263, 267, -252, -156, -464, -217, -302, -237, 138, 231, 371, 249, 418, -66, -106, -297, -329, -441, -775, -667, -457, -170, -247, 346, 306, 648, 264, 495, 317, 212, 225, -87, -338, -298, -209, -156, 11, 148, 438, 329, 456, 24, 45, -2, -402, -399, -528, -491, -559, -394, -308, -24, -38, 365, 460, 188, 592, 252, -78, -126, -46, -462, -250, -320, 50, 101, 434, 194, 329, 127, 61, 159, -22, -180, -422, -614, -599, -288, -249, -158, 43, -194, 96, 131, 563, 318, 260, 355, 238, 24, -52, 133, -165, -98, 235, 291, 313, 250, 291, 78, -71, -43, -306, -308, -524, -450, -147, -191, -144, 55, 153, 284, 255, 497, 378, 419, 106, 74, -256, 66, -135, -24, 17, -268, 152, 118, -78]
5789g8O0j0p6o2lJ59l6k34R4J80J04o0P4l8M2p5J79J0k4n07L46j52j75J50J37
5814Ej94K50j16j15R2l5o7m7J23j49J1J52j21Q9K25k40p8K36L05j61j24j28K88
5837B01m05J25J64J82oj57j47L6r2J11j02Qj95K77R3l0L2k02J64r6k1J84j11q1
5861f8J32K89n39L23j43J92j42K57k47J7J26p5j24k94n8M7L7J13J4O5J13j94K97
5884A38o5K0J06p7J77j37k85R6j39K38o2l9K17O6k09r8K78k23k97K91j62j88J02
5907b52J78M04m46J38L29k59k8K81j45l4k65k4J36j31m2J10K23K7j98R9J00J23
5929C24j12k40k15j03K54k64J0K52j59O7J09L30j42L33J0l63k8m4M0k04J92k3
5951B4j64K29qM4J40ol8j22r6k07K03k39l69J24K10J07N87m55L87p0J72j52L8
$$ y = [-78, -18, -28, -104, -166, -169, -10, -46, -280, -186, -6, 98, 38, 112, 74, 116, 41, 220, 230, 206, -301, 45, -107, -282, -132, 5, -189, 61, -55, -170, -78, -113, -180, -227, -104, -253, -242, -90, -211, -122, 103, -137, -215, 21, 326, 165, 41, -87, 201, -204, -79, 85, 267, 261, 104, -43, -7, -99, 12, -90, -82, -277, 0, 93, 63, 95, -107, 57, -39, -60, 124, 13, -68, 64, 353, -186, 137, -6, 186, 44, 301, 54, 71, 197, 122, -2, -296, -354, -307, -270, -157, -143, -78, 35, -159, 138, 73, 93, 199, 122, 299, 162, -123, -27, -166, 72, 10, -29, 188, 254, 45, -53, 225, 2, -295, -4, -166, -354, -252, -74, 330, -116, 22, 351, 92, 64, 345, 200, 166, -99, -123, 13, -118, -160, -50, 173, 200, 2, 101, 201, 324, 212, -28, -243, -346, -92, -356, -346, -94, -253, -186, -77, 253, 111, 444, 454, 91, 63, 19, 59, -145, 47, 24, -140, 89, 81, 125, 265, 259, 221, 99, 3, -204, -1, -240, -609, -485, -275, -168, 419, -36, 351, 281, 453, 301, 339]
5974C39p2m4J34m04j24Q4K08K34m79J72K28j47q5Lj31j13j32n8k7L0K61j45j0
5997b78L13L28j05L2lk6Q9k23n0J9k61Q0P6K74j24L3O6j00j6j77J80l67j06L2
6021c14o9J06RJ56j6L24J12J31O3k92J79j48j74k2J54l83j8k3K39k20J92K93J6
6044B95l90K72j26k14j97p6l8M2L36n1J86J97J23j17L00p5N1j74j80n6j34n0p3
6067a49J50rk14K15K87J12l90K58l59oj07j60J78j36M9K54J45r0L24q8K99j3l83
6090A67J57m1k33J09k06O1k61n3J5L21l9k3J83k60r0O7l76O3n9J31J25J22R1K34
6114B05P4K4J06l0R5l45J3o3Q1n15K38j1q4J55L9q3J98J41k50j49Q3j2o7l5j84
6139c76J48J21L92l97J95J37N7K9j56J81l63Q4q4j53Q1J51n0L0J06k38j62L38
$$ y = [339, 267, 223, 357, -47, -171, -87, 121, 355, -124, 48, 276, 129, 44, 47, -84, -197, -329, -387, -414, -384, -123, -268, -278, 35, 363, 258, 290, 287, 261, 350, 127, 77, 96, -165, -85, -9, 265, 141, 174, 240, 140, 124, -53, 127, -240, -346, -314, -383, -277, -268, -112, -128, 196, 308, 439, 502, 210, 389, 241, 67, 45, 199, -184, -202, -225, 14, -206, -14, 279, 295, -95, 177, 51, -163, -360, -436, -474, -432, -96, -147, 39, 236, 359, 242, 542, 467, 518, 344, 164, 108, -26, -76, -149, 1, -8, -222, -7, 280, 392, 2, 260, -99, -105, -212, -372, -194, -330, -281, -27, 118, 28, 352, 264, 563, 550, 167, 324, 283, 50, 159, -47, 14, -247, -300, -285, 36, -3, -26, 157, -103, -193, -126, -502, -439, -498, -367, -242, -120, -29, 205, 279, 303, 409, 379, 474, 129, 142, 79, 160, -355, -117, -128, -212, -57, -18, -101, 97, 238, -12, -161, -78, -90, -157, -192, -376, -228, -107, 285, -112, 83, 220, 277, 306, 150, 331, -32, 52, -32, -185, -104, 47, -3, 27, 133, -105, -267, 71]
6161G1Ok63j8n7o3J05M6r0J90N5J72Qk19O0K32j19o4l0o6K93m7k22j65p4K84n
6187B0J06K14k00k62j9K2j18k69L08K92j07M5M0J74k30K22j5j89J22O6l96L85
6209B11l10L1J99k44J52J81m38J58j9K04K1K0q4n4j26J16J9j66L18k78K63l11
6231a37K13M8j17J55j17j13J50N3j17qk9Jl2o3K7L91n48L90K35l70j91L12r8m8
6255a3J22j21J77l05J55J02mj13K77m46J79K5p5L8k3r8p6L59l52N7J94j16L39
6278B82l23K84k06K14k56K23R5j54L8j94K45k29r5J35J57J13m10L4l5j98M9O0
6300a71Jj5k4R9l0J36l8r1J18n4K36N5l19J49K42m31M08j22K7P4k86K8N7K0q0
6325a1Q5j52k11J10j32J10p1Q0J10q9L64k58L59n7n8J65j39j5Q6j06l53J65L04
$$ y = [71, 77, -186, -204, -261, -324, -219, -173, -263, -73, -18, 154, 162, -57, 3, 235, 116, 52, 22, -44, 249, 202, -20, -185, -259, 25, 20, 126, 340, 140, -122, -141, -119, -237, -506, -198, 94, -13, 32, 72, 246, 16, 238, 223, 34, 156, 222, -174, 211, -99, -68, 131, -113, 39, 220, -218, -60, -79, 125, 146, 166, 82, 28, -98, 18, 37, -129, 189, -89, 174, -137, 76, 124, 7, 162, 45, -68, 82, 135, 18, 10, -19, -18, -50, -113, -86, 305, -243, 147, 382, 12, -179, 133, 35, -13, 109, -12, 165, -140, 15, 117, 113, 0, 277, -169, 10, 35, -40, -2, -25, -123, -199, 160, -192, -135, 59, -57, 282, -41, 243, 37, 251, -5, 218, 313, 159, 197, 3, 248, 19, -76, 59, 216, 329, -81, -47, -82, -280, -231, -171, -170, -185, -209, -110, -140, -4, -42, -133, -15, -69, 167, 222, -97, 52, 294, -137, 271, 149, 176, 250, -36, -8, 49, 69, -11, 74, -78, -289, -179, -311, -201, -272, -192, -82, -171, 193, -65, 294, 237, 179, 344, 205, 190, 276, 170, -183, -18, 286]
6348B86l51j62M71m14J46j05M4K31j90j32j58K21J03j38J8Q9R7J28M1R0j12J81
6370C84k63J19lk31P1N3k35M2P4R7J65m84L02k2k23K44k76k15J30j14K42k7K12
6393D2j45L99k3j44K91l25L44m21J98m8k34j37J64J67j22K11j06J45n1m01J97
6414Aj24J8k48J48j88J93k2L8j9K93L09l22L70q3Lj25r9O3k08m6L11p4r0J75m01
6439a27K65o4m5j55j30j27L41k81q2J63m2L79k65M18l2O3P0j14j87O4j15N7j42
6462h8L29m19J42J96j69m9J5k09L27j81j26l16J99M5Q2K01j62j14L29R4K27j75
6484A78J46Mk57K40j78r3j63J9nK25l70K91J62j12K4m88J98J88l62J24j42J05
6506b66j53J33p0M30K48r5Q2L7j13j60jJ23R0j53k58J33J03p1Q0K40o5m62K60
$$ y = [286, -65, -227, 244, -170, -24, -129, -85, 146, -44, -176, -334, -113, -10, -148, -130, -41, 56, 184, 225, 315, 203, 384, 121, 240, 237, 6, 77, 130, -105, -63, 11, 108, 273, -211, 91, 69, -154, 90, -186, -401, -271, -385, -143, -170, 42, -103, 296, 273, 129, 420, 95, 439, 18, 216, 168, -66, -203, -39, 128, 6, 217, 111, 256, 205, -196, 1, -123, -105, -353, -205, -393, -200, -222, -184, -203, 90, 399, 77, 447, 364, 367, 242, 143, 206, -2, -48, 263, 189, 99, 274, -127, 138, 74, 29, -126, -256, -383, -42, -323, -405, -242, -284, 95, -170, 248, 216, 279, 349, 235, 48, 112, -3, 54, -88, 241, -178, -36, 160, -9, -58, -43, -252, 75, -106, -232, -548, -349, -304, -222, -21, -183, -297, 32, 126, 353, 178, 324, 328, 71, 311, 133, 40, -123, -104, -109, 116, -254, 37, 199, 87, 111, -377, -179, 9, -353, -229, -371, -266, -419, -286, -356, 74, 322, 227, 309, 346, 233, 73, 72, 195, 285, 132, -126, 7, 110, 39, 119, 359, 294, -168, 92]
6529I2k74J04o7M6j29j12O7j35L05K19l5n9L69r7J0k58K06j60oj79j04J84j27
6552a40K63Q9l51L05j60J35j70k47k98K10J02J53l26K12L57j00J43oK12l7l33
6573A3K30J50J3l53K8j41K7K51j2o5J72k98J7P3j60J74k85j31l7K30l15K71j25
6596b73J53L23j66L23j16k06L75k97m3j53J52k6j53K17k16J01R4p4l2l2j21o4
6618b34Lk9J00n1M2J54j91j33N53O8j36O7L1k65M3J85n26K62N9l15K91L0J21l18
6642a89J62M3O0j54j26R7Q7J51k44J40k23K10j77J39J26j56p4L80l69K85P8l78
6664a32J48j3m2kj3K81j35n6J04K3k54J61j62J73m8k36J59Q3n0K8K4J3Ol01L12
6689G1j51J62j59J25nj7j1J17j60n7l4K8J30j56J55qL1nj37K57Kl6l36n8K79j73
$$ y = [92, -182, -78, -145, -99, -228, -340, -273, -408, -103, 116, 81, 22, 391, 294, 304, 46, 252, 92, 86, -93, -197, -13, -140, 123, 212, -139, 166, 6, 141, -29, -276, -574, -364, -262, -109, -435, -223, 134, 34, 177, 171, 383, 346, 13, 243, 393, 406, 53, 81, -60, -33, 218, 206, 141, 313, 15, 32, 105, -55, 119, -166, -297, -334, -104, -419, -148, -273, -120, 203, 37, 360, 244, 38, 413, 116, 73, -80, 72, 46, -107, 110, -106, -5, 89, 15, -17, -49, -170, -234, -231, -260, -160, -211, -169, -15, -206, -339, 214, 282, 146, 213, 244, -21, 22, 207, -319, -57, 2, -313, -22, 8, 129, -189, -27, 16, 76, -78, -204, -107, -20, 131, -113, 27, -196, 14, -163, -24, 102, -54, -128, 252, -117, 168, 246, -132, 16, 3, -39, -41, -54, 227, 92, 36, 140, 163, -91, 70, -92, 81, 33, -203, -44, 39, -11, 17, 41, 54, 60, -241, 71, -80, 82, -77, 48, 43, 26, 15, 132, -28, -85, -119, -91, 39, -117, 38, 30, 61, 56, -81, 176, 178, 142, -194, -252, 27, -146]
6715a46J86p9K02k25n6L3J54k08J83j03r0J21q0n7K06j80Q7K17K09k57N9K95l78
6738I3Q9m34K00P5o8k13P7J24J92l50L71Qm03M74l60K3k5m3O5j03p1K49j8P6L08
6763C36j02m7K37j64Q6k16oj58k9J7j55N0PK43MJ82n36K98j15j01j07Ql4Rj48
6788d41M38l64K12N14j97K0L83l80K51n35K13k0k76M3M4J24J27j03K0J08j68l3
6810b0j30k18J5L65l78J47q6J07J47R9J66J27p9N1J00l6J46m04j73J94k53J03
6832a0M8j43J11K45j76nJ87k91j38P3l69J32n2J91nJ19m0k1L61M8K39k29j18M8
6856B05J24k69k08J39j76NQ1j92M66Q4k86J42J08k50p8o8j26j1K50j62J11k9K56
6879A16K29j50j40M09j68q8j93J5N8lj08n9P8j07J06J17j34k3j24K06k54q0p0
$$ y = [-146, 40, -39, 163, -62, -118, -85, 69, -139, 44, -59, -149, -28, -108, -165, 41, -139, -52, 165, 374, 117, 176, 471, 93, 182, -252, -52, 23, -45, -258, -181, -57, 135, -215, 156, 164, -239, 235, -125, -102, -127, -170, -105, -208, -279, -30, -48, 28, 336, 234, 187, 424, 260, 346, 130, 124, -34, -63, -46, -201, -151, -144, 99, 103, 285, -251, 47, -68, -169, -276, -268, -302, -293, -441, -3, -367, -155, 359, 162, 182, 565, 185, 436, -99, 114, 94, -182, -139, -95, 29, 156, 53, 73, 181, 13, -20, -150, -368, -353, 12, -366, -219, -305, -198, -51, 48, 214, 341, 262, 313, 413, 377, 523, 119, -54, 140, -113, -10, 38, -105, 6, 251, 75, 70, 257, -34, -172, -99, -468, -336, -388, -197, -202, -83, -123, -144, 217, 265, 504, 275, 157, 205, 329, 60, -148, -9, -185, -180, -99, -291, 175, 259, -27, 115, 223, -27, -105, -173, -299, -310, -60, -222, -111, -140, 116, 345, 195, 55, 464, 296, 208, 15, 30, 88, 85, -23, -82, -4, -111, -5, 112, -22, -45, -169, 37, -217, -297, -367]
6902c67j8j16J87L77j97K65n0J14KK23j35J08k33N4j8k64N1j17J75l1J3qK9j98
6926a54J94j17j21o1J73k48q9J62J83K37l4J35R7j32L84p3j26q6j27n9j75Kj05
6949a40k11L5K61j2R0q0l4j19l7m8J9k5J68n5J39J70K76l57N4L72j64j10J88j12
6973B68k78j3k44M3K06k07O3M1l5L40q9k6J5q4M04n65r6j97L86J8l0P4J0J98p9
6998A23J78J0j2k20J84k01j3M5k52L58k81J17l5M6J31q5m3j13j31J8j6P2l02K1
7022d01M51k07J78J49p1J10J39k3l41J15j51J94L2l7J35l04N4o2M6K8j33J35J02
7045A38Pj45l37K69ml87M49j75J34p0K42K7L4J8j20O4n5j33L22j10j3j53q6j28
7069b12P2L66J4k78j12J03J90k08j09J60q7q7J44K35k45N4r6J51J41j73o9M1O9
$$ y = [-367, -385, -501, -314, 63, -134, 131, 81, 195, 197, 420, 285, 393, 160, 214, 196, -68, -17, -134, 41, 10, 23, 15, 44, -154, 40, -77, -198, -259, -86, -334, -423, -261, -78, 159, 125, 260, 357, 225, 609, 536, 410, 324, 197, 138, -37, -35, -140, -351, -316, -55, -67, 23, -57, -91, -210, -247, -295, -276, -301, -133, -188, -49, 121, 397, 40, 94, 466, 302, 192, 380, 268, -10, -23, -267, -224, -18, -225, -162, -121, -156, 184, 95, 69, 84, 0, 404, -161, -257, -454, -68, -50, -80, -6, 4, 202, 123, 301, 311, 299, 79, 263, 62, 49, 94, -158, 200, -81, 36, 1, 47, 178, 93, 50, -63, -194, -176, -192, -120, -422, -401, 50, -157, 21, 170, 99, 209, 348, 325, -16, 99, -52, 142, 174, 137, 272, -32, 22, -40, 6, 34, -99, 36, 138, 145, 0, -337, -68, -72, -459, -10, -185, -51, -121, 121, 148, 182, 200, 80, 144, 89, -44, 278, 168, 155, 2, -84, -212, -140, 226, 240, -38, -150, -47, 143, -65, -174, -14, -101, -188, -44, 191, -54, 0, -96, 55, 196, 23, -46, -5, 64]
7092F4oq7j72KM1q1q6K04K66j08J00J84k19J30l01K19j98n4K26l2k80J05Q3L4
7116C4M7j20M0L7M7k23j0J0J28n4N8j7n4J76p5J40J07o8J7j3n9K15n67R4k02J39
7142a73j36L01l21R9M58j84J03j39j4Q5j46k57L03p3q7R1j14M24l7l8J34j69o7
7165D3K18n8l65J74m85L86j75L04k02L22k28K07J11l21K63k23M5m3j08r7J56k87
7187c63M46N8j17P5L58k31j41J16j39K9k21J66k6j99o7N7J27o4M2K54J5j72j3
7210a0l7J45l58J78K9j94J82K33j03K08J63k18J7Q3n5l40K12k4l31J29J67k75
7232a99R3J50r3r5K21J02j38m1N4k62J42r3K71l56L85L4P2K4R0k78K28k03k16
7255a08M3l17N3N5J22L0j38J50P8J99n9P6j32j8N5j08r5l0Q0j55L65k75R6L23
$$ y = [64, 58, -29, -201, -199, -158, -239, -325, -121, 145, 37, 137, 321, 102, 232, -69, 150, -48, -102, 124, 92, -188, -83, 0, 34, 81, -39, 1, 38, 85, -138, -148, -138, -10, -64, -6, -23, -77, 99, 24, 164, 271, 203, 220, 207, 148, 363, -204, -110, -312, -173, -309, -8, -329, -230, 228, 44, 147, 8, -6, 79, -67, -324, -21, -94, -181, -90, -204, 220, 183, 145, 279, 110, 43, 261, 203, -162, 12, -473, -87, -262, 42, -160, 162, -66, 141, 252, -69, 194, -29, 16, -27, -135, -232, -76, -363, 83, 141, 24, 99, 457, 226, 85, 201, 62, 91, -130, 36, 10, -189, -256, -199, -72, -136, -94, 160, 175, 3, -10, -47, 98, -260, -82, -53, -247, -65, 168, 65, 273, 436, 218, 235, 318, 263, -77, 135, 111, -220, -91, 76, -199, -106, 44, -49, -144, 77, 179, 41, 0, 54, -208, -66, -159, 112, -244, 141, 175, 247, 271, 361, 83, 311, 108, -108, -65, -382, -329, -274, -152, -122, -260, -110, -32, 167, 108, 184, 52, 34, 89, -19, -114, -144, -64, -219, 146, -129, -33, 290]
7279B90J3q5Q2j92R3j09l14J06P8N4l62J20R3k16K14%k4K34j50n3R9n2jj86l8
7304c06M29j32Q2j47K63q2L45m60J1J1k3J83l28p6j52K65l47M53N4p6K05p0n9
7327D3n1N7n4l6p3J74J8j06J62p2L41k81J45l3m32K49j05q5j15j91J25K14n3L75
7351B16j66J80j16K3m9k16j3K23j30j0k11L89j64m1R3J59n7l5m6K11j69q6l5q2
7375a32J53k11K30j30pn2K09l05K40pJ21l58j11L52k13J55O7Q7k1K03j73P6j8
7398A55j6nK02l67J15O0k90J11l3j33P2j22J16q9Q5o1M33k04j75O2k7J05k3J48
7422A19k77L61p5j03K15j37K08j40r2j25J60j16Qk35K26k26L16j35j44J17J59
7443H4Q1k16J82j03M9j90q8J86o6m0J91p1p8J67q2K47l6j91K17k58n2l3k43L30
$$ y = [290, 303, 218, 300, 108, 201, 92, -222, -116, -38, 16, -346, -226, -133, -349, -135, -135, -159, 75, -75, -128, -29, -81, -82, -268, -306, 123, -9, 73, -74, 189, 107, 452, -8, 3, 14, -9, 174, -154, -230, -382, -117, -464, -11, 43, -33, 172, 102, 43, -8, 49, -5, -41, -114, 60, 78, -28, 134, 62, 403, 122, 267, 234, -198, 51, -54, -139, -254, -445, -320, -106, -159, 216, 50, 230, 114, 137, 88, -128, -141, 82, -48, -58, -269, 120, -44, -85, 8, 167, 110, 75, 29, 240, 71, -15, -50, -132, 21, -190, 40, -90, -97, -149, 60, -245, -5, -12, 109, -249, -360, -8, -221, -66, 1, 88, 67, 270, 97, 173, 155, 139, 134, 336, -31, 84, 144, -146, -35, -68, -201, -129, -251, -135, -224, -139, -200, 233, 29, -146, -84, -111, -6, -29, 119, -158, 203, 128, 25, 240, 103, 311, 171, 79, -46, 114, -2, 6, -229, -3, -229, 87, -48, -192, -75, 84, 165, -51, 131, 28, 77, -113, -201, -15, -81, -121, 70, -1, -79, 88, 6, 253, 217, 26, 243, -15, -67, -100, -343, -13]
7467a3r9pM7K28k32J26J7L1l30L47j05j43j29J54k3J15j19L3MK03J40o9LJ52k97
7492C4J54q8K1p6o5K03k41j68L74j10nj17N3M21l65O5p7k30m1J39j62Q4J18J57
7516G8k3O8K82k17p2J39j11j35J33m80J31j50J35j46M64M7j32O9j44K82j46k54
7538a82j12L68j54l61K00K05RN3O3R0J8o7j48J82q8k52j51L28k69K43k13K57K23
7561B42k2k4k02L29k38j77k23K95l6j15j37K52O0L5k2j4K23j86j23M7j72K33k30
7584b05r6K89k00J9M70j53j25K40Rk40K00N9j64j04j34k26j0Q3m5J42J53M1O0
7607F3K89k18j58L0K01l16J50j09O0P1k57L74j81K50M1j82K71m13j13n9j13K4
7629b95j46L19J97k1k08N36l71J03L44j81j30J39n44J83l8J13K25k6n4m8n6M1
$$ y = [-13, -112, -119, -72, 156, -76, 50, 67, 98, -232, 115, 10, -133, -262, -108, -131, -16, -135, -102, -98, 105, 245, 176, 179, 331, 34, 188, 100, 121, 45, -20, 183, -58, -226, 148, 38, 33, -84, -31, 390, 25, 90, 13, -217, -258, -119, -281, -197, -79, 78, 55, 123, 405, 188, 116, 255, 144, 9, 142, -338, -207, -357, -222, -368, 96, 143, 11, 80, -64, 218, 72, -182, -294, 74, -80, -441, -241, -36, -27, 26, 89, 179, 197, 130, -18, 164, 76, -176, -327, 1, -268, -25, -238, 19, 242, 220, 196, -6, 323, 85, -92, -315, -20, -56, -171, -308, -56, 4, 39, 17, 3, 226, 40, -83, -36, -208, 25, -205, -301, -12, -212, -193, 277, 124, -1, 239, 248, 8, 208, 267, 103, -1, -135, -361, -371, -288, -333, -191, -38, 3, 63, 352, 134, -24, 6, 207, -109, 41, -68, -8, 63, -194, 180, -1, 249, 290, 108, 379, -34, -147, -206, -319, -295, -441, -122, 75, 54, -154, 382, 11, 114, 458, 277, 147, 286, -258, -75, -113, 0, 225, 199, 145, 97, 41, 82]
7651H2J42o3o1j98R0Kl36J60K08J51n6j24J75N4K3k14K65l53J06j06k7j09Q5J56
7675E2K15j87q7K12Q8j02k78J22N0j11l12K20k73K57J2P6J33j27j31L98jq5k73
7698a32J67j26q9L5j21J75J33m4R1j93M82l08J27N0k25o8J46k09j07R6l2K29J87
7721B64m08K78R7l11J54j03o1N5l0m1J70j95J24p0K04j12K18P9J40k35p3l00r6
7744b52M2J76k20P6K89l32M33R8k26n5J44k19J30j17L2o5K42k91J18K3R2P9J7
7767B14k50r7J56K0J21n24J84O8R9j22m4J11o0J47Q7J36Jj43R0k30J72j92J86
7790A30r3j39q3L88j60n5L54m77J47j71K7L2m1J34J04k16K54k97k2M02p3q3j36
7813g4J19J49k62PJ50k9j01J46j82K91r0j15J03K9j05j50J35q1K28k63J10J81
$$ y = [82, 224, 161, 100, -98, -8, -6, -342, -182, 26, 177, 121, -3, 172, 226, 249, 35, 300, -53, 53, -53, -80, -189, -104, 52, 267, 80, -7, 205, 293, 191, -87, 35, 85, -26, -338, -118, -391, -134, -122, -46, 87, -40, -171, 227, 226, 141, -132, 35, -91, -180, -145, -266, -91, 42, -2, 89, -104, 378, 70, 197, 247, 22, -46, 100, -109, -216, -120, -152, 77, 264, -144, 134, 231, -80, 74, -29, -90, -35, -65, -106, 64, -131, -7, -77, 127, 15, 233, 312, 452, 217, 144, -156, -252, -210, -34, -254, -178, 111, -221, 212, 310, 84, 29, 173, -46, 84, -33, -1, -66, 176, -115, 3, 26, 118, 197, 214, -36, -133, 23, 43, 164, -360, -176, -108, -9, -131, -175, -64, -124, 23, 110, 246, 247, 104, 194, -36, 136, -56, 130, 37, -102, -185, 203, 43, -12, 342, -135, 12, -159, -132, -100, -141, -7, 97, -119, 135, -162, -184, 218, 145, 62, -74, 45, 194, -68, -61, 89, 60, -41, 105, -77, 214, 124, 9, 112, 141, 36, -114, 21, -60, 168, -95, 15, 196]
7835A96k24j19OK3J52j24J19K1Oq4m6K23j83K73k00N7j6j05q0N1J77J09O0k17
7859G5o1N1P5k77Q7k56L93l35J13j10J29P7j86K30j50J21J06P0j62K31j54K0Q5
7882A72q4J12l17K05q9J14j05j16J65m20M54m03J73JJ61k89j15L47J13o3j80K18
7904E4J2k3J65l24L30m12l00L86k15M02P5k84nK85l5N7O1k72J46k58N5r4J23j56
7928b27J54L88k83J58j49k08L36k94J94j72N9m0l17J85kP2N05k91J19r1J02M7
7950B45p0r0j34M7r4M4k16J0K37K16j52J35l7n1j29J70k15j86M01k96n8K39l4
7973a8J38j93J07J22r5J34m8j32Pk42K33j52j43K56j94K10J13O3N2n7n8O8k9k81
7997a39N8m2j32P8J04J21j12M06j77N7j9P3j53k29J23l5r5q7pJ40K85l16L43j08
$$ y = [196, -28, -147, -141, -118, 34, -90, 29, 50, 56, -28, -74, 149, -34, 239, 39, 96, 80, -25, -105, -54, 123, 232, 292, 75, 14, 65, 140, -137, -50, -306, 87, -248, -135, -245, -116, -39, -225, 5, -145, -24, 82, 152, -10, 221, 67, 87, 172, 88, 200, -117, 88, -1, 113, 8, -108, 57, -363, 91, -312, -139, -138, 23, -266, -381, -34, 79, 16, -164, 54, 66, 43, 208, -116, 214, -198, -498, -112, -327, 75, 150, -134, -139, 146, 111, 168, 229, -43, 103, -155, -100, -194, -71, -227, -73, 315, 32, 190, 41, -167, 169, -125, 69, -103, -44, -84, -401, -216, -218, -146, 359, 68, 187, 96, 198, 245, 175, 85, -49, -2, -96, -52, -268, -258, -21, 195, 43, 178, 141, 90, -39, 131, -84, -270, 131, -165, -223, 16, -18, 120, -73, 34, 156, 61, 195, 147, 15, 22, -220, 13, -139, -282, -26, -220, -10, 103, 166, 218, 161, 103, 171, 142, -139, -81, -123, -255, -177, -73, 48, -64, 342, 165, 222, 203, 276, 123, -106, 17, -18, -113, -200, -207, -67, 218, -98, 245, 137]
8021A37j54L63j30j47j42K12j60j68J63l9Q7J7R1l9l6J31n5M8k93r2J44M9k04
8044b17M50m48L56p2L8j6N2K31m66L7j66J29j52K2K71q7m5j80K22l3K52J90m23
8067e5K37L1k84jk72K64r6L42k31R9J07R8p4k15j96M00k76m9k71M75r1j84N7N8
8091a27K36j85K6P9K47j32k07K6k1P7N7q0R8j79J90r9j5K71o8J7k53M0j9Oj30
8116a45L60j68k82R3M2K50Jk0N4k05J59j5Rj10k03O8J5j5K31j4M6K73j80k69J33
8141A08j25J43j88L61k51j78j19K15q2J64R1J47k98q6j2NJ22m6j7k6n1LJ64J30
8165A74j50r8J62RO4j94j66Q0j69J3K14n4K7K00k82k9L84j25l24K06P8Jj34o9
8189a82J23p7
$$ y = [137, -17, 346, 216, 69, -73, 139, -21, -189, -26, -65, 22, 39, 130, 91, 55, 186, 131, 179, -114, -206, -62, -13, -217, 233, -215, 141, 69, 107, 91, 143, 374, -92, -55, -221, -92, -244, -222, 49, -38, -83, -263, -41, -74, 178, 368, -55, 182, 213, -71, -72, -344, -80, -176, 166, -65, 34, 141, 239, 165, -50, -246, 154, -122, -171, -442, 33, -58, -242, -185, -127, 109, -76, -50, 29, 276, 144, -63, -37, -58, 19, 76, -4, 94, -85, 105, 6, -9, 262, 194, 211, -42, -2, -21, -15, -145, 215, 47, -235, -142, -100, 150, 151, 131, 185, -20, 139, 124, 133, 23, -180, -112, -97, -112, 119, 105, 151, 424, 244, -25, 108, -17, 126, -62, 299, 48, -130, -249, -34, -116, 48, 139, 286, -12, -98, -110, -105, 17, -29, -46, -72, -123, -120, 44, 174, 24, -74, 88, 97, 161, -33, -199, -119, -288, -275, -61, -115, -88, 112, -170, -199, 185, 60, -264, -58, 20, 21, -113, -182, -59, -136]
8191a36
$$ Imaginary data points
##PAGE= N=2
##DATA TABLE= (X++(I..I)), XYDATA
0@%%%%%%%%%%%qQqJ6j6J8k6L2m0M9n7O9q0R4j10J29j52J76k01K31k64L00l40L84
35B04m32M86n45O08o82P62q47R39j040J152j274J407j552J712j887K077k288K521
53A321k780L069l393L763m187M676n246N928o754P783r108J0883j3406J7306k4198
68a4343M0043j47090k8728K49563J38374J45134Q0250L2913m8515n3274j01707
79B92620j10029r2336n6747n4158k359K2101K0130J8253K1825k5718n1520o2631
91h0569q6254r9863o3959m2851j4847M3573Q9630J02531J32761J39829J05053
102B25034P4220M6107j5683n8584p0845r3911j00553o4057l8182j7643K9365N7260
114b7472N2936O0460N2758J0214j8890l6066p3657q9027p1974o5653m8798j590
$$ y = [0, 0, 0, 0, 0, 0, 0, 0, 0, 0, 0, 0, -8, 0, -8, 8, -8, 10, -16, 16, -24, 25, -32, 37, -43, 51, -59, 70, -82, 94, -107, 124, -140, 160, -180, 204, -228, 258, -287, 321, -361, 401, -446, 493, -547, 605, -669, 738, -814, 898, -989, 1088, -1200, 1321, -1459, 1610, -1783, 1980, -2207, 2469, -2777, 3151, -3603, 4180, -4928, 5955, -7451, 9855, -14343, 25700, -121390, -150118, 99445, 237819, 382953, 463203, 496116, 447601, 394327, 292620, 182591, 90255, 33508, -20650, -23009, -908, 19222, 37475, 59300, 33582, -17938, -80569, -166823, -266686, -330645, -373496, -388343, -344770, -255140, -152609, -19848, 119981, 225034, 299254, 345361, 329678, 271094, 200249, 106338, 5785, -58272, -96454, -114097, -84732, -27472, 25464, 85924, 138682, 148896, 130006, 93940, 20283, -68744, -140718, -206371, -255169, -256759]
126b56759K8816M3957P5110Q5232O3955N4378L9096k314k5285k9077m6105m6233
138a5229j7338l310J1471M5829N8524M9279N1061L6506m544l0117m9093q4290
150D8749r4980q1381p7834n8862j4328J2264L2754O6117P7506O5569O3784N1549
162I0907J6795Q60o368k7659l0142j2583r899j380K3414K8356K1013K6704J5287
175A35305j3627k5857l7492o2088o4755n1795n0646l3118J369J7332L2928N8720
187i3724O2918N1579N0809L6933O763m555j3462l3895l3770k0493k1488j0804
199b3189J1487J5653J4124K5032J7438j115l874j3435l2744l2188k5798k9891
211g8500j8860K976P708J6936L5430L3021K4892K7556J6150l960p235j3394k8044
$$ y = [-256759, -227943, -183986, -108876, -23644, 40311, 94689, 133785, 131471, 106186, 77109, 31004, -15229, -32567, -35877, -24406, 21423, 79947, 129226, 180287, 216793, 212249, 182132, 133039, 48749, -46231, -127612, -205446, -264308, -278636, -266372, -233618, -167501, -89995, -24426, 39358, 90907, 107702, 108562, 102194, 74535, 44393, 31810, 21911, 20531, 43945, 72301, 93314, 120018, 135305, 121678, 95821, 58329, -3759, -68514, -120309, -170955, -204073, -202704, -185372, -152444, -93724, -30806, 20773, 71582, 108515, 115278, 110723, 97261, 63366, 29596, 9103, -12385, -23189, -11702, 3951, 18075, 43107, 60545, 59430, 55556, 42121, 9377, -22811, -48609, -78500, -97360, -94384, -86676, -69740, -34310, -1289, 23603, 51159, 67309, 63349, 56114, 42720, 14676]
224A4676k3944j3945j6205o159J1870J2634J3507K4927J7335M689O617k290j8126
237B5586j5758j4156k1488j3707n53k059N162J8514J4651J0050J6948Q005l899
250B7296r02n456j5970j1063n031j0665l598Q170L516N327J4851P331J594P029
264B2429N92q919l616l950j2208n761J047n194o67Q607J954J191Q616K237k494
279C864L822O88o662o42Q65p182j903L266m622k150N344q05j921O895L155p88
295A224O547M919k868K354K843o853m339j14q792o871J013k598k511P594O174
310b278J755Q876O501k153L54J30j0075p962l634p751n308N222M537M409J4141
325F764J1299M641P659L362q414q091q749j7350j4126o449p632k519R330R719
$$ y = [14676, -9268, -23213, -39418, -45577, -33707, -21073, -7566, 17361, 34696, 39385, 46002, 43712, 25586, 9828, -4328, -25816, -39523, -40076, -42135, -36973, -18459, -3808, 6242, 23190, 31195, 27296, 26394, 20938, 4968, -6095, -11126, -21791, -25389, -17219, -13703, -8376, 6475, 13806, 15400, 22429, 23021, 14102, 10486, 6536, -5672, -11433, -10386, -15580, -16247, -7640, -5686, -4495, 4121, 6358, 3864, 7686, 8374, 1712, 1070, 1935, -5247, -7150, -3884, -8506, -10656, -5312, -6117, -8038, -1143, 2012, 1224, 7771, 12690, 9822, 12176, 15019, 8166, 3827, 3713, -5079, -11950, -10937, -13535, -16046, -8452, -2278, -523, 8353, 14854, 12701, 13055, 13185, 3110, -4852, -8486, -16237, -21545, -16323, -11786, -7377, 6764, 18063, 22704, 30363, 33725, 25311, 17220, 8471, -8879, -23005, -29454, -37086, -39605, -30275, -20556]
339b0556Q987J6711J1938L197M585r94j2015j0559q190j2689p168M475M380R196
353h702J8977J5572J0158J1919L659r138j1387j5550k4257k0088j2761j2048l024
366e6670J1017J1893J5487K1870J6689P798O706k070j3936j3456j3523j7331r125
379c4651J699L763J1822K2137J9525J6172J6798O659o250r819j7525k7095k2553
392a9318j7456j6840n328P685R473J4932K1477J4967P723N768n018j5605j4996
405a2536j5692j7659o536M688R075K0216L0440K7555K5408K3918J0513l357r793
418H6240k1624l2196k9258k6957k6219j4039j799J541R813J7466J2975Q859P825
431g373j669r750q553j0076j0590Q12J0036J4894K6038L3532K9351K7151K2446
$$ y = [-20556, -11569, 5142, 17080, 20277, 24862, 23868, 11853, 1294, -6896, -19585, -26753, -22278, -17898, -8702, 10275, 25847, 36005, 47924, 51583, 42445, 31058, 15508, -8749, -28837, -41598, -53646, -56670, -45653, -33760, -18273, 3597, 20286, 28084, 34790, 32720, 18784, 5328, -8195, -25526, -34651, -32952, -29189, -17367, 4770, 24295, 40467, 57265, 63924, 57674, 47855, 30330, 3235, -19318, -36774, -53614, -58942, -51257, -41784, -26852, -5375, 9592, 17315, 23083, 18065, 2460, -12536, -28228, -45887, -52423, -47735, -38660, -18444, 11996, 39551, 64959, 88877, 99390, 96033, 86240, 64616, 32420, 3162, -23795, -50014, -64053, -65852, -64311, -54498, -37032, -24057, -15198, -7373, -9042, -18792, -27345, -37421, -48011, -47199, -37163, -22269, 3769, 37301, 66652, 93803, 116249]
444A16249O919p797j6065l0026l9556l6462l4932l0926j7000l599K566J4229K2053
457e4347J8908J6913J5546M786l698l530q721j0203j025M588Q474J8776K4808
470C1275K2012K1505J7765M204o225j3649k5932l2438k9249k7923k3175r525R54
483g0401O911J7701K2880J7712J5272J0849k280j0163j1989j8780j8354j0098
495e0740l833K484J4904K2664K2900K6315K4668J3887O482m46j2953j9110j8743
508B8479k0803j8707r344l656m29Q005J0123N004L973k79j0615j5130j5826j9688
522e8893j6187o304O06Q627K2134K8937L0303L3708L0392J9456J1092K307j1437
535I4741j8869k1010k5687k4325j6888j2608q702N14K893J581L654J020n287p410
$$ y = [116249, 123168, 115371, 99306, 69280, 29724, -6738, -41670, -72596, -89596, -93195, -90629, -76400, -54347, -35439, -18526, -2980, 1806, -1892, -5422, -14143, -24346, -25371, -20783, -12309, 6467, 31275, 53287, 74792, 92557, 96761, 90536, 76887, 50955, 18517, -10732, -38655, -61830, -71355, -70401, -63490, -45789, -22909, -5197, 10075, 20924, 18644, 8481, -3508, -22288, -40642, -50740, -54573, -52089, -37185, -14521, 8379, 34694, 59362, 73249, 79731, 79285, 66332, 47222, 28479, 7676, -11031, -20375, -24031, -24460, -16455, -6332, -1328, 2645, 2366, -8249, -23379, -39205, -58893, -75080, -81384, -80778, -72151, -50017, -21080, 9223, 42931, 73323, 92779, 103871, 106178, 94741, 75872, 54862, 29175, 4850, -12038, -24646, -33348, -32834, -29941, -28360, -24706, -23686, -28973, -36383]
549c6383o863r776p301O78M423J0874K0480K3892K4091K6265K0923J1445N301
562H8049l221j5053j9637k0960k4170k1164j3115r100l216N829Q348P837R709
575i864O521N93j780l926q715p573l261k601K155R304J1309J2326J5606J2470
589C2564O478M124r39r151j0407j0619j3518r925m133k036K172Q342P707P115
603G774P045L310l774n168q163j2894j1156p894p514j769N134O660J0009J3929
617d471J2084Q813Q179M160j921k454m326p297n198k608k951J14L160K094J122
632H500K484j001n548m675o862r680o949m852m010K69N509O445Q922J1978R463
647I993P211P129K602j330k151m194o976n581l816m861k194Q38j39L4K114o17
$$ y = [-36383, -43246, -53022, -60323, -59645, -55222, -44348, -23868, 24, 24115, 50380, 71303, 82748, 88049, 84828, 69775, 50138, 29178, 5008, -16156, -29271, -38371, -41587, -35758, -27410, -19573, -9864, -3343, -2750, -4530, -8456, -17171, -24744, -28005, -30606, -28451, -19147, -7838, 4488, 20094, 32564, 39042, 43166, 42227, 33076, 22669, 12050, -1468, -11393, -15526, -17562, -15390, -7048, 659, 7774, 14819, 18129, 14355, 9187, 1024, -11870, -23026, -30920, -38434, -40203, -35069, -28409, -18400, -4471, 7613, 16426, 24605, 28765, 26844, 24390, 20064, 12767, 7569, 4961, 2010, 2124, 5284, 7378, 8500, 10984, 9983, 4435, -240, -7102, -16782, -23731, -28583, -32593, -32324, -26815, -20370, -11448, 530, 9993, 17204, 24333, 26935, 25605, 23454, 19260, 12284, 6703, 2887, -1974, -4168, -3330, -3469, -3435, -1321, -1938]
663a938j935o25k111m178j562m83j765J773M007L185M780O097L962K288K981Q6
679A4562k452j731l285m798k857k132k743r07J394k02M11K535L35J3J704l10r20
696a383R67M29q50J027J497m5P70J856p77m09O42r53j811N7q62j769J86k07j331
715b966K61M41q84n32P76o37R2J881O93N35K107J481j84J329L98j610o24r09k898
734a250j275m05r73j42J730J313N45K421J411n85M45p04j989j711q93k202j69
751d433J440J038J639K992K348P67J328j5k140k179k349m163k356j156r97L21
767g915K977K153K513L795J887L17K71j174l403k319k140k762o54J353J444K254
783a403M039K962J796K110m71k605k842l913n206l229k081j795J047L472K668
$$ y = [-1938, -3873, -4498, -6609, -10787, -12349, -12832, -14597, -12824, -8817, -5632, -852, 5245, 9207, 11495, 14476, 14562, 12110, 10379, 7094, 2296, -561, -2693, -5436, -6343, -4949, -5151, -4740, -2205, -1870, -1857, -153, -463, -1383, -416, 13, -837, 190, 1687, 1642, 2412, 4268, 3491, 3082, 3724, 2771, 960, 1017, 155, -1614, -1428, -1635, -2966, -2705, -2264, -3148, -3680, -2904, -3541, -3449, -1568, -875, -340, 1767, 3248, 3064, 4393, 4791, 3181, 2557, 1648, -1250, -2525, -2930, -3903, -4045, -2315, -1002, -457, 1964, 3375, 2790, 3235, 2531, 542, -1169, -2062, -4264, -4433, -2993, -1955, -316, 2676, 5024, 5791, 7119, 7104, 4964, 2785, 436, -3727, -6083, -7239, -8236, -7915, -4938, -2785, -272, 3523, 5410, 5727, 5998, 4824, 1421, -898, -3038, -5800, -6454, -5101, -3657, -1403, 2636, 5598, 7394, 9504, 9033, 6428, 3586, -327, -5533, -8762, -10843, -12638, -11591, -8119, -5451]
798e451L816N042L077J456J234j277k930k253k606k740o36J137Q80L184L706K664
814H303J934J137j312l979l810n418o057m416k683k019J376L609L913N499O240
829B317M117K863J650p22k554k205l324k973r89L70O56K521L641K176K148J140
845A0832j531l625l805n387n839m059k678j779J500L867L800N500N380L901K474
860H551J436j238k879k597k850l109k39O14J414L478M429L376L076J653r21k949
876A1245m031n919o246n166m002l182j10J378K255L863M163L222K094J849j21
891A292j386m50j065j87J334K403L094M445M971L359K363J144k234m090n309p461
907B223p215o282n533m079p65M01K573L684M776M228L929K635J709N04Q16j19
$$ y = [-5451, -1635, 3407, 6484, 7940, 9174, 7897, 4967, 2714, 108, -2632, -3268, -2131, -1251, 1933, 5639, 8303, 10237, 11374, 10062, 6083, 2273, -3145, -9202, -13618, -16301, -18320, -16944, -13335, -9422, -3923, 2317, 6434, 9297, 10947, 10225, 7671, 5466, 2142, -831, -1820, -1450, -794, 1727, 5368, 7544, 9692, 10832, 9301, 5676, 1871, -3516, -9355, -13414, -16092, -17871, -16371, -12504, -8704, -3204, 2176, 6077, 8551, 9987, 8749, 5870, 3273, 423, -2686, -2925, -2311, -897, 2581, 7010, 10386, 13462, 15115, 14194, 11245, 7214, 1295, -4951, -10117, -14119, -17301, -17411, -16033, -13778, -9915, -5752, -2530, -436, 1413, 1292, -94, -544, -1609, -1796, -462, 1941, 5035, 9480, 14451, 17810, 20173, 21317, 19083, 14993, 9684, 2223, -4992, -11274, -16807, -20886, -21651, -21250, -18677, -14993, -10217, -5989, -2060, 575, 2284, 2788, 3604, 3485]
923C485N50J727J522K650K800K773J501M48l69l405m392n466o813n800n007m191
939a7987k089N70J656L173M191M720L609L133K253O28j02o21j170j065M06N90
955A895J080K193K192J758J650J53j310j800k530l865l486k419k538j434L40J015
971g106J376K216J610Q24L81p7j757j107j282j300m25R76J427K610L609L669L284
988H928K682J512j33q12j615l210k998l020l096k470j508j000n23L60l07J74k36
1005g272n2m71k07N10M73J513K685K839L020L860K890K392J576L33j058j875k929
1022H227l701l289l172k747j960p99o18L83J079O86Q26J080O15J51R49O88O96
1039i06J047J574J480J737J193L05P13n39j179j563k285j934k374j164j043o32
$$ y = [3485, 4035, 5762, 7284, 9934, 12734, 15507, 17008, 17456, 17087, 13682, 9290, 3824, -2989, -8789, -13796, -17987, -20076, -19506, -17850, -14677, -10486, -5766, -2157, 976, 3229, 3857, 3755, 3134, 1964, 899, 1305, 1895, 2975, 5168, 7360, 9118, 10768, 10921, 9611, 7811, 5281, 1416, -2070, -4489, -7027, -8461, -8121, -7106, -5730, -3514, -1904, -1080, -699, -776, -2533, -3640, -4922, -6222, -6647, -5671, -4244, -1634, 1975, 5644, 8928, 11610, 13122, 12989, 12177, 10562, 7352, 4354, 1334, -1762, -4232, -5740, -6740, -7263, -6903, -7210, -7036, -7272, -7324, -7795, -8002, -7492, -7019, -5506, -2821, 18, 3038, 6898, 9788, 12180, 13756, 14089, 13031, 11156, 8227, 4526, 1237, -1935, -4682, -6642, -7441, -8059, -7676, -6597, -5911, -5085, -4005, -3390, -3239, -2290, -1602, -906, 141, 1715, 3195, 4932, 6125, 6430, 7143, 6604, 5425, 3862, 1577, -357, -2731, -3895, -4938, -5570]
1055e570K63R33J346J001J808J122K61P25m34l10m97o51n76k66L69R7K87L59N73
1074H40m0L05m63q25j14n13m74O84K60N66R15Q92O44M79J18n94q39r57j122j470
1094a708q06p57l64nM80Q44J254R25R31L97O79k5j17k81n41Nk69k05l8O3J16m58
1116A20k09j91q41q96m25n75k84O25N07J023J124J216J360J080O61M1m61j97j208
1135B470j330r40j209j067l66m65o5J38K10N00J89N48K1N76N04L10O23J114N15
1154B276O63J097j61Q2l33n66j423j511j288j520j129p13n71K58M79Q49P07J381
1172a423J214N87J014P05J0J6N67N0K95j07J01m27l24k86j142r45j059j239p27
1191c120n53m96L40N08P54J210J567J025J061P27L15k59j29n91j109o14m25q00
$$ y = [-5570, -5307, -4374, -3028, -2027, -219, 903, 1164, 1889, 1455, 1145, 648, -3, -579, -845, -476, -379, -92, 267, 840, 800, 1105, 642, -183, -297, -810, -1284, -600, -340, 226, 1141, 2033, 2677, 3156, 3274, 2680, 1841, 884, -238, -1708, -2514, -3271, -3635, -3640, -3160, -2316, -1062, -137, 794, 1191, 1870, 1845, 1728, 1447, 906, 911, 642, 437, 399, 462, 578, 120, -89, -280, -1121, -2017, -2442, -3017, -3301, -2676, -2169, -1146, -22, 1194, 2554, 3634, 4295, 4336, 3875, 3678, 2470, 1140, 200, -1009, -2076, -2442, -2907, -2972, -2834, -2624, -2124, -1935, -1387, -1366, -790, -286, 24, 647, 1761, 2276, 2939, 4036, 3875, 3957, 3624, 3058, 1635, 124, -1164, -2684, -3813, -4526, -5097, -4839, -4360, -3511, -2804, -1423, -209, 378, 1392, 2097, 2107, 2123, 2690, 2740, 3035, 2928, 3029, 2602, 2278, 1992, 850, -95, -1154, -2393, -3120, -3673, -4169, -3829, -3321, -2567, -1357, 210, 1235, 2296, 3023, 3338, 3079, 2950, 2359, 1250, 636, 211, -589]
1209e89K27L0KK12K6k9n41m42n05o65j8RJ66M77P86J225P71P92L09r6k12p19j418
1232b02p05r80n12o1M76O58R84J355J214J135L55K51n36p19j412j552j312p30
1250b293l71J0J11J41Q88P06M02j39j41l32n68O4P4K41J082J402J382J612J432
1269E703Q07L50k68j359k171k374k587k449k233j029p03L96Q20J791K041J844
1285a421J252J352P59M30j23j32J0L53N11P39J084O84Q23K57p60j192j884k702
1303D0k562k820k262j377k13M89J509K350K268K816K343J461Q18q5n13j456j259
1320A547j165p88k35O40Q47R85R39R72L32n3j102j655k057k150j641j136n13L76
1338e857J119K022J647K025J305M22P0q29j574j663j437j044p3O96J494K214K515
$$ y = [-589, -362, -332, -330, -118, -92, -121, -662, -1104, -1609, -2274, -2292, -2283, -2117, -1640, -854, 371, 1142, 1934, 2243, 2147, 1935, 1216, -202, -907, -1887, -2399, -2460, -1984, -1326, -342, 1013, 2227, 3362, 3717, 3968, 3432, 2713, 1301, -251, -1563, -2293, -2664, -2654, -2543, -2402, -1514, -808, -406, -545, -686, -1018, -1586, -1522, -1448, -1207, -125, 1277, 2659, 4271, 5703, 6510, 6860, 6592, 5233, 3062, 688, -1899, -4348, -6581, -7610, -8313, -7917, -7097, -5306, -3265, -1421, -169, 1183, 1942, 2372, 2249, 2117, 2127, 2480, 2991, 3730, 4814, 5498, 6321, 6578, 5818, 4626, 2742, 40, -2522, -5342, -7604, -8981, -9194, -8705, -7196, -4846, -2578, 238, 2581, 4042, 4860, 4775, 4262, 2806, 1547, 382, -406, -641, -1, 846, 1831, 2770, 3742, 4074, 4021, 2919, 1264, -793, -2943, -4584, -5720, -6233, -5857, -4738, -2716, -1069, 956, 2261, 2683, 2753, 1924, 350, -1313, -2750, -3794, -3867, -3171, -1677, 537, 3052]
1355C052K318J909J385J63o60j667k830l095k823k256j375q36p3J401J080J267
1371c040J439P23L81k19p97r57n48l34N80J518K120K329K569K335J665M89q3k066
1389H104k630l299l772l617k424j431n74N49J655J895K571K564J416J027N32m49
1405B117o68j009o55l42K68J150J304J457J767Q86J74m0j667j974k617k910j955
1422d714j838p23M18J073K205K279K343K186J285M69p01j616j569k364j782j413
1438d462n33K78J409J674J722K003J578J057N4o55j309j253j649j357p54m23N51
1455b069J267R55J344J090N5j63r73j642j652j933j627r45OQ91J487K691K375
1472A157K661J964J385K94r03r91j794k596j962j711j234k81M37M15J202J303
$$ y = [3052, 5370, 7279, 8664, 8827, 8167, 6500, 3670, 575, -2248, -4504, -5879, -6715, -6788, -5387, -4307, -3040, -1601, -878, -497, -716, -1513, -2470, -3018, -3352, -2772, -1254, 866, 3195, 5764, 8099, 9764, 10253, 10170, 8104, 5474, 2175, -1597, -5214, -7638, -9069, -9643, -9094, -7439, -5544, -2973, -409, 1007, 2034, 2566, 2117, 1449, 440, -215, -557, -289, 861, 2165, 3622, 5389, 6275, 6449, 6409, 4742, 2768, 151, -2759, -4714, -6552, -7275, -6857, -5784, -3579, -1300, 1043, 3229, 4514, 4983, 4282, 2666, 1097, -1267, -3049, -4462, -4995, -4717, -3308, -1634, 88, 2091, 3669, 4726, 4780, 4125, 2816, 1563, -86, -1443, -2197, -2620, -2069, -802, 153, 1497, 2587, 2642, 2479, 1506, -136, -1788, -3721, -5348, -6293, -6287, -5396, -3909, -1218, 1157, 3818, 5782, 7167, 7461, 6558, 5567, 3773, 1177, -785, -2496, -3730, -4011, -3574, -3159, -1957, -654]
1488f54O94Q04l93j95n12r16j158o57M22q7J087J535J220J376J175N75j25p26
1506C465j257j831j932j634j306o83L40R85J367J998J947J849J235O22k6m60r27
1523C752k017j931j155j045p01k68J87O27Q84O85O24K16k51m58p06L6k89J32M58
1542a220P53J535J311J472J227Q16J48p31j100j774k013k154k076j647q79j94
1558f526L30J048J710J355J596J326J148L19L6q6r26m34k38j84O2M50N57P65O27
1577B935J75R0m59q64j153j634j053j427n77l91N10N22J182J265J289J224M53
1594B087K7j59o31j239j088p23q48l4N81O35J406J381J414J326P74j21n85r17
1612C286j386j767j561j098j212m41M41K69Q51Q87R57M78J04j28o32k50l45m13
$$ y = [-654, 40, 844, 451, 256, -256, -1172, -2330, -2987, -2565, -2652, -1565, -30, 1190, 2566, 3741, 4316, 4191, 3465, 2208, 377, -1555, -3189, -4495, -5178, -4838, -3853, -2486, -488, 1459, 3308, 4543, 5165, 5139, 4679, 3752, 1735, -196, -1351, -2396, -3097, -3365, -3178, -2551, -1667, -982, -358, -142, -393, -851, -1557, -1521, -1810, -1678, -1220, -467, 1068, 2379, 3851, 5078, 5894, 6042, 5311, 4211, 2437, 424, -1730, -3806, -5453, -6332, -6526, -6196, -5148, -3438, -2083, -487, 839, 1987, 2306, 2342, 2256, 1330, 896, 658, 474, 536, 986, 1543, 2308, 2935, 3110, 3200, 2741, 1877, 724, -910, -1963, -3390, -3967, -4358, -3848, -3326, -2144, -879, 410, 1634, 2087, 2114, 1955, 1324, 85, -1003, -1726, -2574, -2608, -2027, -1392, 14, 1395, 2809, 4135, 4909, 4788, 4203, 3286, 1900, 133, -1428, -2526, -3738, -4179, -3738, -3469, -2618, -1731, -774, -296, -192, -320, -952, -1202, -1547, -1960]
1630a960K54J075Q29J662J643J392J198P40j40q58j516j889k547k214k154j376
1646e861j036mR33J023J487J876J420J260M04J47l79k36m04n54j7K18R37P47J217
1665C178J078K82K1n11j178j558k065k059j707j473m94J56R66J739J832J896J925
1682B028J013O96l49n07p82j437r15o66o60K80P07J241J621J265M70K95l03j118
1700B879j782j732j727j807n58m90J40J183J369J279J663R32Q81j93n66p48j219
1717d96q95m47k54K96J523J111J837J558J052K93p3q80j994j799k519k397j367
1734e451j296J6P11J255J637J748J854J007R63J40po32k93r05m11J69Q03P31Q16
1753B855J342M91J33m84r95k269j955k125k275j416j030k38J027J529K123K184
$$ y = [-1960, -1706, -631, 198, 1860, 3503, 4895, 6093, 6833, 6693, 5835, 4319, 2430, -117, -2331, -4485, -5861, -6897, -6901, -5968, -4945, -3458, -1582, -162, 1098, 1502, 1649, 1270, 1034, 630, 76, 59, 277, 1214, 1961, 3178, 4256, 4538, 4559, 4048, 2870, 1312, -753, -2812, -4519, -5992, -6486, -6330, -5364, -3625, -1793, 103, 2028, 3041, 3737, 3388, 2881, 2099, 662, -253, -919, -1579, -1299, -592, 649, 2270, 3535, 4005, 4300, 3997, 2879, 1097, -635, -2362, -4169, -4727, -5217, -5077, -3894, -2525, -1246, 417, 1349, 2230, 2037, 1471, 723, -496, -1391, -1838, -2092, -1796, -273, 838, 2675, 4233, 5285, 5578, 5505, 4625, 2631, 832, -1687, -4084, -5451, -6747, -6731, -6020, -4765, -3128, -1380, 474, 1481, 2444, 2584, 2577, 1945, 1652, 747, 336, 505, 1308, 2039, 2855, 4197, 4688, 4821, 4337, 3342, 1073, -882, -3007, -5282, -6698, -7728, -7966, -6939, -5410, -3287, -1103]
1769a103K334J524J450N19j36p29r51j181r36o71m16J26Q58M06P43N28K49o03
1787B011j096j112j976j093j154r80N5O22J022J613J928J857J287O98L34l6j225
1804B755j098j566j079p20l39M9Q63J061J372J434P51K86o8q07j505j484j626
1821a721j425j218k71J11M44J158J168J132R44O21k5P5l77k07j018K8K42K74J025
1840I60J312R22J239Q49K46n73j001j562k103j929k316j805q89l47K90J096J544
1857d067J852J884J462J225Q99P5n11k86m11p12k46K35R9J93O24L76M9j55r19
1876A666j248j466j261j391j373o34K77M32J022J650J798K225J345P68N83m54
1892C939n28j205j465j489r27o27J9K86L90J279J026J194M06M5k52n43j025q58
$$ y = [-1103, 1231, 2755, 4205, 4724, 4588, 3859, 2908, 1727, 791, 120, -296, -170, 688, 1094, 1837, 2365, 2614, 2011, 915, -197, -2173, -3266, -4420, -5400, -5345, -4723, -3701, -2088, -160, 1697, 2984, 3682, 4016, 3980, 2755, 1657, 91, -988, -1708, -2047, -1998, -1135, -74, 1298, 2732, 3483, 3769, 3701, 2894, 1389, -95, -1721, -3146, -4364, -4635, -4524, -4080, -2922, -1754, -622, 322, 943, 918, 993, 616, 409, -609, -581, -339, -65, 960, 2272, 3194, 4433, 5282, 5528, 4955, 3954, 2392, 289, -1640, -3956, -5761, -6650, -6997, -6707, -5611, -4067, -2215, -331, 1131, 2356, 3255, 3330, 2819, 2533, 2122, 1410, 1164, 1399, 1498, 1691, 2315, 2691, 2740, 2585, 1666, 418, -1048, -2309, -3700, -5073, -5707, -5430, -4998, -3976, -2326, -528, 1697, 3042, 3810, 4393, 3939, 3411, 2206, 741, -748, -1675, -2302, -2283, -1997, -1607, -328, 698, 1892, 2298, 2343, 2091, 1548, 523, -335]
1910c35q25n97r6L2N75J072R03P28M82O4m09r27j222j374j114p71j19j87J015
1929c105J735J806J379J758J245L65o1o54j584j313j767j381j041q29O9M51P75
1946b152J021Q32O36L54j20m17r88q10q25j26j81Q63J121J481J065J676J094L85
1964D909q3p96j450j237j912j470j019o52K37M35J522R60J310J248N60m04j71
1981A987j160j450j209j085p21J35K19J134J143J543J262Q61Q23j61q08q90j210
1998D13j239n34m47Q1L15J189J021J228Q33K81l80o93j089j974j437j357r78l53
2016e120N03O83J492J664J830J361J225L54l40m70r80j298q18r08m43O74M25J008
2034H42Q87R17K66j84p07j311j616j686j536q60n98K94N90J259J616J842J674
$$ y = [-335, -1160, -1757, -1853, -1821, -1246, -174, 729, 1457, 1939, 2003, 1594, 667, -555, -1929, -3043, -3814, -3933, -4120, -3105, -1370, 436, 1815, 3573, 4818, 5183, 5122, 4468, 2884, 1571, -196, -1577, -2618, -3447, -3378, -2927, -2152, -1131, -299, 337, 691, 571, 154, -834, -1644, -2469, -2595, -2776, -1913, -792, 689, 1754, 3430, 4524, 4909, 4826, 4030, 2580, 1343, -569, -2039, -3058, -3710, -3473, -3038, -1516, -556, 754, 2002, 2562, 2158, 1987, 827, -623, -1832, -2917, -3638, -3503, -3284, -2150, -1007, 536, 1798, 2659, 3482, 3321, 2513, 1623, 413, -826, -1360, -1807, -1726, -1411, -222, 799, 2027, 2860, 3141, 2761, 2068, 979, -995, -2432, -3789, -4767, -5120, -4617, -3934, -2442, -778, 1052, 2413, 3638, 3992, 3652, 3182, 2202, 904, 86, -822, -1265, -591, -166, 842, 1729, 2646, 2912, 2728, 2021, 710, -906, -2592, -4128, -4988, -5586, -5292, -4702, -3443, -1827, 15, 1689]
2051A689J107N45M87n13n30j382m84p95o06L62N32O58R55N22K58j28n73j303j315
2070e14j591j609j433q84M07N72J438J545J830J647J445P90N04k95p51q46j257
2087I98p16p15o9J14O23O00N91L56Q5q5j152j042j256j295p45q18m4O81P96J548
2107a545J374J627R74O78M74m14p98j076r81j285l39j2O6O41J140Q64N09N57R1
2126B545l90o48q08j529q69o90r09N6M56O40R62R87R58K59O59k57n46l08o01m44
2146d77m41N0M74Q04O07R61L48P41j49k13j032r38j321j145r62r54l33J22O54
2165c204P80R97R11R30J007L34j03O7n64l41j47m6j02L46J02O42J26L93m02m73
2185A253o85m64j383p16o08p13j0J10Q56N31J214P27R01P32M46m6j78k43m89m28
$$ y = [1689, 2796, 3341, 3828, 3315, 2785, 1403, 919, 124, -482, -120, 412, 1070, 2025, 2547, 2805, 2677, 2104, 801, -514, -2105, -3714, -5147, -6031, -5624, -5052, -3614, -2069, -239, 1408, 2853, 3643, 4147, 3852, 3101, 2255, 998, 282, -433, -502, -388, 235, 835, 1426, 1782, 1867, 1782, 630, -412, -1668, -2963, -3708, -4526, -4570, -3889, -3093, -1545, -171, 1456, 2430, 3108, 3582, 3168, 2370, 1294, 313, -972, -1311, -1323, -1257, -616, 524, 1388, 1897, 2454, 2545, 2155, 1507, 699, -830, -1699, -2389, -3298, -3242, -2786, -2146, -1184, -197, 761, 1020, 1679, 1422, 876, 568, -33, -477, -918, -868, -394, 410, 1017, 1978, 2326, 3067, 2918, 2705, 1673, 735, -586, -1731, -2693, -3647, -3980, -3858, -3204, -2424, -1427, -516, 414, 1421, 1755, 1652, 1719, 1155, 814, 667, 621, 519, 865, 967, 1609, 1735, 2128, 1726, 1253, 568, 104, -1279, -1995, -2603, -3316, -3326, -3216, -2360, -1829, -615, 112, 1013, 1745, 2191, 2145, 1967, 1724, 1235, 807]
2205H07p07p7j27mJ64P4L33k56p8j80l43m54n31l17n01j10L62L40N26Q37P78L70
2227I06O61M26q2J74l78m17k61l19n52K98q67P1j49L49J67K3N5k31j77k62k44
2248h09l71J20k82j05L61O57L96L50O20n6K68K57N0k15o04m20k43j77l03k17R0
2269f33M7L69M4J19L59n5J86J9j77m92k75r2k65J9k96K92L41L79K35N88r7M14
2291A029o6K0l95o6q1kk94j62L21K47K82J38j2L1l99o11m44n68o12l48m68j19
2313b579K56P7O33Q33J116Q67N29M33O0L1j41m30n28m98k95k89j89p7n1J77r4
2334a59j57l98k02o88k09m99Q8j60N17M88N62J195Q62Q61Q37M36o4o88l67r53
2354A302r76n01q33m66o7Q1Q7O29O35M17j37N05n36k10l20l65m45J26j9M73O44
$$ y = [807, 100, 23, -104, -108, 56, 130, 463, 207, 129, -51, -394, -848, -1379, -1696, -2197, -2307, -1945, -1605, -1079, -242, 536, 906, 1567, 1993, 1911, 2085, 1707, 1290, 1029, 710, 158, 456, -411, -340, -489, -140, 27, 50, 105, -126, -303, -565, -809, -1180, -1060, -1342, -1447, -1086, -429, -33, 317, 937, 881, 1149, 1406, 1456, 1241, 637, 217, -26, -203, -506, -723, -633, -586, -217, -173, -54, 305, 250, 436, 455, 278, -214, -489, -581, -846, -827, -1123, -831, -490, -111, 124, 712, 615, 1029, 963, 983, 588, 522, 441, 439, 145, -17, 304, 551, 833, 971, 959, 990, 591, -20, -464, -1032, -1644, -1992, -2460, -2579, -2323, -2246, -1613, -780, 336, 1203, 1732, 2165, 2225, 2256, 2115, 1685, 1157, 659, 364, 75, -114, -191, -242, -65, -159, -316, -714, -916, -1604, -1813, -2312, -2224, -2384, -1867, -1379, -817, 378, 1240, 2101, 2938, 3374, 3310, 2622, 2255, 1302, 326, -175, -1008, -1474, -1541, -1460, -1373, -744, -109, 308, 171, 676, 140, -70, -390, -755, -1200, -1074, -1093, -620, 24]
2375B4L28L60P08J21r7n19l00o70n32n39m38Q2K60P26O43P08N07P21K77L1n64
2396A837r89o77j022o49m11n28J27L59P23M24Q43L66L21K59q5p17k63m68K02j96
2416e44Q9P93M27Q93N60m2J78l15o03q12q31r93j284o36j53J67M26Q52R08O34
2436b86J042N31L05j78n23m70l78k77l56L89J01O54M81Q72L09k83L61o64p29q75
$$ y = [24, 352, 712, 1420, 1541, 1444, 925, 625, -45, -577, -1116, -1554, -1472, -1212, -486, 157, 865, 1372, 2093, 2370, 2401, 1837, 848, 171, -851, -1500, -1911, -2439, -2312, -1953, -1230, -806, 37, 403, 724, 983, 898, 181, -82, -550, -348, -544, -455, 338, 765, 1658, 2218, 2176, 2354, 2039, 1436, 624, -207, -1200, -2484, -3120, -3273, -3106, -2680, -1828, -920, -286, 756, 1287, 1592, 1414, 891, 421, 43, -234, -590, -201, -100, 554, 1035, 1907, 2216, 1933, 2294, 1630, 901, 26]
$$ [...]
8191a30
##END NTUPLES=NMR FID
##END=
