##TITLE=1H_PR-II
 D2O,8 sc, 
 1.10.2021
##JCAMPDX= 6.0         $$ Bruker NMR JCAMP-DX V2.0
##DATA TYPE= NMR FID
##DATA CLASS= NTUPLES
##ORIGIN= UXNMR, Bruker Analytische Messtechnik GmbH
##OWNER= root
$$ XWIN-NMR		Version 3.5
$$ Fri Oct  1 13:08:40 2021 Russian Standard Time (UT+4h)  she@DPX200
##.OBSERVE FREQUENCY= 200.1313468511
##.OBSERVE NUCLEUS= ^1H
##.DELAY= (6, 6)
##.ACQUISITION MODE= SIMULTANEOUS
##.ACQUISITION SCHEME= undefined
##.AVERAGES= 8
##.DIGITISER RES= 18
##SPECTROMETER/DATA SYSTEM= spect
##.PULSE SEQUENCE= zg30
##.SOLVENT NAME= D2O
##.SHIFT REFERENCE= (INTERNAL, D2O, 0, 15.7039)
##AUDIT TRAIL= $$ (NUMBER, WHEN, WHO, WHERE, WHAT)
$$ ##TITLE= Audit trail, XWIN-NMR		Version 3.5
$$ ##JCAMPDX= 5.01
$$ ##ORIGIN= Bruker BioSpin GmbH
$$ ##OWNER= she
$$ F:/spectra/data/she/nmr/H-F/1/audita.txt
$$ ##AUDIT TRAIL=  $$ (NUMBER, WHEN, WHO, WHERE, WHAT)
(   1,<2021-10-01 13:07:20.32 +0400>,<she>,<DPX200>,
      <created by zg, POWCHK disabled, PULCHK disabled
       configuration hash MD5:
       00 E9 B6 7A A2 85 ED C7 34 08 36 98 17 FE 4E 26
       data hash MD5: 16K
       EE 78 8E F8 1A A3 95 7D 6E 93 0B D1 0A 5F 6A 81>)
$$ ##END=
$$ 
$$ hash MD5
$$ E8 58 6F 5A 68 DA 2A 21 41 7B 49 71 5D 19 46 ED
##$RELAX= 
##$RELAX= 
##$RELAX= 
##$RELAX= 
##$RELAX= 
##$RELAX= 
$$ Bruker specific parameters
$$ --------------------------
##$DU= <F:/spectra>
##$EXPNO= 1
##$NAME= <H-F>
##$PROCNO= 1
##$TYPE= <nmr>
##$USER= <she>
##$AMP= (0..31)
100 100 100 100 100 100 100 100 100 100 100 100 100 100 100 100 100 100 
100 100 100 100 100 100 100 100 100 100 100 100 100 100 
##$AQSEQ= 0
##$AQ_mod= 1
##$AUNM= <au_zg>
##$AUTOPOS= <>
##$BF1= 200.13
##$BF2= 200.13
##$BF3= 200.13
##$BF4= 200.13
##$BF5= 200.13
##$BF6= 200.13
##$BF7= 200.13
##$BF8= 200.13
##$BYTORDA= 1
##$CFDGTYP= 0
##$CFRGTYP= 5
##$CHEMSTR= <none>
##$CNST= (0..31)
1 1 145 1 1 1 1 1 1 1 1 1 1 1 1 1 1 1 1 1 1 1 1 1 1 1 1 1 1 1 1 1 
##$CPDPRG= <>
##$CPDPRG1= <>
##$CPDPRG2= <>
##$CPDPRG3= <>
##$CPDPRG4= <mlev>
##$CPDPRG5= <mlev>
##$CPDPRG6= <mlev>
##$CPDPRG7= <mlev>
##$CPDPRG8= <mlev>
##$CPDPRGB= <>
##$CPDPRGT= <>
##$D= (0..31)
0 1.2 0 0 0 0 0 0 0 0.06 0 0.03 0 0 0 0 0.0002 0 0 0 0 0 0 0 0 0 0 0 0 
0 0 0 
##$DATE= 1633079239
##$DBL= (0..7)
120 120 120 120 120 120 120 120 
##$DBP= (0..7)
150 150 150 150 150 150 150 150 
##$DBP07= 0
##$DBPNAM0= <>
##$DBPNAM1= <>
##$DBPNAM2= <>
##$DBPNAM3= <>
##$DBPNAM4= <>
##$DBPNAM5= <>
##$DBPNAM6= <>
##$DBPNAM7= <>
##$DBPOAL= (0..7)
0.5 0.5 0.5 0.5 0.5 0.5 0.5 0.5 
##$DBPOFFS= (0..7)
0 0 0 0 0 0 0 0 
##$DE= 6
##$DECBNUC= <off>
##$DECIM= 32
##$DECNUC= <off>
##$DECSTAT= 4
##$DIGMOD= 1
##$DIGTYP= 9
##$DL= (0..7)
0 120 120 120 120 120 120 120 
##$DP= (0..7)
150 150 150 150 150 150 150 150 
##$DP07= 0
##$DPNAME0= <>
##$DPNAME1= <>
##$DPNAME2= <>
##$DPNAME3= <>
##$DPNAME4= <>
##$DPNAME5= <>
##$DPNAME6= <>
##$DPNAME7= <>
##$DPOAL= (0..7)
0.5 0.5 0.5 0.5 0.5 0.5 0.5 0.5 
##$DPOFFS= (0..7)
0 0 0 0 0 0 0 0 
##$DQDMODE= 0
##$DR= 18
##$DS= 0
##$DSLIST= <SSSSSSSSSSSSSSS>
##$DSPFIRM= 0
$$ [...]
##$SUBNAM2= <"">
##$SUBNAM3= <"">
##$SUBNAM4= <"">
##$SUBNAM5= <"">
##$SUBNAM6= <"">
##$SUBNAM7= <"">
##$SUBNAM8= <"">
##$SUBNAM9= <"">
##$SW= 18.0517286264689
##$SWIBOX= (0..15)
0 0 2 0 0 0 0 0 0 0 0 0 0 0 0 0 
##$SW_h= 3612.71676300578
##$TD= 16384
##$TD0= 1
##$TE= 0
##$TE2= 300
##$TE3= 300
##$TEG= 300
##$TL= (0..7)
0 120 120 120 120 120 120 120 
##$TP= (0..7)
150 150 150 150 150 150 150 150 
##$TP07= 0
##$TPNAME0= <>
##$TPNAME1= <>
##$TPNAME2= <>
##$TPNAME3= <>
##$TPNAME4= <>
##$TPNAME5= <>
##$TPNAME6= <>
##$TPNAME7= <>
##$TPOAL= (0..7)
0.5 0.5 0.5 0.5 0.5 0.5 0.5 0.5 
##$TPOFFS= (0..7)
0 0 0 0 0 0 0 0 
##$TUNHIN= 0
##$TUNHOUT= 0
##$TUNXOUT= 0
##$USERA1= <user>
##$USERA2= <user>
##$USERA3= <user>
##$USERA4= <user>
##$USERA5= <user>
##$V9= 5
##$VALIST= <valist>
##$VCLIST= <CCCCCCCCCCCCCCC>
##$VD= 0
##$VDLIST= <DDDDDDDDDDDDDDD>
##$VPLIST= <PPPPPPPPPPPPPPP>
##$VTLIST= <TTTTTTTTTTTTTTT>
##$WBST= 1024
##$WBSW= 4
##$XGAIN= (0..3)
0 0 0 0 
##$XL= 0
##$YL= 0
##$YMAX_a= 153966
##$YMIN_a= -153347
##$ZGOPTNS= <>
##$ZL1= 120
##$ZL2= 120
##$ZL3= 120
##$ZL4= 120
##$ABSF1= 10
##$ABSF2= 0
##$ABSG= 5
##$ABSL= 3
##$ALPHA= 0
##$AQORDER= 0
##$ASSFAC= 0
##$ASSFACI= 0
##$ASSFACX= 0
##$ASSWID= 0
##$AUNMP= <proc_1d>
##$AZFE= 0.1
##$AZFW= 0.1
##$BCFW= 1
##$BC_mod= 2
##$BYTORDP= 1
##$COROFFS= 0
##$CY= 11.3945322036743
##$DATMOD= 1
##$DC= 2
##$DFILT= <>
##$DTYPP= 0
##$F1P= 2.36226072786647
##$F2P= -0.459571619588291
##$FCOR= 0.5
##$FTSIZE= 0
##$FT_mod= 4
##$GAMMA= 1
##$GB= 0.15
##$INTBC= 1
##$INTSCL= 1
##$ISEN= 128
##$LB= 0.24
##$LEV0= 0
##$LPBIN= 0
##$MAXI= 10000
##$MC2= 0
##$MEAN= 0
##$ME_mod= 0
##$MI= 1.114404
##$NCOEF= 0
##$NC_proc= 0
##$NLEV= 6
##$NOISF1= 3.799351
##$NOISF2= 2.8
##$NSP= 1
##$NTH_PI= 0
##$NZP= 0
##$OFFSET= 15.70392
##$PC= 1
##$PHC0= -14967.74
##$PHC1= 23.80083
##$PH_mod= 1
##$PKNL= yes
##$PPARMOD= 0
##$PSCAL= 0
##$PSIGN= 0
##$REVERSE= no
##$SF= 200.130013532006
##$SI= 16384
##$SIGF1= 3
##$SIGF2= 2
##$SINO= 400
##$SIOLD= 16384
##$SREGLST= <1H.CDCl3>
##$SSB= 0
##$STSI= 0
##$STSR= 0
##$SW_p= 3612.71676300578
##$SYMM= 0
##$S_DEV= 0
##$TDeff= 0
##$TDoff= 0
##$TI= <>
##$TILT= no
##$TM1= 0
##$TM2= 0
##$TOPLEV= 0
##$USERP1= <user>
##$USERP2= <user>
##$USERP3= <user>
##$USERP4= <user>
##$USERP5= <user>
##$WDW= 1
##$XDIM= 8192
##$YMAX_p= 0
##$YMIN_p= 0
$$ End of Bruker specific parameters
$$ ---------------------------------
##NTUPLES= NMR FID
##VAR_NAME=  TIME,          FID/REAL,        FID/IMAG
##SYMBOL=    X,             R,               I
##VAR_TYPE=  INDEPENDENT,   DEPENDENT,       DEPENDENT
##VAR_FORM=  AFFN,          ASDF,            ASDF
##VAR_DIM=   8192,          8192,            8192
##UNITS=     SECONDS,       ARBITRARY UNITS, ARBITRARY UNITS
##FACTOR=    0.0002768,     1,               1
##FIRST=     0,             0,               0
##LAST=      2.2672688,     0,               0
##MIN=       0,             -153347,         0
##MAX=       2.2672688,     153966,          0
$$ Real data points
##PAGE= N=1
##DATA TABLE= (X++(R..R)), XYDATA
0 0 0 0 0 0 0 0 0 0 0 0 0 0 0 0 8 -8 8 -8 8 -16 16 -16 24 -24 32 -33 40 -48 51 -59 67 -79 90 -100 115 -130
36 -130 145 -162 182 -202 224 -248 278 -307 339 -375 414 -456 502 -553 610 -672 741 -818 903
55 903 -1001 1110 -1238 1387 -1561 1768 -2029 2352 -2779 3361 -4220 5605 -8216 14930 -71795
70 -71795 -126346 -563 85333 148474 121635 45257 -64946 -137066 -153347 -93218 4472 104467
82 104467 148695 126852 43758 -55672 -130329 -138354 -82406 14064 101647 143578 116179 35291
94 35291 -61811 -127189 -134552 -77767 14670 98987 134567 107766 30142 -60614 -121918 -123796 -67413
107 -67413 20323 98741 131372 101449 25373 -60520 -117091 -117863 -62350 21957 94775 122113
119 122113 92484 19169 -62910 -113866 -110336 -55354 26022 95747 120292 89337 18692 -58191
131 -58191 -105322 -100346 -45417 32188 95596 116093 83583 13033 -61340 -104958 -98637 -45641
143 -45641 28358 88098 104831 70977 3470 -66726 -106554 -96723 -42981 28758 85459 100439
155 100439 66834 1291 -64776 -100129 -88667 -35754 33705 86391 97721 63314 -911 -64441
167 -64441 -97128 -84094 -31997 34218 83394 92556 57212 -5194 -64863 -94360 -79669 -27626
179 -27626 36409 82614 89598 54170 -6386 -63680 -90600 -74553 -23880 37529 80749 85146
191 85146 49091 -10167 -64982 -89322 -72131 -21923 37682 78301 81195 45448 -12028 -63574
203 -63574 -84995 -66162 -16006 41727 80003 81266 45013 -11254 -60481 -80084 -60716 -11718
215 -11718 43436 78837 77639 40597 -14457 -62226 -79988 -59427 -11146 42063 75382 72732
227 72732 35645 -18013 -62981 -78085 -56466 -8250 43726 74586 70264 33361 -19306 -62381
239 -62381 -75390 -52723 -5382 44417 73253 67180 29267 -21971 -62635 -74041 -50344 -2929
251 -2929 45017 71510 64249 26601 -23569 -62248 -71103 -46428 -139 46503 71033 61524 23548
264 23548 -25250 -62293 -69828 -44256 1548 45877 68037 57763 19421 -28529 -62995 -68408
276 -68408 -42486 3016 46538 66938 55343 17657 -28398 -61444 -65185 -37936 6664 47921
288 47921 67259 54622 16257 -28777 -59775 -62527 -35510 8599 48555 65234 51415 13862
300 13862 -30504 -60292 -60897 -33160 9756 48385 64009 49136 11280 -31280 -58915 -58960 -30665
313 -30665 12219 48825 62426 47155 9464 -32566 -58606 -56762 -28517 13190 48786 61109
325 61109 44184 6958 -33195 -57999 -55118 -25754 15336 49022 60004 42748 5392 -33978
337 -33978 -56615 -52462 -23602 16893 49489 58303 39923 3187 -35163 -56898 -51447 -21939 17355
350 17355 48210 56235 37245 327 -36449 -56139 -49933 -20120 19002 48525 54839 35346 -670
363 -670 -36678 -55188 -47305 -17416 20274 48744 54006 33431 -2511 -37002 -54190 -45780 -15716
376 -15716 21593 48276 52170 31640 -3968 -37758 -53245 -43775 -13976 22515 48256 51033 29675
389 29675 -5332 -37659 -52422 -42150 -11911 23452 47576 49527 27855 -6963 -38242 -51457
401 -51457 -40496 -10619 24262 47521 48010 26016 -7950 -38231 -50316 -38226 -8243 25556
413 25556 47428 46994 24533 -9360 -38310 -49028 -36439 -6527 26560 46863 45159 22262 -11136
426 -11136 -39071 -48400 -34880 -5029 27011 46211 43413 19977 -12763 -39289 -47392 -32902 -3015
439 -3015 28137 45889 41839 18116 -14086 -39574 -46199 -30905 -1186 29061 45365 40160 15986
452 15986 -15674 -39834 -45021 -29017 571 29817 44811 38549 14089 -16819 -39733 -43812 -27147
465 -27147 2249 30362 44188 37082 12359 -18012 -39737 -42751 -25607 3464 30799 43375
477 43375 35322 10713 -18887 -39775 -41682 -23971 4730 31099 42779 34110 9413 -19582 -39172
490 -39172 -40238 -22347 6196 31755 42099 32766 8159 -20369 -39006 -39040 -20651 7256 31809
503 31809 41418 31174 6329 -21147 -38725 -38057 -19224 8594 31999 40412 29755 5094 -21942
516 -21942 -38484 -36572 -17670 9496 32400 39672 28066 3595 -22528 -38096 -35597 -16068 10851
529 10851 32338 38724 26787 2040 -23427 -37547 -34091 -14618 11932 32769 37839 25119 800
542 800 -23853 -37393 -32861 -12843 12855 32611 37033 23712 -701 -24533 -36815 -31808 -11719
555 -11719 13797 32650 35746 22170 -1800 -25186 -36469 -30312 -10210 14554 32645 35123 20813
568 20813 -3071 -25270 -35694 -29270 -8800 15629 32382 34011 19729 -4019 -25762 -35051 -27904
581 -27904 -7711 16058 32354 33073 18117 -5071 -25844 -34572 -26792 -6303 16870 31971 32167
594 32167 17081 -6175 -26270 -33774 -25524 -5362 17578 31956 30995 15639 -7011 -26409 -33268
607 -33268 -24234 -3835 18071 31476 30191 14331 -8186 -26512 -32366 -22978 -2681 18965 31375
620 31375 28951 12991 -8975 -26857 -31726 -21488 -1331 19384 31070 27842 11523 -10123 -26871
633 -26871 -31007 -20469 -170 19965 30517 26718 10348 -10965 -27005 -30153 -19098 859 20401
646 20401 30275 25734 9001 -11736 -26939 -29463 -17848 2063 20795 29775 24682 7850 -12601
659 -12601 -26975 -28569 -16705 2910 21191 29382 23557 6799 -13130 -26892 -27804 -15583 3910
672 3910 21424 28839 22661 5757 -13820 -26708 -27029 -14618 4698 21672 28350 21578 4724
685 4724 -14314 -26617 -26255 -13467 5504 21869 27878 20651 3629 -14815 -26381 -25414 -12399
698 -12399 6378 22106 27377 19672 2707 -15390 -26205 -24559 -11389 7153 22268 26785 18632
711 18632 1819 -15941 -26007 -23802 -10419 7897 22359 26192 17735 832 -16374 -25788 -23051
724 -23051 -9283 8660 22478 25697 16766 -96 -16829 -25476 -22154 -8351 9282 22604 25065
737 25065 15685 -795 -17053 -25321 -21381 -7413 9919 22578 24557 14880 -1761 -17474 -24879
750 -24879 -20546 -6545 10632 22561 23864 13979 -2558 -17781 -24689 -19754 -5591 11002 22508
763 22508 23401 13015 -3317 -17952 -24246 -19017 -4780 11688 22424 22629 12241 -4005 -18328
776 -18328 -23836 -18088 -3945 12096 22466 22089 11267 -4755 -18424 -23507 -17344 -2941 12690
789 12690 22207 21403 10439 -5565 -18747 -22951 -16459 -2191 13164 22241 20649 9424 -6128
802 -6128 -18844 -22688 -15537 -1266 13423 21983 20091 8542 -6981 -19018 -22072 -14794 -489
815 -489 14098 21837 19232 7718 -7390 -19238 -21649 -13870 324 14365 21663 18665 6736 -8151
829 -8151 -19114 -21204 -13173 1153 14779 21319 17903 6063 -8712 -19301 -20614 -12258 1664
842 1664 14968 21168 17194 5099 -9164 -19240 -20271 -11470 2614 15268 20800 16542 4394
855 4394 -9821 -19224 -19504 -10732 3145 15630 20542 15713 3551 -10216 -19185 -19098 -9789 3976
869 3976 15730 20228 15121 2767 -10733 -19013 -18480 -9111 4592 16056 19811 14248 2088 -11200
883 -11200 -19139 -17877 -8277 5129 16225 19515 13530 1225 -11628 -18931 -17379 -7589 5909 16419
897 16419 19065 12862 542 -12061 -18864 -16718 -6706 6436 16562 18795 12149 -200 -12354
910 -12354 -18696 -16178 -5944 6963 16557 18373 11457 -834 -12709 -18527 -15491 -5221 7416
923 7416 16677 17940 10719 -1473 -12956 -18409 -14913 -4529 7982 16620 17450 10029 -2102 -13231
937 -13231 -18067 -14392 -3923 8402 16699 16951 9291 -2703 -13465 -17842 -13770 -3125 8806 16637
951 16637 16574 8580 -3318 -13657 -17560 -13092 -2471 9255 16627 16094 7913 -3924 -13883 -17234
965 -17234 -12461 -1806 9677 16577 15573 7272 -4508 -14106 -16967 -11811 -1077 10072 16459 15083
979 15083 6495 -4976 -14183 -16653 -11135 -440 10445 16326 14529 5915 -5565 -14285 -16312 -10527
993 -10527 90 10716 16280 13993 5196 -5962 -14336 -15859 -9866 718 10964 16069 13526 4589
1007 4589 -6481 -14407 -15463 -9310 1363 11277 15843 12871 3947 -6852 -14396 -15154 -8593 1823
1021 1823 11395 15709 12448 3312 -7297 -14377 -14765 -8092 2441 11663 15428 11867 2757 -7710
1035 -7710 -14469 -14246 -7378 2878 11859 15268 11274 2081 -7995 -14347 -13934 -6857 3420 11977 14889
1050 14889 10897 1541 -8449 -14300 -13388 -6312 3807 12195 14625 10262 998 -8627 -14319 -13104 -5606
1065 -5606 4335 12190 14421 9730 413 -9039 -14071 -12578 -5133 4842 12438 14077 9133 -37 -9304
1080 -9304 -14154 -12191 -4445 5251 12438 13902 8621 -678 -9499 -13875 -11743 -3983 5667 12599 13486
1095 13486 8047 -1136 -9833 -13862 -11206 -3403 5944 12662 13260 7483 -1702 -10035 -13711 -10845 -2805
1110 -2805 6535 12691 12910 7011 -2216 -10363 -13449 -10257 -2263 6853 12789 12527 6372 -2660 -10497
1125 -10497 -13379 -9890 -1699 7169 12714 12230 5916 -3131 -10681 -13165 -9439 -1219 7571 12762 11833
1140 11833 5369 -3533 -10882 -13071 -8907 -685 7797 12673 11531 4902 -4058 -11006 -12795 -8493 -199
1155 -199 8171 12611 11157 4482 -4451 -11114 -12587 -7978 330 8405 12567 10796 3890 -4801 -11168
1170 -11168 -12355 -7571 743 8627 12497 10420 3446 -5195 -11303 -12050 -7115 1184 8915 12417 9979
1185 9979 2883 -5517 -11327 -11824 -6632 1642 9113 12274 9618 2417 -5934 -11382 -11506 -6162 2089
1200 2089 9347 12152 9174 1891 -6222 -11411 -11229 -5665 2513 9481 12026 8774 1407 -6512 -11484
1215 -11484 -10881 -5250 2906 9664 11802 8353 1006 -6813 -11484 -10654 -4785 3288 9812 11659 7991
1230 7991 553 -7104 -11480 -10287 -4270 3688 9952 11473 7555 71 -7357 -11372 -9981 -3865 4105
1245 4105 10039 11250 7157 -276 -7634 -11324 -9583 -3443 4374 10086 11075 6731 -701 -7834 -11226
1260 -11226 -9365 -2931 4749 10166 10834 6354 -1145 -8066 -11100 -8931 -2603 5031 10278 10568 5909
1275 5909 -1528 -8269 -11081 -8581 -2101 5381 10263 10362 5534 -1964 -8429 -10901 -8229 -1672 5720
1290 5720 10359 10063 5064 -2276 -8649 -10836 -7834 -1238 5869 10307 9846 4605 -2705 -8702 -10652
1305 -10652 -7552 -838 6267 10295 9495 4265 -3075 -8937 -10478 -7113 -504 6415 10335 9224 3764
1320 3764 -3311 -8949 -10397 -6771 -11 6652 10274 8977 3471 -3712 -9027 -10143 -6341 270 6912
1335 6912 10225 8624 3028 -3967 -9118 -9935 -6008 691 7065 10123 8447 2617 -4329 -9204 -9682
1350 -9682 -5762 1073 7203 10007 8052 2256 -4510 -9247 -9564 -5254 1373 7394 9994 7760 1829
1365 1829 -4849 -9233 -9317 -4954 1750 7614 9810 7423 1535 -5103 -9313 -8985 -4613 2009 7738 9720
1381 9720 7077 1125 -5266 -9321 -8877 -4256 2384 7861 9589 6795 733 -5597 -9329 -8587 -3863
1396 -3863 2677 8000 9452 6410 464 -5758 -9308 -8382 -3509 2988 8062 9329 6167 116 -5991
1411 -5991 -9185 -8104 -3182 3258 8136 9146 5846 -184 -6166 -9183 -7825 -2774 3532 8153 9033
1426 9033 5540 -538 -6290 -9121 -7559 -2531 3745 8175 8765 5221 -813 -6504 -9056 -7293 -2212
1441 -2212 4010 8305 8644 4890 -1139 -6588 -8917 -7021 -1871 4299 8269 8399 4565 -1399 -6746
1456 -6746 -8830 -6772 -1517 4516 8309 8237 4205 -1745 -6778 -8734 -6483 -1190 4666 8237 8043 3882
1472 3882 -1996 -6947 -8638 -6195 -824 4881 8306 7811 3588 -2291 -7062 -8454 -5888 -492 5131
1487 5131 8268 7529 3276 -2553 -7185 -8378 -5633 -235 5228 8278 7363 2930 -2769 -7156 -8214
1502 -8214 -5379 72 5449 8259 7132 2640 -3065 -7294 -8042 -5058 339 5533 8172 6826 2306
1517 2306 -3250 -7370 -7942 -4789 632 5722 8034 6644 2111 -3503 -7375 -7734 -4520 849 5843
1532 5843 8011 6362 1818 -3630 -7380 -7574 -4135 1152 5881 7949 6198 1443 -3889 -7345 -7399 -3964
1548 -3964 1355 6054 7800 5844 1193 -4106 -7389 -7199 -3697 1594 6141 7752 5619 857 -4266
1563 -4266 -7332 -7054 -3383 1920 6196 7551 5385 661 -4415 -7398 -6788 -3054 2113 6309 7489
1578 7489 5127 334 -4503 -7334 -6674 -2809 2325 6310 7329 4903 164 -4717 -7238 -6316 -2556
1593 -2556 2543 6460 7218 4566 -110 -4836 -7220 -6215 -2248 2742 6371 7043 4376 -360 -4942
1608 -4942 -7122 -6033 -2025 2978 6452 6860 4061 -619 -5033 -7062 -5796 -1694 3126 6461 6785
1623 6785 3827 -867 -5120 -6958 -5569 -1417 3325 6533 6589 3609 -1052 -5266 -6898 -5251 -1209
1638 -1209 3448 6508 6418 3300 -1313 -5312 -6809 -5064 -966 3678 6434 6234 3098 -1543 -5399 -6703
1654 -6703 -4824 -747 3758 6467 6098 2897 -1682 -5392 -6591 -4627 -486 3893 6378 5950 2627
1669 2627 -1967 -5504 -6469 -4432 -285 4054 6358 5682 2401 -2095 -5522 -6375 -4141 14 4128 6278
1685 6278 5522 2162 -2297 -5611 -6202 -3960 212 4261 6235 5315 1946 -2443 -5576 -6090 -3695 419
1701 419 4367 6229 5078 1660 -2655 -5649 -5991 -3495 606 4436 6139 4946 1454 -2757 -5635
1716 -5635 -5823 -3320 780 4505 6031 4782 1264 -2924 -5639 -5657 -3106 964 4572 5953 4562 1012
1732 1012 -3028 -5644 -5550 -2838 1207 4623 5856 4357 825 -3124 -5576 -5361 -2665 1392 4718 5800
1748 5800 4224 597 -3297 -5569 -5220 -2461 1528 4719 5703 4020 313 -3430 -5530 -5076 -2229 1729
1764 1729 4762 5557 3770 171 -3564 -5569 -4897 -1968 1854 4834 5438 3561 -15 -3627 -5421 -4782
1780 -4782 -1816 2077 4844 5352 3402 -246 -3769 -5411 -4552 -1603 2135 4935 5274 3138 -414 -3864
1796 -3864 -5345 -4373 -1294 2331 4914 5153 2988 -590 -3954 -5350 -4269 -1216 2469 4914 5033 2757
1812 2757 -755 -4026 -5276 -4052 -1047 2590 4889 4885 2612 -966 -3976 -5194 -3920 -812 2755 4868
1828 4868 4755 2449 -1081 -4060 -5031 -3728 -586 2825 4831 4638 2235 -1217 -4137 -5001 -3555 -444
1844 -444 2902 4809 4474 2066 -1407 -4218 -4924 -3380 -284 3033 4850 4330 1824 -1572 -4191 -4819
1860 -4819 -3191 7 3119 4694 4221 1692 -1716 -4253 -4688 -3019 102 3218 4738 4052 1519 -1813
1876 -1813 -4212 -4640 -2856 320 3221 4646 3914 1349 -2001 -4219 -4521 -2669 449 3394 4634 3704
1892 3704 1115 -2125 -4252 -4354 -2520 585 3356 4494 3559 940 -2180 -4229 -4278 -2369 783 3484
1908 3484 4441 3439 795 -2261 -4271 -4176 -2171 938 3487 4419 3272 563 -2323 -4187 -4042 -1945
1924 -1945 1029 3444 4340 3125 484 -2473 -4142 -3884 -1821 1106 3474 4250 2980 317 -2534 -4119
1940 -4119 -3740 -1690 1295 3553 4112 2840 119 -2596 -4054 -3700 -1476 1435 3537 4036 2662 17
1956 17 -2683 -4066 -3451 -1337 1509 3530 3944 2450 -152 -2714 -3982 -3380 -1147 1576 3608 3830
1972 3830 2282 -288 -2857 -3926 -3160 -990 1681 3548 3687 2144 -521 -2831 -3870 -3060 -860 1787
1988 1787 3612 3635 2038 -552 -2851 -3827 -2935 -702 1830 3507 3508 1816 -743 -2864 -3704 -2810 -524
2005 -524 1975 3487 3406 1773 -819 -2918 -3694 -2683 -432 1944 3505 3351 1603 -887 -2931 -3553
2021 -3553 -2557 -318 2063 3418 3204 1455 -969 -2934 -3445 -2409 -166 2095 3378 3081 1315 -1083
2037 -1083 -2933 -3443 -2289 -45 2200 3379 2953 1233 -1155 -2934 -3329 -2158 -7 2169 3327 2892
2053 2892 1104 -1214 -2956 -3213 -1997 188 2249 3249 2776 883 -1290 -2978 -3176 -1896 223 2314
2069 2314 3263 2664 835 -1355 -2926 -3109 -1804 318 2329 3194 2532 705 -1389 -2890 -2988 -1687 386
2086 386 2375 3081 2396 643 -1534 -2920 -2916 -1596 484 2331 3020 2303 510 -1544 -2892 -2776 -1445
2103 -1445 591 2363 3009 2210 369 -1609 -2847 -2660 -1289 667 2384 2954 2084 306 -1656 -2814
2119 -2814 -2690 -1186 773 2339 2912 2008 177 -1729 -2713 -2519 -1115 841 2360 2806 1839 101 -1710
2136 -1710 -2758 -2460 -1006 947 2347 2755 1768 -42 -1753 -2665 -2343 -889 931 2368 2635 1612
2152 1612 -133 -1758 -2664 -2292 -831 1078 2402 2605 1565 -132 -1788 -2651 -2223 -713 1160 2355
2168 2355 2559 1493 -247 -1896 -2600 -2041 -581 1189 2376 2431 1384 -304 -1903 -2528 -2058 -506 1261
2185 1261 2342 2393 1321 -444 -1934 -2472 -1933 -449 1241 2367 2337 1202 -489 -1935 -2417 -1780 -298
2202 -298 1330 2286 2275 1131 -560 -1895 -2346 -1715 -270 1359 2322 2147 972 -643 -1911 -2319 -1653
2219 -1653 -127 1427 2306 2072 946 -708 -1979 -2335 -1541 -50 1444 2254 1970 816 -770 -1920
2235 -1920 -2264 -1458 -11 1454 2189 1956 765 -800 -1951 -2144 -1364 55 1458 2201 1846 650 -842
2252 -842 -2032 -2118 -1294 144 1473 2124 1768 595 -896 -1956 -2051 -1221 231 1501 2167 1714 448 -979
2270 -979 -1939 -2023 -1161 263 1531 2092 1664 440 -994 -1907 -1905 -1087 268 1570 2043 1578 374 -1017
2288 -1017 -1894 -1861 -1037 351 1498 1990 1502 292 -1036 -1787 -1773 -921 400 1557 1884 1463 236 -1103
2306 -1103 -1867 -1767 -854 475 1587 1895 1342 117 -1094 -1863 -1723 -791 500 1525 1846 1268 96
2323 96 -1127 -1769 -1624 -664 589 1607 1823 1215 28 -1123 -1771 -1579 -633 595 1563 1747 1133 26
2341 26 -1147 -1731 -1540 -596 635 1541 1724 1096 -100 -1205 -1735 -1416 -509 662 1521 1688 1043 -194
2359 -194 -1188 -1682 -1398 -422 686 1512 1612 931 -123 -1170 -1627 -1315 -377 729 1493 1540 899 -194 -1174
2378 -1174 -1601 -1344 -340 754 1506 1558 865 -264 -1279 -1563 -1232 -299 806 1416 1492 781 -288 -1184
2396 -1184 -1560 -1143 -229 795 1501 1433 704 -305 -1203 -1510 -1133 -203 807 1484 1380 651 -379 -1197 -1432
2415 -1432 -1075 -126 802 1405 1306 599 -391 -1159 -1434 -970 -109 861 1413 1228 607 -433 -1201 -1400 -943 -85
2435 -85 829 1361 1235 537 -477 -1168 -1276 -901 -25 856 1337 1212 497 -475 -1193 -1292 -843 30 859 1295
2455 1295 1074 411 -527 -1156 -1283 -756 47 901 1280 1117 296 -528 -1155 -1263 -722 87 917 1216 1029 348
2475 348 -515 -1141 -1210 -705 130 827 1232 926 291 -501 -1130 -1156 -684 190 891 1154 909 196 -614 -1105 -1148
2496 -1148 -611 181 913 1142 888 222 -562 -1066 -1093 -590 190 899 1124 893 214 -561 -1081 -1034 -540 249
2516 249 923 1145 784 160 -604 -1069 -1022 -489 244 868 1057 753 81 -631 -1011 -978 -480 289 855 1036 756
2537 756 126 -597 -1015 -923 -410 270 906 1033 752 96 -552 -993 -928 -390 296 860 955 698 68 -616 -999
2558 -999 -846 -364 361 863 948 646 -9 -658 -1017 -793 -317 335 834 928 603 5 -683 -966 -773 -300 345
2579 345 846 945 517 -10 -628 -923 -772 -294 382 810 903 549 -29 -619 -965 -741 -263 366 860 853 428
2600 428 -126 -647 -901 -734 -191 335 831 861 463 -88 -619 -862 -652 -142 469 820 822 464 -146 -621 -857
2621 -857 -705 -163 445 761 813 395 -154 -694 -852 -614 -77 438 806 802 372 -172 -665 -862 -553 -89 427
2642 427 769 730 334 -249 -640 -818 -571 -50 453 745 741 287 -186 -673 -775 -523 -46 480 757 714 269
2663 269 -270 -663 -724 -534 -13 482 713 675 271 -200 -607 -742 -486 33 486 688 645 227 -304 -660 -738
2684 -738 -442 -36 485 689 579 211 -255 -583 -653 -414 27 461 667 592 164 -279 -640 -593 -389 49 463
2705 463 685 494 124 -283 -590 -603 -364 62 454 630 460 162 -266 -581 -580 -332 123 499 606 462 135
2726 135 -287 -591 -605 -317 118 462 634 446 160 -299 -581 -546 -341 61 406 588 418 111 -289 -499 -548
2747 -548 -263 126 410 554 414 113 -320 -516 -460 -222 132 385 522 406 35 -234 -496 -436 -261 105 362
2768 362 538 345 58 -281 -473 -422 -197 51 424 482 346 88 -326 -469 -458 -216 158 415 404 372 47 -263
2790 -263 -451 -393 -232 97 399 474 344 45 -261 -426 -455 -186 100 346 395 325 51 -249 -445 -394 -192 129
2812 129 357 383 282 34 -253 -444 -407 -148 103 364 325 353 79 -219 -353 -363 -189 73 301 379 271 44
2834 44 -205 -327 -355 -131 57 311 383 259 27 -233 -304 -378 -173 113 284 332 254 22 -216 -382 -327 -178 102
2857 102 337 356 268 -3 -189 -308 -335 -163 29 193 312 291 78 -216 -302 -325 -195 85 272 303 273 63 -162
2880 -162 -363 -301 -168 25 261 335 235 -20 -155 -330 -329 -180 24 291 333 284 76 -196 -281 -298 -128 42 223
2903 223 355 178 41 -152 -346 -303 -176 62 276 339 207 64 -187 -331 -324 -185 64 237 297 276 62 -165
2925 -165 -292 -333 -175 47 263 316 285 107 -142 -325 -295 -182 18 217 364 260 68 -214 -296 -286 -174 93
2947 93 260 385 255 54 -134 -271 -345 -210 27 200 280 276 120 -134 -289 -266 -215 48 193 328 226 47
2969 47 -150 -301 -265 -177 23 207 356 260 22 -155 -273 -345 -171 4 197 300 276 30 -144 -299 -331 -179
2991 -179 -2 218 327 266 44 -103 -306 -362 -213 28 185 234 252 87 -110 -241 -319 -162 61 290 343 282
3013 282 122 -140 -333 -355 -199 26 228 330 285 85 -143 -317 -338 -156 12 230 343 262 125 -156 -344
3034 -344 -306 -181 35 229 354 292 116 -138 -351 -340 -156 9 265 332 347 79 -139 -316 -310 -201 51 204
3056 204 347 289 101 -146 -350 -323 -172 40 216 365 271 72 -185 -291 -343 -194 46 250 353 336 97 -149
3078 -149 -334 -310 -219 41 254 359 367 94 -195 -354 -333 -208 59 274 347 282 45 -169 -330 -323 -196 40 235
3101 235 318 237 94 -193 -327 -410 -177 36 285 358 254 90 -176 -370 -398 -217 -1 245 353 280 66 -136
3123 -136 -391 -365 -214 68 309 319 339 120 -201 -288 -372 -166 26 277 318 320 69 -170 -344 -364 -213 78 276
3146 276 374 297 50 -123 -376 -378 -194 20 279 387 274 77 -212 -345 -347 -188 97 323 380 299 96 -231 -330
3169 -330 -317 -223 67 307 411 304 -5 -193 -469 -320 -173 122 342 372 302 65 -239 -389 -413 -168 53 299
3191 299 429 292 51 -218 -384 -379 -180 72 365 417 292 12 -250 -467 -376 -167 119 343 470 267 52
3212 52 -267 -380 -371 -162 128 352 416 289 4 -258 -464 -377 -158 134 362 431 247 19 -285 -446 -359 -131
3234 -131 128 369 471 293 20 -329 -423 -365 -167 181 398 482 277 -42 -302 -437 -397 -81 166 432 474 277
3256 277 -2 -343 -487 -413 -150 214 424 436 334 -53 -375 -499 -400 -97 218 370 417 261 -86 -363 -460 -417
3278 -417 -100 239 464 458 280 -49 -335 -462 -325 -66 266 497 481 236 -95 -396 -475 -376 -112 242 488 459
3300 459 252 -50 -407 -501 -385 -85 286 484 493 240 -120 -446 -526 -372 -52 280 465 440 229 -156 -440 -496
3322 -496 -381 -70 302 490 479 277 -211 -454 -567 -331 31 415 517 501 223 -166 -468 -544 -334 -17 333
3343 333 524 470 246 -201 -522 -576 -409 6 353 567 482 181 -256 -522 -578 -397 38 399 560 483 200 -238
3365 -238 -463 -555 -324 35 385 572 460 126 -275 -484 -514 -306 12 443 601 510 141 -243 -560 -601 -273
3386 -273 80 479 544 462 112 -297 -524 -623 -305 108 472 532 441 59 -335 -616 -516 -237 134 488 585 431
3408 431 28 -332 -562 -543 -316 108 459 590 425 14 -357 -590 -548 -273 152 557 614 395 30 -292 -618
3429 -618 -565 -279 137 559 597 431 -19 -389 -638 -534 -217 212 502 601 333 -3 -397 -637 -509 -173 219
3450 219 595 622 376 15 -417 -645 -565 -164 268 551 604 385 -79 -437 -641 -500 -177 328 543 630 312
3471 312 -83 -462 -703 -523 -136 281 600 605 374 -111 -489 -644 -555 -132 300 554 567 304 -141 -522 -693
3492 -693 -477 -42 408 621 609 310 -146 -539 -685 -484 -115 359 662 560 311 -177 -545 -693 -454 -65
3512 -65 387 617 601 272 -145 -549 -638 -489 -38 415 608 591 249 -222 -533 -632 -466 -34 397 681 586 275
3534 275 -206 -542 -692 -465 -50 432 649 601 198 -259 -596 -671 -430 42 502 713 560 211 -279 -615 -671
3555 -671 -412 42 482 634 561 194 -304 -648 -700 -370 38 521 683 539 135 -316 -629 -670 -325 65 520
3576 520 745 523 172 -316 -597 -632 -364 130 508 726 535 123 -328 -687 -626 -386 143 558 661 503 83
3597 83 -367 -660 -655 -327 132 585 695 484 83 -455 -776 -637 -301 219 559 690 485 75 -415 -700 -656
3618 -656 -320 196 590 715 445 31 -450 -649 -650 -233 196 640 721 474 -9 -487 -711 -598 -246 265 632
3639 632 688 433 -32 -451 -775 -611 -231 250 618 604 394 -42 -542 -697 -576 -220 304 617 668 317 -86
3660 -86 -530 -705 -635 -155 338 638 660 433 -97 -568 -734 -587 -118 371 695 685 393 -95 -588 -738 -566
3681 -566 -174 371 684 689 346 -134 -602 -731 -556 -146 429 697 647 327 -179 -543 -769 -531 -99 474 740
3702 740 688 297 -207 -563 -768 -485 -70 476 763 660 245 -229 -717 -775 -487 -44 476 732 644 318 -212
3723 -212 -700 -772 -484 44 464 736 577 207 -284 -707 -746 -479 30 522 779 591 239 -278 -663 -725 -451
3744 -451 121 515 800 642 186 -326 -668 -765 -425 106 582 752 641 103 -312 -691 -743 -414 87 622 743
3765 743 622 151 -391 -718 -667 -374 140 565 735 533 143 -447 -702 -725 -381 159 604 730 567 102 -375
3786 -375 -764 -704 -318 159 612 806 519 89 -436 -742 -683 -371 230 644 728 525 35 -499 -772 -632 -357
3807 -357 218 681 727 463 2 -442 -765 -667 -270 309 707 768 461 22 -545 -770 -622 -277 316 710 758
3828 758 468 -57 -513 -803 -667 -189 349 715 747 453 -69 -529 -761 -594 -199 359 732 703 405 -119 -587
3849 -587 -790 -590 -103 363 730 729 398 -95 -557 -762 -571 -149 434 787 723 391 -222 -589 -719 -546 -151
3870 -151 395 757 707 380 -163 -581 -737 -524 -74 422 717 679 301 -180 -645 -706 -538 -21 498 730 635
3891 635 299 -215 -641 -753 -573 26 459 768 661 272 -246 -658 -732 -485 2 481 805 663 259 -266
3911 -266 -692 -802 -492 41 551 783 611 237 -291 -702 -762 -379 118 530 768 648 248 -347 -738 -712 -442
3932 -442 59 542 747 577 167 -306 -742 -748 -344 69 577 749 595 138 -428 -742 -712 -420 188 624 762
3953 762 611 101 -404 -761 -664 -315 175 600 791 535 76 -386 -734 -680 -304 236 589 762 541 61 -503
3974 -503 -788 -673 -306 251 610 792 507 54 -478 -727 -658 -302 197 638 806 492 14 -479 -761 -702 -226
3995 -226 260 671 781 495 -27 -563 -757 -619 -240 312 694 791 527 -52 -494 -799 -610 -235 314 661
4015 661 735 464 -65 -520 -724 -632 -170 375 656 739 432 -106 -535 -770 -609 -116 335 722 743 404 -112
4036 -112 -553 -816 -547 -115 398 775 739 376 -119 -587 -800 -566 -84 424 724 754 320 -200 -578 -739 -546
4057 -546 -90 434 715 652 308 -249 -666 -807 -513 -46 436 757 716 297 -200 -652 -790 -544 -13 478 727
4078 727 686 283 -248 -605 -783 -515 -23 488 778 728 293 -270 -690 -738 -469 8 495 753 660 250 -341
4099 -341 -743 -781 -410 6 522 802 674 224 -336 -721 -721 -425 65 582 774 598 190 -362 -655 -733 -418
4120 -418 103 592 848 591 180 -350 -649 -760 -367 142 573 789 627 104 -378 -705 -780 -373 103 613
4140 613 742 586 151 -415 -753 -696 -352 159 643 795 565 76 -447 -751 -689 -348 115 638 763 545 21
4161 21 -436 -768 -682 -302 201 634 767 532 28 -492 -741 -655 -251 228 648 782 506 41 -473 -768 -649
4182 -649 -268 246 681 753 485 -14 -483 -831 -624 -205 357 674 746 472 -64 -505 -792 -631 -251 282 728
4203 728 766 438 -80 -594 -798 -615 -226 335 711 728 402 -74 -589 -800 -616 -124 368 691 794 416 -98
4224 -98 -597 -768 -568 -118 393 681 716 347 -143 -633 -818 -568 -105 435 706 693 387 -187 -652 -797 -583
4245 -583 -78 459 793 728 354 -183 -611 -730 -560 -26 418 743 653 287 -218 -646 -802 -550 -39 514 733
4266 733 691 245 -275 -639 -779 -573 11 514 771 680 251 -316 -677 -721 -497 48 477 785 684 251 -268
4287 -268 -671 -697 -495 58 503 779 668 197 -268 -713 -740 -448 98 557 804 622 182 -380 -718 -800 -419
4308 -419 125 586 766 556 112 -362 -705 -718 -360 158 550 751 614 149 -373 -735 -718 -365 164 608 786
4329 786 541 157 -418 -703 -714 -345 207 571 777 555 53 -423 -742 -687 -308 210 686 748 514 20 -451
4350 -451 -765 -724 -307 227 624 730 455 39 -438 -736 -639 -290 227 696 743 505 -44 -494 -759 -661 -275
4371 -275 313 630 734 464 2 -550 -777 -603 -163 321 706 701 428 -123 -536 -774 -576 -128 349 699 683
4392 683 412 -96 -540 -774 -612 -149 331 636 703 426 -126 -584 -813 -538 -120 308 674 702 408 -140 -572
4413 -572 -737 -553 -117 346 719 657 360 -183 -571 -688 -473 -56 386 700 683 349 -156 -650 -727 -538 -43
4434 -43 414 681 637 319 -182 -624 -763 -493 -23 407 687 655 288 -232 -611 -707 -459 -26 403 754 651
4455 651 234 -243 -625 -698 -470 26 446 728 652 236 -267 -589 -709 -456 23 494 727 578 170 -303 -676
4476 -676 -717 -413 39 543 693 573 121 -290 -707 -693 -425 91 516 695 610 175 -335 -621 -680 -326 81
4497 81 521 681 563 134 -380 -695 -697 -344 114 572 706 534 68 -389 -693 -638 -298 164 547 682 493
4518 493 85 -423 -665 -624 -365 171 552 707 489 98 -382 -706 -594 -310 178 554 677 500 40 -416
4538 -416 -668 -590 -264 192 645 731 401 10 -402 -642 -574 -221 233 581 675 476 -32 -437 -694 -573 -232
4559 -232 283 638 656 460 -103 -488 -697 -608 -219 268 650 658 385 -55 -479 -685 -548 -174 334 691 635 344
4581 344 -85 -472 -664 -509 -166 304 657 627 300 -51 -496 -677 -550 -116 308 642 597 375 -117 -530 -696
4602 -696 -513 -63 314 649 648 329 -149 -555 -693 -452 -88 352 619 637 310 -180 -571 -714 -427 -51 349
4623 349 662 619 273 -193 -567 -642 -456 -33 429 713 607 235 -216 -556 -682 -442 -8 425 648 595 197
4644 197 -247 -591 -724 -453 45 408 654 602 223 -294 -554 -675 -392 -35 462 644 553 219 -283 -596 -616
4665 -616 -374 125 473 656 571 130 -292 -597 -623 -410 121 475 631 542 77 -284 -645 -602 -345 114 540
4686 540 670 499 87 -349 -664 -598 -295 144 517 682 513 109 -355 -653 -657 -270 184 490 636 478 73
4707 73 -390 -607 -583 -210 229 581 618 465 58 -387 -659 -601 -275 167 588 658 443 45 -408 -643 -555 -223
4729 -223 245 515 665 408 5 -413 -594 -570 -137 196 566 612 379 -18 -381 -608 -515 -149 257 580 621
4750 621 382 -60 -423 -642 -480 -139 264 561 593 319 -79 -479 -621 -531 -126 280 577 614 302 -90 -490
4771 -490 -590 -443 -121 334 567 562 316 -161 -460 -599 -453 -55 318 586 542 271 -158 -564 -625 -447 -60
4792 -60 380 601 549 243 -162 -493 -623 -438 12 456 624 581 237 -171 -514 -644 -402 -1 410 609 520
4813 520 239 -201 -557 -636 -388 6 400 595 501 155 -233 -564 -583 -365 -6 390 574 507 116 -265 -562
4834 -562 -597 -317 64 507 593 537 119 -215 -540 -576 -356 80 429 597 523 152 -294 -570 -539 -343 34 507
4856 507 633 431 100 -293 -572 -587 -283 130 465 558 455 51 -328 -595 -551 -309 123 532 581 394 59
4877 59 -332 -577 -537 -281 167 460 598 425 62 -349 -646 -495 -216 155 557 614 364 -31 -369 -604 -545
4898 -545 -242 218 492 559 368 12 -387 -571 -522 -139 218 518 556 358 -87 -434 -560 -450 -146 271 497
4919 497 582 368 -88 -387 -584 -483 -164 269 559 515 374 -83 -471 -562 -452 -117 291 523 573 284 -115
4940 -115 -438 -594 -385 -81 287 571 562 283 -113 -448 -553 -504 -87 349 575 554 258 -134 -452 -559 -426
4961 -426 -33 306 555 514 227 -158 -462 -535 -365 -23 397 500 505 203 -148 -513 -548 -351 -18 343 525 534
4983 534 222 -157 -505 -503 -414 -2 348 561 459 166 -215 -493 -553 -358 20 386 543 528 176 -214 -474 -506
5005 -506 -357 105 425 528 493 143 -260 -540 -543 -316 81 377 584 433 111 -306 -485 -519 -306 105 386
5026 386 544 458 88 -246 -528 -577 -317 80 415 535 402 30 -272 -514 -538 -262 90 429 555 370 140
5047 140 -320 -538 -514 -253 125 488 542 365 55 -347 -512 -518 -267 117 490 587 337 13 -346 -565 -496 -185
5069 -185 160 495 574 365 13 -308 -574 -528 -186 192 469 545 351 -45 -351 -578 -484 -183 224 510 513 377
5091 377 -40 -331 -523 -484 -95 257 501 554 304 -41 -387 -607 -440 -128 287 522 536 265 -68 -440 -561
5112 -561 -434 -139 236 530 511 284 -136 -420 -533 -408 -78 298 506 511 274 -74 -434 -563 -398 -54 267
5133 267 520 516 223 -140 -445 -545 -369 -24 320 513 474 189 -147 -459 -546 -369 4 333 530 454 162 -192
5155 -192 -468 -510 -312 4 309 541 468 192 -243 -488 -540 -365 53 365 520 418 170 -236 -441 -504 -339
5176 -339 59 346 532 430 134 -247 -463 -493 -278 79 356 517 443 70 -253 -478 -533 -263 22 392 573
5197 573 417 88 -244 -531 -479 -283 86 430 563 412 44 -281 -452 -421 -216 117 399 529 407 53 -261
5218 -261 -506 -486 -219 175 433 519 340 -26 -346 -503 -421 -224 189 441 482 329 -33 -360 -527 -496 -172 161
5240 161 427 525 324 27 -355 -550 -413 -153 166 476 502 310 -35 -362 -522 -430 -193 172 504 572 341
5261 341 -51 -367 -499 -443 -163 188 468 499 292 -63 -361 -512 -412 -128 200 479 487 258 -63 -427 -473 -407
5283 -407 -94 286 437 511 256 -125 -385 -529 -428 -113 282 519 436 192 -122 -488 -488 -337 -80 302 479
5304 479 426 203 -151 -442 -507 -383 -69 349 482 485 229 -165 -471 -470 -337 -35 300 490 422 152 -122 -522
5326 -522 -513 -319 21 297 463 427 147 -138 -443 -526 -295 71 320 506 409 103 -154 -445 -461 -282 40 366
5348 366 486 386 96 -177 -457 -461 -220 90 373 543 386 125 -250 -472 -447 -252 115 365 502 392 94
5369 94 -229 -480 -459 -213 81 386 526 361 48 -273 -436 -470 -224 139 379 514 392 67 -234 -516 -415
5390 -415 -199 91 430 459 329 39 -293 -449 -458 -200 129 450 517 298 10 -282 -513 -429 -148 155 460 470
5412 470 320 -21 -317 -437 -401 -190 147 461 502 247 -31 -332 -489 -413 -130 208 456 499 259 -72 -362
5433 -362 -496 -398 -105 233 440 460 276 -117 -386 -501 -387 -98 252 506 469 272 -145 -399 -511 -391 -44
5454 -44 309 490 489 220 -104 -336 -515 -336 -20 200 523 462 267 -126 -404 -513 -351 -44 268 468 423 189
5476 189 -165 -490 -472 -362 -66 302 487 425 140 -189 -459 -479 -311 -50 285 466 437 198 -182 -423 -477 -318
5498 -318 65 330 405 447 164 -194 -475 -507 -253 -9 342 434 372 172 -209 -456 -519 -301 42 350 486 343
5520 343 84 -271 -452 -405 -196 72 349 473 367 110 -229 -447 -404 -225 52 408 494 384 43 -260 -440
5541 -440 -487 -287 131 405 525 340 18 -307 -538 -462 -207 117 372 479 340 34 -326 -402 -444 -156 126
5562 126 415 446 294 21 -321 -471 -443 -174 152 396 447 295 -30 -306 -464 -406 -130 226 427 460 243 -6
5584 -6 -298 -513 -374 -94 200 439 447 278 -52 -319 -467 -385 -121 268 405 406 257 -15 -339 -500 -325 -114
5606 -114 237 459 439 252 -95 -352 -508 -357 -45 271 458 427 213 -109 -388 -484 -304 22 237 420 378
5627 378 182 -99 -427 -515 -326 -35 271 482 401 179 -104 -360 -465 -342 -26 289 504 406 125 -153 -471
5648 -471 -486 -330 17 378 450 405 135 -214 -442 -459 -326 97 323 449 381 141 -200 -425 -468 -256 40 342
5670 342 518 423 98 -234 -421 -423 -251 80 344 476 391 101 -221 -440 -407 -218 120 392 470 358 32 -321
5692 -321 -376 -423 -265 98 366 485 350 38 -300 -458 -426 -159 101 405 498 298 9 -322 -428 -438 -167 174
5714 174 415 420 343 11 -316 -440 -373 -116 189 405 480 284 9 -341 -472 -365 -114 131 384 425 234 -51
5736 -51 -374 -417 -376 -144 260 471 452 291 -45 -319 -473 -364 -124 205 425 454 273 -49 -337 -527 -375 -86
5758 -86 230 417 379 190 -90 -357 -458 -337 -81 215 440 386 235 -54 -350 -486 -340 -58 246 484 425
5779 425 185 -88 -358 -506 -345 -70 267 400 422 175 -118 -406 -448 -277 -7 312 457 409 162 -157 -387
5800 -387 -402 -317 -34 285 474 404 189 -171 -380 -407 -265 74 296 506 364 84 -208 -402 -429 -312 66 299
5822 299 466 342 76 -193 -426 -425 -240 119 311 453 340 102 -207 -378 -421 -208 88 329 458 357 75
5843 75 -308 -433 -397 -252 80 309 461 361 50 -241 -469 -426 -203 107 323 407 358 51 -259 -420 -449 -141
5865 -141 90 362 493 315 45 -299 -451 -468 -192 171 339 471 350 -1 -292 -469 -373 -167 203 385 422
5886 422 315 -34 -298 -503 -421 -134 128 386 406 279 -53 -339 -439 -414 -129 168 367 452 269 -5 -330
5907 -330 -425 -395 -67 178 438 449 260 -98 -362 -460 -389 -87 235 406 427 187 -57 -395 -478 -320 -52 229
5929 229 457 399 211 -93 -381 -482 -303 -71 282 407 427 175 -95 -356 -519 -356 -58 300 420 486 140
5950 140 -152 -403 -470 -331 24 270 464 403 225 -94 -381 -472 -342 -20 317 382 425 109 -156 -374 -445 -313
5972 -313 16 228 503 411 108 -170 -381 -487 -280 26 326 444 360 135 -266 -423 -478 -275 14 266 421
5993 421 396 117 -219 -440 -428 -244 85 304 418 327 84 -220 -418 -420 -280 85 315 485 343 70 -271 -421
6015 -421 -436 -161 100 353 496 382 -19 -263 -418 -393 -183 176 340 446 248 58 -300 -406 -442 -186 117
6036 117 410 481 293 3 -261 -486 -396 -153 153 451 440 279 -28 -253 -395 -360 -107 149 438 401 261 -43
6058 -43 -370 -503 -354 -162 172 417 449 226 -112 -316 -473 -354 -63 234 389 402 212 -90 -324 -464 -371
6079 -371 -114 171 424 468 168 -129 -390 -432 -342 -58 212 452 419 194 -110 -371 -495 -328 -84 272 427
6100 427 433 201 -84 -376 -453 -333 -41 237 495 366 159 -124 -350 -441 -308 -29 314 457 415 176 -160 -408
6122 -408 -466 -293 19 311 425 415 168 -143 -439 -449 -301 1 296 425 405 137 -212 -397 -433 -259 59 335
6144 335 440 385 87 -242 -441 -419 -262 111 331 462 368 109 -229 -437 -419 -196 114 270 446 312 48
6165 48 -211 -407 -431 -207 121 349 452 312 69 -216 -426 -412 -159 161 294 457 320 65 -286 -417 -408 -147
6187 -147 186 377 352 327 35 -296 -450 -401 -153 108 378 378 281 -10 -283 -436 -372 -120 153 346 434 263 -25
6210 -25 -362 -400 -388 -93 143 359 385 307 -10 -318 -424 -357 -108 132 419 432 222 -53 -326 -414 -346 -111 213
6233 213 431 402 174 -71 -331 -426 -386 -98 217 391 390 204 -85 -329 -440 -347 -112 253 429 404 198 -122
6255 -122 -343 -397 -361 -55 212 437 384 180 -91 -335 -453 -327 -14 272 392 370 139 -161 -391 -436 -336 -19
6277 -19 251 366 377 142 -156 -407 -461 -279 -5 319 418 400 178 -140 -459 -411 -236 -9 255 454 414 116
6299 116 -192 -386 -398 -273 29 319 446 330 53 -189 -440 -454 -242 44 271 429 314 114 -213 -527 -454
6320 -454 -240 44 280 445 349 82 -231 -409 -413 -215 60 352 463 352 44 -280 -435 -368 -208 186 321
6341 321 440 262 51 -235 -405 -420 -225 152 349 502 303 51 -217 -462 -383 -152 191 382 390 342 9 -329
6363 -329 -489 -415 -131 166 355 452 328 -23 -282 -451 -365 -130 168 438 435 276 -96 -324 -460 -357 -125 201
6385 201 397 404 276 -59 -290 -391 -304 -102 185 437 427 207 -83 -354 -433 -376 -105 191 494 399 201 -73
6407 -73 -360 -472 -322 -54 244 403 416 182 -64 -333 -434 -386 11 227 398 403 171 -98 -394 -469 -269 -11
6429 -11 269 463 415 187 -101 -417 -449 -285 -25 270 386 390 157 -176 -405 -466 -333 11 311 434 418 151
6451 151 -162 -384 -435 -276 -19 279 504 347 140 -153 -379 -408 -276 47 305 445 372 103 -194 -449 -488
6472 -488 -266 56 323 415 347 60 -247 -416 -436 -232 27 334 458 361 83 -219 -406 -439 -205 105 365 463
6494 463 384 41 -217 -455 -421 -236 85 354 441 341 16 -268 -442 -382 -192 79 391 421 336 62 -277 -410
6516 -410 -426 -182 90 426 441 299 33 -324 -441 -398 -116 166 327 439 257 11 -230 -441 -394 -171 192
6537 192 434 472 276 -7 -289 -467 -386 -153 186 409 459 244 -51 -242 -388 -334 -129 185 405 482 231 -52
6559 -52 -323 -416 -306 -106 241 386 451 185 -59 -326 -423 -308 -89 241 396 477 226 -126 -365 -481 -323 -64
6581 -64 224 473 393 199 -76 -389 -417 -348 -44 253 410 376 233 -83 -351 -508 -326 -26 283 447 418 205
6603 205 -101 -378 -439 -326 -43 257 401 370 135 -154 -385 -435 -305 -27 304 431 373 67 -162 -373 -418 -218
6625 -218 56 339 461 401 142 -141 -371 -378 -246 -13 313 436 385 111 -188 -410 -432 -248 10 297 456 348
6647 348 58 -190 -434 -447 -258 57 308 422 345 116 -199 -412 -434 -246 101 342 452 374 26 -226 -401
6668 -401 -386 -204 78 389 512 326 9 -208 -381 -394 -184 106 341 423 285 18 -311 -480 -408 -196 168
6689 168 327 453 270 -10 -283 -403 -415 -206 142 345 464 255 -6 -276 -415 -404 -147 147 370 452 224
6710 224 24 -325 -469 -375 -137 183 420 406 252 -30 -278 -429 -358 -130 200 385 466 233 -61 -261 -383
6731 -383 -304 -73 183 428 421 259 -56 -374 -463 -357 -160 210 400 427 271 -58 -350 -444 -355 -64 222 406
6753 406 393 225 -117 -302 -491 -292 -38 237 434 405 213 -125 -367 -430 -323 -74 205 379 427 248 -93
6774 -93 -375 -431 -346 -54 185 416 379 169 -92 -343 -452 -271 -33 270 382 374 169 -144 -464 -371 -320 -41 262
6797 262 398 378 123 -179 -421 -425 -291 14 288 400 326 148 -201 -428 -439 -204 53 260 448 340 121 -218
6819 -218 -488 -390 -240 49 314 405 339 61 -192 -435 -367 -219 39 377 423 296 125 -146 -364 -402 -192 122
6841 122 305 425 306 49 -205 -367 -367 -165 138 319 443 269 56 -186 -428 -408 -166 92 320 441 304
6862 304 66 -218 -413 -429 -220 105 374 430 307 21 -270 -458 -361 -155 106 365 410 290 20 -276 -433
6883 -433 -372 -121 125 365 402 254 11 -283 -371 -374 -127 151 408 448 298 -45 -311 -407 -335 -143 143 401 408
6906 408 253 -38 -273 -426 -389 -125 189 386 431 172 -16 -366 -413 -378 -50 157 379 380 200 -69 -353 -404
6928 -404 -315 -94 247 416 402 180 -90 -291 -442 -290 -85 195 374 442 173 -50 -305 -448 -340 -30 186
6949 186 363 382 178 -147 -349 -402 -276 -33 296 369 322 184 -127 -384 -399 -292 -40 359 400 392 167 -104 -365
6972 -365 -429 -269 17 287 420 375 140 -181 -413 -404 -235 26 323 412 329 98 -154 -384 -372 -185 36 283
6994 283 350 378 112 -177 -369 -369 -226 20 330 426 341 98 -181 -369 -398 -267 60 346 424 299 65 -225 -402
7017 -402 -463 -168 99 366 406 254 75 -195 -366 -425 -151 86 319 444 299 -22 -284 -332 -380 -183 77 325
7039 325 409 246 48 -249 -402 -410 -153 89 381 411 289 20 -251 -447 -360 -131 146 381 374 284 -41 -239 -402
7062 -402 -387 -134 151 389 398 232 -20 -316 -426 -357 -86 128 383 404 252 -31 -268 -416 -321 -149 198 370
7084 370 401 225 -49 -286 -403 -310 -121 173 316 413 196 -57 -264 -375 -368 -80 183 403 387 174 -58 -355
7106 -355 -434 -313 -71 234 381 397 173 -63 -351 -451 -349 -29 281 394 384 167 -129 -326 -426 -328 -28
7127 -28 215 368 382 165 -171 -309 -410 -318 -35 283 415 359 100 -108 -299 -422 -308 56 268 394 350 150
7149 150 -196 -384 -414 -226 20 275 388 317 103 -133 -346 -420 -274 44 251 444 338 94 -150 -390 -412
7170 -412 -214 -6 274 410 304 103 -209 -329 -359 -222 44 325 409 336 124 -213 -315 -379 -198 82 294
7191 294 366 307 85 -230 -402 -400 -168 78 340 404 320 86 -246 -378 -386 -170 69 305 409 268 67 -222 -321
7214 -321 -335 -183 64 348 377 281 10 -280 -385 -366 -177 109 344 408 301 23 -264 -452 -353 -169 172 330
7236 330 403 224 4 -231 -385 -350 -104 166 388 363 269 -31 -284 -394 -298 -187 192 332 394 241 31 -268
7258 -268 -441 -372 -103 192 352 382 246 4 -326 -432 -341 -117 104 400 396 245 -53 -334 -385 -327 -84 155
7280 155 396 363 161 -25 -302 -368 -339 -101 185 426 336 221 -98 -302 -353 -285 -15 216 360 348 222 -68
7302 -68 -261 -400 -227 -70 218 382 377 204 -133 -345 -396 -283 -17 177 360 415 167 -119 -332 -425 -291 -57
7324 -57 229 394 388 126 -93 -374 -379 -236 -19 205 383 412 134 -100 -342 -401 -259 37 266 418 329 161 -147
7347 -147 -364 -364 -222 43 258 380 334 75 -178 -382 -379 -210 -4 334 425 336 66 -180 -394 -357 -250 131 281
7370 281 403 390 108 -116 -389 -384 -171 58 313 401 291 50 -158 -383 -373 -167 67 322 390 277 53 -185
7392 -185 -415 -388 -175 61 319 379 302 17 -181 -371 -402 -152 97 365 390 266 48 -183 -398 -330 -95 154
7414 154 303 389 229 27 -188 -374 -327 -133 116 361 358 239 -15 -215 -359 -357 -118 130 301 354 187 -14
7436 -14 -294 -322 -329 -102 157 362 336 168 -25 -255 -372 -335 -23 134 365 339 216 -26 -237 -378 -337 -119 186
7459 186 376 365 238 -2 -275 -399 -293 -116 246 328 377 152 -68 -290 -343 -244 -91 141 406 311 126 -95
7481 -95 -310 -411 -279 -67 159 376 395 133 -74 -258 -378 -260 -32 212 375 309 136 -135 -363 -355 -275 -76
7503 -76 197 331 294 119 -152 -289 -374 -254 31 243 345 318 101 -100 -291 -346 -193 8 244 378 261 124
7525 124 -136 -280 -361 -218 24 257 327 302 83 -127 -333 -392 -207 -1 232 347 227 82 -98 -348 -359 -149
7547 -149 44 225 338 298 85 -194 -316 -327 -198 50 258 352 254 73 -139 -304 -334 -204 104 208 342 282
7569 282 40 -142 -306 -311 -209 95 302 332 180 20 -172 -321 -339 -153 89 256 333 206 51 -161 -351 -309
7591 -309 -139 124 302 377 234 46 -183 -312 -333 -129 113 287 335 226 0 -196 -312 -344 -120 119 289
7612 289 296 206 23 -225 -341 -292 -150 122 312 334 243 39 -243 -314 -289 -137 125 269 327 211 -21 -223 -317
7635 -317 -264 -100 109 276 349 226 -62 -210 -332 -314 -127 172 264 296 176 -78 -244 -328 -310 -88 139 309
7657 309 296 188 -59 -249 -289 -229 -42 149 273 327 214 -57 -207 -363 -248 -77 195 332 310 156 -31 -259
7679 -259 -318 -251 -44 172 278 300 152 -78 -240 -335 -230 -11 163 327 330 151 -74 -232 -364 -219 -1 151
7701 151 290 270 128 -118 -254 -316 -248 -19 203 313 239 120 -93 -253 -314 -205 5 245 386 280 110 -59
7723 -59 -302 -292 -206 2 207 353 315 64 -85 -288 -330 -194 26 156 336 262 98 -130 -296 -299 -178 39 210
7746 210 298 277 38 -105 -289 -255 -128 15 272 323 245 61 -175 -312 -282 -135 35 238 223 264 63 -154 -264
7769 -264 -287 -191 67 225 268 187 29 -193 -269 -280 -172 112 250 298 220 42 -138 -278 -285 -127 77 193 319
7792 319 224 -15 -142 -287 -244 -123 118 239 325 194 -10 -150 -313 -201 -117 62 237 294 194 56 -161 -298
7814 -298 -244 -101 123 299 287 139 0 -249 -319 -246 -135 86 261 288 158 0 -185 -323 -227 -121 117 273
7836 273 267 173 -57 -171 -284 -272 -63 111 259 276 139 -31 -219 -255 -238 -69 128 185 257 191 -28 -211 -265 -248
7860 -248 -77 106 287 280 167 -73 -234 -257 -216 -33 144 262 270 170 -78 -212 -290 -166 -72 137 275 258 119
7883 119 -55 -196 -260 -175 -18 138 265 221 122 -37 -260 -224 -278 14 177 252 216 73 -89 -211 -240 -172 -25
7906 -25 151 225 236 80 -100 -209 -264 -152 -7 187 241 202 102 -44 -176 -310 -185 -21 196 271 207 103 -96
7929 -96 -225 -233 -207 36 189 267 230 63 -93 -195 -232 -190 -9 155 225 190 43 -76 -231 -285 -106 56 174 259
7953 259 140 74 -102 -248 -266 -88 8 178 295 181 80 -119 -224 -223 -121 0 180 260 204 31 -93 -292
7975 -292 -208 -108 33 175 232 173 21 -138 -205 -217 -145 65 187 188 145 19 -113 -227 -216 -71 67 203 279 169
7999 169 47 -222 -226 -254 -130 54 277 220 120 56 -120 -200 -251 -67 35 224 176 170 8 -126 -214 -191 -127 39
8023 39 181 208 153 -3 -127 -190 -153 -29 29 169 247 122 48 -139 -190 -181 -65 61 181 193 194 -63 -121 -226 -220 -34
8049 -34 83 209 252 137 -16 -122 -180 -220 -68 123 244 246 157 -75 -123 -207 -181 -98 61 147 224 170 -32 -156 -249
8074 -249 -176 -48 97 239 213 73 4 -146 -205 -201 -26 80 250 236 109 -24 -160 -186 -139 -1 68 218 182 125
8098 125 -36 -178 -225 -107 -30 70 225 173 113 -41 -160 -165 -142 9 152 169 245 75 -85 -187 -193 -131 -26 81
8122 81 215 163 83 -103 -144 -249 -181 7 104 247 200 89 -63 -150 -194 -123 -6 123 235 133 100 -58 -247 -210
8146 -210 -147 26 120 154 177 56 -42 -190 -223 -155 4 165 192 233 28 -88 -164 -244 -201 -10 77 198 146 46 -88
8171 -88 -159 -250 -141 92 122 183 171 47 -61 -197 -203 -71 30 141 212 181 4 -85 -148 -178
8191a78
$$ Imaginary data points
##PAGE= N=2
##DATA TABLE= (X++(I..I)), XYDATA
0 0 0 0 0 0 0 0 0 0 0 0 0 0 0 0 0 0 0 0 0 0 0 5 -5 8 -8 8 -8 8 -8 14 -15 16 -17 21 -24 25 -29 33 -37 40 -45 50 -55
43 -55 61 -68 74 -82 92 -100 111 -121 133 -149 164 -179 202 -223 250 -280 317 -363 416 -489 586
64 586 -723 933 -1289 2023 -4166 24672 123152 153966 116533 20957 -84243 -152932 -149078 -79281
78 -79281 24682 112192 144633 103790 11869 -86753 -145581 -138705 -66776 34546 117130 142882
90 142882 101709 12610 -82037 -137022 -126155 -57526 37078 113630 135100 91231 5142 -83317
102 -83317 -133165 -121067 -52538 38748 109319 127425 85458 2356 -81230 -125061 -110223 -44240
114 -44240 42493 108463 122238 78269 -1720 -80470 -121840 -105633 -40367 41295 101877 113449
126 113449 69814 -7576 -81182 -116679 -97987 -33869 45982 103551 111830 68880 -4541 -74284
138 -74284 -106440 -85648 -23104 51881 104438 109635 65038 -7786 -74068 -103577 -83094 -22214
150 -22214 49353 97027 99193 54881 -15229 -77801 -103469 -80353 -20251 48439 93821 94332 50047
163 50047 -17026 -75553 -98120 -73941 -14833 50824 92269 90124 45851 -19674 -75592 -95133
175 -95133 -70074 -12623 50260 88776 84591 40562 -22474 -74771 -91736 -65594 -8712 51640
187 51640 87327 81898 37930 -23388 -73008 -88015 -61448 -6139 51245 83972 76362 32086
199 32086 -27467 -74767 -87510 -59990 -5673 49846 80375 71545 28320 -28966 -73240 -83152
211 -83152 -54423 -752 53002 81397 71411 28188 -27623 -69400 -77857 -49011 3646 54688
223 54688 80015 68360 24928 -29801 -69686 -76267 -46661 4668 53682 77401 64105 20793
235 20793 -31662 -69187 -73889 -43185 7679 54736 76057 61704 18594 -32959 -68207 -70680
247 -70680 -39972 9703 55111 73975 57871 15048 -34812 -68117 -68955 -37084 12008 55043
259 55043 72364 55653 12663 -35649 -66185 -65408 -33381 14992 56334 71142 52824 10279
271 10279 -36732 -66241 -63782 -31140 15369 54629 68026 48519 5885 -39362 -66512 -62915
283 -62915 -30074 16430 54179 65505 45987 4339 -39894 -65001 -59441 -26397 18775 55136
295 55136 65208 44283 2729 -39527 -63313 -57326 -23743 20641 54566 63034 41857 465
307 465 -40940 -62585 -54900 -21790 21578 54863 61558 39126 -1090 -40833 -61460 -52573 -18768
320 -18768 23318 54368 60003 37253 -3340 -41778 -60216 -50618 -17271 24408 54128 57733 34432
333 34432 -4972 -42266 -59425 -48133 -14300 25848 54194 57162 32932 -6363 -41730 -57300
345 -57300 -45675 -11771 27704 54086 55159 30737 -7929 -42842 -56937 -43825 -10582 27697
357 27697 53037 52842 27571 -10352 -43394 -56170 -42503 -8634 28780 52237 51281 26037 -11673
370 -11673 -43602 -54624 -40064 -6792 29700 52206 49693 23821 -12814 -43510 -53881 -38435
382 -38435 -5061 30106 51208 48074 22018 -14333 -43681 -52342 -36552 -3515 31100 50831
394 50831 46338 20375 -15156 -43687 -51304 -34722 -1995 31392 49948 44748 18252 -16822 -43712
407 -43712 -50235 -33194 -540 32027 49147 42990 16560 -17735 -43569 -48683 -30738 1538 33026
420 33026 49055 41698 14878 -18548 -43162 -47114 -28596 3335 33742 48130 39870 12878 -20107
433 -20107 -43400 -45924 -26911 4842 34163 47231 37928 10756 -21402 -43279 -44603 -24815 6647
446 6647 34832 46517 36144 8747 -22519 -43087 -43213 -22731 8280 35266 45565 34261 6825
459 6825 -23631 -42922 -41763 -20999 9614 35676 44732 32556 5336 -24435 -42491 -40340 -19171
472 -19171 10954 35882 43782 31060 3731 -25162 -42030 -39173 -17793 11932 35771 42537 29296
485 29296 2171 -25960 -41814 -37919 -16289 12714 35766 41760 27725 893 -26238 -41133
497 -41133 -36511 -14556 14046 35910 40746 26426 -355 -26874 -40536 -34934 -13120 14966 35964
510 35964 39695 24714 -1659 -27325 -40066 -33722 -11435 15984 35729 38850 23335 -3210 -27855
523 -27855 -39260 -32329 -9991 17003 35926 37519 21632 -4254 -28329 -38968 -30851 -8395 17753
536 17753 35631 36620 20100 -5724 -28623 -38017 -29573 -7009 18873 35512 35332 18840 -6656
549 -6656 -28959 -37286 -27890 -5557 19414 35386 34425 17107 -8000 -29076 -36706 -26890 -4160
562 -4160 20091 34810 33154 15822 -9071 -29563 -35845 -25310 -3138 20658 34757 32016 14306
575 14306 -9750 -29444 -35193 -24131 -1721 21129 34081 31067 13175 -10882 -29552 -34154 -22973
588 -22973 -797 21749 33689 29703 11882 -11473 -29572 -33592 -21510 487 21992 33384
600 33384 28818 10479 -12492 -29409 -32578 -20301 1630 22658 32762 27423 9326 -13308 -29669
613 -29669 -31684 -18865 2647 22916 32443 26271 7828 -14145 -29345 -30845 -17577 4042 23480
626 23480 31733 25214 6711 -14971 -29364 -29755 -16173 4989 23784 31341 23866 5366 -15494
639 -15494 -29176 -29015 -14939 6065 23963 30626 22794 4164 -16301 -29006 -27903 -13736 6930
652 6930 24357 30037 21597 3088 -16879 -28832 -26968 -12438 7834 24360 29407 20513 1894
665 1894 -17477 -28427 -26123 -11360 8641 24465 28736 19396 989 -17782 -28207 -25225 -10224
678 -10224 9290 24502 28090 18326 14 -18262 -27869 -24277 -9245 10027 24618 27398 17334
691 17334 -948 -18680 -27487 -23311 -8226 10714 24573 26752 16236 -1866 -19001 -27142 -22425
704 -22425 -7147 11488 24561 26112 15209 -2759 -19309 -26798 -21514 -6148 12032 24535 25429
717 25429 14241 -3565 -19633 -26408 -20620 -5193 12636 24489 24638 13241 -4386 -19928 -25945
730 -25945 -19666 -4134 13216 24350 24004 12269 -5224 -20079 -25516 -18870 -3313 13772 24244
743 24244 23239 11365 -5839 -20352 -25103 -17911 -2442 14147 24132 22543 10299 -6607 -20451
756 -20451 -24604 -17154 -1547 14693 23846 21811 9538 -7281 -20655 -24101 -16247 -869 15005
769 15005 23725 21086 8606 -7863 -20621 -23699 -15415 99 15342 23417 20490 7683 -8648
782 -8648 -20649 -22951 -14548 820 15899 23283 19558 6766 -9067 -20826 -22600 -13557 1665
795 1665 16010 22967 18912 5829 -9819 -20760 -21945 -12811 2450 16500 22559 18014 5088
808 5088 -10328 -20825 -21318 -11727 3199 16644 22343 17336 4038 -10877 -20646 -20815 -10955 4078
822 4078 16949 21917 16530 3429 -11456 -20762 -20052 -10090 4579 17248 21586 15590 2481 -11773
836 -11773 -20611 -19572 -9256 5362 17276 21110 15058 1718 -12295 -20370 -18851 -8539 5909
849 5909 17554 20772 14162 1006 -12652 -20391 -18347 -7569 6558 17573 20381 13517 145
862 145 -13080 -20023 -17732 -6885 7163 17764 19840 12589 -439 -13481 -19993 -16983 -6033 7636
876 7636 17787 19489 11866 -1295 -13713 -19721 -16428 -5262 8385 17868 18933 11124 -2018 -14145
890 -14145 -19547 -15610 -4481 8766 17986 18548 10270 -2668 -14294 -19272 -15054 -3606 9316 17869
904 17869 18001 9549 -3320 -14647 -18922 -14359 -3026 9775 17925 17454 8813 -3915 -14781 -18751
918 -18751 -13735 -2260 10197 17801 17064 8149 -4621 -15022 -18311 -13015 -1589 10664 17758 16400
932 16400 7349 -5069 -15121 -18110 -12306 -866 10980 17671 15933 6675 -5638 -15258 -17670 -11783
946 -11783 -269 11313 17444 15341 6009 -6181 -15348 -17314 -10958 457 11620 17313 14800 5290
960 5290 -6669 -15486 -16894 -10375 1080 11941 17180 14235 4553 -7173 -15514 -16557 -9651 1648
974 1648 12190 16910 13675 3892 -7652 -15531 -16029 -9001 2290 12471 16749 13009 3242 -8022
988 -8022 -15526 -15562 -8342 2876 12622 16401 12458 2588 -8489 -15427 -15194 -7693 3387 12862 16190
1003 16190 11851 1929 -8837 -15458 -14666 -6957 3912 13015 15955 11271 1358 -9201 -15349 -14204
1017 -14204 -6370 4410 13169 15607 10717 846 -9526 -15237 -13771 -5773 4909 13280 15331 10098
1031 10098 180 -9765 -15085 -13307 -5066 5427 13259 14935 9588 -427 -10095 -14946 -12740 -4605
1045 -4605 5744 13398 14616 8910 -847 -10299 -14874 -12264 -3922 6183 13390 14274 8418 -1466 -10583
1060 -10583 -14582 -11803 -3476 6623 13455 13863 7827 -1940 -10755 -14496 -11289 -2793 6956 13447 13663
1075 13663 7232 -2499 -10916 -14278 -10862 -2257 7387 13425 13127 6735 -2920 -11254 -14074 -10300 -1718
1090 -1718 7671 13458 12809 6023 -3394 -11239 -13905 -9824 -1096 8052 13361 12399 5586 -3994 -11529
1105 -11529 -13585 -9250 -590 8409 13375 12032 4886 -4372 -11616 -13480 -8721 -4 8642 13296 11683
1120 11683 4355 -4893 -11807 -13126 -8287 508 8998 13223 11171 3857 -5221 -11950 -12866 -7738 962
1135 962 9205 13136 10786 3324 -5609 -11909 -12570 -7350 1489 9490 13006 10375 2825 -6003 -12000
1150 -12000 -12331 -6761 1938 9688 12962 10002 2322 -6327 -12031 -12039 -6272 2366 9920 12683 9557 1827
1166 1827 -6713 -12058 -11655 -5763 2762 10072 12561 9120 1404 -6976 -12112 -11402 -5298 3221 10222
1181 10222 12435 8674 896 -7306 -12024 -10976 -4792 3644 10395 12230 8184 372 -7569 -11990 -10653
1196 -10653 -4319 4042 10512 12030 7825 -77 -7830 -11987 -10368 -3852 4401 10628 11771 7377 -532
1211 -532 -8143 -11850 -9968 -3437 4801 10691 11587 6921 -977 -8366 -11802 -9700 -2897 5156 10778
1226 10778 11322 6441 -1371 -8597 -11749 -9286 -2423 5465 10825 10992 6070 -1835 -8816 -11605 -8923
1241 -8923 -1988 5790 10867 10719 5558 -2182 -8981 -11466 -8547 -1589 6077 10798 10547 5155 -2680
1256 -2680 -9129 -11277 -8242 -1162 6350 10908 10183 4706 -2886 -9258 -11164 -7716 -701 6626 10821
1271 10821 9917 4269 -3316 -9326 -10994 -7402 -290 6907 10839 9602 3914 -3724 -9491 -10767 -6912
1286 -6912 79 7117 10818 9356 3399 -4006 -9605 -10630 -6580 564 7343 10639 8959 2985 -4360
1301 -4360 -9674 -10357 -6174 896 7612 10638 8601 2538 -4601 -9696 -10190 -5727 1381 7748 10505
1316 10505 8342 2156 -4991 -9722 -9896 -5440 1659 7946 10376 7944 1839 -5267 -9803 -9725 -4972
1331 -4972 2009 8053 10284 7695 1342 -5548 -9772 -9446 -4592 2393 8280 10193 7248 1046 -5768
1346 -5768 -9863 -9186 -4225 2626 8333 10087 6974 604 -5942 -9728 -8934 -3886 3055 8432 9831
1361 9831 6656 260 -6182 -9756 -8640 -3473 3317 8516 9760 6278 -83 -6395 -9764 -8420 -3029
1376 -3029 3666 8601 9563 5925 -455 -6601 -9618 -8116 -2779 3869 8745 9367 5600 -732 -6792
1391 -6792 -9590 -7832 -2350 4152 8713 9200 5229 -1149 -6942 -9446 -7530 -2026 4462 8784 8870 4855
1407 4855 -1425 -7128 -9422 -7162 -1621 4668 8796 8741 4537 -1782 -7180 -9258 -6977 -1289 4872
1422 4872 8816 8540 4267 -1994 -7326 -9182 -6647 -1002 5127 8768 8335 3939 -2371 -7397 -9016
1437 -9016 -6332 -638 5312 8748 8071 3584 -2609 -7494 -8896 -6035 -349 5516 8814 7865 3251
1452 3251 -2885 -7622 -8761 -5781 -84 5632 8732 7581 2893 -3167 -7701 -8628 -5460 308 5803
1467 5803 8653 7327 2523 -3339 -7700 -8378 -5108 624 6042 8600 7076 2213 -3603 -7777 -8278
1482 -8278 -4812 955 6173 8518 6870 1970 -3851 -7850 -8083 -4459 1202 6254 8441 6547 1661
1497 1661 -4054 -7911 -7850 -4157 1445 6377 8325 6292 1303 -4291 -7792 -7721 -3876 1765 6492 8232
1513 8232 6039 980 -4570 -7823 -7482 -3627 1957 6622 8133 5800 798 -4629 -7813 -7246 -3258
1528 -3258 2230 6669 7985 5523 411 -4838 -7812 -7080 -3109 2437 6761 7879 5333 208 -4956
1543 -4956 -7738 -6869 -2784 2639 6756 7766 5068 -102 -5138 -7704 -6703 -2480 2923 6876 7564
1558 7564 4755 -344 -5216 -7636 -6417 -2165 3062 6900 7408 4395 -586 -5374 -7565 -6190 -1841
1573 -1841 3333 6908 7303 4208 -893 -5522 -7518 -5923 -1677 3491 6942 7061 3878 -1139 -5614
1588 -5614 -7464 -5710 -1343 3663 6870 6922 3692 -1340 -5662 -7282 -5495 -1095 3844 6929 6766 3343
1604 3343 -1517 -5761 -7209 -5179 -811 3980 6896 6572 3133 -1813 -5781 -7075 -4993 -575 4199
1619 4199 6852 6368 2855 -1996 -5925 -6967 -4759 -281 4275 6834 6128 2497 -2153 -5878 -6873 -4511
1635 -4511 -73 4391 6732 5979 2306 -2474 -5980 -6706 -4255 198 4523 6708 5739 2071 -2590 -6032
1651 -6032 -6586 -3987 398 4608 6633 5550 1809 -2815 -6005 -6406 -3828 579 4728 6586 5359
1666 5359 1585 -2942 -6077 -6262 -3572 779 4796 6521 5114 1336 -3100 -5970 -6085 -3347 1101
1681 1101 4916 6426 4924 1094 -3210 -6095 -5934 -3026 1279 4987 6284 4688 883 -3418 -5932
1696 -5932 -5763 -2834 1483 4999 6225 4526 635 -3514 -5997 -5604 -2600 1667 5095 6119 4316
1711 4316 361 -3619 -5935 -5449 -2405 1882 5187 6034 4171 221 -3770 -5919 -5261 -2177 2030 5187
1727 5187 5909 3929 39 -3844 -5860 -5142 -1995 2125 5216 5764 3737 -201 -3948 -5832 -4944 -1780
1743 -1780 2280 5267 5666 3487 -380 -4022 -5784 -4737 -1543 2488 5193 5542 3305 -574 -4196
1758 -4196 -5705 -4572 -1300 2625 5258 5465 3021 -816 -4205 -5644 -4396 -1056 2770 5281 5316 2841
1774 2841 -1037 -4318 -5508 -4183 -865 2928 5238 5155 2587 -1121 -4365 -5471 -3991 -718 3059
1789 3059 5190 4944 2437 -1324 -4456 -5393 -3847 -535 3149 5152 4833 2279 -1432 -4456 -5298 -3649
1805 -3649 -306 3262 5202 4768 2062 -1616 -4389 -5187 -3494 -87 3333 5140 4534 1866 -1757 -4494
1821 -4494 -5098 -3298 62 3371 5156 4439 1669 -1919 -4519 -5046 -3137 228 3519 5054 4188 1443
1837 1443 -2070 -4583 -4860 -2964 416 3602 5013 4063 1301 -2189 -4587 -4789 -2718 633 3610 4923
1853 4923 3969 1092 -2304 -4525 -4666 -2521 762 3778 4879 3758 903 -2420 -4560 -4513 -2325 900
1869 900 3756 4776 3563 644 -2563 -4537 -4371 -2200 1113 3801 4652 3452 554 -2685 -4480 -4244
1885 -4244 -2012 1242 3852 4635 3238 311 -2702 -4430 -4105 -1829 1388 3856 4501 3089 172 -2865
1901 -2865 -4414 -3928 -1621 1512 3930 4444 2950 54 -2915 -4412 -3866 -1468 1626 3955 4357 2753
1917 2753 -160 -2999 -4306 -3679 -1338 1706 3958 4224 2609 -336 -2982 -4299 -3579 -1132 1817 3940
1933 3940 4112 2427 -387 -3072 -4216 -3386 -1004 1945 3916 3987 2285 -593 -3142 -4155 -3243 -766
1949 -766 1997 3834 3879 2108 -755 -3134 -4092 -3135 -625 2109 3844 3790 1899 -830 -3179 -4049 -2966
1966 -2966 -483 2211 3821 3635 1759 -975 -3206 -3925 -2778 -354 2329 3792 3516 1610 -1108 -3239
1982 -3239 -3807 -2573 -187 2358 3738 3385 1456 -1209 -3283 -3725 -2500 -66 2408 3739 3268 1302
1998 1302 -1284 -3262 -3670 -2354 76 2391 3638 3136 1183 -1402 -3238 -3573 -2220 165 2432 3641
2014 3641 3057 1114 -1455 -3201 -3477 -2089 319 2520 3557 2918 871 -1544 -3194 -3408 -1923 377
2030 377 2588 3490 2835 774 -1612 -3199 -3321 -1795 473 2588 3379 2658 616 -1677 -3196 -3186 -1743
2047 -1743 605 2584 3382 2572 564 -1755 -3162 -3104 -1626 620 2619 3307 2431 409 -1804 -3088
2063 -3088 -3048 -1434 762 2690 3297 2319 316 -1867 -3117 -2958 -1301 815 2655 3196 2223 213 -1858
2080 -1858 -3068 -2842 -1246 919 2682 3127 2116 121 -1948 -3102 -2754 -1085 1028 2604 3005 1990
2096 1990 -17 -1958 -2968 -2589 -1036 1092 2629 2981 1864 -156 -1995 -2902 -2512 -886 1125 2616
2112 2616 2859 1779 -213 -2061 -2936 -2414 -768 1283 2665 2782 1640 -256 -2077 -2938 -2259 -642
2128 -642 1252 2608 2688 1532 -405 -2056 -2823 -2228 -565 1389 2604 2633 1399 -438 -2164 -2731 -2070
2145 -2070 -423 1395 2603 2592 1271 -487 -2140 -2672 -1983 -388 1451 2582 2443 1195 -612 -2164
2161 -2164 -2654 -1903 -263 1498 2554 2367 1107 -653 -2165 -2597 -1854 -145 1550 2519 2307 1010 -766
2178 -766 -2120 -2529 -1741 -91 1559 2441 2249 910 -770 -2132 -2460 -1584 -35 1576 2480 2178 772
2195 772 -861 -2163 -2427 -1530 101 1663 2427 2095 763 -969 -2147 -2291 -1482 204 1684 2385 1981
2212 1981 660 -993 -2197 -2296 -1412 243 1666 2339 1889 522 -1064 -2117 -2229 -1296 317 1742 2268
2229 2268 1821 523 -1101 -2123 -2165 -1137 370 1747 2286 1695 409 -1134 -2168 -2072 -1030 499 1729
2246 1729 2238 1667 300 -1191 -2104 -1992 -1001 496 1748 2169 1530 304 -1227 -2092 -1943 -947 565
2263 565 1766 2180 1516 111 -1223 -2031 -1843 -817 562 1763 2140 1378 112 -1297 -2014 -1825 -771
2280 -771 669 1766 1984 1364 2 -1290 -2007 -1725 -677 719 1716 1997 1238 -64 -1292 -1981 -1671
2297 -1671 -619 766 1734 1933 1163 -74 -1338 -1937 -1606 -565 830 1722 1840 1096 -174 -1367 -1900
2314 -1900 -1525 -478 808 1791 1825 1026 -219 -1379 -1888 -1448 -414 925 1681 1775 955 -287 -1413 -1843
2332 -1843 -1452 -350 957 1695 1728 939 -296 -1329 -1758 -1324 -278 904 1679 1637 828 -412 -1391 -1733
2350 -1733 -1260 -249 995 1643 1552 772 -457 -1419 -1671 -1206 -172 990 1644 1463 715 -393 -1334 -1637
2368 -1637 -1177 -144 946 1621 1475 645 -459 -1382 -1575 -1050 -100 1000 1532 1432 601 -543 -1324 -1533
2386 -1533 -1034 -20 1017 1581 1394 531 -536 -1340 -1489 -927 -1 994 1552 1291 506 -552 -1362 -1434 -923
2405 -923 61 1016 1495 1252 416 -576 -1323 -1441 -896 69 1083 1459 1171 364 -558 -1365 -1355 -802 134 1071
2425 1071 1393 1089 353 -661 -1275 -1389 -785 214 1043 1405 1116 305 -648 -1238 -1297 -689 206 1032 1387 1023
2445 1023 211 -626 -1282 -1270 -607 251 1045 1348 1013 153 -652 -1251 -1245 -577 303 1057 1269 956 143 -766 -1199
2466 -1199 -1171 -564 345 1045 1289 914 94 -698 -1156 -1174 -542 280 1001 1233 822 46 -770 -1176 -1045 -480
2486 -480 381 1068 1243 797 50 -795 -1156 -1029 -435 374 988 1202 730 44 -729 -1135 -1046 -409 364 1017
2506 1017 1098 677 20 -690 -1131 -932 -378 438 992 1077 717 -31 -706 -1068 -941 -381 411 971 1080 677
2526 677 -62 -688 -1073 -877 -267 431 950 1017 654 -124 -710 -1058 -832 -196 463 953 1047 599 -68 -735 -1015
2547 -1015 -868 -256 463 1000 1008 549 -141 -740 -991 -762 -199 489 992 920 528 -199 -703 -929 -765 -148 520
2568 520 927 923 466 -243 -745 -939 -688 -157 579 903 862 403 -210 -750 -972 -687 -118 470 928 821 391
2589 391 -268 -767 -893 -653 -140 504 914 834 391 -248 -760 -880 -593 -36 542 875 750 356 -303 -754
2609 -754 -920 -572 -20 523 857 750 302 -287 -755 -876 -540 -30 523 831 733 245 -227 -688 -840 -507
2629 -507 -6 540 830 685 246 -297 -738 -781 -483 89 578 825 724 261 -320 -680 -794 -397 17 582
2649 582 807 646 211 -371 -699 -763 -420 129 580 766 637 198 -327 -649 -701 -414 103 509 761 617 132
2670 132 -315 -702 -710 -404 187 555 721 576 104 -369 -656 -660 -343 87 556 712 500 137 -373 -591 -630 -342
2692 -342 114 572 700 485 95 -413 -628 -627 -271 140 496 659 497 78 -363 -629 -625 -257 148 538 653
2713 653 475 29 -399 -618 -545 -258 176 509 589 407 -1 -429 -615 -505 -191 241 558 566 361 -19 -319
2734 -319 -581 -482 -237 194 523 608 340 76 -367 -522 -500 -166 188 473 553 394 -9 -340 -504 -478 -198 175
2756 175 457 535 332 -48 -308 -512 -400 -157 199 404 443 283 -40 -354 -506 -391 -88 153 430 471 260
2777 260 16 -347 -445 -390 -119 238 439 485 289 -7 -286 -469 -358 -164 266 405 416 287 -10 -297 -429
2798 -429 -354 -138 156 454 443 278 -20 -315 -431 -286 -134 181 357 417 210 -6 -210 -463 -341 -125 171
2819 171 419 419 245 -6 -278 -480 -332 -75 131 337 393 211 -23 -250 -394 -323 -50 109 369 384 268 -52
2841 -52 -303 -383 -303 -108 133 379 299 231 -37 -281 -296 -312 -96 149 328 391 215 -37 -254 -350 -308 -68 125
2864 125 316 411 182 52 -215 -365 -264 -102 80 225 348 146 -14 -241 -332 -265 -79 143 312 335 210
2885 210 22 -206 -290 -301 -101 132 248 366 177 33 -240 -318 -287 -118 146 310 377 235 31 -172 -274 -223
2907 -223 -75 103 298 327 231 6 -179 -293 -287 -166 111 236 304 205 31 -218 -338 -315 -81 84 258 288 196
2930 196 -25 -140 -287 -266 -106 119 214 367 222 29 -161 -291 -247 -126 49 247 331 280 8 -184 -244 -279
2952 -279 -96 75 281 269 213 7 -208 -350 -343 -99 47 236 316 222 64 -161 -352 -313 -134 60 256 348 236
2975 236 -9 -151 -285 -295 -117 53 254 320 212 58 -158 -354 -287 -130 89 272 306 216 31 -202 -267 -297
2997 -297 -99 54 260 312 227 2 -144 -311 -305 -116 54 269 339 247 22 -189 -310 -256 -117 72 256 357
3019 357 248 12 -162 -290 -297 -118 100 262 353 196 57 -203 -271 -300 -171 80 262 359 250 21 -178 -301
3041 -301 -293 -133 86 249 327 270 95 -184 -312 -308 -141 49 230 319 262 8 -186 -339 -283 -122 108 228 358
3064 358 292 -3 -181 -301 -283 -103 49 286 356 271 25 -271 -367 -297 -146 107 258 287 280 23 -207 -331 -275
3087 -275 -188 58 289 350 257 32 -146 -337 -350 -150 86 272 360 244 9 -214 -336 -319 -156 95 287 335
3109 335 243 40 -197 -332 -351 -138 78 317 353 208 14 -186 -353 -313 -131 96 304 364 224 12 -232 -359
3131 -359 -314 -152 127 328 381 246 44 -203 -367 -305 -128 160 335 377 255 14 -226 -400 -244 -103 108
3152 108 326 354 269 -8 -235 -402 -364 -152 126 328 408 232 27 -222 -349 -378 -157 132 350 403 234 -29
3174 -29 -284 -409 -318 -123 131 352 417 262 53 -203 -450 -390 -87 126 369 415 226 8 -296 -421 -355 -107
3196 -107 161 361 418 236 -13 -299 -443 -362 -118 210 385 440 286 -46 -354 -438 -346 -64 145 372 432 245
3218 245 -40 -306 -406 -324 -89 276 434 382 198 -86 -338 -446 -378 -44 220 413 472 205 -27 -364 -481
3239 -481 -293 -53 211 428 431 224 -73 -359 -477 -332 -33 321 465 367 216 -96 -426 -502 -322 -90 239
3260 239 450 482 257 -132 -365 -541 -318 -60 318 439 431 218 -145 -413 -516 -385 -5 336 489 475 198
3281 198 -150 -392 -497 -312 -26 364 518 445 152 -182 -440 -499 -337 -26 343 486 449 164 -164 -488 -547
3302 -547 -317 -23 350 478 461 152 -179 -520 -476 -285 27 353 501 407 191 -183 -489 -548 -305 76 388
3323 388 560 454 158 -234 -487 -523 -342 38 411 527 387 89 -241 -466 -513 -303 73 411 525 473 97
3344 97 -262 -540 -542 -297 90 406 554 443 73 -284 -533 -545 -319 63 448 604 461 49 -303 -495 -543 -245
3366 -245 171 502 491 479 58 -342 -535 -497 -251 162 486 637 392 3 -331 -593 -478 -255 185 505 577
3387 577 366 -29 -353 -562 -507 -199 177 509 581 442 17 -412 -585 -499 -155 241 521 580 377 6 -400
3408 -400 -621 -475 -194 275 547 576 370 -29 -392 -594 -539 -165 262 584 645 367 -58 -415 -628 -505 -124
3429 -124 313 584 602 329 -115 -479 -628 -525 -128 347 599 589 298 -114 -466 -587 -412 -118 397 598 611
3450 611 368 -117 -507 -612 -510 -63 377 610 562 229 -160 -543 -660 -444 -11 363 617 580 255 -151 -547
3471 -547 -593 -437 -50 436 638 579 244 -186 -566 -580 -377 -28 394 642 549 207 -250 -539 -610 -404 -22 453
3493 453 650 549 204 -222 -548 -619 -376 26 403 601 493 156 -322 -620 -687 -394 69 437 602 516 147
3514 147 -274 -594 -650 -367 73 499 668 549 151 -243 -655 -644 -374 108 548 619 515 114 -336 -570 -628
3535 -628 -307 109 517 701 575 90 -314 -660 -690 -245 135 573 666 499 40 -393 -668 -630 -274 159 583
3556 583 673 472 99 -376 -661 -629 -269 141 622 743 484 47 -439 -691 -608 -277 179 568 673 468 21
3577 21 -445 -631 -588 -267 231 601 709 467 12 -489 -724 -626 -245 234 613 650 463 -14 -438 -662 -570 -254
3599 -254 267 603 695 397 12 -483 -728 -551 -201 339 606 721 390 -104 -471 -727 -596 -212 295 643
3619 643 650 378 -81 -487 -683 -530 -80 336 635 661 310 -129 -574 -743 -546 -177 365 695 664 293 -140
3640 -140 -591 -668 -518 -132 446 708 658 272 -114 -546 -701 -516 -46 363 670 628 348 -155 -582 -740 -507
3661 -507 -36 463 695 658 294 -237 -615 -712 -514 9 432 727 627 311 -264 -646 -737 -472 41 450 703
3682 703 615 258 -290 -629 -710 -467 -15 520 705 621 182 -272 -662 -684 -401 33 516 768 607 202 -334
3703 -334 -709 -725 -390 80 534 703 580 206 -394 -672 -690 -378 110 585 754 539 139 -362 -686 -724 -400
3724 -400 91 510 774 560 89 -371 -674 -697 -333 163 622 763 575 73 -420 -757 -639 -330 192 614
3744 614 742 556 75 -445 -734 -681 -288 218 615 754 544 18 -509 -766 -690 -260 254 648 759 451 63
3765 63 -465 -803 -646 -313 263 663 702 458 -28 -553 -770 -591 -227 279 681 747 500 -58 -534 -749 -636
3786 -636 -171 289 681 726 389 -60 -561 -763 -648 -182 309 710 755 398 -64 -620 -788 -623 -153 337 719
3807 719 662 389 -137 -577 -685 -571 -109 382 720 718 366 -187 -614 -702 -572 -159 398 728 684 397 -193 -579
3829 -579 -750 -558 -73 441 738 715 306 -193 -640 -756 -521 -53 471 744 697 284 -208 -668 -759 -518 -39
3850 -39 499 806 670 325 -235 -653 -764 -472 -6 457 711 645 248 -296 -669 -768 -449 12 524 762 646
3871 646 241 -292 -684 -725 -418 57 552 752 639 175 -361 -781 -718 -387 95 528 760 628 165 -352 -691
3892 -691 -754 -410 97 564 806 590 150 -397 -773 -700 -337 174 628 822 583 141 -369 -733 -750 -403 158
3913 158 628 752 591 60 -414 -729 -655 -350 197 609 734 532 27 -450 -758 -631 -300 230 614 782
3933 782 516 7 -470 -765 -675 -258 245 650 724 471 16 -449 -773 -690 -278 262 662 802 485 -13 -525
3954 -525 -745 -647 -240 262 718 731 496 -22 -541 -763 -622 -201 340 712 740 437 -107 -560 -764 -625 -198
3975 -198 324 674 731 433 -70 -589 -745 -637 -133 370 698 749 414 -28 -576 -766 -547 -177 340 714 730
3996 730 416 -113 -576 -796 -548 -175 384 729 713 389 -213 -618 -707 -597 -72 454 798 705 346 -197 -628
4017 -628 -745 -499 -22 447 718 670 317 -291 -631 -730 -506 4 474 725 676 309 -266 -667 -732 -482 45
4038 45 483 745 671 219 -244 -572 -784 -483 32 531 775 634 219 -345 -693 -739 -459 16 570 773 676
4059 676 252 -278 -671 -746 -430 66 563 809 643 178 -321 -670 -743 -400 98 603 760 613 136 -372 -703
4080 -703 -717 -426 114 578 768 562 130 -363 -746 -766 -392 140 569 809 574 99 -428 -794 -704 -340 170
4101 170 618 728 566 106 -440 -746 -689 -370 212 632 754 574 109 -409 -728 -697 -317 274 656 778 546
4122 546 3 -469 -780 -641 -312 241 641 826 523 25 -479 -740 -737 -322 237 698 745 442 -87 -551 -774
4143 -774 -648 -272 299 685 732 506 -20 -457 -792 -645 -207 314 674 746 471 -27 -587 -797 -660 -237 381
4164 381 707 753 491 -70 -595 -797 -625 -148 380 754 724 402 -87 -567 -817 -642 -126 327 727 747 371
4185 371 -139 -575 -809 -576 -86 373 721 749 355 -165 -618 -760 -566 -130 426 703 736 348 -196 -634 -758
4206 -758 -552 -22 433 747 704 299 -233 -654 -783 -468 -17 442 708 706 273 -259 -584 -789 -544 24 459
4227 459 768 664 282 -284 -663 -729 -435 15 518 764 685 231 -308 -682 -772 -451 6 533 777 675 203
4248 203 -347 -669 -775 -456 90 582 786 653 196 -357 -691 -741 -389 88 569 772 622 100 -345 -682
4268 -682 -708 -426 118 627 771 615 124 -408 -747 -771 -437 145 611 772 599 176 -393 -746 -706 -348 145
4289 145 623 757 503 39 -423 -735 -702 -297 207 658 788 559 41 -425 -708 -686 -292 230 647 777 485
4310 485 -19 -454 -748 -724 -301 240 678 729 466 14 -479 -743 -630 -263 266 652 790 470 -54 -504 -727
4331 -727 -644 -210 340 652 768 468 -93 -539 -730 -596 -183 315 752 717 407 -150 -521 -758 -599 -142 358
4352 358 715 725 401 -100 -578 -729 -561 -152 387 702 717 395 -190 -558 -764 -582 -114 386 717 722 373
4373 373 -154 -558 -740 -520 -104 416 736 725 288 -202 -625 -757 -502 -83 433 710 627 382 -174 -611 -792
4394 -792 -545 -22 456 714 664 286 -183 -656 -663 -421 -41 522 727 703 285 -248 -625 -689 -462 22 468 758
4416 758 644 213 -255 -679 -766 -431 41 526 751 627 240 -312 -667 -717 -427 26 533 760 632 171 -277
4437 -277 -695 -765 -434 75 551 728 612 177 -318 -645 -656 -358 163 594 738 529 117 -346 -681 -700 -358
4458 -358 162 608 744 543 104 -398 -718 -714 -267 134 571 742 527 98 -412 -728 -663 -316 129 589 749
4479 749 495 53 -367 -646 -667 -257 218 616 746 501 11 -417 -680 -634 -216 225 643 721 452 43 -475
4500 -475 -709 -598 -204 269 622 699 421 10 -489 -687 -581 -160 287 658 756 443 -49 -434 -641 -551 -163
4521 -163 277 602 711 417 -15 -508 -717 -607 -122 329 652 662 415 -46 -563 -679 -540 -152 336 714
4541 714 692 379 -94 -500 -726 -511 -73 334 625 608 356 -138 -609 -727 -566 -113 367 675 672 362 -137
4562 -137 -569 -646 -487 -46 387 680 620 283 -188 -556 -694 -437 -116 399 696 636 289 -200 -559 -682 -438
4583 -438 -7 463 728 661 228 -147 -639 -667 -485 -15 431 659 614 218 -213 -582 -659 -435 -17 509 684
4604 684 617 221 -260 -560 -705 -421 -22 450 659 552 208 -287 -590 -665 -370 38 476 692 548 141 -311
4625 -311 -617 -673 -348 71 459 708 571 163 -359 -624 -626 -379 88 481 668 515 142 -305 -597 -621 -297
4646 -297 106 531 650 526 124 -336 -623 -579 -297 117 565 688 517 78 -383 -638 -571 -321 181 541 678
4667 678 444 93 -447 -689 -668 -264 158 575 666 422 -4 -455 -642 -557 -258 211 602 698 438 -14 -415
4688 -415 -678 -563 -193 231 625 636 434 -55 -427 -660 -578 -151 283 604 653 420 -51 -454 -713 -520 -120
4709 -120 283 631 614 401 -47 -481 -641 -469 -105 328 587 631 341 -109 -473 -628 -473 -64 309 639 592
4730 592 341 -88 -489 -642 -503 -102 378 610 642 297 -166 -479 -644 -464 -96 363 624 567 280 -139 -546
4751 -546 -588 -421 -41 391 647 540 188 -224 -589 -628 -428 -39 381 633 505 258 -234 -529 -599 -405 8
4772 8 426 572 555 232 -257 -568 -599 -346 43 461 611 542 164 -239 -560 -592 -415 49 432 621 513 157
4794 157 -302 -591 -586 -311 83 425 621 481 179 -336 -556 -579 -285 66 470 616 480 132 -352 -550 -579
4815 -579 -305 169 478 639 470 55 -271 -583 -512 -238 125 496 596 449 32 -295 -545 -602 -256 160 525
4836 525 554 403 1 -316 -593 -535 -198 183 532 610 429 33 -402 -571 -503 -171 176 500 610 373 67
4857 67 -371 -594 -536 -180 266 519 593 389 48 -375 -610 -504 -186 272 488 552 326 -66 -431 -600 -475
4878 -475 -86 275 518 529 361 -129 -470 -588 -483 -125 226 517 563 347 -79 -467 -575 -450 -70 323 560
4899 560 632 285 -100 -428 -650 -452 -99 325 601 506 295 -114 -384 -547 -419 -34 346 547 565 264 -158
4920 -158 -467 -582 -371 -40 311 595 517 233 -166 -471 -614 -411 40 348 521 558 230 -245 -492 -523 -358
4941 -358 5 349 549 498 220 -200 -455 -536 -336 22 360 571 468 163 -184 -483 -546 -370 67 404 628
4962 628 520 163 -277 -569 -539 -302 50 473 535 491 207 -254 -499 -548 -323 107 459 560 484 130 -273 -537
4984 -537 -519 -297 63 443 548 443 62 -308 -554 -530 -294 65 458 548 422 40 -339 -553 -530 -294 150
5005 150 471 582 383 41 -308 -530 -499 -246 174 414 613 402 50 -367 -529 -491 -172 208 470 606 408
5026 408 3 -349 -575 -500 -198 201 491 527 367 19 -341 -599 -512 -178 231 485 541 305 -36 -384 -489
5047 -489 -440 -141 214 513 487 343 -65 -408 -547 -462 -124 210 481 522 298 -34 -443 -575 -467 -105 255
5068 255 477 476 321 -43 -422 -546 -462 -128 269 510 506 276 -101 -483 -569 -427 -12 322 530 547 231 -104
5090 -104 -418 -532 -396 1 358 480 549 254 -158 -449 -543 -371 -91 311 559 509 180 -197 -441 -556 -348
5111 -348 4 323 579 518 150 -214 -403 -516 -360 25 361 556 442 150 -190 -446 -547 -313 92 438
5131 438 586 459 134 -194 -503 -527 -283 46 420 510 428 158 -219 -499 -505 -309 68 378 532 411 117 -200
5153 -200 -492 -474 -281 134 435 553 452 24 -263 -502 -474 -332 114 413 527 410 91 -363 -528 -467 -233
5174 -233 148 463 489 393 12 -339 -563 -445 -244 151 439 507 348 25 -343 -522 -456 -203 106 450 540 369
5196 369 -34 -387 -559 -448 -169 176 464 554 369 -12 -353 -552 -442 -147 203 442 460 302 -1 -371 -501
5217 -501 -428 -163 236 552 524 248 -127 -299 -564 -407 -134 239 515 519 262 -67 -331 -536 -395 -131 285
5238 285 485 487 254 -66 -440 -507 -405 -82 247 526 455 282 -60 -436 -463 -328 -65 299 529 491 183 -86
5260 -86 -397 -518 -329 -54 340 515 424 201 -113 -433 -537 -354 -55 306 508 479 189 -189 -387 -496 -293
5281 -293 -15 344 535 451 183 -201 -426 -470 -341 34 316 467 384 147 -219 -487 -482 -318 11 336 538 363
5303 363 152 -219 -440 -507 -262 35 346 481 415 124 -220 -441 -478 -244 99 396 508 383 78 -259 -449
5324 -449 -444 -245 96 417 509 352 78 -221 -457 -438 -181 162 396 475 358 34 -291 -482 -440 -222 140 390
5346 390 454 339 42 -294 -500 -473 -217 89 440 514 339 -11 -288 -492 -468 -207 105 429 478 297 23 -315
5368 -315 -495 -424 -131 194 479 471 349 -15 -292 -431 -400 -107 183 444 432 229 47 -326 -494 -427 -108 251
5390 251 465 480 261 -3 -340 -507 -420 -87 224 487 464 284 -53 -349 -500 -374 -136 292 471 487 235
5411 235 -145 -378 -481 -341 -111 288 460 438 184 -120 -386 -489 -368 -84 283 456 447 218 -157 -341 -513
5432 -513 -367 -65 295 475 432 213 -131 -418 -471 -359 -32 331 412 429 153 -106 -414 -489 -272 -15 360 523
5454 523 489 181 -142 -420 -497 -320 17 318 488 426 130 -168 -414 -504 -247 61 319 499 392 127 -151
5475 -151 -438 -458 -276 65 366 430 394 80 -247 -450 -414 -301 60 360 536 385 147 -293 -456 -441 -203 130
5497 130 440 506 371 42 -306 -426 -442 -183 95 378 489 334 52 -272 -476 -409 -177 161 434 506 334
5518 334 59 -327 -492 -476 -110 193 436 490 324 -4 -285 -458 -365 -153 251 434 503 337 -22 -318 -457
5539 -457 -343 -130 192 440 416 261 15 -328 -457 -421 -67 161 458 454 314 -56 -343 -502 -360 -121 261
5560 261 439 480 261 -79 -393 -504 -367 -96 251 423 460 240 -142 -387 -455 -292 -47 304 476 438 228
5581 228 -117 -355 -477 -362 -73 250 469 446 180 -115 -427 -492 -310 -13 327 442 378 179 -152 -395 -518
5602 -518 -354 51 316 464 422 154 -216 -476 -436 -234 26 343 497 374 83 -234 -346 -460 -236 41 321
5623 321 508 399 131 -191 -419 -429 -277 71 351 461 382 127 -234 -448 -422 -234 46 352 459 385 114
5644 114 -245 -452 -444 -190 82 381 514 370 41 -236 -409 -419 -182 125 384 456 349 46 -291 -424 -402 -172
5666 -172 164 386 507 311 46 -272 -435 -379 -171 75 352 462 282 14 -349 -464 -360 -182 157 405
5686 405 448 336 18 -339 -437 -370 -137 184 404 441 253 5 -317 -432 -400 -95 249 418 441 257 7 -304
5708 -304 -460 -364 -126 225 415 436 261 -41 -340 -524 -334 -73 244 407 440 217 -102 -346 -431 -326 -55
5729 -55 226 437 416 222 -103 -375 -470 -351 -66 244 458 390 249 -123 -333 -404 -359 5 281 474 404 217
5751 217 -102 -386 -451 -267 11 326 425 405 218 -123 -385 -466 -262 -18 311 483 403 126 -144 -417 -449 -226
5773 -226 -1 329 503 389 180 -162 -406 -434 -275 17 333 473 382 145 -224 -398 -417 -225 117 297 443
5794 443 369 83 -264 -407 -469 -234 55 307 410 366 129 -254 -447 -435 -240 68 395 488 287 59 -214 -467
5816 -467 -495 -164 80 374 474 310 43 -261 -417 -392 -187 129 379 452 335 76 -286 -468 -363 -161 151
5837 151 368 445 352 -1 -249 -461 -421 -136 162 360 444 314 -53 -297 -452 -424 -103 168 405 433 260 -31
5859 -31 -263 -449 -367 -145 193 435 436 269 -40 -324 -461 -338 -117 165 493 434 213 -73 -355 -464 -418 -45
5881 -45 220 420 454 212 -89 -377 -459 -320 -51 224 418 430 187 -76 -378 -444 -368 -50 306 425 435 195
5903 195 -103 -381 -456 -304 -32 269 440 422 189 -94 -381 -469 -263 -58 282 493 421 185 -133 -391 -431 -270
5925 -270 6 286 458 420 154 -163 -426 -423 -295 23 323 481 395 143 -168 -425 -471 -265 89 374 507 378
5947 378 108 -157 -422 -408 -219 28 363 508 375 96 -213 -391 -392 -247 110 389 490 349 68 -197 -442
5968 -442 -441 -226 103 432 441 307 71 -265 -434 -448 -221 103 380 446 367 42 -280 -432 -405 -141 202 367 503
5991 503 339 87 -256 -413 -431 -187 188 389 504 323 13 -308 -438 -400 -125 162 414 414 310 -38 -283
6012 -283 -450 -358 -150 183 401 420 247 -49 -300 -429 -369 -133 179 329 424 245 -109 -271 -420 -376 -110 262
6034 262 470 483 234 -25 -362 -468 -317 -65 213 433 439 254 -89 -309 -473 -372 -70 208 465 373 223
6055 223 -116 -354 -487 -333 -97 242 433 439 137 -137 -384 -425 -297 2 278 428 382 178 -150 -407 -454 -320
6077 -320 -33 285 497 412 133 -187 -348 -469 -237 -8 327 442 404 150 -162 -398 -431 -310 56 279 437
6098 437 378 146 -162 -394 -406 -251 34 372 493 404 86 -191 -449 -435 -201 35 282 445 324 120 -241
6119 -241 -422 -400 -242 13 376 494 310 73 -212 -424 -414 -148 66 314 415 314 64 -243 -394 -436 -237
6140 -237 122 414 434 338 6 -252 -435 -429 -160 136 400 440 305 -8 -316 -443 -329 -198 134 363 466 290
6162 290 -20 -341 -457 -353 -92 158 440 492 286 7 -305 -390 -389 -101 152 370 459 252 -33 -309 -465 -329
6184 -329 -127 223 411 437 236 -38 -350 -433 -375 -77 198 428 405 203 -9 -318 -445 -329 -95 247 455
6205 455 432 251 -61 -302 -453 -302 -41 255 440 395 186 -56 -295 -415 -305 -66 279 425 423 140 -178
6226 -178 -380 -437 -246 -56 269 450 389 143 -116 -392 -421 -310 -9 326 444 369 140 -112 -400 -428 -299 67
6248 67 296 406 360 160 -154 -350 -405 -266 24 331 474 385 161 -133 -418 -437 -287 88 306 453 341 113
6270 113 -202 -400 -395 -200 107 306 438 303 123 -220 -381 -447 -251 122 378 483 365 63 -226 -426 -396
6291 -396 -178 66 395 446 340 33 -223 -436 -408 -180 103 394 443 278 22 -254 -473 -361 -150 111 367
6312 367 423 315 -9 -322 -416 -436 -173 151 347 438 309 50 -295 -428 -369 -99 179 389 423 310 3 -321
6334 -321 -462 -337 -158 169 380 426 314 -31 -303 -436 -394 -140 198 410 369 294 3 -347 -380 -373 -75 258
6356 258 429 406 212 -6 -400 -425 -322 -75 183 401 422 152 -49 -368 -417 -272 -63 233 444 379 244 -96
6378 -96 -369 -437 -305 -7 249 425 403 173 -105 -390 -466 -309 -17 283 416 370 201 -86 -415 -426 -288 46
6400 46 280 440 362 120 -160 -354 -443 -274 6 311 389 394 129 -131 -372 -487 -263 22 287 455 402 126
6422 126 -184 -406 -433 -274 54 355 448 391 156 -186 -416 -443 -181 7 349 496 342 59 -200 -389 -438 -247
6444 -247 77 336 446 351 41 -261 -445 -433 -204 124 335 428 343 40 -238 -371 -450 -166 107 387 438 325
6466 325 42 -247 -428 -444 -205 106 390 470 309 -22 -295 -409 -359 -223 129 417 497 266 -6 -270 -413
6487 -413 -371 -125 164 344 485 287 -20 -272 -441 -384 -114 190 396 409 242 -51 -279 -459 -377 -175 227
6508 227 389 451 254 15 -280 -414 -305 -100 187 415 420 251 -80 -316 -454 -353 -76 177 379 409 250
6529 250 -65 -302 -440 -343 -24 251 436 413 297 -67 -355 -460 -349 -111 290 395 429 207 -115 -360 -487
6550 -487 -339 -34 285 435 388 172 -129 -374 -432 -291 -24 260 408 417 178 -168 -409 -436 -246 -35 314 425
6572 425 315 155 -126 -369 -459 -308 -36 346 443 374 107 -157 -442 -432 -246 27 294 482 332 139 -137
6593 -137 -405 -454 -208 52 286 465 342 160 -160 -419 -428 -258 101 344 467 356 99 -201 -432 -428 -234 45
6615 45 275 444 357 83 -191 -409 -420 -163 103 330 385 314 50 -215 -446 -423 -212 96 337 437 359 63
6637 63 -218 -442 -408 -144 131 329 438 309 26 -307 -421 -413 -170 135 321 421 279 -14 -287 -386 -375 -136
6659 -136 154 438 424 322 61 -254 -453 -444 -115 193 378 394 244 -9 -267 -462 -283 -127 188 371 458 268
6681 268 -36 -296 -456 -359 -155 176 394 424 233 -70 -253 -395 -384 -143 215 351 428 249 -20 -351 -427 -341
6703 -341 -100 205 403 405 225 -73 -358 -465 -371 -51 211 442 418 184 -85 -287 -429 -340 -55 239 395 396
6725 396 246 -147 -316 -448 -328 -59 232 433 439 163 -116 -339 -395 -327 -46 254 491 420 160 -138 -370 -439
6747 -439 -271 10 237 443 359 137 -167 -365 -451 -281 23 323 435 416 118 -160 -389 -381 -270 59 299 393
6769 393 343 128 -154 -407 -368 -214 46 291 488 331 98 -230 -368 -405 -255 104 397 443 356 98 -137 -387
6791 -387 -371 -175 56 348 434 342 39 -200 -366 -377 -209 83 357 392 291 27 -207 -385 -432 -227 139 363
6813 363 416 281 80 -232 -402 -439 -196 139 328 464 236 9 -255 -425 -374 -131 127 310 462 242 48
6834 48 -227 -398 -346 -146 160 376 496 314 -10 -266 -413 -361 -116 153 409 467 304 27 -282 -437 -366 -110
6856 -110 173 350 426 262 -53 -349 -425 -348 -108 169 385 446 262 -54 -311 -405 -378 -109 205 377 425 185
6878 185 -39 -301 -394 -377 -83 190 437 427 190 -57 -315 -433 -273 -107 223 386 413 235 -43 -322 -445
6899 -445 -358 -63 248 420 394 163 -57 -334 -412 -285 28 211 463 395 150 -162 -312 -399 -289 2 260 442
6921 442 320 161 -106 -371 -437 -306 20 304 438 390 113 -147 -388 -412 -279 41 294 438 362 93 -145
6942 -145 -383 -435 -263 45 321 417 384 90 -181 -357 -381 -284 96 343 457 394 117 -183 -422 -408 -262 96
6964 96 336 477 295 66 -238 -381 -417 -220 114 362 436 285 63 -196 -412 -367 -183 90 327 485 272
6985 272 14 -209 -416 -346 -169 128 315 421 296 47 -245 -419 -380 -178 122 348 432 264 5 -282 -424
7006 -424 -349 -158 160 387 430 276 -6 -235 -397 -423 -119 165 379 383 246 14 -331 -440 -322 -120 130 376
7028 376 403 283 6 -297 -447 -323 -85 196 388 384 185 6 -291 -440 -294 -95 184 378 458 203 -74
7049 -74 -314 -434 -288 -60 231 427 406 181 -105 -340 -403 -300 -63 234 348 409 249 -96 -349 -422 -311 -73
7071 -73 228 430 392 196 -81 -367 -405 -237 -61 253 439 368 166 -53 -369 -412 -261 -1 256 402 338 146
7093 146 -111 -347 -389 -227 29 275 396 323 146 -109 -396 -430 -222 19 253 440 382 148 -144 -339 -383 -236
7115 -236 35 263 479 326 138 -178 -427 -412 -275 -7 267 370 343 99 -196 -325 -398 -295 39 324 392
7136 392 384 65 -233 -375 -401 -214 136 242 428 339 44 -237 -376 -394 -255 95 318 413 323 40 -233 -421
7158 -421 -369 -164 50 331 470 378 125 -231 -329 -372 -199 129 298 400 269 17 -216 -428 -327 -159 174
7179 174 331 384 262 7 -278 -374 -329 -180 155 296 378 260 38 -231 -407 -299 -109 169 346 349 261 -40
7201 -40 -294 -362 -331 -114 185 366 405 246 -60 -288 -396 -291 -103 178 350 401 240 -33 -267 -410 -318 -187
7223 -187 140 341 371 230 -53 -281 -426 -294 -91 197 426 380 234 -60 -313 -391 -306 -77 192 404 346 174
7245 174 -38 -245 -424 -338 -70 194 414 368 235 -84 -295 -419 -304 -44 217 397 384 201 -126 -330 -400
7266 -400 -236 -43 203 335 391 190 -151 -384 -405 -295 -26 216 390 331 126 -166 -377 -361 -246 3 284
7287 284 399 311 149 -169 -357 -378 -272 -14 270 401 358 142 -111 -357 -376 -228 67 257 383 323 47 -157
7309 -157 -317 -340 -246 33 213 399 325 119 -158 -375 -366 -246 48 279 400 314 106 -239 -337 -345 -198 143 322
7332 322 389 302 78 -186 -374 -374 -156 121 325 346 251 48 -218 -404 -379 -185 80 308 405 244 74 -211 -334
7355 -334 -394 -191 112 333 397 248 40 -234 -405 -358 -163 139 314 324 336 16 -225 -314 -340 -136 81 338
7377 338 378 233 -34 -240 -397 -366 -58 179 354 378 237 -91 -263 -388 -361 -113 164 322 406 253 -22 -240
7399 -240 -387 -267 -102 171 342 345 207 -48 -283 -320 -346 -137 238 339 369 185 -55 -239 -404 -294 -66 123
7421 123 384 357 185 -21 -292 -390 -279 -104 191 378 321 123 -81 -297 -369 -242 -40 204 393 376 170 -97
7443 -97 -347 -401 -260 -60 198 341 382 122 -101 -305 -385 -254 -62 220 393 334 167 -136 -362 -348 -251 -3
7465 -3 187 369 348 128 -118 -337 -332 -230 65 243 349 324 66 -169 -278 -388 -237 5 273 330 295 138 -128
7488 -128 -308 -338 -255 34 266 349 292 126 -142 -306 -340 -226 9 247 337 249 95 -175 -302 -345 -213 31 269
7511 269 364 301 61 -177 -358 -357 -225 33 288 316 307 39 -257 -356 -281 -154 62 323 312 275 68 -229 -282 -343
7535 -343 -163 88 282 334 231 49 -190 -302 -283 -186 66 289 328 250 40 -182 -336 -263 -127 78 258 356
7557 356 161 18 -222 -320 -328 -138 81 339 279 197 2 -214 -342 -300 -158 115 295 345 161 50 -217 -326
7579 -326 -295 -127 122 277 383 205 -43 -245 -327 -305 -67 106 280 382 181 4 -270 -366 -249 -91 128
7600 128 288 354 171 -61 -219 -362 -249 -96 186 280 340 201 -67 -281 -333 -245 4 169 314 254 211 -29
7622 -29 -295 -306 -248 -55 193 329 315 200 -118 -258 -322 -211 -56 231 333 310 136 -81 -263 -298 -219 -23 144
7645 144 262 270 145 -135 -264 -382 -257 -74 185 285 280 137 -64 -228 -344 -241 -32 147 302 256 133 -57
7667 -57 -265 -301 -198 0 233 311 286 145 -112 -265 -315 -192 -13 221 384 234 69 -121 -237 -244 -165 31 241
7690 241 330 265 102 -124 -292 -314 -209 2 274 326 256 109 -108 -260 -297 -127 79 189 305 243 45 -166
7712 -166 -297 -258 -105 40 250 283 255 15 -184 -298 -291 -182 61 204 373 190 54 -155 -307 -319 -129 58
7734 58 281 282 207 15 -175 -276 -211 -142 107 279 309 258 22 -133 -307 -263 -114 128 255 279 163 51 -171
7757 -171 -289 -257 -102 124 280 293 197 -40 -229 -315 -298 -115 87 242 259 181 18 -232 -307 -233 -71 64 258
7780 258 286 198 -33 -176 -292 -234 -85 58 274 293 182 -33 -245 -311 -227 -110 152 364 335 180 -43 -132 -286
7803 -286 -233 -45 142 255 259 143 -43 -246 -272 -238 -51 143 268 285 146 -46 -196 -306 -220 -56 184 251 270
7826 270 95 -85 -214 -256 -245 -72 146 241 290 145 -74 -241 -207 -165 46 156 228 191 89 -47 -259 -302 -221
7849 -221 0 197 285 265 111 -99 -196 -268 -184 -55 125 293 252 120 -70 -210 -265 -163 4 228 239 190 123
7872 123 -138 -202 -251 -204 27 177 271 256 45 -107 -233 -304 -177 -24 195 256 254 94 -129 -243 -301 -147 37
7895 37 210 264 195 24 -117 -209 -252 -154 62 178 230 199 57 -193 -270 -249 -145 49 170 279 231 48 -137 -233
7919 -233 -243 -121 54 176 267 148 29 -206 -222 -231 -136 -36 247 212 171 66 -164 -231 -265 -113 44 213 232 200
7943 200 18 -171 -247 -196 -64 55 185 252 183 73 -94 -211 -206 -106 70 179 230 215 -31 -95 -237 -210 -64
7966 -64 61 188 280 155 -38 -178 -263 -160 -109 91 192 203 156 -5 -189 -254 -171 -131 82 183 218 142 -27 -145
7990 -145 -238 -210 -109 94 227 240 140 -18 -180 -257 -154 -81 106 255 223 117 -26 -167 -236 -208 -66 108 211
8013 211 240 118 -38 -132 -223 -183 -49 76 208 192 128 -16 -134 -200 -188 -24 61 200 262 131 5 -114 -255
8036 -255 -105 -107 121 210 197 139 -16 -142 -221 -197 18 124 209 220 112 -20 -211 -250 -137 -54 119 239 179 133
8060 133 -45 -194 -282 -159 -25 118 226 213 42 -27 -193 -181 -181 -10 126 144 206 127 -109 -193 -272 -171 1 149
8084 149 298 173 53 -95 -205 -186 -174 26 140 241 228 54 -103 -162 -225 -132 9 128 170 198 122 -80 -185
8107 -185 -252 -110 26 137 178 237 95 -128 -200 -179 -65 43 175 225 157 78 -106 -154 -191 -98 52 128 230 144
8131 144 9 -73 -169 -174 -123 68 148 210 187 -20 -107 -233 -245 -111 34 132 211 120 43 -80 -177 -186 -97 29 137 179
8157 179 165 63 -133 -215 -223 -105 34 128 171 172 40 -86 -208 -197 -76 58 187 215 141 36 -110 -202 -138 -87 98
8182 98 191 196 124 47 -99 -153 -196 -99 25
8191B5
##END NTUPLES=NMR FID
##END=
