##TITLE=1H_PR-I
 D2O,8 sc, 
 1.10.2021
##JCAMPDX= 6.0         $$ Bruker NMR JCAMP-DX V2.0
##DATA TYPE= NMR FID
##DATA CLASS= NTUPLES
##ORIGIN= UXNMR, Bruker Analytische Messtechnik GmbH
##OWNER= root
$$ XWIN-NMR		Version 3.5
$$ Fri Oct  1 13:00:06 2021 Russian Standard Time (UT+4h)  she@DPX200
##.OBSERVE FREQUENCY= 200.1313468511
##.OBSERVE NUCLEUS= ^1H
##.DELAY= (6, 6)
##.ACQUISITION MODE= SIMULTANEOUS
##.ACQUISITION SCHEME= undefined
##.AVERAGES= 8
##.DIGITISER RES= 18
##SPECTROMETER/DATA SYSTEM= spect
##.PULSE SEQUENCE= zg30
##.SOLVENT NAME= D2O
##.SHIFT REFERENCE= (INTERNAL, D2O, 0, 15.7039)
##AUDIT TRAIL= $$ (NUMBER, WHEN, WHO, WHERE, WHAT)
$$ ##TITLE= Audit trail, XWIN-NMR		Version 3.5
$$ ##JCAMPDX= 5.01
$$ ##ORIGIN= Bruker BioSpin GmbH
$$ ##OWNER= she
$$ F:/spectra/data/she/nmr/H-F/1/audita.txt
$$ ##AUDIT TRAIL=  $$ (NUMBER, WHEN, WHO, WHERE, WHAT)
(   1,<2021-10-01 12:58:24.50 +0400>,<she>,<DPX200>,
      <created by zg, POWCHK disabled, PULCHK disabled
       configuration hash MD5:
       00 E9 B6 7A A2 85 ED C7 34 08 36 98 17 FE 4E 26
       data hash MD5: 16K
       97 B6 CF 0D 2F 25 2F 9C 53 96 34 5E 06 4F 87 F9>)
$$ ##END=
$$ 
$$ hash MD5
$$ 22 F2 3E 2A CA 35 53 5F 94 A4 EA 16 12 FF BE 62
##$RELAX= 
##$RELAX= 
##$RELAX= 
##$RELAX= 
##$RELAX= 
##$RELAX= 
$$ Bruker specific parameters
$$ --------------------------
##$DU= <F:/spectra>
##$EXPNO= 1
##$NAME= <H-F>
##$PROCNO= 1
##$TYPE= <nmr>
##$USER= <she>
##$AMP= (0..31)
100 100 100 100 100 100 100 100 100 100 100 100 100 100 100 100 100 100 
100 100 100 100 100 100 100 100 100 100 100 100 100 100 
##$AQSEQ= 0
##$AQ_mod= 1
##$AUNM= <au_zg>
##$AUTOPOS= <>
##$BF1= 200.13
##$BF2= 200.13
##$BF3= 200.13
##$BF4= 200.13
##$BF5= 200.13
##$BF6= 200.13
##$BF7= 200.13
##$BF8= 200.13
##$BYTORDA= 1
##$CFDGTYP= 0
##$CFRGTYP= 5
##$CHEMSTR= <none>
##$CNST= (0..31)
1 1 145 1 1 1 1 1 1 1 1 1 1 1 1 1 1 1 1 1 1 1 1 1 1 1 1 1 1 1 1 1 
##$CPDPRG= <>
##$CPDPRG1= <>
##$CPDPRG2= <>
##$CPDPRG3= <>
##$CPDPRG4= <mlev>
##$CPDPRG5= <mlev>
##$CPDPRG6= <mlev>
##$CPDPRG7= <mlev>
##$CPDPRG8= <mlev>
##$CPDPRGB= <>
##$CPDPRGT= <>
##$D= (0..31)
0 1.2 0 0 0 0 0 0 0 0.06 0 0.03 0 0 0 0 0.0002 0 0 0 0 0 0 0 0 0 0 0 0 
0 0 0 
##$DATE= 1633078703
##$DBL= (0..7)
120 120 120 120 120 120 120 120 
##$DBP= (0..7)
150 150 150 150 150 150 150 150 
##$DBP07= 0
##$DBPNAM0= <>
##$DBPNAM1= <>
##$DBPNAM2= <>
##$DBPNAM3= <>
##$DBPNAM4= <>
##$DBPNAM5= <>
##$DBPNAM6= <>
##$DBPNAM7= <>
##$DBPOAL= (0..7)
0.5 0.5 0.5 0.5 0.5 0.5 0.5 0.5 
##$DBPOFFS= (0..7)
0 0 0 0 0 0 0 0 
##$DE= 6
##$DECBNUC= <off>
##$DECIM= 32
##$DECNUC= <off>
##$DECSTAT= 4
##$DIGMOD= 1
##$DIGTYP= 9
##$DL= (0..7)
0 120 120 120 120 120 120 120 
##$DP= (0..7)
150 150 150 150 150 150 150 150 
##$DP07= 0
##$DPNAME0= <>
##$DPNAME1= <>
##$DPNAME2= <>
##$DPNAME3= <>
##$DPNAME4= <>
##$DPNAME5= <>
##$DPNAME6= <>
##$DPNAME7= <>
##$DPOAL= (0..7)
0.5 0.5 0.5 0.5 0.5 0.5 0.5 0.5 
##$DPOFFS= (0..7)
0 0 0 0 0 0 0 0 
##$DQDMODE= 0
##$DR= 18
##$DS= 0
##$DSLIST= <SSSSSSSSSSSSSSS>
##$DSPFIRM= 0
$$ [...]
##$SUBNAM2= <"">
##$SUBNAM3= <"">
##$SUBNAM4= <"">
##$SUBNAM5= <"">
##$SUBNAM6= <"">
##$SUBNAM7= <"">
##$SUBNAM8= <"">
##$SUBNAM9= <"">
##$SW= 18.0517286264689
##$SWIBOX= (0..15)
0 0 2 0 0 0 0 0 0 0 0 0 0 0 0 0 
##$SW_h= 3612.71676300578
##$TD= 16384
##$TD0= 1
##$TE= 0
##$TE2= 300
##$TE3= 300
##$TEG= 300
##$TL= (0..7)
0 120 120 120 120 120 120 120 
##$TP= (0..7)
150 150 150 150 150 150 150 150 
##$TP07= 0
##$TPNAME0= <>
##$TPNAME1= <>
##$TPNAME2= <>
##$TPNAME3= <>
##$TPNAME4= <>
##$TPNAME5= <>
##$TPNAME6= <>
##$TPNAME7= <>
##$TPOAL= (0..7)
0.5 0.5 0.5 0.5 0.5 0.5 0.5 0.5 
##$TPOFFS= (0..7)
0 0 0 0 0 0 0 0 
##$TUNHIN= 0
##$TUNHOUT= 0
##$TUNXOUT= 0
##$USERA1= <user>
##$USERA2= <user>
##$USERA3= <user>
##$USERA4= <user>
##$USERA5= <user>
##$V9= 5
##$VALIST= <valist>
##$VCLIST= <CCCCCCCCCCCCCCC>
##$VD= 0
##$VDLIST= <DDDDDDDDDDDDDDD>
##$VPLIST= <PPPPPPPPPPPPPPP>
##$VTLIST= <TTTTTTTTTTTTTTT>
##$WBST= 1024
##$WBSW= 4
##$XGAIN= (0..3)
0 0 0 0 
##$XL= 0
##$YL= 0
##$YMAX_a= 233524
##$YMIN_a= -244189
##$ZGOPTNS= <>
##$ZL1= 120
##$ZL2= 120
##$ZL3= 120
##$ZL4= 120
##$ABSF1= 10
##$ABSF2= 0
##$ABSG= 5
##$ABSL= 3
##$ALPHA= 0
##$AQORDER= 0
##$ASSFAC= 0
##$ASSFACI= 0
##$ASSFACX= 0
##$ASSWID= 0
##$AUNMP= <proc_1d>
##$AZFE= 0.1
##$AZFW= 0.1
##$BCFW= 1
##$BC_mod= 2
##$BYTORDP= 1
##$COROFFS= 0
##$CY= 11.3945322036743
##$DATMOD= 1
##$DC= 2
##$DFILT= <>
##$DTYPP= 0
##$F1P= 2.36226072786647
##$F2P= -0.459571619588291
##$FCOR= 0.5
##$FTSIZE= 0
##$FT_mod= 4
##$GAMMA= 1
##$GB= 0.15
##$INTBC= 1
##$INTSCL= 1
##$ISEN= 128
##$LB= 0.24
##$LEV0= 0
##$LPBIN= 0
##$MAXI= 10000
##$MC2= 0
##$MEAN= 0
##$ME_mod= 0
##$MI= 1.114404
##$NCOEF= 0
##$NC_proc= 0
##$NLEV= 6
##$NOISF1= 3.799351
##$NOISF2= 2.8
##$NSP= 1
##$NTH_PI= 0
##$NZP= 0
##$OFFSET= 15.70392
##$PC= 1
##$PHC0= -14961.5
##$PHC1= 15.80083
##$PH_mod= 1
##$PKNL= yes
##$PPARMOD= 0
##$PSCAL= 0
##$PSIGN= 0
##$REVERSE= no
##$SF= 200.130013532006
##$SI= 16384
##$SIGF1= 3
##$SIGF2= 2
##$SINO= 400
##$SIOLD= 16384
##$SREGLST= <1H.CDCl3>
##$SSB= 0
##$STSI= 0
##$STSR= 0
##$SW_p= 3612.71676300578
##$SYMM= 0
##$S_DEV= 0
##$TDeff= 0
##$TDoff= 0
##$TI= <>
##$TILT= no
##$TM1= 0
##$TM2= 0
##$TOPLEV= 0
##$USERP1= <user>
##$USERP2= <user>
##$USERP3= <user>
##$USERP4= <user>
##$USERP5= <user>
##$WDW= 1
##$XDIM= 8192
##$YMAX_p= 0
##$YMIN_p= 0
$$ End of Bruker specific parameters
$$ ---------------------------------
##NTUPLES= NMR FID
##VAR_NAME=  TIME,          FID/REAL,        FID/IMAG
##SYMBOL=    X,             R,               I
##VAR_TYPE=  INDEPENDENT,   DEPENDENT,       DEPENDENT
##VAR_FORM=  AFFN,          ASDF,            ASDF
##VAR_DIM=   8192,          8192,            8192
##UNITS=     SECONDS,       ARBITRARY UNITS, ARBITRARY UNITS
##FACTOR=    0.0002768,     1,               1
##FIRST=     0,             0,               0
##LAST=      2.2672688,     0,               0
##MIN=       0,             -244189,         0
##MAX=       2.2672688,     233524,          0
$$ Real data points
##PAGE= N=1
##DATA TABLE= (X++(R..R)), XYDATA
0@%%%%%%%%%%%%Qj6J6j6J6k4L2m0M8n6P2q0Q8j04J20j44J68j92K24k56K88l25
34a73L68m15M68n26N87o53P28q11R02r99J104j221J348j487J638j803J986k188
52a147K413k663K940l252L605m009M479n029N685o481P471q748J0464j2907J6684
67I505k3385L8882j42663o8584J95662R0189J24347q003j38280j60713q7294p3852
79b44189N8198J68907J40072O3792K9253j02005j76021j06531l0157J4362J35537
90d8782J69242O9339n607n2815j52124j44657k8801L8264Q4158J55774J08181
101A92172j3305o5734j04387j45340o5228N1217Q5106J12469J23453J9715q3573
112A06565r6508j08303r0741K4152J05915R9393R5289N2540o2805j16942r1964
$$ y = [0, 0, 0, 0, 0, 0, 0, 0, 0, 0, 0, 0, 0, 8, -8, 8, -8, 8, -16, 16, -24, 24, -32, 40, -40, 48, -56, 64, -80, 88, -104, 120, -136, 152, -173, 195, -220, 248, -278, 309, -344, 384, -427, 475, -524, 580, -641, 707, -780, 858, -945, 1041, -1147, 1266, -1397, 1543, -1709, 1896, -2113, 2366, -2663, 3022, -3459, 4012, -4736, 5728, -7179, 9505, -13880, 25002, -117661, -186245, 9417, 99606, 223953, 215950, 77670, -83043, -170337, -244189, -185991, -17084, 122988, 186780, 216033, 114028, -61993, -168524, -198681, -184319, -48782, 120460, 189799, 184192, 131377, -20747, -165404, -194205, -155941, -71783, 83991, 192172, 178867, 113133, 8746, -136594, -201822, -150605, -65499, 46970, 170423, 190138, 106565, 10057, -98246, -188987, -164835, -58920, 40473, 135762, 188302, 125497, 8555, -83409]
123h3409p3537j1984R3741J17758P7085M6226k6125j13876j08308n5544j6253
134a54226N8331J22315R0710K9948j4780q3912j19399o6447l049M2036R9074J05964
146A06565L7581k3739o4405j04149q4364p351M7393P9218R8838N6926k1652o5784
158E5077q5428q4306k6461M6927P8088Q3618O3199l998o6865q2564p3608l7246
170a33567L1722P9944Q0351N7064R363n4964q5480p0911l5765J7646P1065Q3759
182E0227N5943J1553m1471p9902p4942l6512J2730N9715Q0825O0936J4825l5404
194G8523p1332p4473m2105P757N3690P5237O2101K1506k8972o6823p1617m4601
206a01109j04M7028P3222O1295K4258j9811o0622p2911m5520l046L7080O8487
$$ y = [-83409, -156946, -168930, -75189, 42569, 119654, 165880, 139755, 25879, -82429, -137973, -154226, -95895, 26420, 117130, 147078, 132298, 48386, -71013, -137460, -140509, -98473, 601, 106565, 144146, 120407, 56002, -48147, -132511, -139862, -92469, -13251, 85587, 142513, 120861, 55077, -30351, -114657, -141118, -94191, -16103, 67515, 130714, 126716, 59851, -22713, -96321, -133567, -101845, -21901, 58450, 115514, 124877, 69913, -15567, -86478, -122243, -104597, -33532, 50227, 106170, 117723, 76252, -3650, -78592, -115104, -102374, -42659, 38166, 99102, 113927, 78523, 7191, -67282, -109387, -101630, -47940, 27297, 89398, 110904, 81932, 15109, -56508, -101109, -101213, -54185, 19037, 80332, 104590, 84779, 24157, -48754, -94274, -97320, -60240, 8247]
218H247O5561K5839j6864n0241p0715n2306m297L3572N8297O7086L4388j7255
230H1312m6033o0660n7901j3785L6253N3341N7772M3844p600n0691n5323n0309
242f9780k6394K8261N9507N1482L9329P439m6100o2367m2660k5635J1173N9374
254a6371N9413L0081J0311k8182o6687n1010j5510N234M2248O7659L7552M69j8942
267E6265n2621o2787k0480J4034K9810N8008N2837J779k6850l7113n7753l8580
279h3451J6168L6533M0941N2746K0935l2108m1931m1079m3488j771M4616M2765
291A0876L7525L1519j7077n3119l9490l0645j7029L3387N6595L2824K1201J579
303F8146m6212n4578k3487j0369J3407N4643M7533J2037o02k6595n8103l6403
$$ y = [8247, 73808, 99647, 82783, 32542, -38173, -90479, -94776, -61204, -2907, 64179, 98567, 81312, 35279, -25381, -83282, -97067, -60814, -7473, 50299, 94143, 86543, 35852, -19471, -69780, -96174, -67913, -8406, 43076, 82405, 89844, 43744, -18623, -61283, -86918, -75745, -16371, 43042, 73123, 83434, 55252, -11435, -62445, -77955, -72721, -30473, 37186, 74738, 75207, 56265, 3644, -59143, -79623, -65589, -35779, 22229, 75066, 76845, 49995, 12882, -44871, -83451, -67283, -30750, 10191, 62937, 83872, 51764, 9833, -31246, -74734, -76505, -31889, 10876, 48401, 79920, 62843, 9724, -29766, -60411, -77440, -44053, 12542, 45366, 66567, 68146, 21934, -32644, -56131, -66500, -53093, 1550, 49083, 61120, 60518, 33923, -24180, -60583]
315f0583L34J1089L6424N6374K2613j2334k0051m2639m9664p310K2755K6905M4818
328B8731L8751q275l0794l0647m3029k4961K2660L5659L1454L7424R645l4592
340C2026l7299k9165k8693N965M2949L5435K4462J7762k0536m7321l0387j7456
352e2258n767L2479M7390K2885R072o201m1022m3335j3572j17J7208M5559L5525
365D7846L338q693k6061m5736k5072P113J6423L1924M1847J2882j6555k2519l4486
378a7749l4440o7K4425K6130L3778K4371j2266k9929k7483k9625j2548K2894L2736
391B27K5916K3125J87l0954l2741k2097j4456J1418L6055K9845J6226M860k1370
404B6241l7955k4476q825M925K8723L6240J7482O91j3897l2999l1555r080P429
$$ y = [-60583, -60249, -49160, -12736, 43638, 66251, 53917, 33866, -8773, -58437, -65747, -42992, -16087, 28731, 67482, 59207, 28413, -2234, -45263, -70224, -47564, -11905, 19549, 56973, 66618, 32026, -5273, -34438, -63131, -57166, -14217, 21218, 45680, 63442, 42906, -4415, -34802, -52258, -58025, -25546, 21844, 44729, 53801, 47600, 6578, -36757, -50329, -50446, -33238, 12321, 47846, 51184, 42491, 16430, -29306, -54378, -47265, -30842, 1082, 42929, 55811, 39256, 16737, -17749, -52189, -52256, -27831, -1701, 32077, 56448, 44182, 14253, -13230, -42855, -55403, -32509, 227, 26143, 49268, 49455, 18501, -14240, -36337, -50793, -39375, -3320, 26525, 42751, 47611, 26241, -11714, -36190, -45015, -40090, -11367, 24873, 42355, 43046, 29149, -3850, -35405, -44485, -37056]
417c7056K1093L3910K4481K90j4819k6016l1817j5637Q406K0846K8130K6613O146
430D4570j6034k5118k7340j9106L407K2046K6954K3899J0122j2022k5960k6415
442b0997j8182o28J9157K7609K3307J0646q111k3933k7212j8307k038J5733K6312
455C356K4377J1687o568k1396k6043j9795m147J4484K4664K3451J3596l685k0610
468A3371k5295j9035o666J1264K4641K3218J3136l66j7686k6364j8916o437P188
481b7947K2397K5496J2831m61j2754k5207k2215n846O782J7306K5704J6845j603
494C1328j1819k0135k4134r901Q505J5515K1071K0583K185j4456j7495k0299j5230
507c4282N658J8748J7621J7829Q793j2862k1009j6109j4207j603J8867K1049J3162
$$ y = [-37056, -15963, 17947, 42428, 42718, 27899, 1883, -29934, -45571, -37165, -16319, 11811, 38424, 44570, 28536, 3418, -23922, -43028, -39621, -17575, 9379, 33278, 43400, 31378, 5418, -20997, -39179, -39807, -20650, 6959, 30266, 40912, 32801, 8868, -18344, -36651, -38689, -22956, 3356, 27733, 39420, 32852, 11456, -14587, -34382, -38529, -24045, 619, 24070, 37666, 33981, 13371, -11924, -30959, -37625, -26361, -1720, 21498, 34634, 34268, 16582, -9782, -28698, -35135, -27947, -5550, 19946, 32777, 32316, 19562, -5645, -27860, -33706, -26924, -9618, 16086, 32931, 31328, 19509, -626, -24760, -34661, -26156, -10641, 10430, 31013, 33198, 18742, 1247, -19052, -34282, -28624, -9876, 7745, 25574, 34367, 21505, 496, -15613, -29820, -31423, -12556, 8493, 21655]
520B1655R516n399k3041j9055r241m277J1908K5052J5220M465r84j7097k4625
533a5903j0099K91N933K0924K1946L903m799r967k2605j7434K301Q620J3094K2316
547A8521J1412q304j1333j4834k0199m461J3281J2850J5198J6503k826j7031j3034
560d257j4127j1417R660J8981J1831J2017N552j5430j9225r422q897O27J9580
573d527J7554O335N230o555k2028j4244k661j186J1433K2472R853j239k626j5334
587B477k0814m540M767O114J7542J7391q64p885q764j8097j2770O252J0151J0352
601A312J7138P013j0745j1350j1017j4709j046J4412J1589J0434J1033m810j6597
614B657j0732q968o526J0027J7313Q926O541J734j4027j6531o367l716L008J6748
$$ y = [21655, 31171, 25772, 2731, -16324, -25565, -29842, -17934, 7118, 22338, 26803, 25819, 8722, -15903, -26002, -25711, -19778, 1146, 23092, 26995, 22196, 12229, -10376, -27810, -25509, -16889, -3795, 18521, 29933, 21629, 10296, -4538, -24737, -29198, -15917, -3067, 12131, 28634, 25808, 8777, -4257, -18384, -29801, -20141, -1160, 10671, 22688, 28240, 12810, -6415, -15837, -24734, -24107, -4527, 13027, 19362, 24592, 18037, -3991, -18235, -20896, -22082, -10649, 11823, 21676, 20437, 17811, 2477, -18337, -22877, -18110, -11996, 5546, 22937, 22073, 14188, 5424, -12673, -25443, -19191, -9040, 1312, 18450, 25463, 14718, 3368, -7649, -22358, -23404, -8992, 2597, 13031, 24064, 19254, 2657, -8075, -17043, -23569, -13542, 3771, 12697, 19238, 20972, 6945, -9586, -15953, -19669, -16661, 87]
628H7J4390L194M46p160j7741j1121K34K659J0442J7247O972l691n469j2523j5089
643a7123k465O531P846J3311J1812k115q987r248j2742p621O365J0491R768J0925
657A6748L014r664j1356r132q222J529J2125J1130P778M687n724j3417r948n629
671a6081q55R163J3418Q034K909k809j1414j2550n453J56O106J2508J0477K536
685A6145l155q595j2469p677M82N939J0217J1092M487l485q060j0699q937j088
699a5803O167R536J0078N916k141q192j0151q449k517M847R676R834N939q39p167
714F734j0173q585k948L861Q721R974O596m33o459r257q900l997L547Q188R115
729E984P293R15o440q904q092n104K250Q491Q701O566K501n197r710p579m483
$$ y = [87, 14477, 17671, 18117, 10957, -6784, -17905, -17671, -15012, -4570, 12677, 19649, 15958, 10489, -2034, -17123, -19588, -13057, -5211, 8100, 19912, 17797, 8810, -438, -13180, -20801, -14436, -3945, 5823, 16748, 19762, 10098, -1258, -10390, -18612, -17083, -4958, 6172, 13950, 18637, 12913, -504, -10452, -16081, -16936, -7773, 5645, 13679, 16588, 13779, 2365, -10185, -15638, -15482, -9376, 3132, 13609, 16145, 12990, 4395, -8074, -15751, -15269, -9330, 887, 11979, 16466, 12981, 4921, -5778, -14715, -15803, -9636, -100, 9978, 15894, 13753, 5561, -4590, -13039, -15556, -10709, -1033, 8801, 14740, 13901, 6734, -3439, -12024, -14972, -11111, -2390, 7584, 14180, 13747, 7288, -1969, -10869, -14866, -11319, -3131, 5984, 13277, 14192, 7752, -1152, -9244, -14348, -12098, -3607, 5094, 11660, 14161, 8964, -746, -8325, -12808]
744a2808R5P620J0037N695K231k700r428r140l451P8M882J0437P542Q21k206o725
760B980j0454n032J722L895P866R568K233m130n054q400p830R14N894N727Q170
775H069N479m061o960n777p264k638O640P315N217N981m49q621o878m214m190
790a2351L391R694N806K947K018n880r922m172j423P7Q005R200K021J8k245r187
806b003p739K46J522L843R682N515k457k704n155r338k781M442L467N989Q178
821A0707r0n969l904o240o298K981O798L931N851L950n394p027l597n010j386
836a0697P371O675K711L830j226q567n649j775k292L591R081M142O04O36n539
851B896q706k352P07Q84O948P673K27j722k367p626o003J743K728L398P698L768
$$ y = [-12808, -12713, -5093, 4944, 10639, 12870, 10170, 742, -8398, -11849, -11771, -6889, 3548, 11090, 11911, 9705, 2980, -7474, -12506, -10784, -6889, 977, 10545, 12778, 8648, 3594, -4806, -12636, -11722, -5828, -101, 8069, 13548, 9487, 2527, -3250, -10514, -13152, -6512, 803, 6020, 12001, 11552, 2931, -3947, -8161, -12351, -8960, 734, 6540, 9487, 11505, 5625, -4297, -8469, -9892, -9815, -1810, 7390, 9411, 9429, 7184, -2003, -9742, -9496, -7974, -4131, 5551, 11066, 8609, 5905, 750, -8588, -11369, -6927, -3460, 2529, 10707, 10617, 4648, 744, -5496, -11794, -8813, -2015, 1916, 7767, 11717, 6323, -704, -4301, -9311, -10697, -3326, 3349, 6060, 9890, 8664, 97, -5552, -7327, -9619, -6028, 3053, 7195, 7799, 8435, 2896, -5810, -8162, -7455, -6571, 377, 8050, 8277, 6555, 4188, -3438, -9441, -7698, -4970, -1572, 6126, 9894]
867I894l464l412m235o961j289M880L733M525N690j082n966l755m253l946L275
882f366O353L476L680J977n172o308k736k763J10O397N734J851J550k047p110
897a374m661p60j28L620P107L207l91j011m908o592j543J543K247N575N412j78
913G165k563l132n689l772J701L363L732N204K042l179l881l855m225j93M176
928c106M136L650K877j645m826l995l007j376L129N125L528K065k91m148m994
943b878k773q73J702M830M457J759l41k971n013l544o15J540L919M646K452n20
959E777k688m371l886j225J641L571M264K866J9k693m080l781j553J087L493M212
975B653K841K73k032m045l929j684R80K800M255L263L31k019l266m070k324R97
$$ y = [9894, 6430, 3018, -1217, -8178, -9467, -4587, -854, 3671, 9361, 8279, 2313, -1442, -5695, -9641, -6366, -13, 3463, 7143, 9120, 3948, -2360, -5096, -7859, -7749, -1352, 4382, 6233, 7783, 5736, -1374, -6035, -6795, -6923, -3303, 3804, 7011, 6620, 5609, 701, -5891, -7434, -5891, -3644, 1931, 7343, 7165, 4602, 1470, -4219, -7991, -6290, -2927, 805, 6009, 8051, 4872, 991, -2864, -7089, -7282, -3106, 1030, 4680, 7557, 5912, 1086, -2909, -5916, -7292, -4163, 962, 4490, 6555, 6264, 2116, -2878, -5651, -6524, -4822, 8, 4465, 6224, 5883, 2912, -2101, -5645, -6260, -4720, -801, 3845, 6297, 5777, 3089, -1282, -5168, -6393, -4752, -1181, 3083, 5949, 5968, 3275, -805, -4586, -6139, -5052, -1559, 2653, 5494, 5767, 3735, -310, -4239, -5923, -4943, -2143, 2112, 5375, 5706, 3687, 421, -3649, -5973, -4976]
991d976K764L524L611J060k224l213l367k875K93L182L316K926J932j543l899
1006E11l002k342q62K890M043K310J656k76l769l955j610p50J414M418L305O03
1022D584j7k284m740k289L56O77L131M520J102j171j368l629l835J35J826J842
1038a160L846K920j445k310k134l654j662K452K610K190L225L23l444k504j982
1053b729k574J014L907K302J625J733k171m263j717j194o98L276L984R42P01k32
1069C906m061l423j42j95J194M450K559o78l24j978m517j381J412P34K614M092
1085D262K26j994j120l051l303R90K464J337L117K262k134k555j463k894j154
1100e010L057K567J353K437p3l748k213j103j842J282M003J803P35J057k316m023
$$ y = [-4976, -2212, 1312, 4923, 5983, 3759, 546, -2821, -5696, -5403, -2221, 1095, 4021, 5953, 4410, 511, -2491, -4833, -5695, -2805, 1238, 3548, 5204, 4928, 1159, -2796, -4406, -5156, -3742, 676, 3981, 4584, 4567, 2283, -2457, -4746, -4390, -3713, -582, 3938, 5040, 3869, 2501, -1128, -4963, -4828, -3002, -1160, 2686, 5606, 4161, 1851, -283, -3937, -5599, -3147, -537, 1653, 4878, 5201, 1757, -747, -2729, -5303, -4289, -382, 1920, 3545, 5278, 3107, -1156, -2873, -4067, -4765, -1489, 2495, 3437, 4138, 3906, -155, -3578, -3720, -3915, -2721, 1729, 4288, 3610, 3286, 1308, -3209, -4590, -3178, -2444, 170, 4262, 4488, 2494, 1374, -1677, -4980, -3990, -1526, -189, 2928, 5190, 3056, 501, -962, -3856, -5010, -1953, 614, 1967, 4404, 4331, 583, -1630, -2733, -4575, -3293, 710, 2513, 3248, 4305, 1989, -2034]
1116b034j033l21l11L172L558K80j8n97l624k897N03M23J307L799J974j203q07
1133B171j876l648q69J785J208K169L117j84k290j355k322k352J192K590J410
1148G46K187J437k151k626j264j866m44K824K496J053J340n52l187k153p04p22
1164c586J460L355J536K96Q5k148l174r73J85O37K586K756K20o28j174k863k066
1181c496M28J145J683K619J245j118j399j848k318m93J609J716J973J675l42k002
1197A077j790j800j001J148K190J823J271K45j675k229j527q70N36K001K128J283
1213B810J79j179k250j831p43M58J611K301J344K21j009k038j892r54L90J552
1229a030J984J559M18q28j965j989r01L9J442K087J491M94o04j813k028r81N9
$$ y = [-2034, -3067, -3388, -3699, -527, 3031, 3311, 3293, 2696, -928, -3825, -3322, -2899, -1592, 2207, 4181, 2978, 2171, 295, -3353, -4222, -2437, -1229, 940, 4057, 3873, 1583, 228, -2094, -4446, -3254, -664, 746, 2933, 4370, 2219, -407, -1671, -3537, -3981, -1157, 1339, 2392, 3732, 3180, -7, -2160, -2864, -3586, -2126, 1229, 2765, 3061, 3146, 998, -2176, -3149, -2964, -2327, 259, 3015, 3235, 2607, 1433, -1430, -3496, -3068, -1923, -240, 2379, 3624, 2506, 1107, -741, -3059, -3552, -1943, -227, 1746, 3421, 3079, 1077, -713, -2513, -3514, -2366, -176, 1647, 2918, 3163, 1488, -741, -2268, -3138, -2602, -601, 1527, 2810, 2989, 1810, -440, -2271, -3014, -2556, -945, 1356, 2700, 2921, 1912, -126, -2018, -2972, -2582, -1030, 954, 2513, 2931, 2103, 138, -1851, -2752, -2713, -1271, 816, 2307, 2801, 2197, 384, -1644, -2625, -2566]
1246b566J016K076J818L23n01j387k112j397K48R46J565K074P54q24j232j643
1262h42j774j10J339J308J601J359n86j661j277j444q36J161J900J102J199K62
1278B701j769j800p85q91K84K162J563N32N26r55k329j239o7j81J379K445N63
1295B139j07k90j750k200oN30N12K069J745o06p28p89k166j118J114R06R85K002
1313B242M30j512r97j048j747K67J841Q80J003J423j002j971o62j007q92J614
1329a138K018L64Q07K72k004j718j20n64K75K282J323k37L73p80k454p32M39M
1347a590J177K256J97p55j01j530k003M28R37L60J683J481r44j011m94j749q71
1364b529J342J052N93J681J03j709q52o57j347M27J981O87N58J001j036j971m72
$$ y = [-2566, -1550, 526, 2344, 2667, 2166, 779, -1333, -2730, -2482, -1536, 29, 2103, 2857, 2033, 801, -842, -2616, -2726, -1387, -79, 1522, 2881, 2295, 634, -643, -2087, -2923, -1762, 138, 1240, 2439, 2701, 932, -868, -1653, -2544, -2260, -98, 1465, 1997, 2523, 1568, -761, -2000, -2067, -2248, -869, 1576, 2139, 2032, 1742, -8, -2208, -2214, -1684, -1172, 897, 2642, 2036, 1308, 519, -1647, -2765, -1651, -745, 240, 2242, 2672, 1160, 163, -885, -2632, -2365, -524, 356, 1359, 2782, 1780, -191, -853, -1860, -2752, -1138, 880, 1244, 2051, 2323, 319, -1399, -1519, -2083, -1808, 474, 1797, 1560, 1933, 1153, -1301, -2033, -1594, -1590, -413, 1843, 2040, 1285, 1184, -346, -2349, -1921, -984, -624, 1059, 2540, 1596, 585, 91, -1658, -2529, -1187, -135, 458, 2139, 2242, 533, -319, -976, -2323, -1896, 85, 772, 1330, 2331, 1295, -676, -1148]
1381a148m39n13J520J759J72L52P7j891j500J65j16L43J955J142m61pq22j948
1399a360o30P36K69J064J749R0r07m30j213j464M63J000N47J267R50q91j049n86
1417c95j204n06J300J071N99R42k2j447r64n76o39M77J620P89K91M45r60j577
1435g56n57j90O4J185J377K92j7m23j325j119pK67P08J358P42k30m70q86j254
1454a241m17N24P12R50J002M5p85p14j053p05L09R06R06Q41L28o01j002q76n57
1473a428MP90J064P26L30l65r35j009o17J11O08R87R03K96l51q24r50o82o7O87
1493g22Q42Q59M72k23r32q50o80k74O40R78P90M27j7q24j083n23k31L27R29J034
1513I39K65J7m90j182p46k2K23O62J147N35k96l98p17j087k01N88L97Q55Q95j64
$$ y = [-1148, -1587, -2100, -580, 1179, 1351, 1703, 1780, -111, -1611, -1446, -1562, -1219, 736, 1878, 1417, 1410, 588, -1360, -1990, -1254, -985, 79, 1828, 1918, 1011, 581, -632, -2096, -1633, -633, -86, 1181, 2131, 1240, 191, -395, -1599, -2105, -805, 266, 865, 1807, 1785, 338, -626, -1202, -1841, -1364, 256, 1045, 1336, 1781, 821, -756, -1313, -1503, -1439, -254, 1123, 1415, 1398, 975, -350, -1469, -1476, -1209, -501, 857, 1599, 1369, 899, 13, -1241, -1658, -1134, -422, 528, 1530, 1575, 790, 76, -977, -1682, -1373, -467, 439, 1280, 1608, 1007, 5, -871, -1428, -1424, -634, 430, 1156, 1486, 1121, 186, -823, -1440, -1329, -721, 266, 1169, 1465, 1114, 290, -660, -1342, -1409, -722, 120, 979, 1451, 1228, 296, -554, -1234, -1508, -868, 110, 900, 1327, 1310, 486, -597, -1120, -1351, -1024, -95, 939, 1204, 1221, 731, -451, -1197, -1219, -996, -334, 813, 1348, 1052, 654, -63, -1150, -1351, -763, -366, 489, 1384, 1220]
1533A220o72m79q46p84N73Q42M11Q34L85q61p66m46o76n2J122O56K80N90l37j191
1553a97n35k00l70O58J263K42K0K55q81j186k7J17p7J142R53k40j98j57j195o99
1573a312M86K48L35J259L13o57l39m48j123K4Q94J63O10R25m19q40k77n98o29
1592a385O70R31J47O01L32j012p27r2n94K1J195O54o8L78l04j234l53J27l15O30
1612c98J221J14k45J14q10j048J77K68M0R20Q16m36k77j88r31n85O07L73K27J028
1632I87J63p46l38l13q53O6R32J84M01P69n14q87j82m07m46O95Q82R6L65J58r17
1653I5p35N0k41Q1J039M90j72K05l57r99l15K34n4M88R97J5k46q0o60p51J71L05
1675d40J90O88N81l70l59l06o89k90N37M12K78O26M0o25m01k72n33J88P12L56
$$ y = [1220, 548, 69, -777, -1561, -988, -146, 265, 1099, 1484, 623, -143, -589, -1265, -1317, -195, 461, 741, 1331, 994, -197, -732, -932, -1302, -644, 619, 861, 881, 1136, 255, -931, -958, -841, -918, 224, 1177, 937, 739, 582, -613, -1312, -826, -578, -243, 1016, 1329, 672, 333, -115, -1238, -1214, -320, -157, 453, 1378, 959, 119, -158, -756, -1385, -715, 216, 363, 964, 1296, 284, -443, -535, -1129, -1108, 87, 741, 673, 1051, 747, -487, -840, -713, -1028, -398, 823, 937, 692, 806, -4, -1052, -875, -607, -567, 353, 1169, 733, 456, 268, -663, -1248, -641, -268, -41, 987, 1150, 404, 66, -247, -1100, -1034, -102, 82, 483, 1252, 738, -149, -331, -738, -1184, -489, 393, 489, 854, 1012, 95, -640, -590, -831, -750, 289, 779, 607, 812, 455, -544, -859, -625, -679, -191, 806, 821, 575, 495, -165, -916, -745, -440, -250, 438, 1019, 649, 290, -16, -705, -995, -458, -46, 232, 858, 898, 273, -128, -400, -933, -745, -33, 323]
1695C23L01K98m06p20k61k04p6M78P63J26N4o3o23n74j05J3K79O73M01k5j24m17
1717A11n57k97J27K25M73N11J69k70l03n12l56j4L62L46M45L24k48k79n37k74
1737e54o7J97M30N04K44r9l71n43l36k3J98L31M83L21j69l29l37m18k04K42M85
1758a5K96L78Qm08l88l08k66J49M96L29K23K06l73m85k61j11r0M72N01J16J57
1779F26j57n13l99j5r7K45N66L31p2n5l36n72j01J29N8L91N99m2k49j41m46l71
1801f21J44K81J58M62L66m03l35j67m51j23N06K51J56L58j9n82j46r4m31K29O18
1822A57J25L0L39m07n49lq8j35M75M83j05J07L1o03l90J76n3J36O08K32k81M1
1844C26k23o06k3L27J4K95M58j38l54J08m37m35L14L40M8L19L30m18l57Ql49o3
$$ y = [323, 624, 922, 516, -204, -465, -669, -745, -267, 496, 622, 676, 613, -10, -584, -689, -676, -397, 276, 677, 652, 528, 111, -446, -743, -616, -391, 82, 593, 762, 492, 189, -323, -679, -693, -331, 15, 460, 784, 536, 257, -280, -554, -621, -424, 6, 510, 754, 655, 284, -259, -595, -618, -420, -89, 394, 715, 546, 217, -120, -538, -742, -500, -15, 281, 659, 667, 259, -129, -437, -703, -554, -58, 271, 494, 700, 327, -158, -419, -530, -620, -148, 353, 469, 626, 469, -44, -443, -458, -555, -310, 256, 587, 515, 460, 124, -448, -549, -420, -362, 29, 628, 586, 337, 196, -250, -621, -477, -196, -38, 424, 790, 387, 52, -115, -566, -689, -183, 68, 224, 582, 563, -19, -165, -259, -690, -461, 157, 282, 312, 651, 244, -305, -308, -396, -531, -56, 427, 322, 429, 460, -143, -533, -357, -410, -274, 334, 566, 285, 326, 103, -503, -526, -199, -185, 110, 568, 430, 76, 184, -253, -688, -374, -34, 14, 333, 663, 245, -112, -104, -453, -516]
1866e16M31L24m4K85J6o40j24N1l33K25N98L0j3K10l35n79R7Qp7L93M50j15q7
1889B55O9m88l40K58O6N0M99J34k95l1j73m67L1L46nK05L87j13l63o8k06k83K35
1912b97L48N5K19J81l48l26Jk57K2M19K04k3K22j19m84j40P8j14J80M04J1K6O9
1935C31l02l34O1K5J4L39K84o8j36j19k60k19J51J26J31K70J31k68j03j22k88
1956c56J6K76O0K40J03j16k32j05j07j37J59K98P3J18L9k62j77r9o8Q5K57J09
1978A74N6P0j42k47j48m6Q0K23J34J42q0m1k71j52p6J15K05J28J52m2j11j88j16
2001a81j05J31N6K53O0Q8k03j51j12j09N1J37J83J86r3q6j07j67j34J15J36P4
2023B2K09k5j17q2j77j08O1K13K9J18J66j07j83j15j23j0J64J48N3P3P7k73j77
$$ y = [-516, -85, 239, 195, 480, 496, -144, -268, -217, -550, -325, 273, 303, 290, 500, 165, -414, -317, -309, -386, 7, 457, 342, 255, 324, -164, -504, -246, -180, -130, 369, 503, 208, 177, 4, -463, -432, -86, -91, 114, 501, 388, 25, -43, -249, -532, -297, 51, 106, 325, 506, 158, -168, -167, -424, -402, 17, 221, 198, 420, 301, -183, -323, -245, -359, -179, 225, 236, 262, 331, 29, -305, -244, -219, -205, 134, 418, 350, 214, 95, -165, -384, -233, -107, 24, 294, 425, 157, 54, -68, -356, -340, -64, -4, 236, 339, 223, -9, -114, -221, -358, -199, 99, 172, 290, 329, 67, -110, -209, -277, -192, 65, 174, 230, 300, 158, -89, -237, -283, -203, 20, 154, 296, 216, 175, -96, -248, -324, -209, -4, 124, 276, 234, 123, -65, -181, -286, -155, -99, 154, 214, 302, 99, -52, -164, -273, -222, -85, 98, 284, 191, 105, -2, -169, -303, -188, -52, 22, 231, 206, 89, 7, -170, -278, -217, -4, 25, 143, 309, 202, 19, -96, -219, -229, -65, 83, 136, 209, 286, 13, -164]
2046a64oo1Q3K14Q2nN7o0k79o1N2q7J68K73m4p1lj62k01P8J35j4K33N4j41m7%
2073B3k31r4K16Q4P4J52Jk34Mr6j59J27J76qP7J42j70k23L5o5q0K36J80m9RP0
2099A97k92m8L9r0J26J88N8j45R9o7k37LJ14k0O4K68j26j03R4j97j68J29J34o2
2123d2J79J76k67m2K5k79K0J78R3m2K42r7k69R8o1k02K05K22j6m4J26j67j93R3
2147f4j9p7J55J72r9R7Mk44j10J15k4K8J59M3p3M1q7k22K7J37J3P1J36n8j85O3
2173ar3j50J58Q3K5R0Q5j90p2K3r5m4J69M6P7K7n1j66k7O4j13J14Q6O3m7M1q8
2200A4r6N8j6q1J50R1l1m2O5j78o3R1PO1J03K1j60O0o7q6OK8P2O7M3l7r3k9m6
2229h8kkR5N3P6r8k4n2n8l0O7J02jL4N5j09p2r7M8K8P2L5Q1k7n3m4q5J2K6Q7K0
$$ y = [-164, -170, -231, -148, 66, 148, 143, 200, 140, -139, -200, -148, -235, -67, 206, 162, 91, 88, -74, -275, -197, -62, -76, 157, 211, 70, 23, 23, -208, -302, -86, -2, 72, 224, 225, -9, -5, -101, -260, -133, 43, 35, 112, 254, 84, -139, -104, -169, -249, -13, 167, 118, 127, 197, -95, -143, -104, -194, -68, 120, 178, 33, 132, 65, -172, -169, -55, -75, -11, 257, 131, 28, 122, -75, -243, -114, 20, -42, 137, 313, 46, 4, 29, -250, -230, -52, 41, -1, 241, 144, -125, -27, -88, -290, -85, 137, 121, 77, 203, 36, -157, -64, -83, -160, -5, 167, 68, 165, 169, -75, -185, -70, -94, -66, 93, 136, 63, 104, 17, -205, -178, -41, -28, 43, 179, 121, -64, -1, -94, -244, -86, -3, 22, 112, 197, 7, -65, -42, -137, -181, -12, 34, 111, 138, 87, -79, -106, -42, -155, -41, 45, 108, 61, 102, 14, -82, -24, -40, -121, 29, 120, 89, 47, 112, -66, -129, -38, -31, 30, 133, 154, -6, 54, -13, -99, -93, -65, 7, 74, 117, 80, -13, -42, -88, -90, -92, 3, 56, 132, 34, 10, -42, -100, -130, -63, 39, 38, 72, 127, 18, -54, -151, -103, -75, -3, 32, 113, 86, 33, -11, -96, -84, -58, 29, 49]
2260D9P1l5k4o8o7j9K2M2P7M5l4lj23L9p1Q2n7R6R1n7l2Qj02l7N5j6O6J04Oj13
2290el5qm7K7N2lP6K8l8m6n2m9RJ09OJ5M0J1p2q6O7q2K7M3M5Qk2M2j34mN7rl2
2323f2J69o5j8nl7o1J4M2MN4Q0p5l1mj03j4J16j2J4J06p3j9M4p7j00OJ75j24J08
2352E2M9q1p6j3%JO3J00p1K2M0j00k0L1m8K5R5l0n2N4Qj07kL6l0M1R4q3Q4j00
2382a8j1p7Q0LK4N1L1p2k2K8j26M3J05Jm0P0qp1l7J1k9J8P8k4j5J19j29j3l9%
2412f9O5N9%q0M1K7o1k6Jk1K5J29j3o4K3q8j0K0Pj0L2O3j2L1q7j8p7J21J4JM3
2443F6pl3m9K7r7K8R7k6K4J01r8r7K7K8l1L4R2n2m7L6j7o9J1j4O3J4K0m8M8Kn2
2474a9lL1j2nN5Qm2L2m7j7l4JO5N4j1n1j1o7J1j9O8N0o3N2j4j7j5j1l9M8K0K6
$$ y = [49, 120, 85, 61, -7, -74, -93, -71, -29, 48, 93, 59, 56, -67, -28, -99, -17, -74, 22, 113, 56, 24, 32, -70, -107, -52, -68, -2, 102, 108, -5, -40, -48, -95, -68, -16, -19, 57, 85, 47, 1, -51, -100, -91, 18, 24, 39, 79, 90, 18, -68, -1, -83, -56, -13, 32, 40, 18, 60, -74, -78, -21, -30, -62, 107, 42, 24, 19, -18, -79, -65, -23, -19, 35, 115, 40, 9, 5, -98, -112, 4, -8, 6, 112, 39, 20, 64, -13, -113, -107, 68, -56, 52, 101, 20, -56, -69, -69, -68, -5, 95, 24, 46, 86, -14, -34, -3, -51, -26, 69, 39, -13, 41, 49, -58, -60, -24, -54, -13, 81, -2, 82, -18, -29, -106, -26, -23, 1, 52, 83, 11, -11, 17, -109, -66, 39, 40, 0, 70, 62, -9, -46, -35, -64, -46, 32, 8, -7, 112, -17, -30, -69, -69, -4, 55, 55, -25, 16, 43, -18, -44, -43, -64, -39, 90, 77, 13, 36, -52, -62, -42, -35, -45, -13, 50, 38, 69, -18, -36, -113, 8, 22, 23, 66, 59, 26, -23, 4, -93, -65, 32, 6, 30, 131, 33, -64, -37, -9, -40, -6, 86, 34, -13, 23, 6, -63, -52, -66, -3, 11, 31, -17, 31, 33, -19, -22, 9, -3, -8, 47, 55, 13, 45, -2, -19, -53, -52, 13, 67, 56, 5, -6, -73, -62, -81, -13, 37, -26, 26, 12, -5, -20, -31, -70, -22, -2, 24]
2506B4M5k6k4o4K1J9m0Q7pj5k7K8m2m4l4P5OM3L2M1n4n7p1M3MQL5K5n%p8n0R7
2539el5j7N1L6mk8L2j14O5k3R2l5j2ol2O5kj03N8k8O1P1n0o1m1N4l0j9KR2kK5
2571E7l1K5o2Mn9nP0K4JN1r5p4N3J7OL1M8%p8P2p7n1J03o7KR5J3o4k6N1r3K8O4
2604C3j04M5J35o4l5j7On2j4J37n7K7K2m1o4L4q2Q3K0M1o9N1Mo1J6N5j00K0J07
2633G6k3o9N6k4j15O1L9l8K2N2p6L0K3p5J4J5M2PL1k9j6mj0r2M8N9M2p0R9n4l6
2664a5M3l3l2J7K0j7N1N0o2m0JP%K0K1pK4Lj13N0K0kn9P6K1l7J00q7m4K4j3MP
2697bN3m8j7Kk2OkJ8L0Ol8O1o4k6nqJ09l2k0kM6r4P3p2k4P2m6J03J4J9r8j9M0
2730A3o2M9k0N0K2l7jm9m8N4j8O3K7m4L3m3j1j7kJ2L2N2k2l6O5q3j7k5L1M1Ok
$$ y = [24, 69, 43, 19, -45, -24, -5, -45, 42, 35, 20, -7, 21, -21, -65, -99, -24, -18, 25, 57, 98, 44, -13, -84, -41, -37, -29, 6, 31, 26, 26, -52, -102, -5, -40, -57, -6, 30, 26, -2, 30, -84, -19, -42, 50, 15, 3, -3, -35, 30, 28, -75, -17, -45, 16, 87, 37, -24, -65, -11, -41, -60, -58, 34, 32, 57, 26, 51, -11, -7, -66, -71, -1, 23, 24, 75, -20, -94, -41, -24, -18, 13, 61, 61, -17, 55, -22, -73, 30, -37, -35, 60, 73, 9, -17, 34, -59, -31, 33, -71, -26, 109, 45, 10, -7, -1, -53, -67, 70, 13, 40, 62, 21, -43, -9, -91, -8, 12, 53, -16, 35, 39, -22, -6, 49, -51, -31, 76, 53, -16, 40, 16, -99, -38, 1, -37, -15, 37, -39, -9, 14, -61, -47, -32, 10, 17, 48, 19, 3, -1, -11, -103, -55, 4, 46, -24, 75, 21, -15, 28, -5, -37, -20, 0, -17, 34, 84, 22, -18, -17, -10, -10, 10, 31, 24, 48, 51, -62, -12, 8, 6, -53, 23, 44, 7, 107, 20, -24, 0, -13, -9, -2, 51, 3, -14, -12, -34, -28, -30, -12, 18, 24, -14, 47, -17, -43, -48, -56, 53, 21, 1, -1, 45, -49, 24, -48, -72, 0, -46, 57, 71, 90, -8, -27, 13, -49, 0, -20, 30, 52, 15, 14, -35, -83, -29, -47, 16, 43, -1, 32, -11, -22, -39, -41, -29, 3, 55, 33, -3, 62, -21, -38, -63, -32, 9, 15, 13]
2762A3J1m4Oj0k3j2Q6n1M5K1o8Lrl1L5j2O2j1l6Q3qp9nMj1M7L2k7L9k0p7l1K1
2795e7P7RLj4Kp2J4j5N3o0N2M3l6K8n1Jj4j0J8M5J9n6N3l9l6J2mJ2M6J5M0q8N3
2828D3p7J9k2KQ8Pn0K3o4%N8q5k6N8K2M2K7q9K6kRj9k2O9o2K3M1o1p4P1J2m5N2
2861fO3j1j7l7j1K4k3l4O5J7L9n2qj8k0JK8n1k6J77r1nJ6m4j6M7K0m9pj7M5J8
2893A7j0r6O0N8J1k6J5J7q2M6J8n4N0j3K4rJ8q0J8PjLM7mo1K9j7n1LR2m7O1o9
2926b6J04m5k0m5%k6M8j2K4K4n8L3LJn0N9m2M8J7k9l8l7P6j1J8K3l1pP0j03K1
2957a1K0j8n5mM1M1J5J9o3j8qNO2n9R2n3qN6n3oK4K1l6O2o5LpPk9m6Q8j3J8Rm2
2992a1Rlj6j7K3L6jl6M4J8k2p8K3K0M5%k3J1J9o8n6J11j11J01J8Rm1K3k8j8om0
$$ y = [13, 24, -20, -14, -24, -47, -59, 27, -24, 21, 42, -26, -23, -32, -63, -28, -40, 22, 11, -25, 58, 50, -29, -34, -30, -41, 6, 38, 11, 50, 30, -47, -78, -57, 20, 29, 32, 18, 20, -52, -38, -53, 0, -60, -8, 35, -1, 27, -24, -23, -37, -47, -29, 16, 35, -21, 32, -7, -43, -31, -35, -23, 23, 38, 78, -10, 43, -34, -15, -37, -35, 53, 60, 10, 33, -31, -31, 27, -58, -84, -26, -4, 38, 65, -24, 2, 0, 9, -10, -32, 37, -25, -2, 39, -22, -96, -25, -13, -58, -6, 57, 46, 29, -8, -19, 5, -18, -52, 13, 30, 69, 17, 9, -9, -29, -28, 0, -51, -77, 100, 9, 4, 20, -24, -40, 7, 27, -22, -29, -46, -1, 17, 7, -89, -29, 29, 40, 14, 29, 46, -36, 10, 28, -26, 24, 11, 35, 26, 44, -36, -18, -11, -12, -9, 38, 34, -27, 2, -15, -66, -63, 29, -18, 43, -26, 78, 33, 13, -32, -32, -58, -10, -22, 2, 26, -32, 1, 4, 5, -45, 14, -28, 20, 37, 8, -30, -67, 9, -2, 16, 39, 8, 1, 71, -32, -11, 9, -9, -64, -68, -27, 14, 29, 48, -15, -33, -41, -36, 26, -33, 59, 6, -2, 54, 1, -5, 19, 40, 4, 66, 1, 4, -3, 4, -25, -71, 17, 4, 22, 31, -11, -2, -5, -21, -38, -15, 21, 20, -16, 28, 46, 24, -54, -31, -11, 34, 34, 11, 22, 41, -27, -83, 28, -83, 18, 36, 45, 4, 27, -1, -19, -25, -65]
3024f5R9qm3K4L5k6K2j19K8M8j0K7M7p7J0m8kQ0K2q6J08l7o3M5p5M2L6k0L4pj6
3055EJn8N7n9L9J5l7OQ9%p4k5J0mL8nJ7L5k1l3qj8J6pJ0K5K3Mp1Nk8P0l3k1O6
3090B9m8O3k1qq0M9K8Mk7K5ll6N2n0N0oj4j3l0J7qL6K1l3%PL9m3L0l9j7j4O6p0
3124d4M2J2j2M4k7m3rJ8l4M9m2L2J4J2K9n9M6oj1m8O7K7m8Lm5l7Q4L4q0Q9mm2
3156A1k5Kk9K1O2r1O1k4RJJ3k9o1Q4jJ2J0ro6M9MNj5l1O3l4O5k1n3J9K2lKJ8p8
3191c7J00l9K1p7N9j08Q4j1M4ln6Q1p8K4n4N5j8J5K8n2m3N4k7RN6J4j1qk9NK2
3222B0ql1k2J7jQL0JOl4kM3k7K9J2p3NM0K3l0k8J1L7n3K3nj0oqO7j7n6K3K3o0
3257e3L5m0L6L7j9K6k1K7o6K9K1j1ok4M2N2p2M7m8k1pO4nrJ8j2l4nK6l4M3n0L3
$$ y = [-65, 34, 26, -17, 7, 42, 16, 38, -81, -53, -5, -15, 12, 59, -18, -8, -56, -58, 22, 44, -42, 66, 29, -34, 11, -64, -22, 14, -6, 28, 21, 5, 6, -52, 5, -54, -15, 0, -37, -31, 58, 58, -16, -41, -31, -35, 3, -2, 15, 50, 29, -4, -12, -30, -14, -21, -11, 14, 37, 41, -30, -25, -53, 17, -16, -37, 29, -19, 44, 23, 15, -65, -16, 12, 16, -11, 14, 11, -25, 27, -23, 27, 21, 7, -6, -36, -19, -27, 9, 30, -3, -3, 4, 43, 0, 30, -9, -26, -40, 26, -44, -2, 10, -2, 42, 15, -28, -37, -19, -53, -4, -46, -14, 0, 12, 41, -18, 28, 22, 11, -37, 30, 57, 9, 12, -33, -70, 14, 48, -32, 57, 53, 11, -14, -12, -41, -20, 42, -49, 12, -12, -3, -2, 11, -18, -79, 5, 4, 16, 26, 17, -49, 0, 4, 9, -6, -37, 26, -8, 57, 36, -17, 2, 24, 21, 23, 41, -37, 63, 24, 45, -32, 27, -81, 3, -8, 36, 33, -23, 58, -20, 4, -50, 5, -13, 2, 30, -22, -65, -11, -38, -29, 27, 41, 30, 22, -7, -2, 20, 12, -19, -41, -24, -25, -17, 13, 14, 20, -14, -16, 27, 0, 29, 41, -32, -27, 13, 36, 6, -22, -11, 26, -27, -4, -9, -19, -25, -33, 34, 17, -39, -16, 7, -53, -18, -58, -22, 15, -4, 22, 1, 28, -38, -9, 12, 1, -5, -29, 13, 65, -7, 40, -8, -29, -36, 28, 23, 14, 32, 20, -14, -19, 7, -27, 16, -34, -1]
3290am6N8K3l4m5L9j8M4LJ2mK0k2r1O4m5J4Q2Qj6n2j1l2J0L6o7P3M5o2M3On2L6
3323A8kOj7q1Q1Ql7P4j22O7L8k1n1M3J2K5k8m5pN7Pm9jO5j0m5jrqN6l4M3k7j6
3357a1k1J4MK3n4Q9j6l8k1l5O6l6M6Pn2N0k7L8J5m7j0L1l0l3Q3l7L4p1J20j10
3387b9KPrRJ8%qo1N3M6m0Mj2M5pK2m4J4m9N1j7pPL3j6j0k2k8O2P9r0J9k7l0O3
3422B8k2k7N0Ro6J6J0mJ9l4k3O1k3k4J8L8J4k9KLqk0J2k4j5O4j1L2p2M1Pp9N0
3455gJ1Km7L1j7oN8n4N9k2K8j7m5l0M8K5n9L1j8L1L1Lp2J3k4K7%Q4m0o2O8r2M8
3488a4J6K6k2J1pL4Qn1l0M0m3J2M8l1L%k1Ok7M2l0J1L7Ml4K1K8m1j0k7N4%n2K5
3522a4lkO5p8nlP9n8K3mqk7L5KJ5q5Q6J1Ko4k3J5RM2Kjl3M8on6J5L6Pl4K0j6J0
$$ y = [-1, -47, 11, 34, 0, -45, -6, -24, 20, 23, 35, 31, 51, 29, -62, 2, -43, -29, 53, 61, 45, -7, -18, -50, -40, -4, -71, 2, 47, -15, 28, 34, -18, 18, 16, 22, 5, -76, 5, 13, -24, 50, -72, -5, 33, 12, -39, 4, 16, 41, 13, -32, -39, 18, 25, -24, -25, 40, 30, -15, -16, -25, -33, 23, -11, 32, 5, -11, -32, -18, -14, 9, -45, 44, 28, -10, -31, -66, 0, -36, 10, 17, -35, 15, -12, 26, 41, -6, -16, 15, -15, -48, 35, -2, 32, -39, 81, -29, -27, -20, -29, -20, -2, -2, -10, -71, -18, 28, -12, -8, -20, 25, 18, 40, -4, 10, -39, 12, -5, -12, -5, 28, 12, 2, -20, -48, 14, 93, 3, 22, -5, -35, 28, 6, -21, 29, 38, -28, -12, -2, -6, 13, -21, -44, 17, -6, -30, -12, 26, 40, 11, 13, 16, 8, -12, 0, -24, -39, 25, 14, 46, -26, 15, 22, -57, -7, 4, 6, -41, -10, -27, -33, 25, -29, 30, 8, 36, 19, -26, -56, -8, 17, -42, -11, -29, 2, 33, 36, -36, -23, -47, -20, -20, 64, 24, -38, 30, -62, -14, 2, 28, 6, 17, 10, 44, 52, 1, -29, 11, -32, -20, 28, -3, 0, 0, -21, -15, -42, 0, -30, -19, 18, 22, -12, 9, 37, -4, -14, -41, 13, 13, -39, -14, -17, -19, 46, -32, -37, -40, 39, -19, 4, 0, -8, -35, 0, 2, 17, -68, 18, 29, 31, -33, -56, -41, -32, 10, 12, 11, -22, 26, 20, -36, -21, 15, 22, -12, 8, -8, 2]
3559Bl4K0jj7QK1KJ5l1N8l2m7L0ML5o8P9mp1L3n6QMK0J0QO3o7M8m3Kn2P6o1M8
3594A0nQ6j24J8J3JJ4pl2J3N3p2pRO7j9m9N2po5J6K1Ljm6J16n6j2rO0J1k8jmk8
3629ik6k1P6J1m1K5p3K4J5L8kj6qRQjk0J2N4n1ll9K7j4K3k7OJ9rN0qm3K1K9m9
3664a3lN8l5j9O3m5m7n0Q5ok4R4n9j3m1O5o3N7M4o9J0M8l5k6J2l7J7J5K6klL1
3696C5o9Nl6K9K2O0L1j06L0k8L5j3Nk1O4m2k2ON5Ln0kJ7m0L7N4l0j2k3j7l5O4
3728Fpl1N1K6n4M5m9lL6n2l3J06k8JoK1m3n4N3k6M6m2M7l6J2J4n4O6k3J4%j8O0
3761D5j08NJ8J6L7m3N3m8K7Om2J7N9j7K7n1j14J32K7nm7L0j5j5%jJ2LLm0N7j8
3793A0km1K1k2oK3J4lK0k3K9j5lM7m5j0J3j0K8j0m3L1ll3RoM1k0J9k0k1%K6R1
$$ y = [2, -32, -12, -13, -30, -22, -1, 1, 16, -15, 43, 11, -36, -6, -2, 33, -35, 44, 40, -31, 2, -54, -46, -42, -22, -12, -4, 59, -8, 40, -3, -1, -53, 23, -38, 10, 5, 91, -33, -15, -2, -1, 13, 6, -26, -13, 40, -32, -39, -30, 37, 18, -31, 21, 14, -51, -35, -14, -11, -12, -58, 58, 2, -10, -19, 41, 52, 24, 23, 19, -9, -35, -56, 20, 31, -10, 15, -58, -34, -19, 19, 17, 1, -7, 2, 10, 9, -11, 1, 55, 4, 1, -38, -11, -25, -2, -29, -23, -4, -13, 37, 29, -14, 7, 36, -13, -16, 42, 7, -12, 51, 6, -41, -91, -6, -12, -36, 58, -1, -14, -55, 10, -53, 4, 48, -21, -11, 37, 2, -24, -12, -49, -32, -17, 9, 7, 4, 35, -34, -29, -65, -36, -14, 46, 77, -29, 1, -27, 8, -5, 0, -21, 43, 1, -21, -15, 40, 43, -7, -9, 8, -32, 5, 59, 29, 17, -6, -23, -58, 6, -1, -32, 19, 45, -9, 36, -13, -16, 20, -32, -65, 41, 13, 14, 8, 29, -14, -68, -15, -41, 5, -37, 10, -26, -14, 0, -54, 12, -11, 3, 3, -15, 45, -63, -58, -40, -24, 13, -30, 23, -25, 2, 8, -34, -17, 42, 25, 52, 1, -113, 19, 46, 41, -6, 24, 9, -6, -6, -7, 5, 8, 11, -29, 28, 10, 8, -33, -12, -34, -40, -17, -3, -6, 14, -9, 20, 5, 2, 49, 4, -6, 7, -3, 25, 15, -28, 3, 0, -33, -24, -30, 11, -9, 10, -10, -31, -31, -5, 86]
3827H6q1on6N1L6l0j0J5L9o9pj3N2l1mK2jK4%k6K3jj3N4o6J1Rp6P0j0l5N8J3l1
3861cl4N5l0j9L1K1RL7p8K5M3k1l4lQK5p4N4pm6P6p5K4O6n6L5k1k6L2J0J5n2K9
3894A6k3L8n7qN7m3M3m9K1j4N3o3QM0n2M3oQk5M7j1m6N5m6J3m8J26m9p8O1Kl4
3926b1Nj8N3j5K6j5m1J0k3J4M3N7j49J17l8MJ0j4k0J7QJ5l2J5m6N5Ol7K4Ok0K7
3958B3j4k3k2M1m0J4J3L7o1J3J1k2lN3m2mK6L2m1Mj3Om3k1J07m8k3J9M8n0O6k7
3990A6p9P7L5m9N0l5o1J07q8l0O9qL4j0k2k0nN6n3L2o2O3%L7Jl1n2O8k8rn2P7
4022B8m6l1N0PJKj8L7l0KK7o4N0n9j1Q6n7L9n5j6L3j7J3P4l6k7K8l6M4m1j4L5
4054bl4J0j3L4L8j9l7NQ4m8Lp2N9k0k5O4o7M7Nj1k0omL2j6m2M3J2kj5L4k4OO2
$$ y = [86, 5, -1, -57, -6, 30, 0, -10, 5, 44, -25, -32, -45, 7, -24, -28, -6, -7, 17, 17, -9, 14, 13, 0, 54, -12, -1, 8, -68, 2, -8, -43, 15, 28, -3, -37, 18, -12, -31, 0, 21, 30, 67, -11, 14, 57, 36, 2, -1, 7, 32, -42, 12, 5, -41, 35, -40, -16, 50, -6, 29, 8, -18, 14, 24, 39, -13, 16, -7, 31, -26, -34, 23, -20, 23, -26, -5, -19, 34, -29, -21, 19, -33, 10, 4, 12, -13, 34, 23, -23, 32, -14, -1, -49, 77, 28, -50, 11, 13, -21, -16, -34, 19, 4, 30, 15, -26, -16, -39, -25, 18, 75, -74, 43, 5, 9, 19, 5, -15, 2, 10, 25, -7, 8, -38, 17, 23, -14, 10, 16, -4, 23, 9, -14, -36, 5, -35, -21, -8, 29, -32, -19, -8, -30, -33, 20, -22, -26, 0, 32, -9, -5, -18, -12, -55, -76, 31, -17, -40, -21, 27, -23, 43, 16, -63, 14, 49, 0, 50, 15, -46, 61, -27, -57, 12, 4, 38, 28, 6, -14, -19, 37, -16, 16, -46, 17, 17, 54, 55, 24, -28, 40, 12, 3, -49, 28, -18, -49, 1, 8, 9, 11, -7, 30, 0, 2, 29, -35, 15, -44, -55, 31, -26, 13, -42, -58, -25, -42, -29, 45, 9, -18, 10, -26, 18, -23, -37, -2, -36, -26, -39, -5, 33, 14, -23, -18, 66, 18, 21, -51, 8, -12, -37, 27, -40, 7, 12, 1, -19, -25, -29, 3, -13, -55, -12, 0, -2, -17, 17, -7, -1, 61]
4088F1m8l8%oJ2M7j3K6K8n5m6O3j6l1j3J2oJ6qJ5k6J5K3k2K5L1k5p6O0l2j4oJ02
4121E5o0M7k8l9l6O1j9K6N1lr7L7J0l7M1o9N7j5N7p3QM9k1n9M7M0m2L1kk1j2L1
4153A5j9m7P3m4K8Jn3L8N6k7p3M5j3J8J0J2qK1k4kk6K7j9K4%ll8qN3l4lK6jn6
4187e1L9qL5MK4k1jk2M6Jo8O6m3M6o6J0KOmm7J50j10J2K5l6N2k3rj1l4N2l8L3
4220A1J1K0j0q1k2N7k6L4KKk8PN0m6N1m8N9m0qK5j5M4m2jk8K8K4n0k4M6mL6j8
4253A6NnOj2k2O1m8OpK6Oj2q0P2J1l3NJ9m4M6o4J7M8k4N0p5K7JMj7K3k9M9Pp1
4288c8O9o4j4M2Jj4oJ6K5k0j4j1N7p9J8JL8Rm4M2j2%j3L4Jj2L9k1k5m0k5N3NR7
4322I5p3k0j4K2o5N0J3k2M6Jn9L9k4J9j5l1k4O0L9n6N4o6qL3J4o8P8j3m6O1j7
$$ y = [61, 13, -25, -25, -31, -19, 28, 15, 41, 69, 14, -32, 31, 15, -16, -29, -17, -23, -7, -15, 0, -26, -11, 12, -10, 15, 46, 21, -55, 5, -27, -41, -47, 55, -5, 42, 14, -25, -61, 0, -19, 7, 58, 55, -42, -5, 5, -32, 9, -60, -3, -18, 39, -34, -26, 23, 2, -57, -10, 30, -12, 19, 17, -4, -16, 15, -4, -51, 22, -22, 6, 7, -46, -8, 48, 21, -52, -7, -20, -2, 8, 20, 12, 33, 9, 7, -19, 8, -11, 13, 13, 10, -28, -36, 17, -17, -20, 6, 5, -51, -12, -20, 15, 19, 43, 22, 21, -1, 45, 46, -22, 44, 1, 47, -19, -9, -7, -1, -5, -52, 98, -12, 0, 25, -11, 41, 18, 9, -2, -36, 16, -22, 11, 22, 42, 32, -49, -71, -14, -40, -6, -4, -2, -30, -23, 27, -19, 32, -16, 43, 3, -5, 20, 5, 49, 7, 6, -22, 6, 30, -20, -44, 2, -2, 34, 16, 21, 16, 22, 10, -12, 49, 1, 7, 0, 26, 32, 20, -60, 12, 23, -10, -5, 14, -30, 16, -48, -31, 17, -7, 43, -32, -5, -4, 0, -17, 6, -23, 26, 33, -38, 31, -33, -47, -5, -4, -18, -24, -8, 17, -3, -17, -28, 29, -50, -32, -31, 7, 16, -28, 14, 2, 2, -11, 23, 24, 12, 51, 30, 5, -35, -60, -7, -2, 95, 22, 2, -12, 10, -55, -5, 8, -14, 32, 33, -26, 13, -11, 8, -7, -38, -62, -2, 37, -19, 35, -31, -39, -6, 8, -60, 18, 5, -41, 20, 3]
4353Cj0pK6rN8q4nN9n1L0l5lK3K2j7ML8k7J3m6K3K8Mn2mQ1r0M9l4M8o4k9P2o4
4387e0M1J2q6R7l5M7L7p3j7P7l7j5K6lo5O8%k9l2M3o8J10n0J7l4M0km6M3j2k1
4418a7rM9j3joL3mk0n8oP5J0m6K4pMKjo4O2Qk2K7k6K3j9kL9k5J6k5mj2J5L9m2
4454cnlo2L7N9n4K5qJ9n9M1M0n2k3L4K9p3L0nN1Jm7n5J19p6K0N9prj9l8J8L0k
4488A2Rj9Oo0M2L8Kl5k1RJ4l2L8o9K8N3j9plL9n2j4L4M3Nmk6j9J0l5J6L3K6l2
4522A0M0l1n1K8m8KN0oK9mm9M8lk7K4j5m2PM6m8O6m9M1k1p1R1k4kk3P9p0L5p3
4555f1K8L0p3J16q3K2L9p8L0Q4n5RKnN6q6P6J3J6j20L8N4k5j1jo1N4K6l4L2oN
4587C1j6K9Lm1J5l9k4K5P4o6J3o5L7R1j17O1k0k4J10k9m4l8N1l1jj0N1k1l6K2
$$ y = [3, -7, -14, 12, 3, 61, -23, -28, 31, -20, 10, -25, -28, -5, 17, 0, 4, 42, 15, 28, -18, 5, 33, 37, -15, -19, 62, -28, 21, -13, 35, -29, -58, 14, -50, -9, 3, -83, 14, -21, 26, 63, -10, -27, 50, 13, -2, 24, 21, -44, 24, 24, -5, -37, 6, -62, 48, -2, 15, -19, 21, 19, -27, 16, 4, -17, -26, 23, 10, 9, 3, 36, 32, 12, -46, -52, 23, 33, -13, 11, 4, 8, 10, 9, -55, 7, 15, -7, 20, -6, 17, -2, -4, 35, 10, 26, 1, -3, -15, 0, 39, -3, -8, -11, -73, -36, 23, -31, -6, -14, 5, -54, -13, 27, -25, -48, -14, 15, -58, -28, -33, 18, 19, -28, -83, 36, -40, -20, 39, 32, 23, 4, -34, -16, 14, 12, 21, 2, 8, -52, -10, 28, 30, -5, -26, -17, -3, -35, 3, -66, -38, 15, -4, -11, -14, 25, -27, -41, -7, 36, 41, 37, 11, -8, 2, -33, -17, 16, 42, 10, 50, 19, -32, -4, -52, -50, 0, -6, 23, 19, -30, 18, 15, -12, 12, -3, -45, -38, 8, -40, 26, -23, 18, -3, -74, 17, -7, -9, -32, 47, -23, 12, -61, -33, -3, -76, 40, -43, -21, 18, -60, -30, 54, -1, 8, 10, 5, 61, -25, 51, 64, 80, -40, -2, 52, 27, 16, 15, -46, 8, 34, 0, 32, 26, 31, 15, 44, 47, 6, 21, -18, -42, -17, 57, -9, 4, -61, -24, 67, -50, 11, -9, -33, 77, 48, 4, -34, 17, -14, -15, -25, 26, 5, -31, -9]
4617in7R6o1lN1MJ6k7l7K7j3j2OL1l0Nj8L8j8K7l3J1jj3K9k3M2J1n7L2j3J6o3
4650d6O8K4m2k2L0p6K6M3K8Rm5j8J2ll6P3J2m9K4Kn9N4k9k9KL7M6j00O9j4K2l3
4682b0M7o8pJ13kn7J8j5L8o3M7j9k5K2k2nPL4j9J3L8m8pJ6n0J14p4L0m2qmLJ0
4715el0Q0m2K2l6%J5L9k5l3j3M3k0O4n9OLQk6K3Nm2PpLK8P4o2J1l5LOk3Q7p1L2
4751C0j0m7M6J2l2L0m5j3rL1N1m0Lj9j8N0m8J6j6N5j1lk0k7L4j3OpQl8P0k7k7
4784b8N3n5N0K8o9qN4m2O8n4KkJ7K5o2j3N1qK1m6ML3k6kJ3j2K1n8K9l6N2j7J5
4817bJ5%j3k0nL7K4j6p6P0n8Q9l9jk9mL9k0N0m6L7q1J01n2K2k1Lkmk0M0m2M%J
4852a9l3P3Ll1J0nk6K6L6k8Mn9M4l7Q2qj3k1M6jl2l5k7O3q4P1%m0N2l7K0l5M2
$$ y = [-9, -66, 30, -31, -34, 17, 21, 37, 10, -27, 0, -13, -25, -19, 12, -18, -13, -31, 7, -11, 16, -17, -6, -7, -20, 9, -14, 28, 39, -18, 14, 1, 17, -46, 22, 46, 4, -18, 12, -64, -38, 5, 33, 42, -3, -21, -9, -12, -48, 25, 37, -12, 12, 14, -45, 9, -20, -49, -47, -10, 36, -64, 5, -9, 13, -20, 27, -41, -48, 65, 63, 6, 24, 9, 47, -16, 31, 12, -13, 9, -13, -18, -11, 23, 4, 17, 55, 7, 0, 16, -34, 80, 6, 36, -6, -14, -18, -15, -5, -35, 45, 3, 25, -11, -11, 4, 43, 18, -15, -28, 15, -5, 59, 0, 6, 9, 17, -9, 14, 19, -23, -16, -23, -20, 8, 82, 20, 31, -4, -1, 5, -18, 69, -2, 30, 20, -27, 19, 31, -1, 29, -16, -29, -38, -7, 44, 4, 7, -12, -30, 20, -28, -12, -28, 27, 16, 13, -7, -34, 0, -13, -7, -14, -6, -44, 26, -1, -28, 25, -30, 20, 48, -21, -29, 25, -17, 51, -3, -1, -3, 14, 39, -23, -36, 15, 7, 28, -18, -14, 19, -7, -9, 4, -8, 13, -45, -16, -52, 0, -17, -2, 13, 13, 0, -20, -25, 12, 36, 20, -56, 14, -44, 45, 6, 5, -24, -28, 11, -9, 41, -5, 32, -49, 52, 0, 22, 1, 4, 2, -2, -22, 18, -24, -20, -20, -19, -52, 21, 24, -7, 3, -2, -28, -2, 34, 6, 10, -49, -5, -42, 40, 32, 19, -2, 44, 43, 11, -24, -51, 12, -72, -1, -1, -41, 11, -26, -6, -41, 1]
4885Aj1j2j6N5n8O2p1L9%l4O1k7p3J47q9M2L6l1Ql1k1K5j9J5LL1k7K4k6j1K6n2
4917c4J00n8k5Kj4K7K7k1j0n9R3k2M2p1l3N9L0q4N2qL3o0N3J4m4ln6L9K2J8K3
4948C2p5J8OpJ5m2M2j8M0kqJ4j7k1Rl4l6R9%m0N4j4m2N8l3L4n3J4Pk4M6j2l0K0
4982@J0J6k0m1L4K0k9qQM3m1pNj0O5o3K8Jo5L3J6l1K1O1l8Mk0J3j4j9l0N2K5n9
5016d0Q1p5L9lL8j04J06l0M0m8L7l1m5Q1o3J3k3K6%j7J5pQ6j21J06r6M4l2M0j6
5046Am2K1pO0l1j1L1k9kk2K9Lj6L5k6j2K7M4o9l8K3k6O0k9M1K5m2J2J2k6n2O4
5078HL8p1J6M2p8L3L8j2k8nk9M6l3K2Ml1L8pK5q6O8k3O2l0k6ll9O1m6P8n3kM0
5111A7J8l7J0Rl2N1k5Mj6l5J5L1K3j5j4m7J8L7l7K9kk0J5O9p3P0l5n8K4J1J5M7
$$ y = [1, -10, -22, -38, 17, -41, 21, -50, -11, -11, -45, 16, -11, -84, 63, -26, 16, 52, 21, 29, -2, -23, 2, -17, -2, 1, 32, 5, 29, 3, -8, 18, -34, 66, 8, -17, -15, -29, -2, 25, 4, -6, -65, 28, 6, 48, -23, -56, 3, 33, -51, 1, -7, 26, -34, 19, 33, -11, -14, -70, -31, -9, 9, 32, -43, -25, -19, -26, -11, -53, -11, -29, 11, 9, 1, 15, -2, -23, -14, -48, -84, 15, 15, -25, 29, 15, -27, 31, -2, 32, -21, -7, 0, -24, 22, 10, -20, 0, 10, 26, 6, -35, -1, 19, -10, -18, -10, 33, -8, -15, -10, -20, 45, -18, 10, 11, -54, -21, -5, -36, -15, 46, 8, 12, -8, 5, -9, -28, -58, -6, 19, -40, 41, -34, 5, 2, 40, -64, 42, 12, 52, 4, 41, 10, -35, 46, -17, -4, -27, -1, -1, -18, -3, -10, 76, -45, 61, -35, 9, -23, 17, 1, -41, -20, -27, 33, 2, -9, 22, -7, -9, -31, -2, 1, -15, 20, -6, -18, 9, 53, -16, -54, -31, -57, 3, -26, 15, 40, -2, 10, 22, -4, -56, 8, 46, -25, -9, 33, -45, -12, 26, 14, -14, -19, -48, -2, -35, -13, -9, -40, -2, -9, 16, -70, -2, -25, 37, 7, -19, -22, -61, 0, -46, 32, -21, -23, 17, 35, -2, 8, 17, -15, 36, 11, 15, -1, -36, -21, 10, 33, 18, 4, -43, -25, 12, -25, 4, 2, -18, -3, 66, -7, 63, 28, -30, -6, 5, 20, 67]
5143F7n2m5M0k9N1p2Q5n6L1pk8L8j9J8j7pj2L9L8l7m9O3J9Oj48P9N7l7J2j4J1
5174B5K7p1j6M0n9qJ8K3L3J7l4Q2o0k2Ml5N0qK2l9M1n4L9M0p8M7k2Nl7M7oJ4n9
5207c4J8J1m4K9jJ8k0L0n3L1oj6L7RM3k5Ol4L6l4J5m3O0p0O7Rk8J2j1pn0P3K1
5240D9l4n1JK5Ok5J8j5L9L7j07M3nN0o9L3L6p6R7j7n0J5Lj6Nm5K5J0J3pOk2K4
5273dk9L0JJ0j9L3%lKl7M5m2j4L0k9L2j1J9k1%l8K9J7k4L4K4o5K1oQkJ9K0m2J8
5308Fj8k6NP8r3Q2K9n1l5L4Ln1J6KN7l4k2k7M9l2M6l7k9K0M0l5M6r6L2P2l3l1
5340c3%P6n2N0n3K5K3k5k4j3O4n5J2j6O2j15J18m5JL2mn0N5n0N4Lj11M2J7nJ2
5371epo8PR0q7O5N5q3QN1n4L0J4J5k0l2K4j2N6r0jK4k0L3l0%J3mJ8pMO9k5l1p2
$$ y = [67, 15, -30, 10, -19, 32, -40, 45, -11, 20, 13, -15, 23, 4, 22, 5, -2, -14, 25, 63, 26, -23, 40, 59, 65, -83, -4, 53, 16, 28, 14, 25, 52, -19, -35, 5, -54, -62, -44, -21, 12, 29, -5, 77, 17, -5, -1, -36, 14, 6, 28, -11, 30, -24, 15, 55, -23, 24, 2, 7, -30, 17, 11, 25, -34, -16, -5, -49, -20, -21, -3, -23, 7, -46, -15, -21, -37, 0, 9, 52, 27, 33, -1, 35, 1, 16, -27, 33, -37, 30, 39, 11, 23, 12, 5, -45, 28, 49, 15, -36, -35, -10, -4, -29, -11, -26, 13, 50, -57, -14, -19, 31, -38, -5, 31, -45, 52, 35, -15, 0, 3, -13, -8, -53, -28, -18, -5, -12, -6, -28, -4, -33, -3, -2, 8, -11, 22, 22, 19, 21, -16, 29, -13, -27, 3, -26, 6, -5, 14, -7, -7, -45, -16, 1, -23, 11, 35, -30, -9, -15, -7, -9, 10, 30, -12, 6, -12, -38, -33, 45, -48, 34, 63, 12, -23, 11, 14, -37, -21, -19, 38, 4, -18, -45, 4, -28, 18, -19, -48, -28, 12, -23, 23, -73, -41, 31, -2, -33, -33, 43, -9, 41, -12, 13, 36, 11, -13, -26, 38, -17, -5, -21, 41, -74, 44, -1, 0, 32, 28, -22, 33, -17, 37, 40, -71, -29, -12, -17, -5, -12, -80, -73, 17, -70, -5, 50, -33, -25, 26, -28, 2, 16, 31, 11, -21, 3, -9, 47, -43, -44, -20, -40, -7, -37, -37, -24, -28, -10, -17, -13, 56, 31, 0, -72]
5406g2N7K4j4M6k6oK6o3M8l3K0j6J8j1J8k5RM4l4j4rL7k4J5nk2K8Nk9m6l6R0j6
5439a6J4M1r3N8ljO1l4j3j5l3N8Njl5m4Q0m8N1o0K3L4pJ2l4J9k6Qj8L6m2M3K3
5472D3m8QM1l2k4%ML9o8N3j9J9o1Q6l0p1J4J8K8J9m2j6P1o0J4N5l0l1N2q2K4M5
5504A9m2K3j3lJ4M7l4n4nQ0%l2J9o8N3J0L7r2P0k5l3rL9L2J2l4Nj1l1N8p1J8j3
5537c4j0N3p2K9JN9k3k2L1j6%k4K4J8k4M3o9J6rM5k8L5%m4Ml4L6J0LQL3n8L7j1
5571Gj6LJ5k0K9l1K7k8j8L7k9L0k1M3l6qn7J09m7L3k7p3N1J4nKJ1J8l3J5L4l5
5603fJ3j9mK6kJ0Kl6j9N4o1N1l5J7L5o1J6j1J2pM2n1kN3j4mJ3Rn1M1K9k5k4oL5
5638B0Kp2L0n1P2jMj1K7p0L6j4N2m3J5J6K4L3o2j8m5O0J8j1rJ6m7l7P6J2q2J10
$$ y = [-72, -15, 9, -5, 41, 15, 9, 35, -28, 20, -13, 7, -9, 9, -2, 16, -9, 0, 44, 10, -4, -13, 24, 0, 15, 10, -12, 16, 21, -8, -54, -90, 0, -16, -2, 39, -54, 4, 1, 0, 61, 27, 14, -1, -34, 24, 29, 28, -7, -51, 29, -19, 32, -28, -5, 29, 22, 34, 0, 19, -7, 1, -17, 19, -23, 20, 43, -5, 3, 44, 12, -12, -12, -8, 31, -37, 16, -3, 16, -45, 41, 11, -60, -46, -28, 0, 19, -23, -39, 32, -28, -14, 41, 11, -20, 32, -50, -26, 19, -23, 0, -13, -16, -2, 45, 11, -43, -48, 32, 32, 0, 19, -49, 4, 14, 51, -41, 29, 4, -29, -38, 1, 33, 45, 11, 16, 5, -26, 32, -39, -21, -34, -44, 9, -63, -34, -33, 26, 3, -19, 12, -4, -4, -28, -4, 14, -10, 33, -36, -20, -29, 16, -12, 23, 23, -21, -17, -51, -15, -5, -2, 6, 39, -19, 18, 7, -9, -6, 9, -11, 18, -13, 14, -14, -32, 5, -24, 6, -15, 28, -8, -16, -73, 36, -11, 22, -5, -78, -27, -13, -18, -16, -5, 13, -20, -5, 29, -6, 7, -12, -16, 10, 8, 18, 20, -16, -35, 19, -42, 9, -26, -9, 26, -35, -19, -30, -18, -25, 17, -34, -36, 17, 3, -1, 12, 21, -30, 11, 40, 15, -9, -15, 20, 22, -50, -20, -71, 1, 0, 4, -7, 20, -50, -14, -28, 24, -19, -4, 12, 36, 69, 7, -11, -56, 4, 22, 11, 2, 18, -29, -66, 10, 22, -60, 50]
5670E0m5l9M5N2m8n8L3Lm1N8k4J5L1m0oM3pJl9J0j6J6K9J3m1J5k3ll6P6m7l2O8
5703A3J7p1K0pJ5N2j9K1p6K7Op3RQ4q6N5R%K8p7Q0l9nm5jR6n2J3j7j6M1l0M0M1
5737E3k2l8L8J0k7o1Q5n1M8k7m2K0L5J0K1q0k0O0qk4j1J9k8kJ01p7PM5m9M0m2
5768a7kk5K6LJ8k3m3J18Oq5L0L9l4m0M2%pOl9K6J2j9L5K2Kn8J9l3nL1j1M0m8m
5802a8m3O8l2L2K3j5J6j4j2nqj3K1L3%k7oj1k4M6L5K0o6pN1n8l6M1K7Rn4M4k3
5835fMl2K2K7k5L9q7L8L4K2k3qkR2r8Jqk3J0K1j7LM5rj6k4L0J2L7p7pK7MKj3L9
5871C4ok3LM8j09J15j22O3K4j6j1K5k4l3J0K2J7J2Nl3J5k1K6q4PQ0k4k7J5m7P9
5902B0j1k0pPL1n6J7K0L1l0rm0L1L3KK2l3Rj5qL4o3J8M6m5L6l4L4j4J7o7KL9%
$$ y = [50, 5, -34, 11, 63, 15, -43, -10, -7, -48, 10, -14, 1, 32, -8, -14, 29, 22, 23, -16, -6, -22, -6, 23, 36, -5, 10, -13, -16, -52, 24, -23, -55, 13, 30, -41, -21, -28, -13, 39, 20, 41, -35, -8, -2, -75, -66, 18, -68, -13, -4, -4, 24, -53, 27, -12, -17, -62, -63, 33, -19, -6, -23, -39, 2, -28, 12, 53, 31, -7, 31, 41, 14, -47, 38, -13, 35, 8, -34, -14, 21, 31, 52, -28, -48, 12, 4, -20, -31, -12, -40, -42, 59, -18, -11, 34, -15, 25, -17, -19, -44, -18, -15, 3, -20, -63, 55, 61, -24, 6, 45, 11, -29, 13, 13, 6, 12, -27, -1, 11, -8, 27, 49, 51, -7, 12, -21, -26, 5, -6, 34, -14, -18, -61, 7, -25, 7, 30, 15, 31, 17, 5, 0, -8, -21, 0, 33, 33, 6, 0, -11, -35, 11, 46, 66, 0, -7, 44, -14, -50, -9, 18, 27, -27, 17, -6, -2, -34, -12, 15, -10, 29, -58, -20, 14, 36, 13, 5, 3, 95, -3, -2, -10, -33, -23, -2, -19, -16, 29, 20, 4, -20, 10, 22, 59, -18, -25, 2, 6, 8, -5, 34, 28, 5, 8, 56, -53, 62, -60, 3, 27, 11, 0, 25, 1, -32, -22, 0, 17, 29, 34, 1, 16, -5, 21, -63, -56, 24, 0, -27, -12, -59, 20, 9, -11, -18, -11, 20, -36, -19, 1, 32, 2, -7, -47, -16, 17, 19, 41, 8, 17, 2, -6, 28, -35, -17, 29, -16, 20, -14, 20, 6, 23, -44, -42, -3, -3]
5936cK7j0qJPP%qL0j5m3L0l1K8m3MoJ9k5KQ5k7j8K9j7n3j4J1J3k4Q9n2Qk5L0k4
5972b6j0N7Pm7mJ9J1Mn5N1Ql8P3Kr9L0L9j7kk5L4M9l8L3l7m3K3Qj8N8m0m6M8m8
6006c9K3L7k9L0l7PJ0l9M8nj9ML5po2K6P8p5K7k2JLO6m4o5J7J6j3J2K3kOjM5l2
6041B3p1N6J7j2o3K1L7%m9K1L8n6MJ2kO0k6l6OL7l9K7k3JK9n0pL7mN5j5Ml6N1
6075D7qn5O8j7j5K0l4k1kM8j6Nl3qJ4M0l1K8J5n2l3R1K9j18M2n7R3m2Olk0jl1
6108e1J01o9N0kj6Nm2pJ3j3M2J5m1MMJ0lrN0l1l6OjJ5J5n5LM4kl8K9MqO0n7K6
6144A5jj8K4Nk1kl0QN3j3l9L0jQMj8n5J5O9o7K9om3N1L3m4j7J2J3No0P3k6PJ6
6179In8J6M6M5m7M4r9K3N0J4n4J9j3MP5p5j9J7m3M9n2J17o2j6Lj5L9l8OM6J7k5
$$ y = [-3, 24, 14, 6, 7, 14, 21, 21, 13, 43, 28, -15, 15, -16, 12, -31, -27, -33, -14, -39, -37, 48, 21, 3, 32, 15, -38, -52, -41, -28, -52, 37, -15, -7, -32, -2, -26, -36, 21, 28, -19, -23, -4, 7, 11, -44, 7, 15, -23, 50, 52, -47, -17, 22, 5, 3, -22, 12, 61, 23, 56, 19, -24, -1, 7, -11, 47, 7, -39, 9, -39, -16, 21, -8, 22, -15, -8, 2, -37, 11, 6, -13, -9, 26, 19, -43, -17, 61, -14, 13, -9, -8, -5, 61, 17, -48, -31, -15, -28, -16, 7, 5, 11, 10, 55, 23, -48, 8, 25, 13, -50, -29, 8, 8, -41, -20, 18, -38, -34, -22, -24, 36, 10, -26, -20, 17, -22, 5, -18, -17, 12, -38, -45, -8, -12, 43, 28, 32, -4, 47, 39, -16, 52, 35, 20, 40, 6, -15, -17, 31, 15, 20, -13, -21, -7, 33, 2, 30, 45, -7, -40, 51, 80, -38, 4, -53, 40, -2, 4, 1, -19, -20, -51, 50, -19, 31, 29, 13, 18, -24, -31, -18, -31, 11, 26, -15, -11, -7, 3, 0, -9, 41, 10, -26, -20, -21, -6, 9, -46, -43, 1, -1, -39, -10, -6, -14, 46, -11, 15, 14, -4, 20, 25, 4, 2, -28, -20, 33, 20, -19, 11, 10, 18, 22, 4, -51, -36, 33, -34, -5, -11, -54, -3, 30, -14, -31, -19, -6, -1, -61, 12, -14, -7, 9, -49, -33, 13, 58, 11, 55, -44, -21, 29, 43, -11, 8, -5, -1, 74, -1, -20, -3, -46, 3, -49, 68, 6, -10, -7, -22, 17, -21, -15, 31, 48, 23]
6211B3%m4N0o2M7m1J7J15r4Kk7rK0j0qpRJ1Q0o3j0L0k0k3K4k3j4L0N3r1M7J1m5
6244b2K0j8N5o3K3MjnK1k6mMoQJ9qLj0J1JM9o4m8P0n2L0N4o1K1n6N7J4rl1nP3
6280D8Ln7l6KP8k1j8K3l5J4m5K5K5MkK0m7k6R5o8NRok6KN7l9Q4n2K6n3L8Ok4L9
6315D8n6J5NJ9n6K3OJ5K6l4j3L0j4LJ0k0QL1j1m6ml7Q8j2m4l3N6K9jk5Qk4K6m6
6349c0n2J37j42J74r2K2j4K2q6O0M2o3j4O3jo1L4k8L1Mj6J6L8m5K4m2K4l5M2n5
6379d3M6J6k9%j8J7%l0K5O2n1K2m8L0K3l1Q7j59J06lmmL0J5n2j1k1KK7k3j0L6
6411Gl9P2k2M9r0O1m6j0J0J7NK0n6L8l1k2M4l0N0j0q1N4O9m7m1MN9p9M3M1l7r
6443gJ5LOj3LJ1Mm5kK6m0R2j8q3QrJ8KoM1Ql1N3j1jk6rl3R3j4k3k1pK8l9K5l7
$$ y = [23, 23, -21, 29, -33, 14, -27, -10, 105, 11, 13, -14, -23, -3, -13, -21, -28, -19, -8, 72, 9, -1, 29, 9, -14, 10, -13, -27, 3, 56, -35, 12, 23, -22, -2, -20, 35, -28, -5, -1, -2, -7, 14, -12, -16, -12, -18, -10, 9, 1, 4, -6, 5, 6, 55, -9, -57, 13, -39, -9, 45, -16, 5, -51, 6, 20, 11, -20, -25, 48, 51, -6, -42, -40, 38, 17, -1, 22, -13, 1, -44, -19, 6, 10, 8, 28, -19, -45, 50, -18, -13, -4, -10, -36, -34, 23, -16, 68, 16, 42, -11, 27, 33, 9, 48, -8, 7, 12, 31, -25, -2, 4, 19, 45, 11, -2, 28, 14, 17, 27, 7, 15, 46, 35, -11, -15, -52, 36, 24, -20, -53, 3, 32, 31, 6, 14, -10, 16, -30, -82, 55, -87, 87, -5, 17, 3, 25, -61, -1, 41, -22, -36, 27, 26, -35, -1, -29, 2, 6, -10, 6, 44, -1, 23, -19, 5, -30, 12, -43, 3, 19, -10, -10, -28, -11, -11, -41, -16, 46, -5, 17, -31, -1, 22, -9, 78, -81, 25, 22, 18, 14, 44, 59, 7, -4, -25, -23, 4, -19, -29, 7, -32, 40, 18, 67, -23, 38, -8, -18, -8, 9, 14, 34, -22, 16, -15, -37, 7, -23, 27, 17, -64, -10, 59, 12, -29, -25, 34, -45, -2, 39, 2, -7, 8, 11, 17, 4, 7, 18, 22, -23, -25, 1, -39, 53, 35, -48, -40, -49, -31, -29, -35, 6, 14, -17, 36, 25, 24, -2, -11, -44, 49, 35, 12, -9, -16, 12, -27, -2, -39]
6480c9N0k1L7k2qMJ8j9%k6j6M3J0k9oK5nKpM2l5Q5n7n5M4m1j7M2k3qM6m0K9Pm6
6515c6M4kj6N6j6m1J1pM7n0J6J8k1mj5j2L7j1K0k9l1P8n1n1M4J7K9j6J1p5Q4k
6547B6m1j7J3K3o6L3K4J0qkj1K0j0Rl9Q7o0K5j7J6NkqK4j6Kk0J3k1J1l7N4l6j6
6581c2PML2m0K5rmL1l5M2l7Qjk7P6l1k9l1LK2L2Lm2J0P2j00O1J0M7Rk3r5QM7k4
6616a1J0k0k5R4m0J3k2M6k9m8m9J05n5oN3j0K3Lj2o4R0o8M0k8L5l5j5L3KKj1l6
6648c5J7jOn7Q0O0o7l9PN1rk5J8rm5N1k5J3k4L2m2N8J5l7oj7J3n4Q2JqKj5nJ3
6683an8J0Q5m0j1K1k5k8K5N1ok7J4Pk2N4m0jm8K2k1N8LK9j07L1Oj4j6R7m6k7K9
6716Dl4J04p1l2N6k5J3Rn0M5l0K5j9J1jK7l5j1K4Rj1M4l5j5k6N8rj2l2k7L6j3
$$ y = [-39, 11, -10, 27, 5, -3, 1, 19, 0, 0, -26, -42, 1, 11, -18, -24, 1, -4, -2, -9, 33, -2, 83, 26, -29, 15, -26, -43, -1, -24, -32, 14, -26, 3, 10, -36, 8, 6, -10, 46, 30, -11, 0, -7, 40, -10, 6, 24, 3, -1, -16, -28, 9, -2, 18, -11, -42, 36, -15, -66, -22, -5, 24, 8, 19, -56, 28, 26, -15, -32, -19, 4, -62, -29, -5, 5, -3, -5, -16, 4, -6, 3, -36, 51, -9, 16, -1, 15, 20, 18, 10, 34, 18, 20, 0, 13, -8, 3, -34, 20, -16, -32, -25, -21, 11, -29, -4, -13, -17, 14, -21, 21, -16, -8, -9, -36, 40, 9, -20, -51, -48, -26, 6, 9, -33, -23, 49, -51, 10, 20, 67, 76, 53, -42, -34, 13, -11, -1, -21, -46, 48, 8, 21, -1, 45, 16, -32, -81, 24, -31, -37, 16, 6, 29, 32, 20, -44, 46, -22, 18, -10, 25, -10, -25, 8, 10, 12, 1, -35, -18, -19, -13, -70, 10, 70, 3, -36, -29, 22, 13, -12, 6, -3, -48, 3, -22, -9, -33, -1, -43, 15, 30, -7, -13, -30, -17, -71, 11, 12, 4, 6, -9, -14, -1, -59, -49, 36, -4, -15, 6, -19, -47, -22, 29, 23, -4, 10, 17, -5, 49, 9, 8, -40, -18, -39, 19, 22, 51, -56, -25, -19, -33, -49, 48, 2, -25, 4, -30, 74, 3, -29, 27, 2, 15, 24, -26, 19, -11, 14, -5, 6, 5, 32, -3, -14, 10, 19, 8, 52, 17, 2, -24, 34, 25, 13, -19, -46, -10, -23]
6748b3Pl4O4q1L9pL5q4O7P0q4j6O0J4k6pJ8m7jO7LL7j06K8j3R1o7k9M8k5l5P1
6780C4j7Mm3NO3n9K%lK2K7j3Rk6m3J2L3no5J1K9L7pl7O7o4L4k2O4l2k2P3q0mJ2
6815dK0lm1J6M8Rl7l0L4L2m4ll4J5K6N4r8K3M8p9L0J6k3K4j1M4m3m4J3J8j1O1
6847B6m5oJ3mJ0k0P0pj2j6K9m3L9k1N1m8ll3J8l3R0j7l5J4o3NKL7n1Q5o5j8J9
6880c2J3J6j2L2j0qM3o0N5l3n7K5L1k6QL3m0L5l7M3k0L2k0Rk0ML4n8K6M6r2M1
6912AJk6J3n7M2j1N5k5K3J0k2j2lLnj7L0k3lPM6n5Q3r1PN7K9r8mP8j5q4J6N3k8
6947b5Jo2P6K0rJ0K1l2j1qKJk4M8j9j7J0L3J4Om4K8n1J4J5K9n8P1n8lj4J1RPM6
6982C7o8K6L7o1J1L2J6m1J9O8q3l1N0J4m0NP0r2N5l0K7k3L5o0Lk5J10o8J8M7o9
$$ y = [-23, -16, -50, 14, -67, -28, -35, 0, -84, -17, 53, -31, -47, 13, 27, 1, -6, 12, -35, -36, 31, 34, 71, -35, -7, -20, 71, 4, -25, 23, -2, -37, 34, 17, 21, -22, -17, 46, -13, -11, -11, -14, 8, 35, 22, 31, 5, -38, -26, 7, 2, -63, -52, -23, 14, 7, -30, 37, -27, 7, -15, 49, 17, -5, 68, -12, -16, -4, 16, 13, -28, -12, 36, 45, 8, -22, 12, 44, 0, -3, -37, -22, 4, 58, -40, -17, 31, -48, -18, -2, -25, -1, -12, 32, -11, -55, -42, -24, -35, 26, -19, -25, -12, -16, -6, -26, 44, 37, 25, 9, 38, -5, 34, 13, 64, 16, 13, -20, -2, -35, 55, 38, 3, 17, -46, -41, -39, -2, -53, 32, -33, -51, -32, -19, -3, -15, 17, 7, -1, 42, -18, 37, 4, -53, -28, 3, -23, -15, 18, -22, 13, -24, 19, -1, 31, 11, 20, 0, 4, 38, -20, 6, 52, -40, 1, 2, -24, -11, -68, -26, -37, 18, -7, 16, 26, 4, -8, -11, -8, -13, -30, 0, -23, -26, -19, 27, -28, 55, -36, -29, 28, 57, -41, -45, 33, 18, -66, -50, 3, -25, -24, -86, -10, 10, 1, 11, 32, 0, -11, -19, -17, -16, -40, 8, -11, -28, -18, 15, 29, 35, -9, 19, -32, -18, -3, 26, -32, 39, -19, -22, -36, -25, -16, -9, 37, -31, -5, 32, -29, -18, 14, 30, -11, 8, 76, -7, -38, 12, 26, -14, -9, 61, -31, 24, -6, 21, -2, 33, -27, -24, -49, 61, -7, 11, 58, -11]
7013a1nK4m4Q1j6J0p9Ljl3O5PrM8l6Jk7NJ2O2o9omL7l2N6o4j0L1qLOK1Lm1N2n9
7050b7K5Jj6J5J9j5m4O7l4l4N4pJ3mJk5K7L2o0J6k5M7o3P9l3j7k9L3kmk7L8pL2
7084B6r5N3L6on7N4l8j5R0j05N4j6N3m0qL2L2o3j4k7O0k2L1L9q5N8k1p3N9k9N2
7115A5m6j3K0L5J1MK4k6m1pOL8Ln2j1NRM9j2l8J3mJ0k3q3J38m2k2M2j8j1RN3n5
7149b0K1lO2n6ql6jM4L0j9k7K3m2N7Nk9l4N2n1rL3jK2k7L0j5o4M2j4O9m6K9j8
7182al8K7j0RJ9J2n0J9lJ5PqJ8kmJ7k1qLj3k5L5m2pJ9M1K1Or8O1K6Kl5J5l5JJ6
7219a1l4P2p2J5L3J8j1Kl2J3K9l0M2l9j1O1k8m5K4p2O4M0J1L2o2O7q1M4n6N6l9
7250@l2jJ4%l7N2K3m7l5P2l2NO1o5N4m2M3k4J4l6mL9o9O0n1P4l4PL6l7m0njN2
$$ y = [-11, -16, 8, -36, 45, 29, 39, -40, -37, -38, -71, -6, 1, -8, 40, 4, 5, -22, -17, -5, 57, -12, -18, -22, 15, -17, 39, -25, -35, -4, -12, -9, -3, 18, 21, -20, 32, -27, -2, -1, -17, -2, 17, 2, -42, 25, -9, -43, 11, 4, 17, 13, 14, -11, 16, 48, -12, 4, -21, 26, -37, 42, 9, -8, -37, -4, -6, -10, -37, 1, -6, 26, -69, -16, 20, 14, -43, 11, -27, -42, 48, -57, -3, -19, 34, -6, -14, 18, 50, -13, -27, -54, 6, -16, 15, 54, -31, 27, 6, -67, -8, -37, 15, -31, -44, -24, 11, 22, 26, 50, 24, -17, -24, -18, 20, 23, -29, -40, -35, -26, 23, 11, -27, -14, -18, -8, -31, -114, 24, -18, -40, 2, -16, -27, -18, 35, -20, 1, -2, 60, 4, -4, -40, -41, 3, 33, 14, -13, 10, -32, 25, 30, 1, -33, 19, -32, -41, -8, -9, 13, -14, 16, 1, -63, -21, -35, 34, -12, 17, -1, -39, -12, -22, -13, 6, 18, -32, -13, -16, -1, 6, -2, 16, 14, 10, 27, 6, -2, 1, -12, -37, -2, -44, -51, -32, 9, 30, 36, -62, -1, 25, 27, -8, 7, -28, -27, -11, -45, 27, -45, -30, 3, 21, 10, 12, -20, -7, 22, -8, 34, -5, -16, 45, 17, -28, -4, -76, -12, 28, 39, 71, 9, 76, -5, 39, -17, 39, 0, -32, -33, -19, -19, -56, -4, 19, -28, -63, 9, -23, -18, 43, -22, 32, -10, 33, 9, 23, -13, -17, 22, -47, 13, -38, 36, 2, 9, 45, 8, -32, -37, -38, 14]
7284A4k1K2p5P2j0l1J1nLj9lM2lj4j3qN8k3K0o0O3q7O3J0Jk0K6rK5n4l5J6K4P7
7318E7j20M4qP3r5R5o2J5NM2k6k3K7q1L9k6LO0J6n5%L6l1L8No3L6m7N5j9k8K8
7350a0K9p8K3K5J4m1L4N2q5M5J2J7l1Oj1N0n4j6J6N1q4O2M1o3l8M9j2JJ1ol3N8
7382C4k5j5Mn4MP2k4M1n3M8k0pM8o2N4o4n2N1j0J1L1k7J8J0J9l9J9n4N5M0k9j4
7414A0j0m0J8N6n6J5j9NM7o3J9M2J1o0L5l2LJ0Mj0j0MM6k9j1O1k7l8Kj7K1J5p5
7447g3O1k7Q4m2Qpk1J5L4j5l2J4k1L8m8K8k3L6L9p9m4P7K3l5J8Ml9L1l8K6l2P4
7479C4Mo1P5m8pL1MJ6n8J8qL3j3n3N4p0RJ13m7j9K0PJ8o2M2m6rk5N0j3K4J9m8
7512a6l8O1J1n4jJ8M4l0JM5r1O3k7rK4qM0l8k4j2L7Nl3j0M5j0m5L1M7m3kL9o3
$$ y = [14, -7, 15, -60, 12, 2, -29, -18, -23, -20, -39, -42, 0, -3, -17, -30, -38, 20, -3, 17, -43, 20, -67, -4, 6, 7, -13, 13, 4, 29, -25, -60, -44, -20, 57, -63, -19, -27, 46, -49, 46, -16, -1, 4, 46, 20, -3, 24, -57, -18, -44, -41, 19, 35, -20, -20, 16, -15, 23, 28, -35, 1, -46, 9, -10, -38, -10, 19, -59, -36, -11, 3, -38, -4, 48, -37, 8, 20, 37, 6, 12, 1, 51, -3, -19, -3, 48, -36, 26, 67, 4, -34, 15, 3, 4, 15, 9, -24, 34, 9, -6, -2, -56, -52, 20, -4, 37, -16, 32, 12, 5, 53, -9, 45, -19, -71, -20, -30, -19, 12, -15, 3, 13, 32, -7, 12, -42, 13, 53, 24, 10, 0, -40, -22, 34, -22, -7, -26, -21, 26, -37, -18, 24, 35, -25, 10, -22, -19, -9, -5, -15, -25, -21, 25, -4, -15, 46, 19, -19, -17, -34, -13, 2, -73, -12, -39, 45, 3, 11, 4, -17, -2, 32, 17, -15, -1, -22, 16, -32, -4, -27, 9, 48, -31, -75, 2, 25, -10, 8, 12, -27, 4, -34, -8, -40, 34, 38, -23, 52, 4, -3, 28, 32, 48, -10, 8, 0, 33, 20, -33, 21, -49, -40, 73, 26, 7, 27, 34, 52, -10, 32, -14, -23, -48, 2, -11, 13, 32, -16, -54, 7, 18, -36, -37, -19, 25, -5, -4, 41, -50, 13, -14, -23, 1, -7, 33, -5, -29, -41, -4, 1, -32, -42, 3, -7, -52, -21, 26, -17, -19, 20, -43]
7545d3K3MRJ0l1K0K0nL8m1qM3JJ3m7l7NO2k7Nkj1J5L9l1k6K2M4n0J0j8J1K8m8
7579cQok3K5kJ0M5n8pN4p3N5nl1M0n7K3J3k6L1PJ4m7k2L0l3PJ9KJ2J8m1K7m6N3
7614A3Prj0j2N2n6K6m8J8%j2kN6l5Jj0L2pp1Q9k0k0OL2n4M2o7QJ6P9n1k9M3j5
7648hM2n4Q9j11M1L9n9O0m1RPm2M9L5m1m1O1K1J7q6K7r2L9OL4Kk3P2k5l2j1m5
7680f1L5m3M0O4m1j1O4n4mn1R8o0M6Rm3K1l4rN1l4K4N8p5J0mJ7K5o7LK9m2R0r1
7713d0j8jL5J9K2k6Kj4J6nj6J9j9L0K8rL6o8L9n3N2l8J2k8M1j1M9m2p2K2O3k0
7745Ek4j4NL3rm2O4rj6L7m6JL6l5J0loL2J1n4OoMO4l9qJ3n2M7L4o2M4kJ6p3O0
7781B2k0l8L0k9L4j8O9m7l4O9l0J4lp6M8L2l6K9Mm0ML1mj8j0O4k9o4J1P3m6j8
$$ y = [-43, -20, -16, -7, 3, -28, -8, 12, 7, 45, 4, -4, 39, 40, 53, 6, -31, -26, 36, 9, 14, 12, 1, 16, 55, 24, -2, 20, 64, 14, 24, 6, 17, 45, -3, 5, -1, -24, 1, -1, 9, 54, -4, -11, 43, -30, 25, 20, -11, 29, -28, -5, 8, -18, 13, 20, 34, -13, -35, -5, -38, -31, -12, -10, 2, 20, -21, 6, -40, 13, 20, 11, 1, -11, 41, -15, 11, -37, -19, -19, -31, -33, 23, -12, -11, -21, 11, 4, -67, 22, 2, -18, -12, 20, -34, 8, -59, -51, -35, 44, -7, -36, 7, -8, 34, -20, 69, -42, -1, 38, -21, 39, -2, 7, 14, -28, 21, 56, 15, -26, 35, 56, 73, -13, 14, -78, -39, -33, 1, 3, -20, 52, 27, -5, -16, -61, -26, -69, -29, 35, -6, -17, 47, -7, -11, -62, 36, -24, 22, 31, -12, 9, -25, -34, 17, -17, 7, 65, -10, 0, -4, 13, 38, -29, -26, 3, -39, 51, -40, -58, -59, -24, -5, 17, -9, -7, -21, -5, -10, -26, -7, -26, 4, 32, 23, 59, -9, 30, -23, 29, -9, 3, -25, 16, 5, 54, 12, -60, -38, 25, 5, -19, -33, -28, 5, -4, -46, 18, 9, -7, 30, -16, -15, 21, -14, -4, -7, -13, 19, 30, -24, -18, -24, -20, 44, 5, -3, 10, -42, 5, 39, -23, 21, 19, 35, -38, 22, 2, -36, -6, -35, -1, -19, 50, 3, -31, 38, 8, 22, 19, -57, -9, 23, -13, 16, 20, -20, -16, 15, 11, -7, -17, 47, 18, -46, -35, 38, -8, -26]
7813b6P1o8N0j7j5J3K7j1k6j4NJ2K2p0L8j4J6L4m3J0j0K2n5O6j15Q4pJ5oRn2M1
7845a4Ll2O6j7k6J1M9l9j6j5P9Or5MO3k4J4K2j04P1k4Ok7K4ML1k4L1pm3rnM3m4
7879c8O0pjo1L2k3L2K9nl6L9qo5L1j9N2J3o8M4k0PJ4L4p6M2k4PM1m8j9K0J5KP
7913CnL0l1j2O0o2JlJM7j9k2J7j8L7k3n5M3Jn8J01n1mN4l7rL1L9p6pK6Po8R4k4
7948Hj0kRrK7j8L6m3J4l7onJ1L0L9l5k7j2K5kk0L5j9q3O5K7j3M5m1J0L3l3k7K
7982b6jJ2Nlk4J9MJ0pK7j6M7q3k5Q8nmj4j1K4M0qj8l7LM1k1oj8jKK8k5m0L3k0
8018c0N0ojJ0J3n0K4j6L5n8M5o6M3j2kk7N5Jk2LJ2j4lJ8j3K8j7NK0j0l8L6n4L3
8052hpM5l7MM4Jk6n2NO3lk2L1j9o1K6jJ1K6J4n6KPJ1N1k6k1l8N9j3m5O3k5Mk0
$$ y = [-26, 45, -23, 27, 10, -5, 8, 35, 24, -2, -16, -11, 1, 23, -47, -9, -23, -7, 27, -16, -6, -16, 6, -49, 17, -98, -14, -21, -6, -12, -3, -55, -14, -11, -43, 23, 6, -20, -9, 40, 1, -15, -30, 49, 55, -40, -36, 27, 3, 17, 39, -65, 6, -18, -12, -39, -15, -11, 20, -4, 27, 20, -23, -32, -37, 6, -38, 22, 15, 14, -47, -15, -38, -6, 23, 18, -18, 21, 13, -52, -21, -40, 12, 25, -43, 1, -19, -12, 2, 36, -40, 2, -22, -15, 26, -22, -41, -21, -6, -4, 3, -2, 28, -3, -15, 45, -17, -16, -19, -18, 29, 10, -12, 5, -13, 24, 1, -54, -11, -10, -68, 33, -18, -22, 32, -5, -14, 17, 56, -20, -27, -1, 6, -62, 32, 8, -2, -4, 5, -4, 23, 5, 41, -2, 12, -25, -31, -36, -25, 5, 44, 9, -18, -30, -5, -7, -27, 8, -11, -94, -29, -2, -15, 30, -11, -1, 32, -1, -28, -26, -27, -15, -10, -13, -37, -18, -14, -4, -11, 16, 0, 47, -36, -61, 27, 22, 18, 4, -7, 17, 57, 49, 31, -6, -3, 38, 17, 11, -7, -8, -6, 22, -3, -43, -10, -30, 20, 14, 13, 23, 36, -14, 10, -6, 29, -29, 16, -50, -7, -19, -21, -48, 7, 8, -14, -11, 1, -13, -16, 2, -11, 17, 0, 5, 25, 15, -23, 13, -41, -8, -15, 30, -7, -3, 41, 42, 16, -36, -31, 32, 29, 7, 38, 19, -42, -16, -17, -6, 20, 34, -22, -20, -13, -2, 49, 23, 2, -36, 23, 10, -35, 28, 3, 7, -13]
8087a3J5j6R5o7JK0k6r1K9L3Qn5J16j3n0N0j6n9N7j0k4M9j2K5m1j1k6J6J2orM9
8119C0l7K4J2M1m5m0m5O8j7J2l5O7n9K3l7K8J7j2K6j1l9M2o6P5m7K3k4K2J3j5
8149fK9rk2n3P8p1N4K1o7N3m3M3n3M3nN8j3r5J5kM9l2k7M7l9K2K5k7mJ1L5o7K4
8182b8M1j1j5J1j6K0M5l5k5
$$ y = [-13, 2, -14, 81, 14, 15, 35, 9, -82, -53, -20, -12, -67, 49, 36, -14, 36, 20, -39, 18, 8, -16, 33, 21, 46, 5, -6, -32, -16, -4, -10, -19, 30, -7, 17, 29, 70, 25, -15, -60, 8, -9, 3, -32, 35, -24, -1, -38, -10, 7, -5, 21, 10, -29, 13, -53, 22, -25, -2, -26, -4, 9, -6, 23, 14, -8, -61, 17, -54, 0, 21, -46, 7, -36, 7, -46, -3, -8, 50, 37, -58, -43, -45, 4, -28, -55, -8, -47, -25, 0, -27, -31, -20, 15, -52, -28, 13, 2, -13, -2, -18, 2, 47, 12, -13]
8191a3
$$ Imaginary data points
##PAGE= N=2
##DATA TABLE= (X++(I..I)), XYDATA
0@%%%%%%%%%%%%%%%%%%%Nj1J4j6J6j6J6k2L0l2L2l7M5n2N8o6P4q2R1j00J14j28
41f7J41j56J72j89K07k28K55k79L04l38L74m14M58n04N58o20O94p81Q81j004J157
62F21j355J616j983K537l454N253j0052M7309J61033J7585l9450j03114j86830
75a10284j20847K5223P1924J26880J73529O7099o8155r6452j37565j45134j0578
86b24360J02803J08547J33735J07241m1132j27152j09921j14680n9199Q5472J38379
97b67J02721Q9052R889j19867j35426q4376n6059L6296J41419J20901N8857K0837
109A83977p5504j50318r7555k8610J4526J03743J43892O7238k400m6789j21229
120i029j25075l2402L1466P2207J26644R7039k968n6070q8771j19235o2083L6360
$$ y = [0, 0, 0, 0, 0, 0, 0, 0, 0, 0, 0, 0, 0, 0, 0, 0, 0, 0, 0, 0, 5, -6, 8, -8, 8, -8, 8, -14, 16, -16, 16, -21, 24, -28, 30, -36, 38, -44, 47, -53, 61, -67, 74, -82, 90, -99, 108, -120, 135, -144, 160, -178, 196, -218, 240, -264, 294, -326, 368, -413, 468, -536, 621, -734, 882, -1101, 1436, -2018, 3235, -6817, 40492, 201525, 219110, 179660, 76546, -110284, -231131, -205908, -133984, -7104, 166425, 233524, 165369, 68917, -68648, -213782, -224360, -121557, -13010, 120725, 227966, 186834, 59682, -50239, -164919, -224118, -138646, -267, 102454, 191506, 201395, 81528, -53898, -138274, -194333, -158037, -16618, 104283, 163140, 183977, 108473, -41845, -139400, -168010, -153484, -49741, 94151, 161389, 158989, 112200, -9029, -134104, -166506, -135040, -62833, 63811, 160850, 157882, 101812, 13041, -106194, -168277, -131917]
132a31917P5234R5890J01964K5473o4206q7181r3644p5733J1643Q5015R0526Q2284
144A15348M4300m5032r7711q6029o3939j1122P1517J00928P3670L9430k0970r0069
156C0321r5906n5479j2809M8389R8804Q2912L3025j4107o9678r8373o3668q435
168a25004L8490Q2831Q9214M0604j5997n8311q7306p2696j5201L8181P1686Q3087
180F9578N1085r624n6516p8145p1237k6353L2367O8969P6669N3171J196n0798
192F0362p5832o8362l0891K2512O4101P5504N3454P078m2092p1411o9156l4062
204a08795J6676N6613P2189N7126J1985l7398o4662o6910m0744J0661N3830O6539
216B7110N6361K1162l1850o3896o1948m2038l42M9875O7194N1742K5105j9887
$$ y = [-131917, -56683, 39207, 141171, 166644, 102438, 15257, -78387, -154120, -142477, -57462, 33064, 115348, 159648, 114616, 16905, -69124, -133063, -144185, -72668, 28260, 101930, 141360, 120390, 30321, -65585, -121064, -133873, -85484, 13320, 96232, 129257, 115150, 45472, -52901, -116569, -125004, -86514, -3683, 85531, 126135, 110138, 51827, -35479, -108175, -123376, -85195, -13509, 69578, 120663, 111039, 54523, -23622, -94859, -121212, -88845, -19876, 56793, 109964, 111160, 60362, -15470, -83832, -114723, -92211, -28110, 47394, 100848, 107926, 65834, -5577, -74733, -108795, -92119, -35506, 36683, 93809, 105794, 68396, 3734, -63176, -103920, -93259, -39429, 27110, 83471, 104633, 72783, 8887, -53061, -95099, -95441, -45566, 21628, 73370, 98475, 78588]
228G8588o3172o3832l7094p114L7534P0315N4378J9776j0520n1464p0642m0052
240h3299j986K6373O0804O4324K1908j4700l8594o5044n2309j857K8989M6456
252h935O3512L6265j7847l9964m9710n6394j7188L4874M6507M8700M4503l149
264H1174m8040m7929m3716k9606K3085N6389M4246L5213J3098m0664n9504l6397
276e2651k3535L735N3472N7132K5573J0709j9745o1342m9180j2839K087L3734
288c2850O3604L6596n39j3623m4000o0725k0932J3721K3265M9891N2403M121k5178
301D5754l0431n1197l9675J2651L3641L4677M7986K3614k7702l8542l5449m0940
313f5613o068M0097L9610L2565L0657j1096m8392l7182k6838j7872K6419N2068
$$ y = [78588, 15416, -48416, -85510, -92624, -55090, 15225, 69603, 89379, 78859, 27395, -43247, -83299, -85285, -58912, 1892, 66216, 88124, 73424, 34830, -30214, -82523, -84380, -55391, -8935, 54577, 90842, 72995, 33031, -16679, -73073, -90261, -55387, -8880, 39820, 84323, 81174, 33134, -14795, -58511, -88117, -65032, -8643, 35603, 70816, 83914, 43250, -16254, -52651, -76186, -72451, -18979, 38153, 63726, 74435, 54690, -6652, -55832, -68671, -66584, -32850, 30754, 67350, 66811, 53188, 9188, -51537, -72469, -58748, -35483, 14408, 66811, 70932, 45754, 15323, -35874, -75549, -62898, -29257, 5420, 53406, 77020, 49318, 10776, -24673, -65613, -71681, -31584, 8026, 40591, 71248, 60152, 11760, -25422, -52260, -70132, -43713, 8355]
325H355L1481J9025M031l8937n1141k2857r654R275M7749M5480J2454j45k1115
338C4001n1930l6326j023R636L0503N1285K4140j0064j7693l6763m6437j0136
350f0807J9967K3910L9441L7258m135k7685k7614l8301k5475J7516L2831K8659
362A5565L3747J1807k8736l4958k7042k6251K298L7234L3893K2780J6558j5357
374D1538m1970l0144j6375n742K6459M2809K3788Q709n237l4464m0130j5470r0
387d6319J4966L8997L4036O048q342k2826l9830k5275L755J5703K8254L6893J4795
400E0855j2834k1623l0615l0902l540K0668K5490K9797K2356p394k6483k6871
412a1096k6351j2021J7008K9901K5784K0300J348k4620l0715k2520j2444R004
$$ y = [8355, 39836, 58861, 62892, 23955, -27186, -50043, -59697, -50422, -2673, 42807, 55261, 55116, 34001, -17929, -54255, -55278, -45642, -15139, 36146, 60286, 50222, 32529, -4234, -50671, -60807, -40840, -16930, 22511, 59769, 55634, 27949, 335, -37966, -63441, -45925, -13094, 15565, 49312, 61119, 32383, -2575, -29617, -55868, -53570, -16336, 17557, 40337, 56895, 41538, -432, -30576, -46951, -52693, -26234, 16575, 40363, 49072, 43835, 9371, -30759, -46229, -46319, -31353, 7644, 41680, 47728, 39386, 16560, -23270, -48545, -44790, -29087, -833, 36060, 50855, 38021, 16398, -14217, -45119, -48659, -27991, -2501, 27296, 49652, 42258, 15775, -11096, -37447, -49468, -32460, -2559, 23225, 43525, 44873, 20253, -10462, -32982, -45426, -36422]
424c6422K9783K9008J6926L483j7560l2056k5066j0092N784K4108L1257J9224
436C8377K074j4002k7915k7824j2008N867K0839K8974K1977L887j3290k5053k6934
449b5031j5010M122J9629K6918K2318O928j1422k4194k5979j5636J209J7406K6518
462G776K2629P700q908k1614k6323j7064N66J5059K4020K3916R706q365j9185
475I913k4356j9617j601J5066K1342K2720J3641o722j9898k1336j9160o539J3965
488b2582K2578J9439J4323j003k0010k2728j5951q549Q409K3994K0634J1175K442
501C2171j4837k5733j6667n579L479J9902K5133J1149j62q945k3094k2175m614
514b9972N417J3254K4449J7141k272r748j6260k3565j0602Q631J2878J7786K0785
$$ y = [-36422, -6639, 22369, 39295, 42778, 25218, -6838, -31904, -41996, -36212, -12104, 19153, 38377, 40451, 26449, -1466, -29290, -41298, -35431, -14592, 14382, 36359, 40246, 26956, 1903, -25031, -40041, -35919, -16290, 10628, 32946, 39874, 28452, 4258, -21721, -37357, -36148, -18742, 7776, 30405, 38105, 29197, 7583, -18740, -35804, -35238, -20179, 3841, 27757, 37463, 29098, 9913, -14443, -34060, -35661, -20595, 747, 23467, 37108, 30386, 10488, -10848, -30008, -36547, -22582, -4, 19435, 33758, 32755, 12745, -9983, -25934, -34483, -26074, -2080, 18554, 29729, 32171, 17334, -8399, -25066, -30645, -27166, -7264, 17869, 29018, 28856, 19911, -3183, -25358, -29972, -24555, -11301, 13148, 30289, 28017, 18269, 2009, -21556, -32158, -23527, -10649, 7137, 27922]
527B7922L090j3926j4637j7735j6174M364J7935J4772J6190J0417j1591j9856
539G71j3500j3321l949J7400J9965J1096R547k911k1537j8103p575n138R120K3658
553E523J4582L594M79j4368k3753r660P46L866J8059K1683M000m730p659k0213
567g851j7652K008Q070J0436K0568J2205p661j0531j2199j9129n685J2532J1693
580c196J2736J6064r71j6039j1850j2146j1690P450J8101J0806J0369O359j2900
593A3093j8374q757p753r37J6997J7254N844M505m343j9575j4412k635q89Q911
607a1071K0348J0530r34k445j2582j9300n953M466N559J4743J6727Q52p522p844
621E574j5555j2690M095R753R383J4933P746q543j1151r872j2944k516J2183J1546
$$ y = [27922, 31012, 17086, 2449, -15286, -31460, -27096, -9161, 5611, 21801, 32218, 20627, 771, -12729, -26050, -29999, -12599, 7366, 18462, 28009, 25098, 3561, -14542, -22117, -27255, -18135, 5523, 20105, 23699, 24178, 9810, -13943, -23603, -22857, -18991, -932, 20751, 24751, 20021, 12362, -7851, -25503, -23495, -15425, -4989, 15579, 27784, 20123, 9592, -2607, -21736, -27421, -14889, -3196, 9540, 25604, 24633, 8594, -3256, -15402, -27092, -19642, -1541, 9265, 19634, 25993, 13093, -5281, -14038, -21791, -22728, -5731, 11523, 17367, 21872, 17529, -2046, -16458, -19093, -19982, -11071, 9277, 19807, 18873, 16428, 3846, -15454, -21407, -16941, -11382, 3361, 20088, 20940, 13418, 5574, -9981, -22671, -18576, -8823, 560, 15493, 23239, 14696, 3545, -6327, -19271, -21787, -9604, 1942]
635A942R486R748k785j4604j0949q004n828P568J5487R511N813J592j1455j5233
649g711p028l097K691J3871J3615M218ko359j5019j1032j024L116R220J4712P637
664A7808k170n950j1053j3035l743N227Q058J1685J0400l36p737r352j1232o924
678a8354M064R675R819R486L007p157j0710r391o932R00R595J0819Q154L692m611
693A2056j0907j0107o028k45P464J1423Q627L313l116r513j0861o567k75O132
707h604J0434R481M002k757q489j0247p401j247N633R827R262M803j723q036j0125
722e187p224j909M314R595R425M643q18o559j0381p841j667L293Q307J0108N378
737A3477j187n311r205r152k318L895O616R336P349q82o018p361q752m713M008
$$ y = [1942, 11428, 21176, 18391, 3787, -7162, -15166, -20994, -13426, 2061, 11572, 17385, 18977, 7522, -7711, -14739, -17836, -15145, -1274, 12341, 16559, 16557, 10198, -4821, -15853, -16877, -13761, -4541, 10171, 17808, 15638, 9688, -1365, -14400, -18143, -12916, -4858, 6827, 17227, 16891, 9154, -198, -11430, -18354, -14290, -4615, 5204, 14690, 17697, 10540, -170, -9561, -16493, -15593, -5998, 4821, 12975, 16667, 12056, 1149, -8958, -14986, -15231, -7767, 3656, 12283, 15596, 12480, 2967, -7894, -14461, -14736, -8604, 1830, 11311, 15313, 12556, 4067, -6180, -13581, -14828, -9195, 632, 9894, 14697, 12974, 4938, -5187, -12411, -14320, -10006, -411, 9014, 13657, 12839, 6280, -4101, -11942, -13609, -10316, -2009, 8099, 13477, 12290, 6979, -2226, -11378, -13696, -9801, -3185, 6151, 13500, 12618, 6600, -761, -9513, -14226, -10218]
752a0218P280P309P593J769o709p860o660n783J453Q684P483N380L670m382r898
767h89o377l854j095O931R963M699J980j221q892r192k535j06L469R932P564J47
783A0524j628n181j0251n204K275L033O429R613K349m298l992p160q250P19N887
798e135M488P273O091l622o915m491o772l511O320P108M060N714O48q243o709
813c696l274m187K259R406N584K118K414m724r726l954r27n15O798R223J930l88
829H341j337q077p823O4J731K901Q659N819k228k664m120q526l463M095L432M914
845A718P698O69n524l767n282o079J950O457L780M987M117m334o796l408m336
860h150j776O282O527K550L322m50p527n798j645j941K698Q107M449N46M89m453
$$ y = [-10218, -2938, 4371, 11964, 13733, 7024, -836, -7496, -13279, -11826, -3142, 4341, 9721, 13391, 9009, -889, -7266, -11120, -12215, -5284, 4679, 9378, 11358, 10137, 1245, -7947, -10482, -10588, -7119, 2813, 10377, 10524, 8896, 3715, -6536, -11740, -9465, -6432, -3, 9610, 11959, 7661, 3669, -3491, -11741, -11022, -5135, -647, 6626, 12717, 9095, 2180, -2311, -9083, -12594, -6274, 834, 4894, 10608, 11256, 3013, -3696, -6970, -11157, -8898, 508, 6092, 8210, 10624, 5900, -3826, -7780, -8707, -9222, -2424, 6799, 8729, 8341, 7004, -1073, -8896, -8832, -7101, -4200, 4459, 10278, 8050, 5386, 1266, -7260, -10723, -6628, -3196, 1718, 9416, 10085, 4561, 794, -4488, -10567, -8617, -2160, 1620, 6607, 10724, 6390, -406, -3814, -8150, -9926, -3644, 2883, 5433, 8755, 8305, 778, -5020, -6665, -8606, -5908, 2199, 6648, 7194, 7683, 3230]
876C230q096k733O30R22N833P161R43j738k207o522n783R29K678L271O519L890
892H927k560l454l878n989j831M049L873M099M878k37n116l980l898l461K306
907f272N746L677L272J770m019n829l122k357Q8N270N484K195J169j773n933m571
923e205j180M9L183O062L485Lj328m281n653k026J164K385M799M777N62k212l316
940A268m825l434Q29L092L930M277J941k013l877l979l408l54L084M141L753K256
956F681j129l874m168l096p97K299M303L936K045o21l318m256l346q35J965L789
972d22M070K401m32l047m009l377j385J769L742L730K521K63k879m122l072j518
988e767Q78L818L937K148N52k016m323l440j040M02K896M569K423R2j384l604
$$ y = [3230, -4866, -7599, -6969, -6047, -214, 6947, 7890, 6152, 3945, -2577, -8360, -7431, -4753, -1482, 5037, 8927, 6367, 2913, -965, -6954, -8785, -4736, -863, 3236, 8114, 7877, 2761, -1219, -5117, -8578, -6272, -526, 3151, 6423, 8193, 4174, -1655, -4777, -7134, -7046, -1776, 3708, 5903, 7072, 5299, -634, -5205, -6385, -6336, -3153, 2909, 6394, 6397, 5069, 788, -4865, -6891, -5727, -3342, 1457, 6234, 6796, 4584, 1268, -3557, -6991, -6162, -3070, 860, 5137, 7078, 5065, 1188, -2791, -6199, -6553, -3469, 672, 4425, 6681, 5552, 1678, -2490, -5586, -6383, -4084, 219, 4155, 6200, 5579, 2261, -1995, -5341, -6176, -4211, -422, 3648, 6049, 5617, 2570, -1439, -4816, -6201, -4432, -690, 3040, 5561, 5824, 2945, -1177, -4249, -5767, -4889, -1071, 2866, 5014, 5566, 3550, -773, -4213, -5253, -4851, -1955, 2614, 5037, 5129, 3745, 141]
1004A41m246j283J018J977M002L631r4j786k447m078k580J306K444K761L740J301
1020E807k445k823k712l153M2L361K742K492K409j406m009k459k002j378K618
1035b916M138J891J475L48l623l984j119q01O82M401L321K89J57j755m648k327
1051d471N50L89K610M445J234j333r10l141m029J7J959J347L445L186j296k401
1067A601j603l426k072K331K631J777L103P42l235k523j562k620N43L876K181
1082A744J374J856j744m261j514j007j125K879M070R41M96J79l734l517r5j23
1098c581P79M121K753o69m05j512m227j691J431P41K206L891N43j908j194k530
1114a252l328O48K406J257K726K376j668k718j257k538j327K562K639J278K113
$$ y = [141, -4105, -5388, -4370, -2393, 1609, 5240, 5146, 3360, 913, -3165, -5745, -4439, -1995, 766, 4506, 5807, 3362, 539, -2173, -5326, -5284, -1923, 819, 3311, 5720, 4314, 305, -2154, -4156, -5534, -2916, 1222, 3113, 4588, 4936, 1313, -2671, -3790, -4591, -3909, 492, 3813, 4102, 4259, 2504, -2144, -4471, -3921, -3532, -922, 3523, 4757, 3424, 2514, -627, -4656, -4639, -2680, -1333, 2112, 5298, 4002, 1601, -2, -3428, -5500, -3169, -538, 1239, 4342, 5084, 1849, -674, -2236, -4856, -4313, -437, 1744, 3118, 4974, 3230, -1031, -2545, -3552, -4677, -1798, 2272, 3213, 3709, 3888, 154, -3363, -3458, -3581, -2802, 1319, 4072, 3403, 2998, 1486, -2741, -4432, -3001, -2260, -54, 3837, 4380, 2472, 1278, -1252, -4580, -3932, -1526, -269, 2457, 4833, 3165, 447, -810, -3348, -4675, -2113, 526, 1804, 3917]
1129C917K61l345k371r68j633Q57L722J872O89Q92j814l714j246k77k94K655L453
1146B656O37k50m88l123k924K19O44J111L350K034q44j043j644l197j126J520
1162b468J291J965K765K56k067j497k109k075P26K335J666J879J332j593k533
1177a27j493j581m02K249K410J258J097m91k631k154r17m61J188K803J807M54
1193C009j94j884k662j250K5Q81K208K357O12m99j416k322j860%J022J808K202
1210B037J149n36j408k030j854n16J079J846J887J343j56j502j934j803o27P65
1226b260J792K022J254l0j181k011j797p43O16J649J942J443J23j190j714j813
1242a898j046N30J709J603J603M82j198j874j507j114O1J734J849J125P46o33
$$ y = [3917, 4178, 833, -1538, -2506, -4139, -3282, 440, 2312, 3001, 3893, 2079, -1635, -2881, -3158, -3452, -797, 2656, 3293, 3043, 2555, -568, -3492, -3273, -2629, -1518, 1832, 3866, 3022, 1979, 335, -2862, -3988, -2468, -1177, 788, 3553, 3809, 1742, 245, -1864, -3939, -3213, -878, 788, 2667, 3999, 2406, -127, -1620, -3201, -3603, -1354, 1056, 2314, 3411, 2920, 289, -1865, -2782, -3243, -2055, 748, 2555, 3009, 2815, 931, -1731, -2981, -2956, -2075, 133, 2490, 3102, 2603, 1187, -1135, -2995, -2995, -1973, -165, 2037, 3186, 2650, 1242, -788, -2642, -3158, -2079, -233, 1654, 2997, 2841, 1339, -595, -2398, -3025, -2260, -468, 1554, 2808, 2778, 1597, -414, -2211, -2954, -2338, -689, 1253, 2696, 2819, 1629, -85, -1898, -2944, -2414, -705, 898, 2501, 2983, 1785, -89, -1596, -2710, -2649, -915, 934, 2059, 2805, 2172]
1258B172k104j622p66l28J205K240J270L47j41j647k267p49R1N85J996J966J86
1275B434n01r24k139j548M66Q11J115K213R26j058r35j378j918k34J407J128J320
1292A185J562l94j821r84j276j189J187J916Q38J096O54j790j851n75q49p6K225
1309a42J580L25N44n58k463j172J38l90J155K434P02m53K9j516k291n3O70K48
1327a213J831J877m93q50m98k008j338J100R62O38J917P30j601q80q08j734mJ940
1345d32P88P80J400o95k025n97p44r86J289J967M81N91M34j823j703j51m07J4
1363a819K140J408k26K85n59k251r62M78lR59K232L58p08k29j201j982J61R79
1381i40K78J570J381o91j019m53j552r93J212J041N18J487M08j542j021n40j193
$$ y = [2172, 68, -1554, -2320, -2648, -1443, 797, 2067, 2414, 2273, 626, -1641, -2390, -2299, -1714, 282, 2248, 2434, 1933, 1009, -1130, -2678, -2212, -1401, -286, 1927, 2853, 1795, 860, -518, -2436, -2670, -1263, -135, 1185, 2747, 2353, 532, -452, -1728, -2917, -1730, 186, 1024, 2120, 2774, 984, -867, -1442, -2291, -2367, -142, 1438, 1763, 2307, 1749, -714, -1886, -1748, -2138, -983, 1451, 2153, 1700, 1729, 213, -2078, -2131, -1461, -1213, 618, 2495, 2002, 1152, 654, -1354, -2692, -1592, -630, 8, 1925, 2655, 1054, 174, -634, -2368, -2372, -432, 356, 1136, 2536, 1841, -184, -781, -1525, -2511, -1222, 745, 1226, 1817, 2251, 428, -1275, -1426, -1833, -1819, 321, 1729, 1503, 1788, 1229, -1022, -1984, -1506, -1509, -550, 1682, 2040, 1332, 1103, -98, -2080, -1919, -940, -662, 908, 2289, 1598, 579, 126, -1426, -2419, -1207, -166, 352, 1839, 2247, 705, -316, -856, -2049]
1398b049J58J765Q77N28Q05o93j809o78l59m48J136J702M14K06M6j546j462J8
1416a389n5K70J710J120j96k12o66j695p23N38M02R27J522K37p28o05j026j269
1434a838K52Q89N87J177Q80o21j033p63r94l97R29J093P10P49K8j143j073n96
1452a164n21M57J251Q93M85J90p63j335p39k17J28J053J186N09n0m83j135r51
1470a206k95K49Q79J053P18J8n70r78r35m49K25Q68R23P93K10n33r72r33m78J56
1490a257O81J010Q17J04l73q23r92n48J76M91R83R62J26m18o47r11q19J62O75
1509f01O45Q96N66m36q72o45p97k35P90Q21O24O07q7j008p66n20l81L94J195O15
1529H05K61L08p86j213k98j96j8J064J028J39Nk81j124q87J82R4M57J193O11m80
$$ y = [-2049, -1891, -126, 751, 1279, 2084, 1391, -418, -1096, -1455, -1903, -767, 935, 1349, 1555, 1601, 55, -1407, -1389, -1444, -1174, 536, 1656, 1460, 1248, 582, -1113, -1836, -1298, -896, 31, 1553, 1790, 1062, 457, -569, -1838, -1586, -697, -110, 1067, 1947, 1326, 293, -470, -1464, -1861, -932, 161, 871, 1620, 1648, 505, -568, -1164, -1685, -1228, 23, 916, 1401, 1591, 828, -507, -1246, -1463, -1335, -282, 904, 1413, 1363, 880, -255, -1206, -1501, -1252, -373, 680, 1398, 1416, 846, -132, -1067, -1516, -1291, -423, 500, 1293, 1503, 970, -2, -935, -1413, -1257, -576, 434, 1251, 1355, 982, 159, -833, -1381, -1205, -714, 269, 1231, 1357, 939, 292, -619, -1438, -1276, -601, 44, 940, 1506, 1070, 198, -447, -1244, -1479, -689, 132, 756, 1363, 1276, 268, -498, -1018, -1399, -1005, 190, 805, 1066, 1374, 588, -625, -923, -1119, -1137, -73, 955, 1094, 1099, 818, -306, -1193, -1011, -917, -460, 733, 1344, 864]
1549H64k48m91j252k60P14K62P15J054j49p83l29p40q26M89P88L42P37N76p86
1568F77r30j59o36k68J051P81J51N37p4j283n98jm51M41J335L08j06L04p28j202
1588h51l3Q0p0R35J045k30k03o7j093p74N01K19K63J150M34p25k97l05j061j66
1608a248Q83L03M29R29l38q16k77m64p07N69R54M9N87M01r04q00j8m93r3J069
1628A5O68m6L47j72j119n51J86k11M10J152J66k13J31o14j035L5L07MP68Q80l60
1649G48l03j31q94n46N14L43K53Q43K48o13l80k93p63k4P81L26L38O53l44p81
1669b5l18k76l97N48P55K03K74J27p22o84o4k26N0Q47N96r3J30k45q66m05J88
1690f03kL95Q12K14k23j58n68o58lL36K43N97M58j35l68l76n23l48M02M27K81
$$ y = [864, 616, 125, -1127, -1387, -673, -411, 304, 1358, 1209, 426, 97, -643, -1469, -980, -192, 150, 887, 1463, 677, -253, -412, -1048, -1316, -265, 516, 667, 1204, 1130, -153, -751, -752, -1203, -762, 573, 881, 775, 1079, 351, -851, -884, -804, -874, 61, 1106, 876, 673, 606, -487, -1261, -760, -541, -278, 872, 1306, 581, 284, -21, -1082, -1248, -365, -62, 367, 1296, 958, 142, -135, -599, -1306, -737, 217, 266, 853, 1254, 350, -450, -468, -961, -1054, 15, 683, 637, 984, 812, -307, -858, -672, -883, -473, 679, 845, 632, 763, 149, -886, -851, -544, -540, 228, 1108, 748, 445, 314, -580, -1126, -612, -269, -16, 827, 1075, 462, 82, -211, -974, -998, -217, 109, 447, 1100, 756, -25, -343, -619, -1016, -468, 287, 490, 764, 891, 169, -515, -579, -805, -755, 92, 688, 595, 725, 480, -386, -791, -603, -605, -210, 602, 816, 593, 435, -133, -791, -794, -458, -215, 382, 840, 705, 337, -39, -562, -910, -508, -81, 200]
1711B00M70J04m11m02m07l53J45M78M72K93K23l32n78l36k41k4L92N77L00J27
1731F97j73m92m76k07J2L05N47K84K35k38l39m56l70l0L30M89M19J56j41l98n37
1752c83j57r8K60M85L97J25m1k98n78k96N4O6L95N78J34j76j48m44m81j3K68K49
1774a02M19L63k32k35k47m64j92K60L50K49M71K0m32l21k51k78L3N78K47J99K14
1795F49k39n41j66j55j88M64M82R8Q0K6m77n32N1p4J00O17L69j48P3k68p04j11
1817e94K29K4L06O24o8k62j8m17n04K62K52M6M50L84k98l95om82k15M91L08QM90
1840F15J6n95k08o5l10L9O86O8L5K81k36o12rn1j83L91N70q9k6J39n88l25J34
1863c23N1RN62K81k58j20mo67j31M23PK51M52q2l25o3k20l87J98L20J1L18K75
$$ y = [200, 670, 774, 363, -39, -446, -799, -654, -176, 296, 589, 812, 480, -98, -434, -675, -699, -307, 270, 570, 697, 524, 32, -444, -651, -639, -334, 213, 497, 732, 494, 155, -301, -671, -701, -371, 118, 537, 693, 552, 154, -383, -540, -638, -378, 107, 504, 629, 588, 290, -288, -584, -530, -464, -69, 509, 643, 467, 319, -125, -606, -619, -351, -102, 317, 680, 448, 213, -34, -498, -690, -430, -80, 169, 640, 660, 228, -93, -344, -622, -589, -11, 236, 435, 649, 410, -131, -297, -452, -640, -176, 306, 404, 484, 510, 33, -499, -448, -522, -422, 195, 564, 416, 489, 221, -483, -594, -365, -341, -35, 589, 521, 259, 241, -176, -680, -418, -166, -120, 330, 714, 416, 21, 15, -467, -682, -191, 117, 125, 615, 631, 36, -172, -237, -547, -508, 178, 246, 281, 562, 326, -286, -295, -346, -529, -138, 432, 343, 317, 456, -132, -457, -323, -272, -263, 299, 580, 322, 202, 198, -469, -600, -177, -170, 81, 533, 451, 126, 63, -157, -544, -346, -26, -15, 303, 578]
1886E78l67l30P3l08k22M58K55MK61O6n43j94M2k06J39M99P4jJ66k68m44n1pk3
1910c49L20M64j52k0M1m31l34J37J16P4L97K33l01n3j19l68m4K45Q6J43L35q3
1932C37k50p8k08k80J77L57L4J92J59k79l22nj95l0L19L13J7P3m7m07n5k4r5J43
1956a54L43O1K5l3k20l04RM0P7K09K87n7j01j46j96j91J00J49J27J60J76j39j84
1979C8j50j43j5J38J70J32J23nk14j93r1k6P9J66K14K4P9k33j32j74q3J18K13
2002C5J54R5q6j06j48j45o4R1K06J04J31j4j82j27j19p3M6J85J90J5K6n9k71r1
2026b07m2N7J31K11Q9l5j3k09k11LN3P7J70J96r8o7o3j90j71J65N0J41J82O2j89
2051I2m7r8k51M7J71J32J9J37Pk48o8p7n1J58J10L9P1Q3j85j74K0q0j3L15M6o2
$$ y = [578, 211, -119, -46, -354, -576, -118, 137, 141, 402, 468, -75, -269, -227, -433, -294, 205, 279, 278, 444, 176, -268, -319, -326, -349, -29, 435, 283, 263, 304, -127, -461, -324, -208, -134, 263, 496, 195, 142, 23, -345, -389, -144, -58, 85, 420, 337, 87, 9, -199, -479, -302, 55, 89, 281, 440, 161, -161, -166, -361, -391, -72, 241, 258, 331, 284, -123, -178, -202, -297, -154, 189, 250, 275, 242, 22, -282, -273, -233, -156, 53, 340, 283, 182, 36, -160, -351, -251, -102, 25, 185, 361, 222, 38, -112, -255, -270, -132, 38, 170, 293, 288, 74, -119, -210, -236, -157, 9, 223, 247, 326, 93, -39, -213, -296, -178, 35, 189, 284, 198, 92, -56, -201, -265, -174, 32, 136, 267, 253, 71, -56, -175, -248, -202, -17, 173, 188, 214, 155, -116, -207, -249, -192, -61, 150, 239, 204, 191, -18, -229, -226, -173, -96, 74, 270, 172, 105, 42, -148, -319, -154, -104, 37, 219, 281, 92, 45, -53, -304, -257, -86, 46, 65, 202, 209, -39, -107, -184, -235, -77, 33, 72, 143, 226, 41, -133, -113, -193, -206, 109, 155, 93]
2077I3M6J1l05n1N4j2Q7K81k0j08N0j52j90R8P5n8J82J83j59j04J7k13q6K18R3
2102C0o5K38L3k37k6l3j81P4J78R2OJ20j88j32k7k7q0J80K26r0RN7k26j12P7m9
2128a53jK95M4j10J6m9j94oN9lJ21J53j6j20N5j68j30R6J09LJ29J07j19j95Q6
2153Ij47j05K34L1J2J77n1k63J2M0p2J3J66M7j4M5p1j95pO6o9J78J08p4M6Lj88
2180f9o8J02l0J2J72L5r0m4j6j86%J39J7P5J29o3j29l5j9j38Q0J29l3J32K3k1
2206A04j25rp4l0J36L6L5O0n0j64k5L0prJ85L4mm1n0j50PO2m7Q6J46n1l1k8j13
2235h7p0J16qK4J08O4l6q1j3r7j8M0P2J43o5m2l4q9r9J05m1Q1Q9J7L6q0n3n2r6
2264a66P9R6L2Q1k5m7j2j09j9M8k6O0J23q3K6p7o0mJ4J00qN3J0l6j11Np1O5N0
$$ y = [93, 139, 150, -155, -206, -152, -164, -77, 204, 184, 76, 126, -26, -216, -118, -43, -101, 81, 264, 105, 1, 18, -195, -281, -63, 30, -35, 203, 236, -1, -27, -60, -241, -167, 11, 103, 109, 229, 41, -91, -118, -145, -225, -45, 181, 91, 100, 157, -69, -181, -104, -153, -154, 141, 185, 75, 91, 42, -152, -158, -99, -102, 19, 172, 156, 36, 91, -77, -207, -111, -2, 1, 130, 237, 118, -77, 9, -138, -243, -9, 22, 34, 211, 160, -103, -91, -51, -123, -110, 56, 103, 89, 134, 63, -132, -139, -73, -142, 36, 144, 70, 116, 119, -69, -137, -35, -65, -53, 119, 154, 64, 20, 4, -182, -182, -43, -26, 49, 178, 115, -14, -49, -68, -206, -126, 3, -30, 102, 125, 104, -21, -30, -104, -134, 2, 38, 73, 133, 83, -81, -106, -76, -83, -92, 93, 127, 123, 82, 32, -118, -111, -49, -96, -10, 136, 85, 54, 26, -87, -157, -41, -49, -25, 83, 147, 111, 30, 17, -80, -98, -58, 14, 157, 92, 50, 16, -73, -172, -67, -108, -27, 62, 79, 115, 35, -18, -70, -166, -87, 9, 41, 122, 97, 50, 38, -71, -90, -42, -68, -8, 115, 32, 58, -19, -79, -83, -69, 31, 23, 76, 86, 50, -61, -56, -127, -62, -12]
2293a2O7j9M9L1j38o8L3N7o1Q6J05j26J08j01k2r7Q5k9L9P4O8q9o7m0o4O4N7L2
2321B2K2P3j31L7k5o5p5J52L6m8J10j2r3k6q6J09p3J19L8o3R2p9q1m1P8r2J37
2348C5J10j24OL5o0r3N0N8o0J23K0m7n6Q2j40rJ43p6QP8J6n7n4j7p3M3J12k8M5
2377G0M1q5q4N8j03L1O1N3m5M6N5j69JK9m9N8J00j4n0Q6o6j47N1O9n2Q9J8n4K9
2406B7K0m1j47J22j9L3N9N4j21K9Kr4k7P7J7L3P8m0m0p9R7j41O9P7m8K8K7o3o6
2435g7j8O5n4J08L1l4oj1j05Q7Jk6l0J09pm9K3p0M3n4N4k2R8kl4Pj9l6o8L4R2
2466C0Ol3N7o6pl5n5M9K4MJ5N7n9l8RK1k0K7L5MJ9J3q6l2L0j5RL6R8l8Nn0n7q
2500e1J8J1O1Kj7O0r3o5L3K0k9O8m5Q5j5n0p9O3k1k5O3J3M8j9m1q6M5M4q7Q2p
$$ y = [-12, 55, 36, 85, 116, -22, -90, -57, 0, -61, 25, 130, 4, 112, 11, -11, -108, -23, -52, -13, 61, 129, 40, -27, -67, -131, -67, -10, 22, 44, 117, -14, 23, -2, -67, -142, 10, 46, -2, 108, 96, 3, -23, -109, 0, -73, 46, 84, 21, 113, 34, -47, -88, -10, -102, 35, 145, 21, 27, 62, 2, -91, -41, 17, -43, 80, 100, 53, -3, 79, -61, -70, 73, -3, 5, 83, 99, 42, -12, -29, -102, -59, 53, 25, 70, 111, 26, -58, 0, -103, -72, -11, 42, -3, 43, 98, -71, -70, -41, -90, -32, 68, 54, 4, 90, 24, -123, -72, -3, -55, 34, 52, -2, 27, 47, 6, -141, -19, -38, -5, 54, 108, -13, 16, 18, -76, -103, -26, -9, 24, 102, 62, 22, -57, 40, -101, -32, 45, -3, 25, 52, -11, -77, -95, -30, -84, 24, 55, 21, 15, 4, -101, -14, -13, -39, -69, 40, 33, -16, 7, -63, -20, -74, -20, -42, 56, 54, 20, 27, 8, -28, -96, -62, 30, 36, 3, 60, -6, -13, -48, -103, -54, -30, -26, -11, 46, -13, -51, -42, -21, -41, -14, 21, 25, 44, 57, -29, -61, -31, -46, -37, -1, 97, 59, 64, 14, -43, -51, -33, -22, 39, 41, 24, 84, -9, -74, -41, -21, -50, 18, -27, 58, 43, -7, -86, -23, -44, -69, -6, 7, 55, 36, -5, -91, -46, -2, -89, -7, -14]
2531a4N6jqk4o9nO9k4L5O2ol8l6p2M5lO8j8J4Jj0q5J1L8j8N5J0l1J2P9p1j39J01
2564a6j0nM3L9p3R3n3j02K4J9J0M5J02q7l7J0j1l0J6%O1L4rl6q3R1n8l8N0P2p2
2595a1J02o8n9O4j2r7L0K1P0m2O4%j45L3J7k1M2O2k2k1J9n1l0P8p3L3N7m2K3p
2625A4J2p8qN5l9P9M9p1qj5J4j34M5R9lNP6p9k4Jk5j9J08n6oR2p0l7l5K6nK0Q1
2658F4n4l2Q2m8kl9L4n7O5L5j8j7M2p9n8N8k0K3Q3m1K1J3o8m0OQ2l4j0J9L0p8
2689c8N3j01J9J8Q0J0k0K3n6mn1LJ6N7L3pl9L3o9%J1rQL5L4q4N1pj4l4M7j7k4
2722d3R4m3j2lQk1k7N1L5n0L4j4j5K7q0M0N4k3k2M3m3N2m9Nl4KQ4Jk%m7j1Q9n6
2756B4o5J02k4j5K3Qm9p6P1kk5M8k1j1K0l2j2Pj9P0m4M1K4n4L8n1N2j10J02M3
$$ y = [-14, 42, 41, 33, 9, -60, -65, 4, -20, 15, 77, 71, 33, -3, -75, -30, -33, 35, 17, 31, 32, 22, -63, -52, -14, -32, 23, 33, 2, 14, 93, 22, -117, -16, -26, -31, 12, 51, -22, 71, 18, -84, -60, -41, -31, 14, 116, 29, -8, 2, -9, -39, -23, -23, 38, 72, 63, 27, -56, 35, -23, -61, -11, 61, -11, 91, 23, -36, 28, 16, -81, -51, -30, 40, -2, 62, 62, -83, -50, -33, -54, -12, 50, 28, 7, 26, -25, -55, 23, -50, -17, 40, -2, 21, 14, 26, -52, -60, -5, -44, 35, 84, 13, 5, -10, 4, -130, -85, 14, 11, 16, 92, 13, -11, -10, -35, -54, 54, -2, -8, 84, 14, -23, -58, -32, -37, -17, 64, 10, -22, 60, 12, 10, -29, 5, -52, 13, 48, 30, 13, 55, -24, -82, -24, -44, -21, 62, 21, 42, 55, -13, -53, -47, 35, 1, -9, 10, 40, -38, 15, -86, -67, -49, 31, 41, 21, 44, -12, -16, -67, -64, -48, 9, 42, 35, -4, 29, -40, -40, -29, -38, -30, 5, 39, -45, 6, -1, -15, -49, -2, -19, -43, 51, 8, -4, -7, 1, -20, -47, 4, 39, -11, 23, 9, -6, 21, -59, -19, 35, 12, -10, 33, -10, 42, -7, -2, -36, -34, 50, 51, 49, 49, 2, -9, 80, 24, -41, 61, 37, 22, 45, 53, 4, -72, -1, -3, -28, 20, -1, -12, 8, -24, -36, -29, -48, 22, -22, 19, 43, -11, 27, -24, 28, -82, 20, 63]
2786F3o2M8m5nK2n9OM1NL2p1K8L9q8j8L6K8mJ1M9p7J8j0o5P0l6L5L6k6Mm7qL3
2819a7J7OL2pj0M2m2k3L9j22M8Q3Lkk4K2Pr9K6K6J8N9p5Lj9K0m6j2L8J3rrQ9j19
2853d4J2K1K3l9K2l6Q1n4M9j1mp1j7N8L1l3L1K1p9J0j3qN1K3MjO0j01j6l4L2k3
2885e5J03qk3N2o6L6r3N1m7K5P1l6l4Nj2j5J6K8K5l2N2p3K8Lj6Mj2J4OP1o4k5
2917b1N6n9l8N0Q0p0J7NL3q6N7k5n2N5K0nj1J2mo6J5K1r7R5M0J2m6K5J6n8M1K3
2949C5p0L5L7n0Nj9k9J9LK7J9J4J5m9Qo3O7k7L0K3K6l3JLJ3o6k3K2kNN0mn1k7
2983e6L4M0k7K8k3m2j2Q5p8rO6M0m9L0L5j6m9qk0M2J3%M1m1k0Moj2n4M4O3o3J6
3016dJ8m8Mm5M6J8O0j2Mk7m3K3k0JK5Pj4mJ6N8p3k8P2rk0J7J2pm8J7j5j6J2M3
$$ y = [63, 1, 49, 4, -1, 21, -38, -32, 9, 14, 46, -25, 3, 42, -46, -64, -28, 0, -4, 7, 56, -21, -3, -13, -78, -8, -44, -9, 27, 1, 5, -42, -50, -17, 0, 6, 38, 31, 21, 63, 21, -2, 37, -85, -37, 46, 49, 47, 23, 45, 52, -47, -21, 5, 23, 82, 7, 10, -9, 11, -35, -47, -9, 4, -5, -14, 75, -44, -32, -11, 12, -27, -5, -41, 40, -14, 35, 24, 20, -51, -68, -10, 21, -12, 19, 40, -39, -29, -42, -50, 1, 24, 28, 27, 87, -14, -30, -64, -32, -55, 48, 40, 17, 69, 3, 39, -54, -3, -50, -25, 46, 10, -24, -19, -31, -46, -30, -2, 23, -9, 43, -30, -2, 1, -15, -11, -23, -9, -3, 68, 4, -21, 35, -24, -62, -12, 68, -2, 15, 20, 53, -33, 24, -1, -53, 2, 22, 17, 6, 18, 14, -52, -37, -16, -113, -18, 22, 34, -12, 13, 29, -29, 12, 35, -35, 0, 37, -13, -8, -27, -56, -37, -34, -7, 12, 26, 41, -8, 0, -63, 4, -23, 7, 30, 56, 23, 24, 27, 40, -26, -49, -27, -29, -24, 26, 22, -29, -56, -22, 18, -9, 19, -4, -46, -58, 27, -51, -60, 6, 46, -3, 27, 62, 46, -3, -11, -31, 11, 24, 24, 65, 24, 4, 8, 2, -10, -64, -20, 43, -20, -4, 14, -34, -30, -75, -29, -11, 49, 37, 41, 14, -29, -6, -26, -25, 0, 7, -7, -11, 5, 63, -10, -38, 34, 25, 5, 22, 34, 27, -21, -4, -19, -35, -23, 20]
3050B0OrM7l1o0oL6l4nON2Ql9j4J7k9N8k2nm8J4K0M2q8L0j6O7k1K3J1m2m1R0o5
3084b8P4k3k1m5M5qJ4N3n0K9q4O4K7n8K2j9k8l7K1J8L4J1K1j3m2M4r6O6J8k1Q2
3115G0p0N0m6p7R5m6L7j3jJ7k3pL1qnL0j9K2Rrm0j6N7k1l6j2M8l8P7o6j1NM8j20
3149h8Q2Q2r6P0pp0M1ol1Q3n5K1J6l2k5kL8j6K9J7lkp8L6J2n5L1mj1N4n0PN6n7
3183a3Qj6N5j0Kn7Q6q8O0k6n9J5M4k5jQ2m2k6J2l9K0N9n0KOm0NJ8O8j06R3qk2
3216Gm1K9Qk9K2NL3KNn0qRk4m3Q2j04J04J0L9l5k9n5R3j8l5RN6k9J9m7L3j8M0
3249D0l4j1K7rMM1o1oKk0K8J6ml4L6oq5P5Qp5P3l1M5l9N0j8kl7l1kO4K2Nm9J6
3284bk9J2N9k0k6KO3r9N0oj4n2N8J3L9l6Ql0k4Qk6N7k5Q2n6q1J00n0k4J9K7L8
$$ y = [20, 26, 17, 64, 33, -27, -33, 3, -31, -36, -30, 22, 30, -9, -23, -6, -35, 23, 1, -4, -52, -38, -18, 24, -64, -34, -50, 17, -4, 19, 30, -12, -53, 37, -28, 46, 23, 2, -43, 2, -6, 8, 61, 11, 40, -44, 20, 47, -11, 11, -8, -36, -73, -52, -34, 0, 11, 32, 19, -23, 21, -75, -9, 9, -12, 70, 0, 50, 4, -73, 22, -24, 13, 0, -1, 16, -7, -14, 17, 9, 4, 34, 15, 37, 46, 37, -3, -19, 38, 17, -19, -31, 17, -21, 56, -10, -21, -16, 32, -88, -6, 76, -20, 50, 43, -27, 14, 8, -23, 60, 5, 26, 42, 10, -15, -17, 21, 5, 34, 51, 48, 46, -32, 4, 16, -39, -8, -12, -23, 31, -19, -12, 44, -13, -5, -21, 34, 24, 26, -31, 55, -33, 27, 1, -58, -43, 1, -24, -25, 57, 15, -11, 1, -38, -18, 41, -9, -7, -1, -41, -36, -18, 50, -56, 37, 29, 7, -34, -5, 3, -26, -4, 1, 34, 36, 41, -9, -17, -8, -32, -75, 7, -97, 7, 17, 56, 21, -8, -63, 30, 12, -23, -14, 42, 13, 32, -15, 18, 0, 40, 6, -5, 22, 13, 17, 58, -3, -9, -7, -27, 1, 17, 13, -21, 15, 9, -76, -1, 7, -68, 5, -26, 19, -20, 30, 12, 10, -27, -58, -60, 4, 26, 31, -18, -2, -31, -19, 40, 20, -6, -4, 59, -40, 10, 4, -10, -62, -4, 9, 48, 12, 20, -10, -34, -26, -52, 5, -20, 62, 6, -75, 25, -25, -49, -30, -3, 35]
3316C5o5RL7j8Ol9N1n5N1k6N0l3%pj1L2LPk0J2k6L6l1%J3l7Q5o2qj3P8j03RM2
3350BK7o6L7Pl9K5N7p8M1m6n1J29J2m2n1N6o1N4K1Ll5qN0p3m6O4l9J7N9k9KL6
3382C5j3m8M6k5N3m0j1k8K4O2m4J1n2J9j9lN0l2K9Qp1K5N1k1l8K5kj0l5j8O7k8
3414c3K1J0qQ7m8l9mM8n2J1nLl9O7k3L9k3Rm1QO1q3L6J3oQpq4O3M3lm2N2j0m1
3449a2K0olpk3J03k0o1J6l6k1Q7l6j4mK0PK1l4Ml5L4j2J9K1l2k9K9j5m7P1Pj9
3482gOrN0o3RK3kpj7J0M5l2J8l7K5k4O4qn2L5m5MK1j7Oo0K2M9J6n9M1Rl5L6Jj1
3518EO9p6j5j0LK4m6N5j6j3LK2K7l5j8j2K5J04j02L4m0K4J4o6O1L0p5K8PJ1lk9
3550a0j2RL7n5R4l4k8%lk7L9j0k2L5jm2Rj0Oj1O7kk8RJJ8n3L1j4m3J01l7p1Q2
$$ y = [35, -30, -21, 16, -2, 4, -35, 16, -39, 12, -14, 36, 3, 3, -4, -15, 17, 20, 27, 7, 19, -7, 29, -2, -2, 11, -26, 59, -3, -11, -24, 54, -49, -40, 2, 29, -37, 0, 7, -32, -7, 50, -28, 13, -33, -84, 45, 57, 15, -36, 20, -41, 13, 34, 37, 2, -6, 44, -29, -75, -11, -50, -33, 26, -3, -1, 35, 22, -26, 20, -5, 48, 8, -3, -31, -7, 55, 11, 22, -30, -11, -30, -33, 17, -15, 14, 22, -49, -24, 27, 6, -32, -7, -9, -19, -54, -72, -5, -33, -12, -2, -10, 77, 29, -10, -14, 34, -18, -7, -12, -9, -48, 19, -4, 35, 12, 21, -20, -12, 49, -34, 2, 15, 9, 17, 10, -74, -11, 32, 29, -13, 39, 29, -12, 8, 2, -1, -8, -31, 72, 52, -9, 7, -29, -50, 37, 1, -13, -17, 3, 10, 31, -3, 1, -34, 0, -12, 7, 28, -4, -33, -4, -19, -66, 5, 12, -7, -1, -10, 40, -23, -14, 9, 7, 0, -17, -7, 38, 6, 24, -13, 12, -12, 52, 44, -8, 27, -18, -14, 7, -10, -4, -64, -42, 7, 23, -36, 5, 14, -21, 15, 16, 5, 74, -2, -17, -27, -24, 0, -46, 9, -7, -20, -17, 5, 32, -3, -21, -33, -8, 96, -6, 28, -12, 12, 26, -40, 21, 51, -24, 4, 11, 22, 19, -10, -22, -13, 24, -31, 63, 29, 1, 1, -2, -29, 10, 0, -22, 13, 12, -30, -21, -31, -25, -36, 31, 29, 1, 10, 11, 29, -24, 7, -7, -50, 51, 14, -57, 25]
3584B5jl1k9j1O9l9P0qq6M2rK9j1rj3j7O4k3j6Kp9J10l7ll8N8J3p3M1L7o7N6k6
3617a0N3o3Jk8k6O2N0p4J1K8k3J2L7j1L0j7j5j3j0QL1j2k4N9j09M5NqP5n2J0k2
3649@m1L9L2l1m3M7pNk8K2K5l8L1k6J8k8O2n5k3P0m3k4M8n5O0L8l4k6M7l1m6M6
3681A1l1M2j8J0l1j0j2N9M6q5j5Pj7K2n2Q1l2O0Mp0J12q1L0l0K0l6M2J8q0O9Q
3712D1p7O%J7RP2m1m2J2k2J4p6O3j7L6L5l6j9N2q9M5Lk5J1P5J3o6k2QJ4K8m2M4
3745B4pl9N4o3LJ9l5O3M7p2J8jl9L6l7L1J8RJj6k3k2MOl8P6l0P5q5k1M3k0L3l2
3779b0L9n2kQK9oJ6n8P2k8M6o7j6M2rN3p0j8L3J5N7l5l9MK8p3k2Q3oJ8j8pjK3
3813A9m4K9k3L4K3l0l6O0n0J0L4o5K3l2Q6Om1k1mJ5l4O6M8o7L8p2QM7n3J9Lj0
$$ y = [25, 24, -7, -36, -47, 22, -17, 53, 45, -41, 1, -8, 21, 10, 1, -12, -29, 35, 12, -4, -2, -81, 29, -8, -11, -49, 9, 22, -51, -10, 27, -40, 16, -10, 43, -20, -19, -47, -73, -11, 39, -35, -24, 4, -19, -7, 30, 19, 49, 32, 17, 4, -6, 2, 33, 21, -3, 56, -53, -8, -3, -11, 64, 12, 22, 0, -41, -2, 30, -1, -44, 3, -4, 1, -27, -5, 20, -18, 13, -13, 5, -23, 39, -16, -39, 31, -12, -36, 12, -43, 17, 55, 21, -5, 42, 11, -35, 11, -20, 22, 4, 14, -17, -27, -39, 20, 66, -19, -34, -27, -44, -22, -74, 7, -25, 35, 39, -31, 81, 0, 30, 0, 20, -16, 26, 44, -36, 33, 41, -36, -30, -30, -13, -4, 68, 27, -15, -3, -25, -11, -87, -24, -41, -5, 30, -6, -25, 27, -62, -17, -14, -39, -28, 47, 60, -6, -28, -20, -6, 22, -20, 24, 17, -22, 32, -31, -28, -9, -44, 19, 66, -6, 12, 11, -28, 8, -29, 2, 20, 29, 30, 14, -9, -31, -27, -21, -59, 17, -13, 62, -23, -44, -1, -21, 12, -20, 19, -33, -35, -27, 2, -4, 12, -46, 26, -2, 44, -23, -39, 3, -6, 47, -23, -41, -8, 7, 64, 29, -10, -6, 22, -51, -73, 10, 4, 22, 4, -3, -4, 19, -25, 4, -19, 15, 38, 8, -28, 32, -18, -8, 26, -39, -16, -48, 38, 44, 3, -18, -22, -7, -41, 25, 73, 6, 44, -28, -20, 27, -26, -7, -4, -14]
3845a4l9Q6n8LJ5n5K2N0j9q%J3k0L7k4rK7p6Q3L0k6ol5KM7m4N5o6M8K5Oq0L8r0
3879h2R2J2k7L9Olq1L8ppQ9l8l1l0NM6p9M9j4k8L0k6K3M3m3Qm8O4L1ol8Jk5L5
3913bJ4j4%QQn5O4Pl4JQm0L9J4K0m7J1L9n3L8k5NNl4K1J9J1p8K4K6k4J9P8p0j4
3948a1M6J2o8Mj9J4k3J9K7j4N0Lk8MNl9L2j0K9o9RM5j1K6n9N5l0j1n2K0N1j7J
3981iJ5OJ3K4m0l4J0j0O0k9J5l9k2K8J0N5p1M9k5J2ql3K0M9o4L6j5J2m1P5k0m3
4013a4lK8k8J5On1N5J4j9k1k0J0k4J9J8jL6n5j5J2L9JJ4l1K1mk1J8N3n0j7L8K
4046B5qJ7k6pj2LL4o9rM9J2j2n1RN9rj1K1q3L4J7K0K1o7K6L9n9N1m4J5J7oO4j10
4080e0O3M4p3J5K1l4L7m3k4M0K9m2j5M6jm8N2n3k5O7k9N6k3o4N8l2J4Op4O5m4
$$ y = [-14, -53, 33, -25, -22, -7, -62, -40, 10, -9, -17, -17, -4, -24, 13, -11, -20, 7, -69, 14, 44, 18, 12, -23, -21, 26, -18, 37, -29, 19, 44, 50, -30, 8, -82, 10, 22, -5, 34, 40, 37, -44, -6, -13, -20, 69, 31, 0, -30, -25, 21, -58, -9, -23, -51, -21, -47, -24, 19, -24, -16, -64, 0, 31, 25, -13, -12, -37, -2, 12, -2, -2, 6, 14, -41, 23, 30, -4, -3, 5, -35, 4, 18, 38, -9, 2, 41, -12, 26, 1, 6, 11, -23, -2, 17, 28, -50, -26, 0, -24, -5, 73, 3, -11, 35, 47, -21, -17, -36, -22, -45, -26, 1, -13, 37, 40, 12, 16, 21, -18, 14, 4, 33, -36, -27, 18, 7, 33, -26, 29, -1, -12, -64, -44, 7, -10, -9, 6, 12, 25, 49, 9, -25, -15, -25, 35, 6, 21, -18, -40, -12, -2, 53, -18, 31, 6, 18, 10, -23, -3, 46, -18, 18, 3, 15, -26, 49, 29, -14, -17, 11, -17, -2, 4, -47, 8, 22, 3, -18, -38, -28, -52, -33, -15, -16, 20, -35, -50, -38, 1, 2, 16, -15, 6, 2, -19, -1, 52, 2, -15, 23, 25, 17, 34, 8, 1, -11, -8, 26, -43, -52, -3, 9, -3, -54, -45, 14, 5, -6, 15, -68, -34, -17, 3, 24, -43, -17, 22, -37, 14, -30, -15, 2, -4, 60, -50, 13, 57, -16, -1, 20, -14, 23, -20, -44, -4, 25, -17, -32, 14, 13, -35, 17, -36, -61, 6, -23, 33, 10, -54, 4, -28, -14, -8, -82, -17, -61]
4111f1N7N2j2j5J6m3nL0m9K8Q2j18L5Qm4M9J8n7J0j3J9O5k4n5K6%j4N6j6n0Lq
4143c0N1J7k1j9lnJ1k6KQkmLL6rk1QLM1o3J8pK5qj6mn6N5rN5M7j16OM9o4M3J8
4180A3K1l1l1N4j2m7k3Q4p2J8L3j5K5K4l3o6P9K9o4PK1m5J9L0m5Nj0J9NK9n4K
4212c1P0q7L0N0qm1PJ1K5jm5qk2P3n6N3l0K7oj3K8p2M6o3K3K1j6K4kk1RK8n1M2
4246fM5n3%L7n5M1j9J8L1k2K7k1n8rM9qk2L0J1j6lL9Kq8L0j0M6m2L1m6LN2q7R2
4280A9o3J14o5qJ6pKm3K8l8J28p3M%j4K3n9N7j8opk0N1j6nl7J4M6n8J0j7N2m8
4313c8N5k0j9m2J8K8M9n1J0Pn6O1J3J3k5%lN0o5j3P4j1o1Q4o9R%L4l0n4N8Okn2
4347d2O5L3o4L1j0n2j0L9j1N1p6K9O3o6M2lq8Q4j7MO3p5oJ5l5P9k8j4JN9n0j22
$$ y = [-61, -4, 48, 36, 21, 37, -6, -11, 19, -30, -2, 80, -38, -3, 5, -39, 10, 28, -29, -19, -32, -13, 52, 28, -27, -1, -1, -15, 41, 25, -25, -22, -30, 21, 38, 17, -2, -5, -10, 1, -25, -23, -15, -17, -21, -18, 18, 9, -12, -4, -1, 40, -23, -5, -12, 13, 5, -11, -15, -71, -16, -25, 30, 77, -39, -33, 16, -48, -5, 13, 34, 3, -28, 26, 14, -33, -56, 28, -44, -26, 7, -8, 17, 41, 8, -58, 21, 50, -14, -7, 14, -31, -12, 18, -27, -22, -32, -13, -8, 21, -33, -31, 39, -48, -18, 32, 24, -17, -10, 1, 26, 25, -20, -28, -50, 23, -33, 20, -10, 17, 11, -2, 26, -46, 0, -63, -40, -19, -35, -11, -13, -34, -25, 3, -48, -6, 39, -14, -14, 23, -32, 9, -10, 8, 39, 17, 44, 23, -35, -44, 5, -3, -25, 5, 16, 0, -3, 36, 38, -50, -20, -30, 16, -26, 5, -41, -38, 14, -73, 19, -44, 70, 5, -3, 13, 6, 8, -35, -7, -45, 83, 10, 14, 14, 0, 23, -36, 21, 3, -3, -10, -30, 21, 5, 0, -37, -23, 23, -35, -25, -42, 10, -38, 17, -3, -22, -64, -46, -18, 31, -20, -10, -3, -59, 2, 15, 28, 3, 3, 0, 50, -15, -28, 46, 35, -26, 58, -11, -2, -2, 32, 2, -52, 6, 12, 10, -42, 23, 56, -8, 23, 13, -39, -49, -10, -21, 30, -46, -17, 46, -20, 22, 19, -69, 15, -2, 2, 65, -10, -16, -1, -36, 43, 15, 1, 2, 61, 11, -111]
4379a11J27Jm8P6l7K5ppr7O7Qo9K3K8j5j7M3oK4mmn6R3Jl3m8K4J0j8N1k5n8M1
4412a8M2j3oJ9p3K8K4M8r3N9M4r8o6J30j5%pj6NL5j6l2N2n8qL7j1j3rK4K4o6M8
4445An8O3n9N0k2OP0L2j35Q8ko1O5p0J9L9j3n0P9J3p1M4Kk7Ok4L5NPl6J3rPm1
4479c4Q2m9M4m2Q6j71P2L5jj3m6PQK9M9o9m2R4o1J0K8J0l6L9p1K7J3kk1J7Jn7
4511f4J48q7n0OLP3n1M0L2Oj9jj03O6L5o6OL8p6N3QPn0kJ06r8K5L0o6K1O5Po3
4544b1nO6m3%OQn6K3q6J22l0Kj8N7j4j8p0O5K0k4L0nmmjl4P9n8J8k5K9m6L6ko
4579iJj9NoQ6k0n8pO8l9RJ2J8J2o2j3O1p0Q4m6m5L5J1Jn5O5m3k3Q4k9j9KKK9k4
4614bjQk8K8mm4JL0M1J3l1j0k7k3Q3n8N3k7k4K1Ok0L4Jq6M8K8k2j8J8K9PJ2Ro2
$$ y = [-111, 16, 17, -31, 45, 8, 33, 26, 19, -78, -11, -3, -72, -49, -21, -36, -53, -10, -16, 8, 4, 0, -56, 37, 38, 5, -43, -19, -9, -27, 24, -1, -59, -18, 24, 11, 5, 24, -49, -21, 3, 51, -42, 17, 61, -37, -103, 27, 12, 12, 5, -11, -6, 29, 13, -19, 33, -25, -33, 4, -7, -20, -29, -5, 19, -47, 1, -57, 6, -53, -3, -25, -19, 51, 83, -52, 36, 34, -27, 38, -32, -13, 26, 13, -37, 42, 55, -16, 28, 30, 3, 9, -15, 20, 25, 32, -4, 9, 0, 7, -34, 48, -1, 43, 1, 87, -84, -12, 23, 22, 9, -37, -30, -22, 7, 56, -13, -55, 39, -22, -12, 16, 26, -10, 29, -42, -15, -2, -4, -25, -8, -7, -64, 84, -3, -53, -47, -44, 29, -22, 18, 50, 56, 37, 36, -67, -1, 34, -32, -26, 12, -64, -11, -3, 4, -46, -48, 58, -40, -15, 15, -51, -30, 35, 42, -21, -26, 40, -3, -3, 3, 11, -45, -22, -108, 14, -16, -14, -32, 25, 11, -7, -77, -12, 8, -16, 14, 9, 5, 1, 0, -34, 45, -13, 5, -20, 9, -37, -1, -3, -9, -8, -27, -22, -28, 58, 38, -20, -27, 41, 2, 11, 23, 41, 53, -9, -22, 39, -31, 53, 7, -38, -3, 8, 9, -46, 19, -24, -47, 37, 8, -11, -9, -7, 22, -2, -3, 5, -23, 5, 1, -43, -42, -12, 29, 42, 11, 1, -26, -49, 34, -24, 29, 2, -22, -1, 5, -15, 19, 20, -66, -18, 10, -12, -30, -12, 17, 24, 36, 45, -17]
4649a7Q7l8m9M0nk4m6J7PoQN4m0j9J3N0K6j6p1J8RJ6m0M4K1m1K4J4o2L0K8l9j8
4682b5K8j5J9q1O0n6P1L1p0O3o1JRMK7k4L5mj7J1L3k6O8r2k4N2pmJ6k1M1p6M2
4715HL9o6L9qk0l8N9J9n5ML8k5Rj5K4p2N0o1M0L2q9N8J01j4p1L9k2K6l3N2Oj04
4747e0J8j4P8j0p9M3L3m7K4K0M1p6kL1L0m5j4%J3M6p3Q9r2K5l9L8lJ6KJ9l4J1
4779aJ7J9l9k9L4m1M7N4q5J0O5k7k7L6p0K0L4j4j2rM6l7K4Pk4M3k1m3jJ7k2M1
4811A2j2J2k2k1O3m6J9j7k3K2L1k4Pm9O4n4j1N9M1p5K7l4l7J08k2n4jL4L1Op1
4842c7N5m5K3J6mk5J9J1l5lJ8m3M8L1m0j7M8%k7l2L9l3L4M4kj06M7j3J4N3o4N1
4874B5m1M4Ko9O4M8q1K3k0OJ8mn1P9l5J0n2J2J7o7P4J8j3l1MJ1j6N2l2n1N2N1
$$ y = [-17, 70, 32, -17, 23, 18, -6, -52, -35, -28, -34, -26, 28, -12, -31, -18, 32, 58, 42, -29, -11, -2, 14, -26, 18, 39, -2, 22, 36, -26, 4, 32, -7, -25, 3, -12, 7, -74, -14, -70, 1, 32, -38, 25, -36, -35, -26, -22, 5, -19, 16, 12, -5, 6, 39, 13, 81, -11, -35, 17, 10, 6, 22, 1, 42, -34, 8, 47, -19, 20, 12, -8, -46, 13, 32, -23, -19, 19, -6, 3, -12, 12, -60, -10, -71, -31, 1, -88, -30, 71, 57, -14, 25, 3, 29, -4, 48, 54, -50, -32, -46, 32, 22, -57, -14, 19, -28, -4, 16, 57, -19, -21, 10, 40, -5, -19, -19, -6, 40, -33, 56, -36, -11, -50, -12, -15, 1, 3, 22, -12, -1, 16, 35, -4, -33, 1, -40, 7, 61, -24, -14, 51, 24, -3, 33, -37, -17, 17, 3, -9, -18, 28, -9, 15, 22, -2, 41, 20, -23, -24, -7, -29, 12, 0, 12, -10, -31, 32, -14, 5, -12, -35, -13, 18, -6, 1, -48, 16, -38, -49, 10, 51, -24, 3, -31, -68, 40, 18, -36, -37, -3, 28, 34, -37, 18, -27, -4, 12, 8, -17, 2, 13, -22, -25, -7, -50, -2, 29, -11, -28, 20, 20, -7, -39, 0, -33, 1, 45, 43, -63, -16, -29, -15, 38, -26, 25, -16, 28, 30, -39, 25, 73, -8, 15, -5, 1, 19, 15, -36, 43, 8, 18, -34, -22, -5, -72, 2, 20, 7, -24, -20, -9, -25, 27, -5, -56, -4, 47]
4906D7j6%l2mlJL2k0L9n1%K4k8l7K8JJ1K4K7m9J3k3L0pJ1n0J1Rk8O4%J0l5k3J3
4941a1J7rj0J7p6R1l9LK6l0l2N0M4n7L9J4Mm8k4l3Q1j2K5l6M2l4L3m5k4K7ML7
4973C4m1j7M3m0jj9%M9j1%Pk0J1j8P2n3j8OLm5M8K7J7m4j6kK8J2J6n6O0m6rN0
5007B7l6M4N4r8K9j2rk4j1L4Mj3m9N6j1J1j6nL4rk6N2J3n4L0k2qk9K1M7m9KK8
5040El4L7qk4Ok7P3k7k1O2k4l4Q6o4k8K6K5j21J8J37k9o4K4j7l5P4o0K8m2P0j7
$$ y = [47, 31, 31, -1, -5, -8, -7, 25, 5, 44, -7, -7, 17, -11, -48, -20, -19, -8, 16, 43, -6, 7, -16, 14, 7, 18, -32, -21, -12, -40, 24, 24, 34, -1, -24, -11, 6, -3, -13, 4, -72, 19, -20, -17, 9, -21, -53, -3, 41, -16, 23, 37, 41, -7, -31, -64, 17, 5, 30, -6, 36, 2, 35, -10, -34, -7, -3, 34, -7, -24, 19, -21, -22, -41, -41, 8, -3, -3, 4, -16, -5, -23, 49, -4, -22, -16, -13, -58, -10, 17, 34, -10, -26, -28, 0, 12, 28, -28, 32, -14, -23, 27, -9, 35, 89, -9, 20, 8, -1, -25, -36, -2, 2, -11, -60, -4, -15, -4, -20, -25, 9, 0, -26, 26, 39, -15, 15, -7, -15, -44, -23, 24, -25, -23, 5, -29, 8, 0, -24, -18, -45, 28, 1, -20, 42, 18, -16, 70, 6, -22, 4, 29, -92, -74, 63, 34, -30, -6, -23, -58, 16, -44, -16, -58, 12, -5]
$$ [...]
8191g0
##END NTUPLES=NMR FID
##END=
